test packages.x86_64-linux.nix-ci-check-gammaloop-nextest-python-api

Reproduce this run
Original Run
  1. 0.00 s $ /nix/store/9ypz3flqsrl5xl495mm8h645gadjsxi1-coreutils-9.11/bin/timeout --kill-after=15s 7200s /nix/store/23zk8sgzamrbmj1fday15szf7f2279s8-nix-2.34.7/bin/nix --extra-experimental-features nix-command --extra-experimental-features flakes flake clone git+https://github.com/alphal00p/gammaloop --dest /tmp/nix-ci-worker/stable-pwd/repo/
  2. 0.07 s Cloning into '/tmp/nix-ci-worker/stable-pwd/repo'...
  3. 0.76 s remote: Enumerating objects: 93878, done.
  4. 0.88 s remote: Counting objects: 0% (1/9169) remote: Counting objects: 1% (92/9169) remote: Counting objects: 2% (184/9169) remote: Counting objects: 3% (276/9169) remote: Counting objects: 4% (367/9169) remote: Counting objects: 5% (459/9169) remote: Counting objects: 6% (551/9169) remote: Counting objects: 7% (642/9169) remote: Counting objects: 8% (734/9169) remote: Counting objects: 9% (826/9169) remote: Counting objects: 10% (917/9169) remote: Counting objects: 11% (1009/9169) remote: Counting objects: 12% (1101/9169) remote: Counting objects: 13% (1192/9169) remote: Counting objects: 14% (1284/9169) remote: Counting objects: 15% (1376/9169) remote: Counting objects: 16% (1468/9169) remote: Counting objects: 17% (1559/9169) remote: Counting objects: 18% (1651/9169) remote: Counting objects: 19% (1743/9169) remote: Counting objects: 20% (1834/9169) remote: Counting objects: 21% (1926/9169) remote: Counting objects: 22% (2018/9169) remote: Counting objects: 23% (2109/9169) remote: Counting objects: 24% (2201/9169) remote: Counting objects: 25% (2293/9169) remote: Counting objects: 26% (2384/9169) remote: Counting objects: 27% (2476/9169) remote: Counting objects: 28% (2568/9169) remote: Counting objects: 29% (2660/9169) remote: Counting objects: 30% (2751/9169) remote: Counting objects: 31% (2843/9169) remote: Counting objects: 32% (2935/9169) remote: Counting objects: 33% (3026/9169) remote: Counting objects: 34% (3118/9169) remote: Counting objects: 35% (3210/9169) remote: Counting objects: 36% (3301/9169) remote: Counting objects: 37% (3393/9169) remote: Counting objects: 38% (3485/9169) remote: Counting objects: 39% (3576/9169) remote: Counting objects: 40% (3668/9169) remote: Counting objects: 41% (3760/9169) remote: Counting objects: 42% (3851/9169) remote: Counting objects: 43% (3943/9169) remote: Counting objects: 44% (4035/9169) remote: Counting objects: 45% (4127/9169) remote: Counting objects: 46% (4218/9169) remote: Counting objects: 47% (4310/9169) remote: Counting objects: 48% (4402/9169) remote: Counting objects: 49% (4493/9169) remote: Counting objects: 50% (4585/9169) remote: Counting objects: 51% (4677/9169) remote: Counting objects: 52% (4768/9169) remote: Counting objects: 53% (4860/9169) remote: Counting objects: 54% (4952/9169) remote: Counting objects: 55% (5043/9169) remote: Counting objects: 56% (5135/9169) remote: Counting objects: 57% (5227/9169) remote: Counting objects: 58% (5319/9169) remote: Counting objects: 59% (5410/9169) remote: Counting objects: 60% (5502/9169) remote: Counting objects: 61% (5594/9169) remote: Counting objects: 62% (5685/9169) remote: Counting objects: 63% (5777/9169) remote: Counting objects: 64% (5869/9169) remote: Counting objects: 65% (5960/9169) remote: Counting objects: 66% (6052/9169) remote: Counting objects: 67% (6144/9169) remote: Counting objects: 68% (6235/9169) remote: Counting objects: 69% (6327/9169) remote: Counting objects: 70% (6419/9169) remote: Counting objects: 71% (6510/9169) remote: Counting objects: 72% (6602/9169) remote: Counting objects: 73% (6694/9169) remote: Counting objects: 74% (6786/9169) remote: Counting objects: 75% (6877/9169) remote: Counting objects: 76% (6969/9169) remote: Counting objects: 77% (7061/9169) remote: Counting objects: 78% (7152/9169) remote: Counting objects: 79% (7244/9169) remote: Counting objects: 80% (7336/9169) remote: Counting objects: 81% (7427/9169) remote: Counting objects: 82% (7519/9169) remote: Counting objects: 83% (7611/9169) remote: Counting objects: 84% (7702/9169) remote: Counting objects: 85% (7794/9169) remote: Counting objects: 86% (7886/9169) remote: Counting objects: 87% (7978/9169) remote: Counting objects: 88% (8069/9169) remote: Counting objects: 89% (8161/9169) remote: Counting objects: 90% (8253/9169) remote: Counting objects: 91% (8344/9169) remote: Counting objects: 92% (8436/9169) remote: Counting objects: 93% (8528/9169) remote: Counting objects: 94% (8619/9169) remote: Counting objects: 95% (8711/9169) remote: Counting objects: 96% (8803/9169) remote: Counting objects: 97% (8894/9169) remote: Counting objects: 98% (8986/9169) remote: Counting objects: 99% (9078/9169) remote: Counting objects: 100% (9169/9169) remote: Counting objects: 100% (9169/9169), done.
  5. 3.21 s remote: Compressing objects: 0% (1/1923) remote: Compressing objects: 1% (20/1923) remote: Compressing objects: 2% (39/1923) remote: Compressing objects: 3% (58/1923) remote: Compressing objects: 4% (77/1923) remote: Compressing objects: 5% (97/1923) remote: Compressing objects: 6% (116/1923) remote: Compressing objects: 7% (135/1923) remote: Compressing objects: 7% (140/1923) remote: Compressing objects: 8% (154/1923) remote: Compressing objects: 9% (174/1923) remote: Compressing objects: 10% (193/1923) remote: Compressing objects: 11% (212/1923) remote: Compressing objects: 12% (231/1923) remote: Compressing objects: 13% (250/1923) remote: Compressing objects: 14% (270/1923) remote: Compressing objects: 15% (289/1923) remote: Compressing objects: 16% (308/1923) remote: Compressing objects: 17% (327/1923) remote: Compressing objects: 18% (347/1923) remote: Compressing objects: 18% (355/1923) remote: Compressing objects: 19% (366/1923) remote: Compressing objects: 20% (385/1923) remote: Compressing objects: 21% (404/1923) remote: Compressing objects: 22% (424/1923) remote: Compressing objects: 23% (443/1923) remote: Compressing objects: 24% (462/1923) remote: Compressing objects: 25% (481/1923) remote: Compressing objects: 26% (500/1923) remote: Compressing objects: 27% (520/1923) remote: Compressing objects: 28% (539/1923) remote: Compressing objects: 29% (558/1923) remote: Compressing objects: 30% (577/1923) remote: Compressing objects: 31% (597/1923) remote: Compressing objects: 32% (616/1923) remote: Compressing objects: 33% (635/1923) remote: Compressing objects: 34% (654/1923) remote: Compressing objects: 35% (674/1923) remote: Compressing objects: 36% (693/1923) remote: Compressing objects: 37% (712/1923) remote: Compressing objects: 38% (731/1923) remote: Compressing objects: 39% (750/1923) remote: Compressing objects: 40% (770/1923) remote: Compressing objects: 41% (789/1923) remote: Compressing objects: 42% (808/1923) remote: Compressing objects: 43% (827/1923) remote: Compressing objects: 44% (847/1923) remote: Compressing objects: 45% (866/1923) remote: Compressing objects: 46% (885/1923) remote: Compressing objects: 47% (904/1923) remote: Compressing objects: 48% (924/1923) remote: Compressing objects: 49% (943/1923) remote: Compressing objects: 50% (962/1923) remote: Compressing objects: 51% (981/1923) remote: Compressing objects: 52% (1000/1923) remote: Compressing objects: 53% (1020/1923) remote: Compressing objects: 54% (1039/1923) remote: Compressing objects: 55% (1058/1923) remote: Compressing objects: 56% (1077/1923) remote: Compressing objects: 57% (1097/1923) remote: Compressing objects: 58% (1116/1923) remote: Compressing objects: 59% (1135/1923) remote: Compressing objects: 60% (1154/1923) remote: Compressing objects: 61% (1174/1923) remote: Compressing objects: 62% (1193/1923) remote: Compressing objects: 63% (1212/1923) remote: Compressing objects: 64% (1231/1923) remote: Compressing objects: 65% (1250/1923) remote: Compressing objects: 66% (1270/1923) remote: Compressing objects: 67% (1289/1923) remote: Compressing objects: 68% (1308/1923) remote: Compressing objects: 69% (1327/1923) remote: Compressing objects: 70% (1347/1923) remote: Compressing objects: 71% (1366/1923) remote: Compressing objects: 72% (1385/1923) remote: Compressing objects: 73% (1404/1923) remote: Compressing objects: 74% (1424/1923) remote: Compressing objects: 75% (1443/1923) remote: Compressing objects: 76% (1462/1923) remote: Compressing objects: 77% (1481/1923) remote: Compressing objects: 78% (1500/1923) remote: Compressing objects: 79% (1520/1923) remote: Compressing objects: 80% (1539/1923) remote: Compressing objects: 81% (1558/1923) remote: Compressing objects: 82% (1577/1923) remote: Compressing objects: 83% (1597/1923) remote: Compressing objects: 84% (1616/1923) remote: Compressing objects: 85% (1635/1923) remote: Compressing objects: 86% (1654/1923) remote: Compressing objects: 87% (1674/1923) remote: Compressing objects: 88% (1693/1923) remote: Compressing objects: 89% (1712/1923) remote: Compressing objects: 90% (1731/1923) remote: Compressing objects: 91% (1750/1923) remote: Compressing objects: 92% (1770/1923) remote: Compressing objects: 93% (1789/1923) remote: Compressing objects: 94% (1808/1923) remote: Compressing objects: 95% (1827/1923) remote: Compressing objects: 96% (1847/1923) remote: Compressing objects: 97% (1866/1923) remote: Compressing objects: 98% (1885/1923) remote: Compressing objects: 99% (1904/1923) remote: Compressing objects: 100% (1923/1923) remote: Compressing objects: 100% (1923/1923), done.
  6. 12.79 s Receiving objects: 0% (1/93878) Receiving objects: 1% (939/93878) Receiving objects: 2% (1878/93878) Receiving objects: 3% (2817/93878) Receiving objects: 4% (3756/93878) Receiving objects: 5% (4694/93878) Receiving objects: 6% (5633/93878) Receiving objects: 7% (6572/93878) Receiving objects: 8% (7511/93878), 15.69 MiB | 31.43 MiB/s Receiving objects: 9% (8450/93878), 15.69 MiB | 31.43 MiB/s Receiving objects: 10% (9388/93878), 15.69 MiB | 31.43 MiB/s Receiving objects: 11% (10327/93878), 15.69 MiB | 31.43 MiB/s Receiving objects: 12% (11266/93878), 15.69 MiB | 31.43 MiB/s Receiving objects: 13% (12205/93878), 15.69 MiB | 31.43 MiB/s Receiving objects: 14% (13143/93878), 15.69 MiB | 31.43 MiB/s Receiving objects: 15% (14082/93878), 15.69 MiB | 31.43 MiB/s Receiving objects: 16% (15021/93878), 15.69 MiB | 31.43 MiB/s Receiving objects: 17% (15960/93878), 15.69 MiB | 31.43 MiB/s Receiving objects: 18% (16899/93878), 15.69 MiB | 31.43 MiB/s Receiving objects: 19% (17837/93878), 15.69 MiB | 31.43 MiB/s Receiving objects: 20% (18776/93878), 15.69 MiB | 31.43 MiB/s Receiving objects: 21% (19715/93878), 15.69 MiB | 31.43 MiB/s Receiving objects: 22% (20654/93878), 15.69 MiB | 31.43 MiB/s Receiving objects: 23% (21592/93878), 15.69 MiB | 31.43 MiB/s Receiving objects: 24% (22531/93878), 15.69 MiB | 31.43 MiB/s Receiving objects: 25% (23470/93878), 15.69 MiB | 31.43 MiB/s Receiving objects: 26% (24409/93878), 15.69 MiB | 31.43 MiB/s Receiving objects: 27% (25348/93878), 15.69 MiB | 31.43 MiB/s Receiving objects: 28% (26286/93878), 15.69 MiB | 31.43 MiB/s Receiving objects: 29% (27225/93878), 15.69 MiB | 31.43 MiB/s Receiving objects: 30% (28164/93878), 15.69 MiB | 31.43 MiB/s Receiving objects: 31% (29103/93878), 15.69 MiB | 31.43 MiB/s Receiving objects: 32% (30041/93878), 15.69 MiB | 31.43 MiB/s Receiving objects: 33% (30980/93878), 15.69 MiB | 31.43 MiB/s Receiving objects: 34% (31919/93878), 15.69 MiB | 31.43 MiB/s Receiving objects: 34% (32648/93878), 30.32 MiB | 30.34 MiB/s Receiving objects: 35% (32858/93878), 30.32 MiB | 30.34 MiB/s Receiving objects: 36% (33797/93878), 30.32 MiB | 30.34 MiB/s Receiving objects: 37% (34735/93878), 30.32 MiB | 30.34 MiB/s Receiving objects: 38% (35674/93878), 30.32 MiB | 30.34 MiB/s Receiving objects: 39% (36613/93878), 30.32 MiB | 30.34 MiB/s Receiving objects: 40% (37552/93878), 30.32 MiB | 30.34 MiB/s Receiving objects: 41% (38490/93878), 43.59 MiB | 29.07 MiB/s Receiving objects: 42% (39429/93878), 43.59 MiB | 29.07 MiB/s Receiving objects: 43% (40368/93878), 43.59 MiB | 29.07 MiB/s Receiving objects: 44% (41307/93878), 43.59 MiB | 29.07 MiB/s Receiving objects: 45% (42246/93878), 43.59 MiB | 29.07 MiB/s Receiving objects: 46% (43184/93878), 43.59 MiB | 29.07 MiB/s Receiving objects: 47% (44123/93878), 43.59 MiB | 29.07 MiB/s Receiving objects: 48% (45062/93878), 43.59 MiB | 29.07 MiB/s Receiving objects: 49% (46001/93878), 43.59 MiB | 29.07 MiB/s Receiving objects: 50% (46939/93878), 43.59 MiB | 29.07 MiB/s Receiving objects: 50% (47467/93878), 43.59 MiB | 29.07 MiB/s Receiving objects: 51% (47878/93878), 60.00 MiB | 30.03 MiB/s Receiving objects: 52% (48817/93878), 60.00 MiB | 30.03 MiB/s Receiving objects: 53% (49756/93878), 60.00 MiB | 30.03 MiB/s Receiving objects: 54% (50695/93878), 60.00 MiB | 30.03 MiB/s Receiving objects: 55% (51633/93878), 60.00 MiB | 30.03 MiB/s Receiving objects: 56% (52572/93878), 60.00 MiB | 30.03 MiB/s Receiving objects: 57% (53511/93878), 60.00 MiB | 30.03 MiB/s Receiving objects: 58% (54450/93878), 77.50 MiB | 31.03 MiB/s Receiving objects: 59% (55389/93878), 77.50 MiB | 31.03 MiB/s Receiving objects: 60% (56327/93878), 77.50 MiB | 31.03 MiB/s Receiving objects: 61% (57266/93878), 77.50 MiB | 31.03 MiB/s Receiving objects: 61% (57307/93878), 92.66 MiB | 30.91 MiB/s Receiving objects: 61% (57464/93878), 126.46 MiB | 31.64 MiB/s Receiving objects: 61% (57557/93878), 142.50 MiB | 31.59 MiB/s Receiving objects: 61% (58011/93878), 193.35 MiB | 33.06 MiB/s Receiving objects: 62% (58205/93878), 209.47 MiB | 32.95 MiB/s Receiving objects: 63% (59144/93878), 209.47 MiB | 32.95 MiB/s Receiving objects: 64% (60082/93878), 209.47 MiB | 32.95 MiB/s Receiving objects: 65% (61021/93878), 209.47 MiB | 32.95 MiB/s Receiving objects: 66% (61960/93878), 209.47 MiB | 32.95 MiB/s Receiving objects: 67% (62899/93878), 209.47 MiB | 32.95 MiB/s Receiving objects: 68% (63838/93878), 209.47 MiB | 32.95 MiB/s Receiving objects: 68% (63912/93878), 226.48 MiB | 32.84 MiB/s Receiving objects: 69% (64776/93878), 226.48 MiB | 32.84 MiB/s Receiving objects: 70% (65715/93878), 226.48 MiB | 32.84 MiB/s Receiving objects: 71% (66654/93878), 226.48 MiB | 32.84 MiB/s Receiving objects: 72% (67593/93878), 226.48 MiB | 32.84 MiB/s Receiving objects: 73% (68531/93878), 226.48 MiB | 32.84 MiB/s Receiving objects: 74% (69470/93878), 226.48 MiB | 32.84 MiB/s Receiving objects: 75% (70409/93878), 226.48 MiB | 32.84 MiB/s Receiving objects: 76% (71348/93878), 243.37 MiB | 33.14 MiB/s Receiving objects: 77% (72287/93878), 243.37 MiB | 33.14 MiB/s Receiving objects: 78% (73225/93878), 243.37 MiB | 33.14 MiB/s Receiving objects: 79% (74164/93878), 243.37 MiB | 33.14 MiB/s Receiving objects: 80% (75103/93878), 243.37 MiB | 33.14 MiB/s Receiving objects: 81% (76042/93878), 243.37 MiB | 33.14 MiB/s Receiving objects: 81% (76287/93878), 243.37 MiB | 33.14 MiB/s Receiving objects: 82% (76980/93878), 260.25 MiB | 33.15 MiB/s Receiving objects: 83% (77919/93878), 276.80 MiB | 33.02 MiB/s Receiving objects: 84% (78858/93878), 276.80 MiB | 33.02 MiB/s Receiving objects: 85% (79797/93878), 276.80 MiB | 33.02 MiB/s Receiving objects: 86% (80736/93878), 276.80 MiB | 33.02 MiB/s Receiving objects: 87% (81674/93878), 276.80 MiB | 33.02 MiB/s Receiving objects: 87% (81774/93878), 276.80 MiB | 33.02 MiB/s Receiving objects: 88% (82613/93878), 293.20 MiB | 33.10 MiB/s Receiving objects: 89% (83552/93878), 293.20 MiB | 33.10 MiB/s Receiving objects: 90% (84491/93878), 293.20 MiB | 33.10 MiB/s Receiving objects: 91% (85429/93878), 293.20 MiB | 33.10 MiB/s Receiving objects: 92% (86368/93878), 293.20 MiB | 33.10 MiB/s Receiving objects: 93% (87307/93878), 293.20 MiB | 33.10 MiB/s Receiving objects: 94% (88246/93878), 293.20 MiB | 33.10 MiB/s Receiving objects: 95% (89185/93878), 293.20 MiB | 33.10 MiB/s Receiving objects: 96% (90123/93878), 293.20 MiB | 33.10 MiB/s Receiving objects: 97% (91062/93878), 293.20 MiB | 33.10 MiB/s Receiving objects: 98% (92001/93878), 293.20 MiB | 33.10 MiB/s Receiving objects: 99% (92940/93878), 293.20 MiB | 33.10 MiB/s remote: Total 93878 (delta 7949), reused 7309 (delta 7245), pack-reused 84709 (from 3)
  7. 12.79 s Receiving objects: 100% (93878/93878), 293.20 MiB | 33.10 MiB/s Receiving objects: 100% (93878/93878), 309.93 MiB | 32.39 MiB/s, done.
  8. 13.83 s Resolving deltas: 0% (0/63138) Resolving deltas: 1% (635/63138) Resolving deltas: 2% (1263/63138) Resolving deltas: 3% (1895/63138) Resolving deltas: 4% (2526/63138) Resolving deltas: 5% (3157/63138) Resolving deltas: 6% (3789/63138) Resolving deltas: 7% (4420/63138) Resolving deltas: 8% (5052/63138) Resolving deltas: 9% (5683/63138) Resolving deltas: 10% (6314/63138) Resolving deltas: 11% (6946/63138) Resolving deltas: 12% (7577/63138) Resolving deltas: 13% (8208/63138) Resolving deltas: 14% (8840/63138) Resolving deltas: 15% (9472/63138) Resolving deltas: 16% (10104/63138) Resolving deltas: 17% (10734/63138) Resolving deltas: 18% (11367/63138) Resolving deltas: 19% (11997/63138) Resolving deltas: 20% (12628/63138) Resolving deltas: 21% (13260/63138) Resolving deltas: 22% (13891/63138) Resolving deltas: 23% (14522/63138) Resolving deltas: 24% (15154/63138) Resolving deltas: 25% (15785/63138) Resolving deltas: 26% (16416/63138) Resolving deltas: 27% (17048/63138) Resolving deltas: 28% (17679/63138) Resolving deltas: 29% (18311/63138) Resolving deltas: 30% (18942/63138) Resolving deltas: 31% (19573/63138) Resolving deltas: 32% (20205/63138) Resolving deltas: 33% (20836/63138) Resolving deltas: 34% (21467/63138) Resolving deltas: 35% (22100/63138) Resolving deltas: 36% (22730/63138) Resolving deltas: 37% (23362/63138) Resolving deltas: 38% (23993/63138) Resolving deltas: 39% (24624/63138) Resolving deltas: 40% (25257/63138) Resolving deltas: 41% (25888/63138) Resolving deltas: 42% (26519/63138) Resolving deltas: 43% (27150/63138) Resolving deltas: 44% (27782/63138) Resolving deltas: 45% (28413/63138) Resolving deltas: 46% (29044/63138) Resolving deltas: 47% (29675/63138) Resolving deltas: 48% (30307/63138) Resolving deltas: 49% (30938/63138) Resolving deltas: 50% (31569/63138) Resolving deltas: 51% (32201/63138) Resolving deltas: 52% (32833/63138) Resolving deltas: 53% (33464/63138) Resolving deltas: 54% (34097/63138) Resolving deltas: 55% (34726/63138) Resolving deltas: 56% (35358/63138) Resolving deltas: 57% (35991/63138) Resolving deltas: 58% (36621/63138) Resolving deltas: 59% (37252/63138) Resolving deltas: 60% (37883/63138) Resolving deltas: 61% (38515/63138) Resolving deltas: 62% (39146/63138) Resolving deltas: 63% (39777/63138) Resolving deltas: 64% (40409/63138) Resolving deltas: 65% (41040/63138) Resolving deltas: 66% (41672/63138) Resolving deltas: 67% (42303/63138) Resolving deltas: 68% (42936/63138) Resolving deltas: 69% (43566/63138) Resolving deltas: 70% (44197/63138) Resolving deltas: 71% (44830/63138) Resolving deltas: 72% (45460/63138) Resolving deltas: 73% (46091/63138) Resolving deltas: 74% (46723/63138) Resolving deltas: 75% (47359/63138) Resolving deltas: 76% (47985/63138) Resolving deltas: 77% (48617/63138) Resolving deltas: 78% (49248/63138) Resolving deltas: 79% (49880/63138) Resolving deltas: 80% (50511/63138) Resolving deltas: 81% (51142/63138) Resolving deltas: 82% (51774/63138) Resolving deltas: 83% (52405/63138) Resolving deltas: 84% (53036/63138) Resolving deltas: 85% (53668/63138) Resolving deltas: 86% (54299/63138) Resolving deltas: 87% (54931/63138) Resolving deltas: 88% (55563/63138) Resolving deltas: 89% (56193/63138) Resolving deltas: 90% (56825/63138) Resolving deltas: 91% (57456/63138) Resolving deltas: 92% (58088/63138) Resolving deltas: 93% (58720/63138) Resolving deltas: 94% (59350/63138) Resolving deltas: 95% (59982/63138) Resolving deltas: 96% (60613/63138) Resolving deltas: 96% (60650/63138) Resolving deltas: 97% (61246/63138) Resolving deltas: 98% (61876/63138) Resolving deltas: 99% (62507/63138) Resolving deltas: 100% (63138/63138) Resolving deltas: 100% (63138/63138), done.
  9. 14.37 s Fetching commit 3f9429122eb2e371af39dd0423cbb68dcf4c90ba for advanced_sampling ...
  10. 14.37 s $ /nix/store/bcnisk3ydfgv26v2gw3zlky24g00yww2-git-2.54.0/bin/git fetch origin 3f9429122eb2e371af39dd0423cbb68dcf4c90ba
  11. 14.78 s From https://github.com/alphal00p/gammaloop
  12. 14.78 s * branch 3f9429122eb2e371af39dd0423cbb68dcf4c90ba -> FETCH_HEAD
  13. 14.79 s $ /nix/store/9ypz3flqsrl5xl495mm8h645gadjsxi1-coreutils-9.11/bin/timeout --kill-after=15s 7200s /nix/store/bcnisk3ydfgv26v2gw3zlky24g00yww2-git-2.54.0/bin/git -c advice.detachedHead=false checkout 3f9429122eb2e371af39dd0423cbb68dcf4c90ba
  14. 15.28 s HEAD is now at 3f9429122 handle fully weighted underflow in stability checks
  15. 15.29 s $ /nix/store/9ypz3flqsrl5xl495mm8h645gadjsxi1-coreutils-9.11/bin/timeout --kill-after=15s 7200s /nix/store/23zk8sgzamrbmj1fday15szf7f2279s8-nix-2.34.7/bin/nix --extra-experimental-features nix-command --extra-experimental-features flakes --log-format internal-json run .#packages.x86_64-linux.nix-ci-check-gammaloop-nextest-python-api --print-build-logs
  16. 22.78 s
  17. 22.84 s Downloading cached gammaloop-nextest-binaries-python-api-gammaloop-integration-tests from https://cache.nix-ci.com
  18. 22.84 s Downloading cached gammaloop-python-module from https://cache.nix-ci.com
  19. 22.94 s Downloaded cached gammaloop-nextest-binaries-python-api-gammaloop-integration-tests (8.5 MiB) in 101ms
  20. 22.94 s Progress: 0 of 1 built, 1 of 4 downloaded from cache (1 downloading)
  21. 22.94 s Downloading cached gammaloop-nextest-binaries-python-api from https://cache.nix-ci.com
  22. 22.95 s Downloaded cached gammaloop-nextest-binaries-python-api (520 B) in 11ms
  23. 22.95 s Progress: 0 of 1 built, 2 of 4 downloaded from cache (1 downloading)
  24. 23.92 s Downloaded cached gammaloop-python-module (150.8 MiB) in 1.0s
  25. 23.92 s Progress: 0 of 1 built, 3 of 4 downloaded from cache
  26. 23.92 s Downloading cached nix-ci-check-gammaloop-nextest-python-api from https://cache.nix-ci.com
  27. 23.92 s Downloaded cached nix-ci-check-gammaloop-nextest-python-api (1104 B) in 4ms
  28. 23.92 s Progress: 0 of 1 built, 4 of 4 downloaded from cache
  29. 31.53 s evaluating derivation 'g copying '/nix/store/881j evaluating derivation 'g copying '/nix/store/881j evaluating derivation 'g copying '/nix/store/881j evaluating derivation 'g copying '/nix/store/881j evaluating derivation 'g copying '/nix/store/881j evaluating derivation 'g copying '/nix/store/881j evaluating derivation 'g copying '/nix/store/881j evaluating derivation 'g querying gammaloop-nexte [0.0 KiB DL] querying in [0/7 built, 5/0/12 copiebuilder.pl> Running phase: patchPhase
  30. 31.54 s [1/0/5 built, 2/5/12 copbuilder.pl> Running phase: updateAutotoolsGnuConfigScriptsPhase
  31. 31.55 s builder.pl> Running phase: configurePhase
  32. 31.55 s builder.pl> no configure script, doing nothing
  33. 31.56 s builder.pl> Running phase: buildPhase
  34. 31.56 s builder.pl> Running phase: checkPhase
  35. 31.57 s builder.pl> Running phase: installPhase
  36. 31.57 s builder.pl> no Makefile or custom installPhase, doing nothing
  37. 31.57 s builder.pl> Running phase: fixupPhase
  38. 31.58 s builder.pl> shrinking RPATHs of ELF executables and libraries in /nix/store/n17p4y03iknmyjpnfk30rj7i0klr448n-builder.pl
  39. 31.58 s builder.pl> checking for references to /build/ in /nix/store/n17p4y03iknmyjpnfk30rj7i0klr448n-builder.pl...
  40. 31.59 s builder.pl> patching script interpreter paths in /nix/store/n17p4y03iknmyjpnfk30rj7i0klr448n-builder.pl
  41. 31.61 s builder.pl (post)> Uploading to the NixCI cache: /nix/store/n17p4y03iknmyjpnfk30rj7i0klr448n-builder.pl
  42. 31.66 s builder.pl (post)> warning: 'warn-short-path-literals' is deprecated, use 'lint-short-path-literals = ignore' instead
  43. 31.68 s builder.pl (post)> copying 0 paths...
  44. 31.73 s builder.pl (post)> warning: 'warn-short-path-literals' is deprecated, use 'lint-short-path-literals = ignore' instead
  45. 31.77 s builder.pl (post)> copying 0 paths...
  46. 32.32 s [1/4 built, 2/7/12 copie [1/4 built, 1/11/12 copi [1/3 built, 12 copied (2python3> structuredAttrs is enabled
  47. 32.39 s [1/1/3 built, 12 copied python3> created 227 symlinks in user environment
  48. 33.19 s python3 (post)> Uploading to the NixCI cache: /nix/store/3gi2x25n327sf3xma8b08jd57aqv69x5-python3-3.13.14-env
  49. 33.23 s python3 (post)> warning: 'warn-short-path-literals' is deprecated, use 'lint-short-path-literals = ignore' instead
  50. 33.26 s python3 (post)> copying 0 paths...
  51. 33.30 s python3 (post)> warning: 'warn-short-path-literals' is deprecated, use 'lint-short-path-literals = ignore' instead
  52. 33.44 s python3 (post)> copying 0 paths...
  53. 33.74 s [2/4 built, 12 copied (2 [1/2/3 built, 12 copied gammaloop-nextest-python-api> Extracting 1 binary, 1 build script output directory, and 3 linked paths to /build/nextest-archive-J5dUI3
  54. 33.80 s gammaloop-nextest-python-api> Extracted 18 files to /build/nextest-archive-J5dUI3 in 0.07s
  55. 33.81 s gammaloop-nextest-python-api> ------------
  56. 33.81 s gammaloop-nextest-python-api> Nextest run ID 1991f1e6-a793-428e-a18d-828fc205d70b with nextest profile: ci_gammaloop
  57. 33.81 s gammaloop-nextest-python-api> Starting 5 tests across 1 binary
  58. 33.93 s gammaloop-nextest-python-api> FAIL [ 0.118s] (1/5) gammaloop-integration-tests::test_python_api python_evaluate_sample_honors_generate_events_and_observable_snapshots
  59. 33.93 s gammaloop-nextest-python-api> stdout ---
  60. 33.93 s gammaloop-nextest-python-api>
  61. 33.93 s gammaloop-nextest-python-api> running 1 test
  62. 33.93 s gammaloop-nextest-python-api> test python_evaluate_sample_honors_generate_events_and_observable_snapshots ... FAILED
  63. 33.93 s gammaloop-nextest-python-api>
  64. 33.93 s gammaloop-nextest-python-api> failures:
  65. 33.93 s gammaloop-nextest-python-api>
  66. 33.93 s gammaloop-nextest-python-api> failures:
  67. 33.93 s gammaloop-nextest-python-api> python_evaluate_sample_honors_generate_events_and_observable_snapshots
  68. 33.93 s gammaloop-nextest-python-api>
  69. 33.93 s gammaloop-nextest-python-api> test result: FAILED. 0 passed; 1 failed; 0 ignored; 0 measured; 4 filtered out; finished in 0.11s
  70. 33.93 s gammaloop-nextest-python-api>
  71. 33.93 s gammaloop-nextest-python-api> stderr ---
  72. 33.93 s gammaloop-nextest-python-api> Error: Python API test subprocess failed.
  73. 33.93 s gammaloop-nextest-python-api> stdout:
  74. 33.93 s gammaloop-nextest-python-api> ┌────────────────────────────────────────────────────────┐
  75. 33.93 s gammaloop-nextest-python-api> │ You are running a restricted Symbolica instance. │
  76. 33.93 s gammaloop-nextest-python-api> │ │
  77. 33.93 s gammaloop-nextest-python-api> │ This mode is only permitted for non-commercial use and │
  78. 33.93 s gammaloop-nextest-python-api> │ is limited to one instance and core per machine. │
  79. 33.93 s gammaloop-nextest-python-api> │ │
  80. 33.93 s gammaloop-nextest-python-api> │ Hobbyists can easily acquire a free license key │
  81. 33.93 s gammaloop-nextest-python-api> │ that unlocks all cores and removes this banner: │
  82. 33.93 s gammaloop-nextest-python-api> │ │
  83. 33.93 s gammaloop-nextest-python-api> │ from symbolica import * │
  84. 33.93 s gammaloop-nextest-python-api> │ request_hobbyist_license('YOUR_NAME', 'YOUR_EMAIL') │
  85. 33.93 s gammaloop-nextest-python-api> │ │
  86. 33.93 s gammaloop-nextest-python-api> │ All other users can obtain a free 30-day trial key: │
  87. 33.93 s gammaloop-nextest-python-api> │ │
  88. 33.93 s gammaloop-nextest-python-api> │ from symbolica import * │
  89. 33.93 s gammaloop-nextest-python-api> │ request_trial_license('NAME', 'EMAIL', 'EMPLOYER') │
  90. 33.93 s gammaloop-nextest-python-api> │ │
  91. 33.93 s gammaloop-nextest-python-api> │ See https://symbolica.io/docs/get_started.html#license │
  92. 33.93 s gammaloop-nextest-python-api> └────────────────────────────────────────────────────────┘
  93. 33.93 s gammaloop-nextest-python-api> ┌───────────────────────────────────────────────────────────────────────────────────────────────────────────┐
  94. 33.93 s gammaloop-nextest-python-api> │ Cannot start new unlicensed Symbolica instance since there is already another one running on the machine. │
  95. 33.93 s gammaloop-nextest-python-api> └───────────────────────────────────────────────────────────────────────────────────────────────────────────┘
  96. 33.93 s gammaloop-nextest-python-api>
  97. 33.93 s gammaloop-nextest-python-api> stderr:
  98. 33.93 s gammaloop-nextest-python-api>
  99. 33.93 s gammaloop-nextest-python-api> ┌───────────────────────────────────────────────────────────┐
  100. 33.93 s gammaloop-nextest-python-api> │ Could not resolve the IP of the Symbolica license server. │
  101. 33.93 s gammaloop-nextest-python-api> │ │
  102. 33.93 s gammaloop-nextest-python-api> │ Please check your DNS configuration. │
  103. 33.93 s gammaloop-nextest-python-api> └───────────────────────────────────────────────────────────┘
  104. 33.93 s gammaloop-nextest-python-api> Error: failed to lookup address information: Temporary failure in name resolution
  105. 33.93 s gammaloop-nextest-python-api>
  106. 33.93 s gammaloop-nextest-python-api>
  107. 33.93 s gammaloop-nextest-python-api> Location:
  108. 33.93 s gammaloop-nextest-python-api> tests/tests/test_python_api.rs:156:20
  109. 33.93 s gammaloop-nextest-python-api>
  110. 33.93 s gammaloop-nextest-python-api> FAIL [ 0.118s] (2/5) gammaloop-integration-tests::test_python_api python_session_getters_return_live_toml_and_command_blocks
  111. 33.93 s gammaloop-nextest-python-api> stdout ---
  112. 33.93 s gammaloop-nextest-python-api>
  113. 33.93 s gammaloop-nextest-python-api> running 1 test
  114. 33.93 s gammaloop-nextest-python-api> test python_session_getters_return_live_toml_and_command_blocks ... FAILED
  115. 33.93 s gammaloop-nextest-python-api>
  116. 33.93 s gammaloop-nextest-python-api> failures:
  117. 33.93 s gammaloop-nextest-python-api>
  118. 33.93 s gammaloop-nextest-python-api> failures:
  119. 33.93 s gammaloop-nextest-python-api> python_session_getters_return_live_toml_and_command_blocks
  120. 33.93 s gammaloop-nextest-python-api>
  121. 33.93 s gammaloop-nextest-python-api> test result: FAILED. 0 passed; 1 failed; 0 ignored; 0 measured; 4 filtered out; finished in 0.11s
  122. 33.93 s gammaloop-nextest-python-api>
  123. 33.93 s gammaloop-nextest-python-api> stderr ---
  124. 33.93 s gammaloop-nextest-python-api> Error: Python API test subprocess failed.
  125. 33.93 s gammaloop-nextest-python-api> stdout:
  126. 33.93 s gammaloop-nextest-python-api> ┌────────────────────────────────────────────────────────┐
  127. 33.93 s gammaloop-nextest-python-api> │ You are running a restricted Symbolica instance. │
  128. 33.93 s gammaloop-nextest-python-api> │ │
  129. 33.93 s gammaloop-nextest-python-api> │ This mode is only permitted for non-commercial use and │
  130. 33.93 s gammaloop-nextest-python-api> │ is limited to one instance and core per machine. │
  131. 33.93 s gammaloop-nextest-python-api> │ │
  132. 33.93 s gammaloop-nextest-python-api> │ Hobbyists can easily acquire a free license key │
  133. 33.93 s gammaloop-nextest-python-api> │ that unlocks all cores and removes this banner: │
  134. 33.93 s gammaloop-nextest-python-api> │ │
  135. 33.93 s gammaloop-nextest-python-api> │ from symbolica import * │
  136. 33.93 s gammaloop-nextest-python-api> │ request_hobbyist_license('YOUR_NAME', 'YOUR_EMAIL') │
  137. 33.93 s gammaloop-nextest-python-api> │ │
  138. 33.93 s gammaloop-nextest-python-api> │ All other users can obtain a free 30-day trial key: │
  139. 33.93 s gammaloop-nextest-python-api> │ │
  140. 33.93 s gammaloop-nextest-python-api> │ from symbolica import * │
  141. 33.93 s gammaloop-nextest-python-api> │ request_trial_license('NAME', 'EMAIL', 'EMPLOYER') │
  142. 33.93 s gammaloop-nextest-python-api> │ │
  143. 33.93 s gammaloop-nextest-python-api> │ See https://symbolica.io/docs/get_started.html#license │
  144. 33.93 s gammaloop-nextest-python-api> └────────────────────────────────────────────────────────┘
  145. 33.93 s gammaloop-nextest-python-api> ┌───────────────────────────────────────────────────────────────────────────────────────────────────────────┐
  146. 33.93 s gammaloop-nextest-python-api> │ Cannot start new unlicensed Symbolica instance since there is already another one running on the machine. │
  147. 33.93 s gammaloop-nextest-python-api> └───────────────────────────────────────────────────────────────────────────────────────────────────────────┘
  148. 33.93 s gammaloop-nextest-python-api>
  149. 33.93 s gammaloop-nextest-python-api> stderr:
  150. 33.93 s gammaloop-nextest-python-api>
  151. 33.93 s gammaloop-nextest-python-api> ┌───────────────────────────────────────────────────────────┐
  152. 33.93 s gammaloop-nextest-python-api> │ Could not resolve the IP of the Symbolica license server. │
  153. 33.93 s gammaloop-nextest-python-api> │ │
  154. 33.93 s gammaloop-nextest-python-api> │ Please check your DNS configuration. │
  155. 33.93 s gammaloop-nextest-python-api> └───────────────────────────────────────────────────────────┘
  156. 33.93 s gammaloop-nextest-python-api> Error: failed to lookup address information: Temporary failure in name resolution
  157. 33.93 s gammaloop-nextest-python-api>
  158. 33.93 s gammaloop-nextest-python-api>
  159. 33.93 s gammaloop-nextest-python-api> Location:
  160. 33.93 s gammaloop-nextest-python-api> tests/tests/test_python_api.rs:156:20
  161. 33.93 s gammaloop-nextest-python-api>
  162. 33.94 s gammaloop-nextest-python-api> FAIL [ 0.126s] (3/5) gammaloop-integration-tests::test_python_api python_evaluate_sample_preserves_graph_grouping_and_incoming_pdgs
  163. 33.94 s gammaloop-nextest-python-api> stdout ---
  164. 33.94 s gammaloop-nextest-python-api>
  165. 33.94 s gammaloop-nextest-python-api> running 1 test
  166. 33.94 s gammaloop-nextest-python-api> test python_evaluate_sample_preserves_graph_grouping_and_incoming_pdgs ... FAILED
  167. 33.94 s gammaloop-nextest-python-api>
  168. 33.94 s gammaloop-nextest-python-api> failures:
  169. 33.94 s gammaloop-nextest-python-api>
  170. 33.94 s gammaloop-nextest-python-api> failures:
  171. 33.94 s gammaloop-nextest-python-api> python_evaluate_sample_preserves_graph_grouping_and_incoming_pdgs
  172. 33.94 s gammaloop-nextest-python-api>
  173. 33.94 s gammaloop-nextest-python-api> test result: FAILED. 0 passed; 1 failed; 0 ignored; 0 measured; 4 filtered out; finished in 0.12s
  174. 33.94 s gammaloop-nextest-python-api>
  175. 33.94 s gammaloop-nextest-python-api> stderr ---
  176. 33.94 s gammaloop-nextest-python-api> Error: Python API test subprocess failed.
  177. 33.94 s gammaloop-nextest-python-api> stdout:
  178. 33.94 s gammaloop-nextest-python-api> ┌────────────────────────────────────────────────────────┐
  179. 33.94 s gammaloop-nextest-python-api> │ You are running a restricted Symbolica instance. │
  180. 33.94 s gammaloop-nextest-python-api> │ │
  181. 33.94 s gammaloop-nextest-python-api> │ This mode is only permitted for non-commercial use and │
  182. 33.94 s gammaloop-nextest-python-api> │ is limited to one instance and core per machine. │
  183. 33.94 s gammaloop-nextest-python-api> │ │
  184. 33.94 s gammaloop-nextest-python-api> │ Hobbyists can easily acquire a free license key │
  185. 33.94 s gammaloop-nextest-python-api> │ that unlocks all cores and removes this banner: │
  186. 33.94 s gammaloop-nextest-python-api> │ │
  187. 33.94 s gammaloop-nextest-python-api> │ from symbolica import * │
  188. 33.94 s gammaloop-nextest-python-api> │ request_hobbyist_license('YOUR_NAME', 'YOUR_EMAIL') │
  189. 33.94 s gammaloop-nextest-python-api> │ │
  190. 33.94 s gammaloop-nextest-python-api> │ All other users can obtain a free 30-day trial key: │
  191. 33.94 s gammaloop-nextest-python-api> │ │
  192. 33.94 s gammaloop-nextest-python-api> │ from symbolica import * │
  193. 33.94 s gammaloop-nextest-python-api> │ request_trial_license('NAME', 'EMAIL', 'EMPLOYER') │
  194. 33.94 s gammaloop-nextest-python-api> │ │
  195. 33.94 s gammaloop-nextest-python-api> │ See https://symbolica.io/docs/get_started.html#license │
  196. 33.94 s gammaloop-nextest-python-api> └────────────────────────────────────────────────────────┘
  197. 33.94 s gammaloop-nextest-python-api> ┌───────────────────────────────────────────────────────────────────────────────────────────────────────────┐
  198. 33.94 s gammaloop-nextest-python-api> │ Cannot start new unlicensed Symbolica instance since there is already another one running on the machine. │
  199. 33.94 s gammaloop-nextest-python-api> └───────────────────────────────────────────────────────────────────────────────────────────────────────────┘
  200. 33.94 s gammaloop-nextest-python-api>
  201. 33.94 s gammaloop-nextest-python-api> stderr:
  202. 33.94 s gammaloop-nextest-python-api>
  203. 33.94 s gammaloop-nextest-python-api> ┌───────────────────────────────────────────────────────────┐
  204. 33.94 s gammaloop-nextest-python-api> │ Could not resolve the IP of the Symbolica license server. │
  205. 33.94 s gammaloop-nextest-python-api> │ │
  206. 33.94 s gammaloop-nextest-python-api> │ Please check your DNS configuration. │
  207. 33.94 s gammaloop-nextest-python-api> └───────────────────────────────────────────────────────────┘
  208. 33.94 s gammaloop-nextest-python-api> Error: failed to lookup address information: Temporary failure in name resolution
  209. 33.94 s gammaloop-nextest-python-api>
  210. 33.94 s gammaloop-nextest-python-api>
  211. 33.94 s gammaloop-nextest-python-api> Location:
  212. 33.94 s gammaloop-nextest-python-api> tests/tests/test_python_api.rs:156:20
  213. 33.94 s gammaloop-nextest-python-api>
  214. 34.02 s gammaloop-nextest-python-api> FAIL [ 0.211s] (4/5) gammaloop-integration-tests::test_python_api python_evaluate_samples_batch_and_momentum_space_have_expected_shape
  215. 34.02 s gammaloop-nextest-python-api> stdout ---
  216. 34.02 s gammaloop-nextest-python-api>
  217. 34.02 s gammaloop-nextest-python-api> running 1 test
  218. 34.02 s gammaloop-nextest-python-api> test python_evaluate_samples_batch_and_momentum_space_have_expected_shape ... FAILED
  219. 34.02 s gammaloop-nextest-python-api>
  220. 34.02 s gammaloop-nextest-python-api> failures:
  221. 34.02 s gammaloop-nextest-python-api>
  222. 34.02 s gammaloop-nextest-python-api> failures:
  223. 34.02 s gammaloop-nextest-python-api> python_evaluate_samples_batch_and_momentum_space_have_expected_shape
  224. 34.02 s gammaloop-nextest-python-api>
  225. 34.02 s gammaloop-nextest-python-api> test result: FAILED. 0 passed; 1 failed; 0 ignored; 0 measured; 4 filtered out; finished in 0.21s
  226. 34.02 s gammaloop-nextest-python-api>
  227. 34.02 s gammaloop-nextest-python-api> stderr ---
  228. 34.02 s gammaloop-nextest-python-api> Error: Python API test subprocess failed.
  229. 34.02 s gammaloop-nextest-python-api> stdout:
  230. 34.02 s gammaloop-nextest-python-api> ┌────────────────────────────────────────────────────────┐
  231. 34.02 s gammaloop-nextest-python-api> │ You are running a restricted Symbolica instance. │
  232. 34.02 s gammaloop-nextest-python-api> │ │
  233. 34.02 s gammaloop-nextest-python-api> │ This mode is only permitted for non-commercial use and │
  234. 34.02 s gammaloop-nextest-python-api> │ is limited to one instance and core per machine. │
  235. 34.02 s gammaloop-nextest-python-api> │ │
  236. 34.02 s gammaloop-nextest-python-api> │ Hobbyists can easily acquire a free license key │
  237. 34.02 s gammaloop-nextest-python-api> │ that unlocks all cores and removes this banner: │
  238. 34.02 s gammaloop-nextest-python-api> │ │
  239. 34.02 s gammaloop-nextest-python-api> │ from symbolica import * │
  240. 34.02 s gammaloop-nextest-python-api> │ request_hobbyist_license('YOUR_NAME', 'YOUR_EMAIL') │
  241. 34.02 s gammaloop-nextest-python-api> │ │
  242. 34.02 s gammaloop-nextest-python-api> │ All other users can obtain a free 30-day trial key: │
  243. 34.02 s gammaloop-nextest-python-api> │ │
  244. 34.02 s gammaloop-nextest-python-api> │ from symbolica import * │
  245. 34.02 s gammaloop-nextest-python-api> │ request_trial_license('NAME', 'EMAIL', 'EMPLOYER') │
  246. 34.02 s gammaloop-nextest-python-api> │ │
  247. 34.02 s gammaloop-nextest-python-api> │ See https://symbolica.io/docs/get_started.html#license │
  248. 34.02 s gammaloop-nextest-python-api> └────────────────────────────────────────────────────────┘
  249. 34.02 s gammaloop-nextest-python-api> ┌───────────────────────────────────────────────────────────────────────────────────────────────────────────┐
  250. 34.02 s gammaloop-nextest-python-api> │ Cannot start new unlicensed Symbolica instance since there is already another one running on the machine. │
  251. 34.02 s gammaloop-nextest-python-api> └───────────────────────────────────────────────────────────────────────────────────────────────────────────┘
  252. 34.02 s gammaloop-nextest-python-api>
  253. 34.02 s gammaloop-nextest-python-api> stderr:
  254. 34.02 s gammaloop-nextest-python-api>
  255. 34.02 s gammaloop-nextest-python-api> ┌───────────────────────────────────────────────────────────┐
  256. 34.02 s gammaloop-nextest-python-api> │ Could not resolve the IP of the Symbolica license server. │
  257. 34.02 s gammaloop-nextest-python-api> │ │
  258. 34.02 s gammaloop-nextest-python-api> │ Please check your DNS configuration. │
  259. 34.02 s gammaloop-nextest-python-api> └───────────────────────────────────────────────────────────┘
  260. 34.02 s gammaloop-nextest-python-api> Error: failed to lookup address information: Temporary failure in name resolution
  261. 34.02 s gammaloop-nextest-python-api> [2026-09-14 22:20:37.313] @gammaloop_api::se... INFO : Running command import model sm-default
  262. 34.02 s gammaloop-nextest-python-api> [2026-09-14 22:20:37.313] @import::model INFO : Loading built-in JSON model sm-default
  263. 34.02 s gammaloop-nextest-python-api> [2026-09-14 22:20:37.348] @gammalooprs::model INFO : The following 11 external parameters were forced to zero by the restriction card:
  264. 34.02 s gammaloop-nextest-python-api> lamWS, AWS, rhoWS, etaWS, ymc, yme, ymm, MC, Me, MM, WTau
  265. 34.02 s gammaloop-nextest-python-api> [2026-09-14 22:20:37.348] @gammalooprs::model INFO : The following 34 vertex rules were removed by the restriction card:
  266. 34.02 s gammaloop-nextest-python-api> V_82 -> (c~, d, G+) | V_83 -> (t~, d, G+) | V_84 -> (c~, s, G+) | V_85 -> (t~, s, G+) | V_86 -> (u~, b, G+) | V_87 -> (c~, b, G+) | V_90 -> (c~, d, W+) | V_91 -> (t~, d, W+) | V_92 -> (u~, s, W+) | V_94 -> (t~, s, W+) | V_95 -> (u~, b, W+) | V_96 -> (c~, b, W+) | V_101 -> (e+, e-, G0) | V_102 -> (mu+, mu-, G0) | V_104 -> (e+, e-, H) | V_105 -> (mu+, mu-, H) | V_110 -> (ve~, e-, G+) | V_111 -> (vm~, mu-, G+) | V_116 -> (b~, u, G-) | V_117 -> (d~, c, G-) | V_118 -> (s~, c, G-) | V_119 -> (b~, c, G-) | V_120 -> (d~, t, G-) | V_121 -> (s~, t, G-) | V_124 -> (s~, u, W-) | V_125 -> (b~, u, W-) | V_126 -> (d~, c, W-) | V_128 -> (b~, c, W-) | V_129 -> (d~, t, W-) | V_130 -> (s~, t, W-) | V_138 -> (c~, c, G0) | V_140 -> (c~, c, H) | V_145 -> (e+, ve, G-) | V_146 -> (mu+, vm, G-)
  267. 34.02 s gammaloop-nextest-python-api> [2026-09-14 22:20:37.348] @gammalooprs::model INFO : The following 36 couplings were removed by the restriction card:
  268. 34.02 s gammaloop-nextest-python-api> GC_13, GC_14, GC_16, GC_17, GC_18, GC_19, GC_20, GC_22, GC_23, GC_24, GC_25, GC_26, GC_28, GC_29, GC_42, GC_43, GC_44, GC_46, GC_47, GC_48, GC_84, GC_85, GC_86, GC_87, GC_88, GC_89, GC_90, GC_91, GC_92, GC_93, GC_101, GC_102, GC_103, GC_105, GC_106, GC_107
  269. 34.02 s gammaloop-nextest-python-api> [2026-09-14 22:20:37.348] @gammaloop_api::se... INFO : Running command set default-runtime kv kinematics.externals='{"type":"constant","data":{"momenta":[[32.0,0.0,0.0,32.0],[32.0,0.0,0.0,-32.0]],"helicities":[1,1]}}'
  270. 34.02 s gammaloop-nextest-python-api> [2026-09-14 22:20:37.349] @gammaloop_api::se... INFO : Running command set default-runtime kv subtraction.disable_threshold_subtraction=true
  271. 34.02 s gammaloop-nextest-python-api> [2026-09-14 22:20:37.350] @gammaloop_api::se... INFO : Running command generate xs e+ e- > d d~ g | e- a d g QED^2==4 [{{2}} QCD=0] --numerator-grouping group_identical_graphs_up_to_sign --clear-existing-processes --only-diagrams
  272. 34.02 s gammaloop-nextest-python-api> [2026-09-14 22:20:37.352] @feyngen::diagram_... INFO : 0s | Δ=0s | Starting Feynman graph generation with Symbolica...
  273. 34.02 s gammaloop-nextest-python-api> [2026-09-14 22:20:37.355] @feyngen::diagram_... INFO : 0s | Δ=0s | Number of graphs resulting from Symbolica generation: 246
  274. 34.02 s gammaloop-nextest-python-api> [2026-09-14 22:20:37.356] @feyngen::diagram_... INFO : 0s | Δ=0s | Number of graphs retained after enforcing supergraph particle content: 8
  275. 34.02 s gammaloop-nextest-python-api> [2026-09-14 22:20:37.356] @feyngen::diagram_... INFO : 0s | Δ=0s | Number of graphs retained after removal of vetoed topologies: 8
  276. 34.02 s gammaloop-nextest-python-api> [2026-09-14 22:20:37.356] @feyngen::diagram_... INFO : 0s | Δ=0s | Number of graphs after vertex info assignment: 8
  277. 34.02 s gammaloop-nextest-python-api> [2026-09-14 22:20:37.356] @feyngen::diagram_... INFO : 0s | Δ=0s | Number of graphs after all complete graphs filters are applied: 8
  278. 34.02 s gammaloop-nextest-python-api>
  279. 34.02 s gammaloop-nextest-python-api>
  280. 34.02 s gammaloop-nextest-python-api> Location:
  281. 34.02 s gammaloop-nextest-python-api> tests/tests/test_python_api.rs:156:20
  282. 34.02 s gammaloop-nextest-python-api>
  283. 34.04 s gammaloop-nextest-python-api> FAIL [ 0.225s] (5/5) gammaloop-integration-tests::test_python_api python_settings_wrappers_expose_nested_runtime_and_global_settings
  284. 34.04 s gammaloop-nextest-python-api> stdout ---
  285. 34.04 s gammaloop-nextest-python-api>
  286. 34.04 s gammaloop-nextest-python-api> running 1 test
  287. 34.04 s gammaloop-nextest-python-api> test python_settings_wrappers_expose_nested_runtime_and_global_settings ... FAILED
  288. 34.04 s gammaloop-nextest-python-api>
  289. 34.04 s gammaloop-nextest-python-api> failures:
  290. 34.04 s gammaloop-nextest-python-api>
  291. 34.04 s gammaloop-nextest-python-api> failures:
  292. 34.04 s gammaloop-nextest-python-api> python_settings_wrappers_expose_nested_runtime_and_global_settings
  293. 34.04 s gammaloop-nextest-python-api>
  294. 34.04 s gammaloop-nextest-python-api> test result: FAILED. 0 passed; 1 failed; 0 ignored; 0 measured; 4 filtered out; finished in 0.22s
  295. 34.04 s gammaloop-nextest-python-api>
  296. 34.04 s gammaloop-nextest-python-api> stderr ---
  297. 34.04 s gammaloop-nextest-python-api> Error: Python API test subprocess failed.
  298. 34.04 s gammaloop-nextest-python-api> stdout:
  299. 34.04 s gammaloop-nextest-python-api> ┌────────────────────────────────────────────────────────┐
  300. 34.04 s gammaloop-nextest-python-api> │ You are running a restricted Symbolica instance. │
  301. 34.04 s gammaloop-nextest-python-api> │ │
  302. 34.04 s gammaloop-nextest-python-api> │ This mode is only permitted for non-commercial use and │
  303. 34.04 s gammaloop-nextest-python-api> │ is limited to one instance and core per machine. │
  304. 34.04 s gammaloop-nextest-python-api> │ │
  305. 34.04 s gammaloop-nextest-python-api> │ Hobbyists can easily acquire a free license key │
  306. 34.04 s gammaloop-nextest-python-api> │ that unlocks all cores and removes this banner: │
  307. 34.04 s gammaloop-nextest-python-api> │ │
  308. 34.04 s gammaloop-nextest-python-api> │ from symbolica import * │
  309. 34.04 s gammaloop-nextest-python-api> │ request_hobbyist_license('YOUR_NAME', 'YOUR_EMAIL') │
  310. 34.04 s gammaloop-nextest-python-api> │ │
  311. 34.04 s gammaloop-nextest-python-api> │ All other users can obtain a free 30-day trial key: │
  312. 34.04 s gammaloop-nextest-python-api> │ │
  313. 34.04 s gammaloop-nextest-python-api> │ from symbolica import * │
  314. 34.04 s gammaloop-nextest-python-api> │ request_trial_license('NAME', 'EMAIL', 'EMPLOYER') │
  315. 34.04 s gammaloop-nextest-python-api> │ │
  316. 34.04 s gammaloop-nextest-python-api> │ See https://symbolica.io/docs/get_started.html#license │
  317. 34.04 s gammaloop-nextest-python-api> └────────────────────────────────────────────────────────┘
  318. 34.04 s gammaloop-nextest-python-api> ┌───────────────────────────────────────────────────────────────────────────────────────────────────────────┐
  319. 34.04 s gammaloop-nextest-python-api> │ Cannot start new unlicensed Symbolica instance since there is already another one running on the machine. │
  320. 34.04 s gammaloop-nextest-python-api> └───────────────────────────────────────────────────────────────────────────────────────────────────────────┘
  321. 34.04 s gammaloop-nextest-python-api>
  322. 34.04 s gammaloop-nextest-python-api> stderr:
  323. 34.04 s gammaloop-nextest-python-api>
  324. 34.04 s gammaloop-nextest-python-api> ┌───────────────────────────────────────────────────────────┐
  325. 34.04 s gammaloop-nextest-python-api> │ Could not resolve the IP of the Symbolica license server. │
  326. 34.04 s gammaloop-nextest-python-api> │ │
  327. 34.04 s gammaloop-nextest-python-api> │ Please check your DNS configuration. │
  328. 34.04 s gammaloop-nextest-python-api> └───────────────────────────────────────────────────────────┘
  329. 34.04 s gammaloop-nextest-python-api> Error: failed to lookup address information: Temporary failure in name resolution
  330. 34.04 s gammaloop-nextest-python-api>
  331. 34.04 s gammaloop-nextest-python-api>
  332. 34.04 s gammaloop-nextest-python-api> Location:
  333. 34.04 s gammaloop-nextest-python-api> tests/tests/test_python_api.rs:156:20
  334. 34.04 s gammaloop-nextest-python-api>
  335. 34.04 s gammaloop-nextest-python-api> ------------
  336. 34.04 s gammaloop-nextest-python-api> Summary [ 0.226s] 5 tests run: 0 passed, 5 failed, 0 skipped
  337. 34.04 s gammaloop-nextest-python-api> FAIL [ 0.118s] (1/5) gammaloop-integration-tests::test_python_api python_evaluate_sample_honors_generate_events_and_observable_snapshots
  338. 34.04 s gammaloop-nextest-python-api> stdout ---
  339. 34.04 s gammaloop-nextest-python-api>
  340. 34.04 s gammaloop-nextest-python-api> running 1 test
  341. 34.04 s gammaloop-nextest-python-api> test python_evaluate_sample_honors_generate_events_and_observable_snapshots ... FAILED
  342. 34.04 s gammaloop-nextest-python-api>
  343. 34.04 s gammaloop-nextest-python-api> failures:
  344. 34.04 s gammaloop-nextest-python-api>
  345. 34.04 s gammaloop-nextest-python-api> failures:
  346. 34.04 s gammaloop-nextest-python-api> python_evaluate_sample_honors_generate_events_and_observable_snapshots
  347. 34.04 s gammaloop-nextest-python-api>
  348. 34.04 s gammaloop-nextest-python-api> test result: FAILED. 0 passed; 1 failed; 0 ignored; 0 measured; 4 filtered out; finished in 0.11s
  349. 34.04 s gammaloop-nextest-python-api>
  350. 34.04 s gammaloop-nextest-python-api> stderr ---
  351. 34.04 s gammaloop-nextest-python-api> Error: Python API test subprocess failed.
  352. 34.04 s gammaloop-nextest-python-api> stdout:
  353. 34.04 s gammaloop-nextest-python-api> ┌────────────────────────────────────────────────────────┐
  354. 34.04 s gammaloop-nextest-python-api> │ You are running a restricted Symbolica instance. │
  355. 34.04 s gammaloop-nextest-python-api> │ │
  356. 34.04 s gammaloop-nextest-python-api> │ This mode is only permitted for non-commercial use and │
  357. 34.04 s gammaloop-nextest-python-api> │ is limited to one instance and core per machine. │
  358. 34.04 s gammaloop-nextest-python-api> │ │
  359. 34.04 s gammaloop-nextest-python-api> │ Hobbyists can easily acquire a free license key │
  360. 34.04 s gammaloop-nextest-python-api> │ that unlocks all cores and removes this banner: │
  361. 34.04 s gammaloop-nextest-python-api> │ │
  362. 34.04 s gammaloop-nextest-python-api> │ from symbolica import * │
  363. 34.04 s gammaloop-nextest-python-api> │ request_hobbyist_license('YOUR_NAME', 'YOUR_EMAIL') │
  364. 34.04 s gammaloop-nextest-python-api> │ │
  365. 34.04 s gammaloop-nextest-python-api> │ All other users can obtain a free 30-day trial key: │
  366. 34.04 s gammaloop-nextest-python-api> │ │
  367. 34.04 s gammaloop-nextest-python-api> │ from symbolica import * │
  368. 34.04 s gammaloop-nextest-python-api> │ request_trial_license('NAME', 'EMAIL', 'EMPLOYER') │
  369. 34.04 s gammaloop-nextest-python-api> │ │
  370. 34.04 s gammaloop-nextest-python-api> │ See https://symbolica.io/docs/get_started.html#license │
  371. 34.04 s gammaloop-nextest-python-api> └────────────────────────────────────────────────────────┘
  372. 34.04 s gammaloop-nextest-python-api> ┌───────────────────────────────────────────────────────────────────────────────────────────────────────────┐
  373. 34.04 s gammaloop-nextest-python-api> │ Cannot start new unlicensed Symbolica instance since there is already another one running on the machine. │
  374. 34.04 s gammaloop-nextest-python-api> └───────────────────────────────────────────────────────────────────────────────────────────────────────────┘
  375. 34.04 s gammaloop-nextest-python-api>
  376. 34.04 s gammaloop-nextest-python-api> stderr:
  377. 34.04 s gammaloop-nextest-python-api>
  378. 34.04 s gammaloop-nextest-python-api> ┌───────────────────────────────────────────────────────────┐
  379. 34.04 s gammaloop-nextest-python-api> │ Could not resolve the IP of the Symbolica license server. │
  380. 34.04 s gammaloop-nextest-python-api> │ │
  381. 34.04 s gammaloop-nextest-python-api> │ Please check your DNS configuration. │
  382. 34.04 s gammaloop-nextest-python-api> └───────────────────────────────────────────────────────────┘
  383. 34.04 s gammaloop-nextest-python-api> Error: failed to lookup address information: Temporary failure in name resolution
  384. 34.04 s gammaloop-nextest-python-api>
  385. 34.04 s gammaloop-nextest-python-api>
  386. 34.04 s gammaloop-nextest-python-api> Location:
  387. 34.04 s gammaloop-nextest-python-api> tests/tests/test_python_api.rs:156:20
  388. 34.04 s gammaloop-nextest-python-api>
  389. 34.04 s gammaloop-nextest-python-api> FAIL [ 0.118s] (2/5) gammaloop-integration-tests::test_python_api python_session_getters_return_live_toml_and_command_blocks
  390. 34.04 s gammaloop-nextest-python-api> stdout ---
  391. 34.04 s gammaloop-nextest-python-api>
  392. 34.04 s gammaloop-nextest-python-api> running 1 test
  393. 34.04 s gammaloop-nextest-python-api> test python_session_getters_return_live_toml_and_command_blocks ... FAILED
  394. 34.04 s gammaloop-nextest-python-api>
  395. 34.04 s gammaloop-nextest-python-api> failures:
  396. 34.04 s gammaloop-nextest-python-api>
  397. 34.04 s gammaloop-nextest-python-api> failures:
  398. 34.04 s gammaloop-nextest-python-api> python_session_getters_return_live_toml_and_command_blocks
  399. 34.04 s gammaloop-nextest-python-api>
  400. 34.04 s gammaloop-nextest-python-api> test result: FAILED. 0 passed; 1 failed; 0 ignored; 0 measured; 4 filtered out; finished in 0.11s
  401. 34.04 s gammaloop-nextest-python-api>
  402. 34.04 s gammaloop-nextest-python-api> stderr ---
  403. 34.04 s gammaloop-nextest-python-api> Error: Python API test subprocess failed.
  404. 34.04 s gammaloop-nextest-python-api> stdout:
  405. 34.04 s gammaloop-nextest-python-api> ┌────────────────────────────────────────────────────────┐
  406. 34.04 s gammaloop-nextest-python-api> │ You are running a restricted Symbolica instance. │
  407. 34.04 s gammaloop-nextest-python-api> │ │
  408. 34.04 s gammaloop-nextest-python-api> │ This mode is only permitted for non-commercial use and │
  409. 34.04 s gammaloop-nextest-python-api> │ is limited to one instance and core per machine. │
  410. 34.04 s gammaloop-nextest-python-api> │ │
  411. 34.04 s gammaloop-nextest-python-api> │ Hobbyists can easily acquire a free license key │
  412. 34.04 s gammaloop-nextest-python-api> │ that unlocks all cores and removes this banner: │
  413. 34.04 s gammaloop-nextest-python-api> │ │
  414. 34.04 s gammaloop-nextest-python-api> │ from symbolica import * │
  415. 34.04 s gammaloop-nextest-python-api> │ request_hobbyist_license('YOUR_NAME', 'YOUR_EMAIL') │
  416. 34.04 s gammaloop-nextest-python-api> │ │
  417. 34.04 s gammaloop-nextest-python-api> │ All other users can obtain a free 30-day trial key: │
  418. 34.04 s gammaloop-nextest-python-api> │ │
  419. 34.04 s gammaloop-nextest-python-api> │ from symbolica import * │
  420. 34.04 s gammaloop-nextest-python-api> │ request_trial_license('NAME', 'EMAIL', 'EMPLOYER') │
  421. 34.04 s gammaloop-nextest-python-api> │ │
  422. 34.04 s gammaloop-nextest-python-api> │ See https://symbolica.io/docs/get_started.html#license │
  423. 34.04 s gammaloop-nextest-python-api> └────────────────────────────────────────────────────────┘
  424. 34.04 s gammaloop-nextest-python-api> ┌───────────────────────────────────────────────────────────────────────────────────────────────────────────┐
  425. 34.04 s gammaloop-nextest-python-api> │ Cannot start new unlicensed Symbolica instance since there is already another one running on the machine. │
  426. 34.04 s gammaloop-nextest-python-api> └───────────────────────────────────────────────────────────────────────────────────────────────────────────┘
  427. 34.04 s gammaloop-nextest-python-api>
  428. 34.04 s gammaloop-nextest-python-api> stderr:
  429. 34.04 s gammaloop-nextest-python-api>
  430. 34.04 s gammaloop-nextest-python-api> ┌───────────────────────────────────────────────────────────┐
  431. 34.04 s gammaloop-nextest-python-api> │ Could not resolve the IP of the Symbolica license server. │
  432. 34.04 s gammaloop-nextest-python-api> │ │
  433. 34.04 s gammaloop-nextest-python-api> │ Please check your DNS configuration. │
  434. 34.04 s gammaloop-nextest-python-api> └───────────────────────────────────────────────────────────┘
  435. 34.04 s gammaloop-nextest-python-api> Error: failed to lookup address information: Temporary failure in name resolution
  436. 34.04 s gammaloop-nextest-python-api>
  437. 34.04 s gammaloop-nextest-python-api>
  438. 34.04 s gammaloop-nextest-python-api> Location:
  439. 34.04 s gammaloop-nextest-python-api> tests/tests/test_python_api.rs:156:20
  440. 34.04 s gammaloop-nextest-python-api>
  441. 34.04 s gammaloop-nextest-python-api> FAIL [ 0.126s] (3/5) gammaloop-integration-tests::test_python_api python_evaluate_sample_preserves_graph_grouping_and_incoming_pdgs
  442. 34.04 s gammaloop-nextest-python-api> stdout ---
  443. 34.04 s gammaloop-nextest-python-api>
  444. 34.04 s gammaloop-nextest-python-api> running 1 test
  445. 34.04 s gammaloop-nextest-python-api> test python_evaluate_sample_preserves_graph_grouping_and_incoming_pdgs ... FAILED
  446. 34.04 s gammaloop-nextest-python-api>
  447. 34.04 s gammaloop-nextest-python-api> failures:
  448. 34.04 s gammaloop-nextest-python-api>
  449. 34.04 s gammaloop-nextest-python-api> failures:
  450. 34.04 s gammaloop-nextest-python-api> python_evaluate_sample_preserves_graph_grouping_and_incoming_pdgs
  451. 34.04 s gammaloop-nextest-python-api>
  452. 34.04 s gammaloop-nextest-python-api> test result: FAILED. 0 passed; 1 failed; 0 ignored; 0 measured; 4 filtered out; finished in 0.12s
  453. 34.04 s gammaloop-nextest-python-api>
  454. 34.04 s gammaloop-nextest-python-api> stderr ---
  455. 34.04 s gammaloop-nextest-python-api> Error: Python API test subprocess failed.
  456. 34.04 s gammaloop-nextest-python-api> stdout:
  457. 34.04 s gammaloop-nextest-python-api> ┌────────────────────────────────────────────────────────┐
  458. 34.04 s gammaloop-nextest-python-api> │ You are running a restricted Symbolica instance. │
  459. 34.04 s gammaloop-nextest-python-api> │ │
  460. 34.04 s gammaloop-nextest-python-api> │ This mode is only permitted for non-commercial use and │
  461. 34.04 s gammaloop-nextest-python-api> │ is limited to one instance and core per machine. │
  462. 34.04 s gammaloop-nextest-python-api> │ │
  463. 34.04 s gammaloop-nextest-python-api> │ Hobbyists can easily acquire a free license key │
  464. 34.04 s gammaloop-nextest-python-api> │ that unlocks all cores and removes this banner: │
  465. 34.04 s gammaloop-nextest-python-api> │ │
  466. 34.04 s gammaloop-nextest-python-api> │ from symbolica import * │
  467. 34.04 s gammaloop-nextest-python-api> │ request_hobbyist_license('YOUR_NAME', 'YOUR_EMAIL') │
  468. 34.04 s gammaloop-nextest-python-api> │ │
  469. 34.04 s gammaloop-nextest-python-api> │ All other users can obtain a free 30-day trial key: │
  470. 34.04 s gammaloop-nextest-python-api> │ │
  471. 34.04 s gammaloop-nextest-python-api> │ from symbolica import * │
  472. 34.04 s gammaloop-nextest-python-api> │ request_trial_license('NAME', 'EMAIL', 'EMPLOYER') │
  473. 34.04 s gammaloop-nextest-python-api> │ │
  474. 34.04 s gammaloop-nextest-python-api> │ See https://symbolica.io/docs/get_started.html#license │
  475. 34.04 s gammaloop-nextest-python-api> └────────────────────────────────────────────────────────┘
  476. 34.04 s gammaloop-nextest-python-api> ┌───────────────────────────────────────────────────────────────────────────────────────────────────────────┐
  477. 34.04 s gammaloop-nextest-python-api> │ Cannot start new unlicensed Symbolica instance since there is already another one running on the machine. │
  478. 34.04 s gammaloop-nextest-python-api> └───────────────────────────────────────────────────────────────────────────────────────────────────────────┘
  479. 34.04 s gammaloop-nextest-python-api>
  480. 34.04 s gammaloop-nextest-python-api> stderr:
  481. 34.04 s gammaloop-nextest-python-api>
  482. 34.04 s gammaloop-nextest-python-api> ┌───────────────────────────────────────────────────────────┐
  483. 34.04 s gammaloop-nextest-python-api> │ Could not resolve the IP of the Symbolica license server. │
  484. 34.04 s gammaloop-nextest-python-api> │ │
  485. 34.04 s gammaloop-nextest-python-api> │ Please check your DNS configuration. │
  486. 34.04 s gammaloop-nextest-python-api> └───────────────────────────────────────────────────────────┘
  487. 34.04 s gammaloop-nextest-python-api> Error: failed to lookup address information: Temporary failure in name resolution
  488. 34.04 s gammaloop-nextest-python-api>
  489. 34.04 s gammaloop-nextest-python-api>
  490. 34.04 s gammaloop-nextest-python-api> Location:
  491. 34.04 s gammaloop-nextest-python-api> tests/tests/test_python_api.rs:156:20
  492. 34.04 s gammaloop-nextest-python-api>
  493. 34.04 s gammaloop-nextest-python-api> FAIL [ 0.211s] (4/5) gammaloop-integration-tests::test_python_api python_evaluate_samples_batch_and_momentum_space_have_expected_shape
  494. 34.04 s gammaloop-nextest-python-api> stdout ---
  495. 34.04 s gammaloop-nextest-python-api>
  496. 34.04 s gammaloop-nextest-python-api> running 1 test
  497. 34.04 s gammaloop-nextest-python-api> test python_evaluate_samples_batch_and_momentum_space_have_expected_shape ... FAILED
  498. 34.04 s gammaloop-nextest-python-api>
  499. 34.04 s gammaloop-nextest-python-api> failures:
  500. 34.04 s gammaloop-nextest-python-api>
  501. 34.04 s gammaloop-nextest-python-api> failures:
  502. 34.04 s gammaloop-nextest-python-api> python_evaluate_samples_batch_and_momentum_space_have_expected_shape
  503. 34.04 s gammaloop-nextest-python-api>
  504. 34.04 s gammaloop-nextest-python-api> test result: FAILED. 0 passed; 1 failed; 0 ignored; 0 measured; 4 filtered out; finished in 0.21s
  505. 34.04 s gammaloop-nextest-python-api>
  506. 34.04 s gammaloop-nextest-python-api> stderr ---
  507. 34.04 s gammaloop-nextest-python-api> Error: Python API test subprocess failed.
  508. 34.04 s gammaloop-nextest-python-api> stdout:
  509. 34.04 s gammaloop-nextest-python-api> ┌────────────────────────────────────────────────────────┐
  510. 34.04 s gammaloop-nextest-python-api> │ You are running a restricted Symbolica instance. │
  511. 34.04 s gammaloop-nextest-python-api> │ │
  512. 34.04 s gammaloop-nextest-python-api> │ This mode is only permitted for non-commercial use and │
  513. 34.04 s gammaloop-nextest-python-api> │ is limited to one instance and core per machine. │
  514. 34.04 s gammaloop-nextest-python-api> │ │
  515. 34.04 s gammaloop-nextest-python-api> │ Hobbyists can easily acquire a free license key │
  516. 34.04 s gammaloop-nextest-python-api> │ that unlocks all cores and removes this banner: │
  517. 34.04 s gammaloop-nextest-python-api> │ │
  518. 34.04 s gammaloop-nextest-python-api> │ from symbolica import * │
  519. 34.04 s gammaloop-nextest-python-api> │ request_hobbyist_license('YOUR_NAME', 'YOUR_EMAIL') │
  520. 34.04 s gammaloop-nextest-python-api> │ │
  521. 34.04 s gammaloop-nextest-python-api> │ All other users can obtain a free 30-day trial key: │
  522. 34.04 s gammaloop-nextest-python-api> │ │
  523. 34.04 s gammaloop-nextest-python-api> │ from symbolica import * │
  524. 34.04 s gammaloop-nextest-python-api> │ request_trial_license('NAME', 'EMAIL', 'EMPLOYER') │
  525. 34.04 s gammaloop-nextest-python-api> │ │
  526. 34.04 s gammaloop-nextest-python-api> │ See https://symbolica.io/docs/get_started.html#license │
  527. 34.04 s gammaloop-nextest-python-api> └────────────────────────────────────────────────────────┘
  528. 34.04 s gammaloop-nextest-python-api> ┌───────────────────────────────────────────────────────────────────────────────────────────────────────────┐
  529. 34.04 s gammaloop-nextest-python-api> │ Cannot start new unlicensed Symbolica instance since there is already another one running on the machine. │
  530. 34.04 s gammaloop-nextest-python-api> └───────────────────────────────────────────────────────────────────────────────────────────────────────────┘
  531. 34.04 s gammaloop-nextest-python-api>
  532. 34.04 s gammaloop-nextest-python-api> stderr:
  533. 34.04 s gammaloop-nextest-python-api>
  534. 34.04 s gammaloop-nextest-python-api> ┌───────────────────────────────────────────────────────────┐
  535. 34.04 s gammaloop-nextest-python-api> │ Could not resolve the IP of the Symbolica license server. │
  536. 34.04 s gammaloop-nextest-python-api> │ │
  537. 34.04 s gammaloop-nextest-python-api> │ Please check your DNS configuration. │
  538. 34.04 s gammaloop-nextest-python-api> └───────────────────────────────────────────────────────────┘
  539. 34.04 s gammaloop-nextest-python-api> Error: failed to lookup address information: Temporary failure in name resolution
  540. 34.04 s gammaloop-nextest-python-api> [2026-09-14 22:20:37.313] @gammaloop_api::se... INFO : Running command import model sm-default
  541. 34.04 s gammaloop-nextest-python-api> [2026-09-14 22:20:37.313] @import::model INFO : Loading built-in JSON model sm-default
  542. 34.04 s gammaloop-nextest-python-api> [2026-09-14 22:20:37.348] @gammalooprs::model INFO : The following 11 external parameters were forced to zero by the restriction card:
  543. 34.04 s gammaloop-nextest-python-api> lamWS, AWS, rhoWS, etaWS, ymc, yme, ymm, MC, Me, MM, WTau
  544. 34.04 s gammaloop-nextest-python-api> [2026-09-14 22:20:37.348] @gammalooprs::model INFO : The following 34 vertex rules were removed by the restriction card:
  545. 34.04 s gammaloop-nextest-python-api> V_82 -> (c~, d, G+) | V_83 -> (t~, d, G+) | V_84 -> (c~, s, G+) | V_85 -> (t~, s, G+) | V_86 -> (u~, b, G+) | V_87 -> (c~, b, G+) | V_90 -> (c~, d, W+) | V_91 -> (t~, d, W+) | V_92 -> (u~, s, W+) | V_94 -> (t~, s, W+) | V_95 -> (u~, b, W+) | V_96 -> (c~, b, W+) | V_101 -> (e+, e-, G0) | V_102 -> (mu+, mu-, G0) | V_104 -> (e+, e-, H) | V_105 -> (mu+, mu-, H) | V_110 -> (ve~, e-, G+) | V_111 -> (vm~, mu-, G+) | V_116 -> (b~, u, G-) | V_117 -> (d~, c, G-) | V_118 -> (s~, c, G-) | V_119 -> (b~, c, G-) | V_120 -> (d~, t, G-) | V_121 -> (s~, t, G-) | V_124 -> (s~, u, W-) | V_125 -> (b~, u, W-) | V_126 -> (d~, c, W-) | V_128 -> (b~, c, W-) | V_129 -> (d~, t, W-) | V_130 -> (s~, t, W-) | V_138 -> (c~, c, G0) | V_140 -> (c~, c, H) | V_145 -> (e+, ve, G-) | V_146 -> (mu+, vm, G-)
  546. 34.04 s gammaloop-nextest-python-api> [2026-09-14 22:20:37.348] @gammalooprs::model INFO : The following 36 couplings were removed by the restriction card:
  547. 34.04 s gammaloop-nextest-python-api> GC_13, GC_14, GC_16, GC_17, GC_18, GC_19, GC_20, GC_22, GC_23, GC_24, GC_25, GC_26, GC_28, GC_29, GC_42, GC_43, GC_44, GC_46, GC_47, GC_48, GC_84, GC_85, GC_86, GC_87, GC_88, GC_89, GC_90, GC_91, GC_92, GC_93, GC_101, GC_102, GC_103, GC_105, GC_106, GC_107
  548. 34.04 s gammaloop-nextest-python-api> [2026-09-14 22:20:37.348] @gammaloop_api::se... INFO : Running command set default-runtime kv kinematics.externals='{"type":"constant","data":{"momenta":[[32.0,0.0,0.0,32.0],[32.0,0.0,0.0,-32.0]],"helicities":[1,1]}}'
  549. 34.04 s gammaloop-nextest-python-api> [2026-09-14 22:20:37.349] @gammaloop_api::se... INFO : Running command set default-runtime kv subtraction.disable_threshold_subtraction=true
  550. 34.04 s gammaloop-nextest-python-api> [2026-09-14 22:20:37.350] @gammaloop_api::se... INFO : Running command generate xs e+ e- > d d~ g | e- a d g QED^2==4 [{{2}} QCD=0] --numerator-grouping group_identical_graphs_up_to_sign --clear-existing-processes --only-diagrams
  551. 34.04 s gammaloop-nextest-python-api> [2026-09-14 22:20:37.352] @feyngen::diagram_... INFO : 0s | Δ=0s | Starting Feynman graph generation with Symbolica...
  552. 34.04 s gammaloop-nextest-python-api> [2026-09-14 22:20:37.355] @feyngen::diagram_... INFO : 0s | Δ=0s | Number of graphs resulting from Symbolica generation: 246
  553. 34.04 s gammaloop-nextest-python-api> [2026-09-14 22:20:37.356] @feyngen::diagram_... INFO : 0s | Δ=0s | Number of graphs retained after enforcing supergraph particle content: 8
  554. 34.04 s gammaloop-nextest-python-api> [2026-09-14 22:20:37.356] @feyngen::diagram_... INFO : 0s | Δ=0s | Number of graphs retained after removal of vetoed topologies: 8
  555. 34.04 s gammaloop-nextest-python-api> [2026-09-14 22:20:37.356] @feyngen::diagram_... INFO : 0s | Δ=0s | Number of graphs after vertex info assignment: 8
  556. 34.04 s gammaloop-nextest-python-api> [2026-09-14 22:20:37.356] @feyngen::diagram_... INFO : 0s | Δ=0s | Number of graphs after all complete graphs filters are applied: 8
  557. 34.04 s gammaloop-nextest-python-api>
  558. 34.04 s gammaloop-nextest-python-api>
  559. 34.04 s gammaloop-nextest-python-api> Location:
  560. 34.04 s gammaloop-nextest-python-api> tests/tests/test_python_api.rs:156:20
  561. 34.04 s gammaloop-nextest-python-api>
  562. 34.04 s gammaloop-nextest-python-api> FAIL [ 0.225s] (5/5) gammaloop-integration-tests::test_python_api python_settings_wrappers_expose_nested_runtime_and_global_settings
  563. 34.04 s gammaloop-nextest-python-api> stdout ---
  564. 34.04 s gammaloop-nextest-python-api>
  565. 34.04 s gammaloop-nextest-python-api> running 1 test
  566. 34.04 s gammaloop-nextest-python-api> test python_settings_wrappers_expose_nested_runtime_and_global_settings ... FAILED
  567. 34.04 s gammaloop-nextest-python-api>
  568. 34.04 s gammaloop-nextest-python-api> failures:
  569. 34.04 s gammaloop-nextest-python-api>
  570. 34.04 s gammaloop-nextest-python-api> failures:
  571. 34.04 s gammaloop-nextest-python-api> python_settings_wrappers_expose_nested_runtime_and_global_settings
  572. 34.04 s gammaloop-nextest-python-api>
  573. 34.04 s gammaloop-nextest-python-api> test result: FAILED. 0 passed; 1 failed; 0 ignored; 0 measured; 4 filtered out; finished in 0.22s
  574. 34.04 s gammaloop-nextest-python-api>
  575. 34.04 s gammaloop-nextest-python-api> stderr ---
  576. 34.04 s gammaloop-nextest-python-api> Error: Python API test subprocess failed.
  577. 34.04 s gammaloop-nextest-python-api> stdout:
  578. 34.04 s gammaloop-nextest-python-api> ┌────────────────────────────────────────────────────────┐
  579. 34.04 s gammaloop-nextest-python-api> │ You are running a restricted Symbolica instance. │
  580. 34.04 s gammaloop-nextest-python-api> │ │
  581. 34.04 s gammaloop-nextest-python-api> │ This mode is only permitted for non-commercial use and │
  582. 34.04 s gammaloop-nextest-python-api> │ is limited to one instance and core per machine. │
  583. 34.04 s gammaloop-nextest-python-api> │ │
  584. 34.04 s gammaloop-nextest-python-api> │ Hobbyists can easily acquire a free license key │
  585. 34.04 s gammaloop-nextest-python-api> │ that unlocks all cores and removes this banner: │
  586. 34.04 s gammaloop-nextest-python-api> │ │
  587. 34.04 s gammaloop-nextest-python-api> │ from symbolica import * │
  588. 34.04 s gammaloop-nextest-python-api> │ request_hobbyist_license('YOUR_NAME', 'YOUR_EMAIL') │
  589. 34.04 s gammaloop-nextest-python-api> │ │
  590. 34.04 s gammaloop-nextest-python-api> │ All other users can obtain a free 30-day trial key: │
  591. 34.04 s gammaloop-nextest-python-api> │ │
  592. 34.04 s gammaloop-nextest-python-api> │ from symbolica import * │
  593. 34.04 s gammaloop-nextest-python-api> │ request_trial_license('NAME', 'EMAIL', 'EMPLOYER') │
  594. 34.04 s gammaloop-nextest-python-api> │ │
  595. 34.04 s gammaloop-nextest-python-api> │ See https://symbolica.io/docs/get_started.html#license │
  596. 34.04 s gammaloop-nextest-python-api> └────────────────────────────────────────────────────────┘
  597. 34.04 s gammaloop-nextest-python-api> ┌───────────────────────────────────────────────────────────────────────────────────────────────────────────┐
  598. 34.04 s gammaloop-nextest-python-api> │ Cannot start new unlicensed Symbolica instance since there is already another one running on the machine. │
  599. 34.04 s gammaloop-nextest-python-api> └───────────────────────────────────────────────────────────────────────────────────────────────────────────┘
  600. 34.04 s gammaloop-nextest-python-api>
  601. 34.04 s gammaloop-nextest-python-api> stderr:
  602. 34.04 s gammaloop-nextest-python-api>
  603. 34.04 s gammaloop-nextest-python-api> ┌───────────────────────────────────────────────────────────┐
  604. 34.04 s gammaloop-nextest-python-api> │ Could not resolve the IP of the Symbolica license server. │
  605. 34.04 s gammaloop-nextest-python-api> │ │
  606. 34.04 s gammaloop-nextest-python-api> │ Please check your DNS configuration. │
  607. 34.04 s gammaloop-nextest-python-api> └───────────────────────────────────────────────────────────┘
  608. 34.04 s gammaloop-nextest-python-api> Error: failed to lookup address information: Temporary failure in name resolution
  609. 34.04 s gammaloop-nextest-python-api>
  610. 34.04 s gammaloop-nextest-python-api>
  611. 34.04 s gammaloop-nextest-python-api> Location:
  612. 34.04 s gammaloop-nextest-python-api> tests/tests/test_python_api.rs:156:20
  613. 34.04 s gammaloop-nextest-python-api>
  614. 34.05 s gammaloop-nextest-python-api> error: test run failed
  615. 34.07 s gammaloop-nextest-python-api>
  616. 34.07 s gammaloop-nextest-python-api> ========== nextest test summary ==========
  617. 34.07 s gammaloop-nextest-python-api> report: target/nextest/ci_gammaloop/junit.xml
  618. 34.07 s gammaloop-nextest-python-api> tests: 5, failures: 5, errors: 0
  619. 34.07 s gammaloop-nextest-python-api>
  620. 34.07 s gammaloop-nextest-python-api> 1. gammaloop-integration-tests::test_python_api::python_evaluate_sample_honors_generate_events_and_observable_snapshots
  621. 34.07 s gammaloop-nextest-python-api> failure: test failure with exit code 101
  622. 34.07 s gammaloop-nextest-python-api> Error: Python API test subprocess failed.
  623. 34.07 s gammaloop-nextest-python-api> stdout:
  624. 34.07 s gammaloop-nextest-python-api> ┌────────────────────────────────────────────────────────┐
  625. 34.07 s gammaloop-nextest-python-api> │ You are running a restricted Symbolica instance. │
  626. 34.07 s gammaloop-nextest-python-api> │ │
  627. 34.07 s gammaloop-nextest-python-api> │ This mode is only permitted for non-commercial use and │
  628. 34.07 s gammaloop-nextest-python-api> │ is limited to one instance and core per machine. │
  629. 34.07 s gammaloop-nextest-python-api> │ │
  630. 34.07 s gammaloop-nextest-python-api> │ Hobbyists can easily acquire a free license key │
  631. 34.07 s gammaloop-nextest-python-api> │ that unlocks all cores and removes this banner: │
  632. 34.07 s gammaloop-nextest-python-api> │ │
  633. 34.07 s gammaloop-nextest-python-api> │ from symbolica import * │
  634. 34.07 s gammaloop-nextest-python-api> │ request_hobbyist_license('YOUR_NAME', 'YOUR_EMAIL') │
  635. 34.07 s gammaloop-nextest-python-api> │ │
  636. 34.07 s gammaloop-nextest-python-api> │ All other users can obtain a free 30-day trial key: │
  637. 34.07 s gammaloop-nextest-python-api> │ │
  638. 34.07 s gammaloop-nextest-python-api> │ from symbolica import * │
  639. 34.07 s gammaloop-nextest-python-api> │ request_trial_license('NAME', 'EMAIL', 'EMPLOYER') │
  640. 34.07 s gammaloop-nextest-python-api> │ │
  641. 34.07 s gammaloop-nextest-python-api> │ See https://symbolica.io/docs/get_started.html#license │
  642. 34.07 s gammaloop-nextest-python-api> └────────────────────────────────────────────────────────┘
  643. 34.07 s gammaloop-nextest-python-api> ┌───────────────────────────────────────────────────────────────────────────────────────────────────────────┐
  644. 34.07 s gammaloop-nextest-python-api> │ Cannot start new unlicensed Symbolica instance since there is already another one running on the machine. │
  645. 34.07 s gammaloop-nextest-python-api> └───────────────────────────────────────────────────────────────────────────────────────────────────────────┘
  646. 34.07 s gammaloop-nextest-python-api>
  647. 34.07 s gammaloop-nextest-python-api> stderr:
  648. 34.07 s gammaloop-nextest-python-api>
  649. 34.07 s gammaloop-nextest-python-api> ┌───────────────────────────────────────────────────────────┐
  650. 34.07 s gammaloop-nextest-python-api> │ Could not resolve the IP of the Symbolica license server. │
  651. 34.07 s gammaloop-nextest-python-api> │ │
  652. 34.07 s gammaloop-nextest-python-api> │ Please check your DNS configuration. │
  653. 34.07 s gammaloop-nextest-python-api> └───────────────────────────────────────────────────────────┘
  654. 34.07 s gammaloop-nextest-python-api> Error: failed to lookup address information: Temporary failure in name resolution
  655. 34.07 s gammaloop-nextest-python-api>
  656. 34.07 s gammaloop-nextest-python-api>
  657. 34.07 s gammaloop-nextest-python-api> Location:
  658. 34.07 s gammaloop-nextest-python-api> tests/tests/test_python_api.rs:156:20
  659. 34.07 s gammaloop-nextest-python-api> system-out
  660. 34.07 s gammaloop-nextest-python-api> running 1 test
  661. 34.07 s gammaloop-nextest-python-api> test python_evaluate_sample_honors_generate_events_and_observable_snapshots ... FAILED
  662. 34.07 s gammaloop-nextest-python-api>
  663. 34.07 s gammaloop-nextest-python-api> failures:
  664. 34.07 s gammaloop-nextest-python-api>
  665. 34.07 s gammaloop-nextest-python-api> failures:
  666. 34.07 s gammaloop-nextest-python-api> python_evaluate_sample_honors_generate_events_and_observable_snapshots
  667. 34.07 s gammaloop-nextest-python-api>
  668. 34.07 s gammaloop-nextest-python-api> test result: FAILED. 0 passed; 1 failed; 0 ignored; 0 measured; 4 filtered out; finished in 0.11s
  669. 34.07 s gammaloop-nextest-python-api> system-err
  670. 34.07 s gammaloop-nextest-python-api> Error: Python API test subprocess failed.
  671. 34.07 s gammaloop-nextest-python-api> stdout:
  672. 34.07 s gammaloop-nextest-python-api> ┌────────────────────────────────────────────────────────┐
  673. 34.07 s gammaloop-nextest-python-api> │ You are running a restricted Symbolica instance. │
  674. 34.07 s gammaloop-nextest-python-api> │ │
  675. 34.07 s gammaloop-nextest-python-api> │ This mode is only permitted for non-commercial use and │
  676. 34.07 s gammaloop-nextest-python-api> │ is limited to one instance and core per machine. │
  677. 34.07 s gammaloop-nextest-python-api> │ │
  678. 34.07 s gammaloop-nextest-python-api> │ Hobbyists can easily acquire a free license key │
  679. 34.07 s gammaloop-nextest-python-api> │ that unlocks all cores and removes this banner: │
  680. 34.07 s gammaloop-nextest-python-api> │ │
  681. 34.07 s gammaloop-nextest-python-api> │ from symbolica import * │
  682. 34.07 s gammaloop-nextest-python-api> │ request_hobbyist_license('YOUR_NAME', 'YOUR_EMAIL') │
  683. 34.07 s gammaloop-nextest-python-api> │ │
  684. 34.07 s gammaloop-nextest-python-api> │ All other users can obtain a free 30-day trial key: │
  685. 34.07 s gammaloop-nextest-python-api> │ │
  686. 34.07 s gammaloop-nextest-python-api> │ from symbolica import * │
  687. 34.07 s gammaloop-nextest-python-api> │ request_trial_license('NAME', 'EMAIL', 'EMPLOYER') │
  688. 34.07 s gammaloop-nextest-python-api> │ │
  689. 34.07 s gammaloop-nextest-python-api> │ See https://symbolica.io/docs/get_started.html#license │
  690. 34.07 s gammaloop-nextest-python-api> └────────────────────────────────────────────────────────┘
  691. 34.07 s gammaloop-nextest-python-api> ┌───────────────────────────────────────────────────────────────────────────────────────────────────────────┐
  692. 34.07 s gammaloop-nextest-python-api> │ Cannot start new unlicensed Symbolica instance since there is already another one running on the machine. │
  693. 34.07 s gammaloop-nextest-python-api> └───────────────────────────────────────────────────────────────────────────────────────────────────────────┘
  694. 34.07 s gammaloop-nextest-python-api>
  695. 34.07 s gammaloop-nextest-python-api> stderr:
  696. 34.07 s gammaloop-nextest-python-api>
  697. 34.07 s gammaloop-nextest-python-api> ┌───────────────────────────────────────────────────────────┐
  698. 34.07 s gammaloop-nextest-python-api> │ Could not resolve the IP of the Symbolica license server. │
  699. 34.07 s gammaloop-nextest-python-api> │ │
  700. 34.07 s gammaloop-nextest-python-api> │ Please check your DNS configuration. │
  701. 34.07 s gammaloop-nextest-python-api> └───────────────────────────────────────────────────────────┘
  702. 34.07 s gammaloop-nextest-python-api> Error: failed to lookup address information: Temporary failure in name resolution
  703. 34.07 s gammaloop-nextest-python-api>
  704. 34.07 s gammaloop-nextest-python-api>
  705. 34.07 s gammaloop-nextest-python-api> Location:
  706. 34.07 s gammaloop-nextest-python-api> tests/tests/test_python_api.rs:156:20
  707. 34.07 s gammaloop-nextest-python-api>
  708. 34.07 s gammaloop-nextest-python-api> 2. gammaloop-integration-tests::test_python_api::python_session_getters_return_live_toml_and_command_blocks
  709. 34.07 s gammaloop-nextest-python-api> failure: test failure with exit code 101
  710. 34.07 s gammaloop-nextest-python-api> Error: Python API test subprocess failed.
  711. 34.07 s gammaloop-nextest-python-api> stdout:
  712. 34.07 s gammaloop-nextest-python-api> ┌────────────────────────────────────────────────────────┐
  713. 34.07 s gammaloop-nextest-python-api> │ You are running a restricted Symbolica instance. │
  714. 34.07 s gammaloop-nextest-python-api> │ │
  715. 34.07 s gammaloop-nextest-python-api> │ This mode is only permitted for non-commercial use and │
  716. 34.07 s gammaloop-nextest-python-api> │ is limited to one instance and core per machine. │
  717. 34.07 s gammaloop-nextest-python-api> │ │
  718. 34.07 s gammaloop-nextest-python-api> │ Hobbyists can easily acquire a free license key │
  719. 34.07 s gammaloop-nextest-python-api> │ that unlocks all cores and removes this banner: │
  720. 34.07 s gammaloop-nextest-python-api> │ │
  721. 34.07 s gammaloop-nextest-python-api> │ from symbolica import * │
  722. 34.07 s gammaloop-nextest-python-api> │ request_hobbyist_license('YOUR_NAME', 'YOUR_EMAIL') │
  723. 34.07 s gammaloop-nextest-python-api> │ │
  724. 34.07 s gammaloop-nextest-python-api> │ All other users can obtain a free 30-day trial key: │
  725. 34.07 s gammaloop-nextest-python-api> │ │
  726. 34.07 s gammaloop-nextest-python-api> │ from symbolica import * │
  727. 34.07 s gammaloop-nextest-python-api> │ request_trial_license('NAME', 'EMAIL', 'EMPLOYER') │
  728. 34.07 s gammaloop-nextest-python-api> │ │
  729. 34.07 s gammaloop-nextest-python-api> │ See https://symbolica.io/docs/get_started.html#license │
  730. 34.07 s gammaloop-nextest-python-api> └────────────────────────────────────────────────────────┘
  731. 34.07 s gammaloop-nextest-python-api> ┌───────────────────────────────────────────────────────────────────────────────────────────────────────────┐
  732. 34.07 s gammaloop-nextest-python-api> │ Cannot start new unlicensed Symbolica instance since there is already another one running on the machine. │
  733. 34.07 s gammaloop-nextest-python-api> └───────────────────────────────────────────────────────────────────────────────────────────────────────────┘
  734. 34.07 s gammaloop-nextest-python-api>
  735. 34.07 s gammaloop-nextest-python-api> stderr:
  736. 34.07 s gammaloop-nextest-python-api>
  737. 34.07 s gammaloop-nextest-python-api> ┌───────────────────────────────────────────────────────────┐
  738. 34.07 s gammaloop-nextest-python-api> │ Could not resolve the IP of the Symbolica license server. │
  739. 34.07 s gammaloop-nextest-python-api> │ │
  740. 34.07 s gammaloop-nextest-python-api> │ Please check your DNS configuration. │
  741. 34.07 s gammaloop-nextest-python-api> └───────────────────────────────────────────────────────────┘
  742. 34.07 s gammaloop-nextest-python-api> Error: failed to lookup address information: Temporary failure in name resolution
  743. 34.07 s gammaloop-nextest-python-api>
  744. 34.07 s gammaloop-nextest-python-api>
  745. 34.07 s gammaloop-nextest-python-api> Location:
  746. 34.07 s gammaloop-nextest-python-api> tests/tests/test_python_api.rs:156:20
  747. 34.07 s gammaloop-nextest-python-api> system-out
  748. 34.07 s gammaloop-nextest-python-api> running 1 test
  749. 34.07 s gammaloop-nextest-python-api> test python_session_getters_return_live_toml_and_command_blocks ... FAILED
  750. 34.07 s gammaloop-nextest-python-api>
  751. 34.07 s gammaloop-nextest-python-api> failures:
  752. 34.07 s gammaloop-nextest-python-api>
  753. 34.07 s gammaloop-nextest-python-api> failures:
  754. 34.07 s gammaloop-nextest-python-api> python_session_getters_return_live_toml_and_command_blocks
  755. 34.07 s gammaloop-nextest-python-api>
  756. 34.07 s gammaloop-nextest-python-api> test result: FAILED. 0 passed; 1 failed; 0 ignored; 0 measured; 4 filtered out; finished in 0.11s
  757. 34.07 s gammaloop-nextest-python-api> system-err
  758. 34.07 s gammaloop-nextest-python-api> Error: Python API test subprocess failed.
  759. 34.08 s gammaloop-nextest-python-api> stdout:
  760. 34.08 s gammaloop-nextest-python-api> ┌────────────────────────────────────────────────────────┐
  761. 34.08 s gammaloop-nextest-python-api> │ You are running a restricted Symbolica instance. │
  762. 34.08 s gammaloop-nextest-python-api> │ │
  763. 34.08 s gammaloop-nextest-python-api> │ This mode is only permitted for non-commercial use and │
  764. 34.08 s gammaloop-nextest-python-api> │ is limited to one instance and core per machine. │
  765. 34.08 s gammaloop-nextest-python-api> │ │
  766. 34.08 s gammaloop-nextest-python-api> │ Hobbyists can easily acquire a free license key │
  767. 34.08 s gammaloop-nextest-python-api> │ that unlocks all cores and removes this banner: │
  768. 34.08 s gammaloop-nextest-python-api> │ │
  769. 34.08 s gammaloop-nextest-python-api> │ from symbolica import * │
  770. 34.08 s gammaloop-nextest-python-api> │ request_hobbyist_license('YOUR_NAME', 'YOUR_EMAIL') │
  771. 34.08 s gammaloop-nextest-python-api> │ │
  772. 34.08 s gammaloop-nextest-python-api> │ All other users can obtain a free 30-day trial key: │
  773. 34.08 s gammaloop-nextest-python-api> │ │
  774. 34.08 s gammaloop-nextest-python-api> │ from symbolica import * │
  775. 34.08 s gammaloop-nextest-python-api> │ request_trial_license('NAME', 'EMAIL', 'EMPLOYER') │
  776. 34.08 s gammaloop-nextest-python-api> │ │
  777. 34.08 s gammaloop-nextest-python-api> │ See https://symbolica.io/docs/get_started.html#license │
  778. 34.08 s gammaloop-nextest-python-api> └────────────────────────────────────────────────────────┘
  779. 34.08 s gammaloop-nextest-python-api> ┌───────────────────────────────────────────────────────────────────────────────────────────────────────────┐
  780. 34.08 s gammaloop-nextest-python-api> │ Cannot start new unlicensed Symbolica instance since there is already another one running on the machine. │
  781. 34.08 s gammaloop-nextest-python-api> └───────────────────────────────────────────────────────────────────────────────────────────────────────────┘
  782. 34.08 s gammaloop-nextest-python-api>
  783. 34.08 s gammaloop-nextest-python-api> stderr:
  784. 34.08 s gammaloop-nextest-python-api>
  785. 34.08 s gammaloop-nextest-python-api> ┌───────────────────────────────────────────────────────────┐
  786. 34.08 s gammaloop-nextest-python-api> │ Could not resolve the IP of the Symbolica license server. │
  787. 34.08 s gammaloop-nextest-python-api> │ │
  788. 34.08 s gammaloop-nextest-python-api> │ Please check your DNS configuration. │
  789. 34.08 s gammaloop-nextest-python-api> └───────────────────────────────────────────────────────────┘
  790. 34.08 s gammaloop-nextest-python-api> Error: failed to lookup address information: Temporary failure in name resolution
  791. 34.08 s gammaloop-nextest-python-api>
  792. 34.08 s gammaloop-nextest-python-api>
  793. 34.08 s gammaloop-nextest-python-api> Location:
  794. 34.08 s gammaloop-nextest-python-api> tests/tests/test_python_api.rs:156:20
  795. 34.08 s gammaloop-nextest-python-api>
  796. 34.08 s gammaloop-nextest-python-api> 3. gammaloop-integration-tests::test_python_api::python_evaluate_sample_preserves_graph_grouping_and_incoming_pdgs
  797. 34.08 s gammaloop-nextest-python-api> failure: test failure with exit code 101
  798. 34.08 s gammaloop-nextest-python-api> Error: Python API test subprocess failed.
  799. 34.08 s gammaloop-nextest-python-api> stdout:
  800. 34.08 s gammaloop-nextest-python-api> ┌────────────────────────────────────────────────────────┐
  801. 34.08 s gammaloop-nextest-python-api> │ You are running a restricted Symbolica instance. │
  802. 34.08 s gammaloop-nextest-python-api> │ │
  803. 34.08 s gammaloop-nextest-python-api> │ This mode is only permitted for non-commercial use and │
  804. 34.08 s gammaloop-nextest-python-api> │ is limited to one instance and core per machine. │
  805. 34.08 s gammaloop-nextest-python-api> │ │
  806. 34.08 s gammaloop-nextest-python-api> │ Hobbyists can easily acquire a free license key │
  807. 34.08 s gammaloop-nextest-python-api> │ that unlocks all cores and removes this banner: │
  808. 34.08 s gammaloop-nextest-python-api> │ │
  809. 34.08 s gammaloop-nextest-python-api> │ from symbolica import * │
  810. 34.08 s gammaloop-nextest-python-api> │ request_hobbyist_license('YOUR_NAME', 'YOUR_EMAIL') │
  811. 34.08 s gammaloop-nextest-python-api> │ │
  812. 34.08 s gammaloop-nextest-python-api> │ All other users can obtain a free 30-day trial key: │
  813. 34.08 s gammaloop-nextest-python-api> │ │
  814. 34.08 s gammaloop-nextest-python-api> │ from symbolica import * │
  815. 34.08 s gammaloop-nextest-python-api> │ request_trial_license('NAME', 'EMAIL', 'EMPLOYER') │
  816. 34.08 s gammaloop-nextest-python-api> │ │
  817. 34.08 s gammaloop-nextest-python-api> │ See https://symbolica.io/docs/get_started.html#license │
  818. 34.08 s gammaloop-nextest-python-api> └────────────────────────────────────────────────────────┘
  819. 34.08 s gammaloop-nextest-python-api> ┌───────────────────────────────────────────────────────────────────────────────────────────────────────────┐
  820. 34.08 s gammaloop-nextest-python-api> │ Cannot start new unlicensed Symbolica instance since there is already another one running on the machine. │
  821. 34.08 s gammaloop-nextest-python-api> └───────────────────────────────────────────────────────────────────────────────────────────────────────────┘
  822. 34.08 s gammaloop-nextest-python-api>
  823. 34.08 s gammaloop-nextest-python-api> stderr:
  824. 34.08 s gammaloop-nextest-python-api>
  825. 34.08 s gammaloop-nextest-python-api> ┌───────────────────────────────────────────────────────────┐
  826. 34.08 s gammaloop-nextest-python-api> │ Could not resolve the IP of the Symbolica license server. │
  827. 34.08 s gammaloop-nextest-python-api> │ │
  828. 34.08 s gammaloop-nextest-python-api> │ Please check your DNS configuration. │
  829. 34.08 s gammaloop-nextest-python-api> └───────────────────────────────────────────────────────────┘
  830. 34.08 s gammaloop-nextest-python-api> Error: failed to lookup address information: Temporary failure in name resolution
  831. 34.08 s gammaloop-nextest-python-api>
  832. 34.08 s gammaloop-nextest-python-api>
  833. 34.08 s gammaloop-nextest-python-api> Location:
  834. 34.08 s gammaloop-nextest-python-api> tests/tests/test_python_api.rs:156:20
  835. 34.08 s gammaloop-nextest-python-api> system-out
  836. 34.08 s gammaloop-nextest-python-api> running 1 test
  837. 34.08 s gammaloop-nextest-python-api> test python_evaluate_sample_preserves_graph_grouping_and_incoming_pdgs ... FAILED
  838. 34.08 s gammaloop-nextest-python-api>
  839. 34.08 s gammaloop-nextest-python-api> failures:
  840. 34.08 s gammaloop-nextest-python-api>
  841. 34.08 s gammaloop-nextest-python-api> failures:
  842. 34.08 s gammaloop-nextest-python-api> python_evaluate_sample_preserves_graph_grouping_and_incoming_pdgs
  843. 34.08 s gammaloop-nextest-python-api>
  844. 34.08 s gammaloop-nextest-python-api> test result: FAILED. 0 passed; 1 failed; 0 ignored; 0 measured; 4 filtered out; finished in 0.12s
  845. 34.08 s gammaloop-nextest-python-api> system-err
  846. 34.08 s gammaloop-nextest-python-api> Error: Python API test subprocess failed.
  847. 34.08 s gammaloop-nextest-python-api> stdout:
  848. 34.08 s gammaloop-nextest-python-api> ┌────────────────────────────────────────────────────────┐
  849. 34.08 s gammaloop-nextest-python-api> │ You are running a restricted Symbolica instance. │
  850. 34.08 s gammaloop-nextest-python-api> │ │
  851. 34.08 s gammaloop-nextest-python-api> │ This mode is only permitted for non-commercial use and │
  852. 34.08 s gammaloop-nextest-python-api> │ is limited to one instance and core per machine. │
  853. 34.08 s gammaloop-nextest-python-api> │ │
  854. 34.08 s gammaloop-nextest-python-api> │ Hobbyists can easily acquire a free license key │
  855. 34.08 s gammaloop-nextest-python-api> │ that unlocks all cores and removes this banner: │
  856. 34.08 s gammaloop-nextest-python-api> │ │
  857. 34.08 s gammaloop-nextest-python-api> │ from symbolica import * │
  858. 34.08 s gammaloop-nextest-python-api> │ request_hobbyist_license('YOUR_NAME', 'YOUR_EMAIL') │
  859. 34.08 s gammaloop-nextest-python-api> │ │
  860. 34.08 s gammaloop-nextest-python-api> │ All other users can obtain a free 30-day trial key: │
  861. 34.08 s gammaloop-nextest-python-api> │ │
  862. 34.08 s gammaloop-nextest-python-api> │ from symbolica import * │
  863. 34.08 s gammaloop-nextest-python-api> │ request_trial_license('NAME', 'EMAIL', 'EMPLOYER') │
  864. 34.08 s gammaloop-nextest-python-api> │ │
  865. 34.08 s gammaloop-nextest-python-api> │ See https://symbolica.io/docs/get_started.html#license │
  866. 34.08 s gammaloop-nextest-python-api> └────────────────────────────────────────────────────────┘
  867. 34.08 s gammaloop-nextest-python-api> ┌───────────────────────────────────────────────────────────────────────────────────────────────────────────┐
  868. 34.08 s gammaloop-nextest-python-api> │ Cannot start new unlicensed Symbolica instance since there is already another one running on the machine. │
  869. 34.08 s gammaloop-nextest-python-api> └───────────────────────────────────────────────────────────────────────────────────────────────────────────┘
  870. 34.08 s gammaloop-nextest-python-api>
  871. 34.08 s gammaloop-nextest-python-api> stderr:
  872. 34.08 s gammaloop-nextest-python-api>
  873. 34.08 s gammaloop-nextest-python-api> ┌───────────────────────────────────────────────────────────┐
  874. 34.08 s gammaloop-nextest-python-api> │ Could not resolve the IP of the Symbolica license server. │
  875. 34.08 s gammaloop-nextest-python-api> │ │
  876. 34.08 s gammaloop-nextest-python-api> │ Please check your DNS configuration. │
  877. 34.08 s gammaloop-nextest-python-api> └───────────────────────────────────────────────────────────┘
  878. 34.08 s gammaloop-nextest-python-api> Error: failed to lookup address information: Temporary failure in name resolution
  879. 34.08 s gammaloop-nextest-python-api>
  880. 34.08 s gammaloop-nextest-python-api>
  881. 34.08 s gammaloop-nextest-python-api> Location:
  882. 34.08 s gammaloop-nextest-python-api> tests/tests/test_python_api.rs:156:20
  883. 34.08 s gammaloop-nextest-python-api>
  884. 34.08 s gammaloop-nextest-python-api> 4. gammaloop-integration-tests::test_python_api::python_evaluate_samples_batch_and_momentum_space_have_expected_shape
  885. 34.08 s gammaloop-nextest-python-api> failure: test failure with exit code 101
  886. 34.08 s gammaloop-nextest-python-api> Error: Python API test subprocess failed.
  887. 34.08 s gammaloop-nextest-python-api> stdout:
  888. 34.08 s gammaloop-nextest-python-api> ┌────────────────────────────────────────────────────────┐
  889. 34.08 s gammaloop-nextest-python-api> │ You are running a restricted Symbolica instance. │
  890. 34.08 s gammaloop-nextest-python-api> │ │
  891. 34.08 s gammaloop-nextest-python-api> │ This mode is only permitted for non-commercial use and │
  892. 34.08 s gammaloop-nextest-python-api> │ is limited to one instance and core per machine. │
  893. 34.08 s gammaloop-nextest-python-api> │ │
  894. 34.08 s gammaloop-nextest-python-api> │ Hobbyists can easily acquire a free license key │
  895. 34.08 s gammaloop-nextest-python-api> │ that unlocks all cores and removes this banner: │
  896. 34.08 s gammaloop-nextest-python-api> │ │
  897. 34.08 s gammaloop-nextest-python-api> │ from symbolica import * │
  898. 34.08 s gammaloop-nextest-python-api> │ request_hobbyist_license('YOUR_NAME', 'YOUR_EMAIL') │
  899. 34.08 s gammaloop-nextest-python-api> │ │
  900. 34.08 s gammaloop-nextest-python-api> │ All other users can obtain a free 30-day trial key: │
  901. 34.08 s gammaloop-nextest-python-api> │ │
  902. 34.08 s gammaloop-nextest-python-api> │ from symbolica import * │
  903. 34.08 s gammaloop-nextest-python-api> │ request_trial_license('NAME', 'EMAIL', 'EMPLOYER') │
  904. 34.08 s gammaloop-nextest-python-api> │ │
  905. 34.08 s gammaloop-nextest-python-api> │ See https://symbolica.io/docs/get_started.html#license │
  906. 34.08 s gammaloop-nextest-python-api> └────────────────────────────────────────────────────────┘
  907. 34.08 s gammaloop-nextest-python-api> ┌───────────────────────────────────────────────────────────────────────────────────────────────────────────┐
  908. 34.08 s gammaloop-nextest-python-api> │ Cannot start new unlicensed Symbolica instance since there is already another one running on the machine. │
  909. 34.08 s gammaloop-nextest-python-api> └───────────────────────────────────────────────────────────────────────────────────────────────────────────┘
  910. 34.08 s gammaloop-nextest-python-api>
  911. 34.08 s gammaloop-nextest-python-api> stderr:
  912. 34.08 s gammaloop-nextest-python-api>
  913. 34.08 s gammaloop-nextest-python-api> ┌───────────────────────────────────────────────────────────┐
  914. 34.08 s gammaloop-nextest-python-api> │ Could not resolve the IP of the Symbolica license server. │
  915. 34.08 s gammaloop-nextest-python-api> │ │
  916. 34.08 s gammaloop-nextest-python-api> │ Please check your DNS configuration. │
  917. 34.08 s gammaloop-nextest-python-api> └───────────────────────────────────────────────────────────┘
  918. 34.08 s gammaloop-nextest-python-api> Error: failed to lookup address information: Temporary failure in name resolution
  919. 34.08 s gammaloop-nextest-python-api> [2026-09-14 22:20:37.313] @gammaloop_api::se... INFO : Running command import model sm-default
  920. 34.08 s gammaloop-nextest-python-api> [2026-09-14 22:20:37.313] @import::model INFO : Loading built-in JSON model sm-default
  921. 34.08 s gammaloop-nextest-python-api> [2026-09-14 22:20:37.348] @gammalooprs::model INFO : The following 11 external parameters were forced to zero by the restriction card:
  922. 34.08 s gammaloop-nextest-python-api> lamWS, AWS, rhoWS, etaWS, ymc, yme, ymm, MC, Me, MM, WTau
  923. 34.08 s gammaloop-nextest-python-api> [2026-09-14 22:20:37.348] @gammalooprs::model INFO : The following 34 vertex rules were removed by the restriction card:
  924. 34.08 s gammaloop-nextest-python-api> V_82 -> (c~, d, G+) | V_83 -> (t~, d, G+) | V_84 -> (c~, s, G+) | V_85 -> (t~, s, G+) | V_86 -> (u~, b, G+) | V_87 -> (c~, b, G+) | V_90 -> (c~, d, W+) | V_91 -> (t~, d, W+) | V_92 -> (u~, s, W+) | V_94 -> (t~, s, W+) | V_95 -> (u~, b, W+) | V_96 -> (c~, b, W+) | V_101 -> (e+, e-, G0) | V_102 -> (mu+, mu-, G0) | V_104 -> (e+, e-, H) | V_105 -> (mu+, mu-, H) | V_110 -> (ve~, e-, G+) | V_111 -> (vm~, mu-, G+) | V_116 -> (b~, u, G-) | V_117 -> (d~, c, G-) | V_118 -> (s~, c, G-) | V_119 -> (b~, c, G-) | V_120 -> (d~, t, G-) | V_121 -> (s~, t, G-) | V_124 -> (s~, u, W-) | V_125 -> (b~, u, W-) | V_126 -> (d~, c, W-) | V_128 -> (b~, c, W-) | V_129 -> (d~, t, W-) | V_130 -> (s~, t, W-) | V_138 -> (c~, c, G0) | V_140 -> (c~, c, H) | V_145 -> (e+, ve, G-) | V_146 -> (mu+, vm, G-)
  925. 34.08 s gammaloop-nextest-python-api> [2026-09-14 22:20:37.348] @gammalooprs::model INFO : The following 36 couplings were removed by the restriction card:
  926. 34.08 s gammaloop-nextest-python-api> GC_13, GC_14, GC_16, GC_17, GC_18, GC_19, GC_20, GC_22, GC_23, GC_24, GC_25, GC_26, GC_28, GC_29, GC_42, GC_43, GC_44, GC_46, GC_47, GC_48, GC_84, GC_85, GC_86, GC_87, GC_88, GC_89, GC_90, GC_91, GC_92, GC_93, GC_101, GC_102, GC_103, GC_105, GC_106, GC_107
  927. 34.08 s gammaloop-nextest-python-api> [2026-09-14 22:20:37.348] @gammaloop_api::se... INFO : Running command set default-runtime kv kinematics.externals='{"type":"constant","data":{"momenta":[[32.0,0.0,0.0,32.0],[32.0,0.0,0.0,-32.0]],"helicities":[1,1]}}'
  928. 34.08 s gammaloop-nextest-python-api> [2026-09-14 22:20:37.349] @gammaloop_api::se... INFO : Running command set default-runtime kv subtraction.disable_threshold_subtraction=true
  929. 34.08 s gammaloop-nextest-python-api> [2026-09-14 22:20:37.350] @gammaloop_api::se... INFO : Running command generate xs e+ e- > d d~ g | e- a d g QED^2==4 [{{2}} QCD=0] --numerator-grouping group_identical_graphs_up_to_sign --clear-existing-processes --only-diagrams
  930. 34.08 s gammaloop-nextest-python-api> [2026-09-14 22:20:37.352] @feyngen::diagram_... INFO : 0s | Δ=0s | Starting Feynman graph generation with Symbolica...
  931. 34.08 s gammaloop-nextest-python-api> [2026-09-14 22:20:37.355] @feyngen::diagram_... INFO : 0s | Δ=0s | Number of graphs resulting from Symbolica generation: 246
  932. 34.08 s gammaloop-nextest-python-api> [2026-09-14 22:20:37.356] @feyngen::diagram_... INFO : 0s | Δ=0s | Number of graphs retained after enforcing supergraph particle content: 8
  933. 34.08 s gammaloop-nextest-python-api> [2026-09-14 22:20:37.356] @feyngen::diagram_... INFO : 0s | Δ=0s | Number of graphs retained after removal of vetoed topologies: 8
  934. 34.08 s gammaloop-nextest-python-api> [2026-09-14 22:20:37.356] @feyngen::diagram_... INFO : 0s | Δ=0s | Number of graphs after vertex info assignment: 8
  935. 34.08 s gammaloop-nextest-python-api> [2026-09-14 22:20:37.356] @feyngen::diagram_... INFO : 0s | Δ=0s | Number of graphs after all complete graphs filters are applied: 8
  936. 34.08 s gammaloop-nextest-python-api>
  937. 34.08 s gammaloop-nextest-python-api>
  938. 34.08 s gammaloop-nextest-python-api> Location:
  939. 34.08 s gammaloop-nextest-python-api> tests/tests/test_python_api.rs:156:20
  940. 34.08 s gammaloop-nextest-python-api> system-out
  941. 34.08 s gammaloop-nextest-python-api> running 1 test
  942. 34.08 s gammaloop-nextest-python-api> test python_evaluate_samples_batch_and_momentum_space_have_expected_shape ... FAILED
  943. 34.08 s gammaloop-nextest-python-api>
  944. 34.08 s gammaloop-nextest-python-api> failures:
  945. 34.08 s gammaloop-nextest-python-api>
  946. 34.08 s gammaloop-nextest-python-api> failures:
  947. 34.08 s gammaloop-nextest-python-api> python_evaluate_samples_batch_and_momentum_space_have_expected_shape
  948. 34.08 s gammaloop-nextest-python-api>
  949. 34.08 s gammaloop-nextest-python-api> test result: FAILED. 0 passed; 1 failed; 0 ignored; 0 measured; 4 filtered out; finished in 0.21s
  950. 34.08 s gammaloop-nextest-python-api> system-err
  951. 34.08 s gammaloop-nextest-python-api> Error: Python API test subprocess failed.
  952. 34.08 s gammaloop-nextest-python-api> stdout:
  953. 34.08 s gammaloop-nextest-python-api> ┌────────────────────────────────────────────────────────┐
  954. 34.08 s gammaloop-nextest-python-api> │ You are running a restricted Symbolica instance. │
  955. 34.08 s gammaloop-nextest-python-api> │ │
  956. 34.08 s gammaloop-nextest-python-api> │ This mode is only permitted for non-commercial use and │
  957. 34.08 s gammaloop-nextest-python-api> │ is limited to one instance and core per machine. │
  958. 34.08 s gammaloop-nextest-python-api> │ │
  959. 34.08 s gammaloop-nextest-python-api> │ Hobbyists can easily acquire a free license key │
  960. 34.08 s gammaloop-nextest-python-api> │ that unlocks all cores and removes this banner: │
  961. 34.08 s gammaloop-nextest-python-api> │ │
  962. 34.08 s gammaloop-nextest-python-api> │ from symbolica import * │
  963. 34.08 s gammaloop-nextest-python-api> │ request_hobbyist_license('YOUR_NAME', 'YOUR_EMAIL') │
  964. 34.08 s gammaloop-nextest-python-api> │ │
  965. 34.08 s gammaloop-nextest-python-api> │ All other users can obtain a free 30-day trial key: │
  966. 34.08 s gammaloop-nextest-python-api> │ │
  967. 34.08 s gammaloop-nextest-python-api> │ from symbolica import * │
  968. 34.08 s gammaloop-nextest-python-api> │ request_trial_license('NAME', 'EMAIL', 'EMPLOYER') │
  969. 34.08 s gammaloop-nextest-python-api> │ │
  970. 34.08 s gammaloop-nextest-python-api> │ See https://symbolica.io/docs/get_started.html#license │
  971. 34.08 s gammaloop-nextest-python-api> └────────────────────────────────────────────────────────┘
  972. 34.08 s gammaloop-nextest-python-api> ┌───────────────────────────────────────────────────────────────────────────────────────────────────────────┐
  973. 34.08 s gammaloop-nextest-python-api> │ Cannot start new unlicensed Symbolica instance since there is already another one running on the machine. │
  974. 34.08 s gammaloop-nextest-python-api> └───────────────────────────────────────────────────────────────────────────────────────────────────────────┘
  975. 34.08 s gammaloop-nextest-python-api>
  976. 34.08 s gammaloop-nextest-python-api> stderr:
  977. 34.08 s gammaloop-nextest-python-api>
  978. 34.08 s gammaloop-nextest-python-api> ┌───────────────────────────────────────────────────────────┐
  979. 34.08 s gammaloop-nextest-python-api> │ Could not resolve the IP of the Symbolica license server. │
  980. 34.08 s gammaloop-nextest-python-api> │ │
  981. 34.08 s gammaloop-nextest-python-api> │ Please check your DNS configuration. │
  982. 34.08 s gammaloop-nextest-python-api> └───────────────────────────────────────────────────────────┘
  983. 34.08 s gammaloop-nextest-python-api> Error: failed to lookup address information: Temporary failure in name resolution
  984. 34.08 s gammaloop-nextest-python-api> [2026-09-14 22:20:37.313] @gammaloop_api::se... INFO : Running command import model sm-default
  985. 34.08 s gammaloop-nextest-python-api> [2026-09-14 22:20:37.313] @import::model INFO : Loading built-in JSON model sm-default
  986. 34.08 s gammaloop-nextest-python-api> [2026-09-14 22:20:37.348] @gammalooprs::model INFO : The following 11 external parameters were forced to zero by the restriction card:
  987. 34.08 s gammaloop-nextest-python-api> lamWS, AWS, rhoWS, etaWS, ymc, yme, ymm, MC, Me, MM, WTau
  988. 34.08 s gammaloop-nextest-python-api> [2026-09-14 22:20:37.348] @gammalooprs::model INFO : The following 34 vertex rules were removed by the restriction card:
  989. 34.08 s gammaloop-nextest-python-api> V_82 -> (c~, d, G+) | V_83 -> (t~, d, G+) | V_84 -> (c~, s, G+) | V_85 -> (t~, s, G+) | V_86 -> (u~, b, G+) | V_87 -> (c~, b, G+) | V_90 -> (c~, d, W+) | V_91 -> (t~, d, W+) | V_92 -> (u~, s, W+) | V_94 -> (t~, s, W+) | V_95 -> (u~, b, W+) | V_96 -> (c~, b, W+) | V_101 -> (e+, e-, G0) | V_102 -> (mu+, mu-, G0) | V_104 -> (e+, e-, H) | V_105 -> (mu+, mu-, H) | V_110 -> (ve~, e-, G+) | V_111 -> (vm~, mu-, G+) | V_116 -> (b~, u, G-) | V_117 -> (d~, c, G-) | V_118 -> (s~, c, G-) | V_119 -> (b~, c, G-) | V_120 -> (d~, t, G-) | V_121 -> (s~, t, G-) | V_124 -> (s~, u, W-) | V_125 -> (b~, u, W-) | V_126 -> (d~, c, W-) | V_128 -> (b~, c, W-) | V_129 -> (d~, t, W-) | V_130 -> (s~, t, W-) | V_138 -> (c~, c, G0) | V_140 -> (c~, c, H) | V_145 -> (e+, ve, G-) | V_146 -> (mu+, vm, G-)
  990. 34.08 s gammaloop-nextest-python-api> [2026-09-14 22:20:37.348] @gammalooprs::model INFO : The following 36 couplings were removed by the restriction card:
  991. 34.08 s gammaloop-nextest-python-api> GC_13, GC_14, GC_16, GC_17, GC_18, GC_19, GC_20, GC_22, GC_23, GC_24, GC_25, GC_26, GC_28, GC_29, GC_42, GC_43, GC_44, GC_46, GC_47, GC_48, GC_84, GC_85, GC_86, GC_87, GC_88, GC_89, GC_90, GC_91, GC_92, GC_93, GC_101, GC_102, GC_103, GC_105, GC_106, GC_107
  992. 34.08 s gammaloop-nextest-python-api> [2026-09-14 22:20:37.348] @gammaloop_api::se... INFO : Running command set default-runtime kv kinematics.externals='{"type":"constant","data":{"momenta":[[32.0,0.0,0.0,32.0],[32.0,0.0,0.0,-32.0]],"helicities":[1,1]}}'
  993. 34.08 s gammaloop-nextest-python-api> [2026-09-14 22:20:37.349] @gammaloop_api::se... INFO : Running command set default-runtime kv subtraction.disable_threshold_subtraction=true
  994. 34.08 s gammaloop-nextest-python-api> [2026-09-14 22:20:37.350] @gammaloop_api::se... INFO : Running command generate xs e+ e- > d d~ g | e- a d g QED^2==4 [{{2}} QCD=0] --numerator-grouping group_identical_graphs_up_to_sign --clear-existing-processes --only-diagrams
  995. 34.08 s gammaloop-nextest-python-api> [2026-09-14 22:20:37.352] @feyngen::diagram_... INFO : 0s | Δ=0s | Starting Feynman graph generation with Symbolica...
  996. 34.08 s gammaloop-nextest-python-api> [2026-09-14 22:20:37.355] @feyngen::diagram_... INFO : 0s | Δ=0s | Number of graphs resulting from Symbolica generation: 246
  997. 34.08 s gammaloop-nextest-python-api> [2026-09-14 22:20:37.356] @feyngen::diagram_... INFO : 0s | Δ=0s | Number of graphs retained after enforcing supergraph particle content: 8
  998. 34.08 s gammaloop-nextest-python-api> [2026-09-14 22:20:37.356] @feyngen::diagram_... INFO : 0s | Δ=0s | Number of graphs retained after removal of vetoed topologies: 8
  999. 34.08 s gammaloop-nextest-python-api> [2026-09-14 22:20:37.356] @feyngen::diagram_... INFO : 0s | Δ=0s | Number of graphs after vertex info assignment: 8
  1000. 34.08 s gammaloop-nextest-python-api> [2026-09-14 22:20:37.356] @feyngen::diagram_... INFO : 0s | Δ=0s | Number of graphs after all complete graphs filters are applied: 8
  1001. 34.08 s gammaloop-nextest-python-api>
  1002. 34.08 s gammaloop-nextest-python-api>
  1003. 34.08 s gammaloop-nextest-python-api> Location:
  1004. 34.08 s gammaloop-nextest-python-api> tests/tests/test_python_api.rs:156:20
  1005. 34.08 s gammaloop-nextest-python-api>
  1006. 34.08 s gammaloop-nextest-python-api> 5. gammaloop-integration-tests::test_python_api::python_settings_wrappers_expose_nested_runtime_and_global_settings
  1007. 34.08 s gammaloop-nextest-python-api> failure: test failure with exit code 101
  1008. 34.08 s gammaloop-nextest-python-api> Error: Python API test subprocess failed.
  1009. 34.08 s gammaloop-nextest-python-api> stdout:
  1010. 34.08 s gammaloop-nextest-python-api> ┌────────────────────────────────────────────────────────┐
  1011. 34.08 s gammaloop-nextest-python-api> │ You are running a restricted Symbolica instance. │
  1012. 34.08 s gammaloop-nextest-python-api> │ │
  1013. 34.08 s gammaloop-nextest-python-api> │ This mode is only permitted for non-commercial use and │
  1014. 34.08 s gammaloop-nextest-python-api> │ is limited to one instance and core per machine. │
  1015. 34.08 s gammaloop-nextest-python-api> │ │
  1016. 34.08 s gammaloop-nextest-python-api> │ Hobbyists can easily acquire a free license key │
  1017. 34.08 s gammaloop-nextest-python-api> │ that unlocks all cores and removes this banner: │
  1018. 34.08 s gammaloop-nextest-python-api> │ │
  1019. 34.08 s gammaloop-nextest-python-api> │ from symbolica import * │
  1020. 34.08 s gammaloop-nextest-python-api> │ request_hobbyist_license('YOUR_NAME', 'YOUR_EMAIL') │
  1021. 34.08 s gammaloop-nextest-python-api> │ │
  1022. 34.08 s gammaloop-nextest-python-api> │ All other users can obtain a free 30-day trial key: │
  1023. 34.08 s gammaloop-nextest-python-api> │ │
  1024. 34.08 s gammaloop-nextest-python-api> │ from symbolica import * │
  1025. 34.08 s gammaloop-nextest-python-api> │ request_trial_license('NAME', 'EMAIL', 'EMPLOYER') │
  1026. 34.08 s gammaloop-nextest-python-api> │ │
  1027. 34.08 s gammaloop-nextest-python-api> │ See https://symbolica.io/docs/get_started.html#license │
  1028. 34.08 s gammaloop-nextest-python-api> └────────────────────────────────────────────────────────┘
  1029. 34.08 s gammaloop-nextest-python-api> ┌───────────────────────────────────────────────────────────────────────────────────────────────────────────┐
  1030. 34.08 s gammaloop-nextest-python-api> │ Cannot start new unlicensed Symbolica instance since there is already another one running on the machine. │
  1031. 34.08 s gammaloop-nextest-python-api> └───────────────────────────────────────────────────────────────────────────────────────────────────────────┘
  1032. 34.08 s gammaloop-nextest-python-api>
  1033. 34.08 s gammaloop-nextest-python-api> stderr:
  1034. 34.08 s gammaloop-nextest-python-api>
  1035. 34.08 s gammaloop-nextest-python-api> ┌───────────────────────────────────────────────────────────┐
  1036. 34.08 s gammaloop-nextest-python-api> │ Could not resolve the IP of the Symbolica license server. │
  1037. 34.08 s gammaloop-nextest-python-api> │ │
  1038. 34.08 s gammaloop-nextest-python-api> │ Please check your DNS configuration. │
  1039. 34.08 s gammaloop-nextest-python-api> └───────────────────────────────────────────────────────────┘
  1040. 34.08 s gammaloop-nextest-python-api> Error: failed to lookup address information: Temporary failure in name resolution
  1041. 34.08 s gammaloop-nextest-python-api>
  1042. 34.08 s gammaloop-nextest-python-api>
  1043. 34.08 s gammaloop-nextest-python-api> Location:
  1044. 34.08 s gammaloop-nextest-python-api> tests/tests/test_python_api.rs:156:20
  1045. 34.08 s gammaloop-nextest-python-api> system-out
  1046. 34.08 s gammaloop-nextest-python-api> running 1 test
  1047. 34.08 s gammaloop-nextest-python-api> test python_settings_wrappers_expose_nested_runtime_and_global_settings ... FAILED
  1048. 34.08 s gammaloop-nextest-python-api>
  1049. 34.08 s gammaloop-nextest-python-api> failures:
  1050. 34.08 s gammaloop-nextest-python-api>
  1051. 34.08 s gammaloop-nextest-python-api> failures:
  1052. 34.08 s gammaloop-nextest-python-api> python_settings_wrappers_expose_nested_runtime_and_global_settings
  1053. 34.08 s gammaloop-nextest-python-api>
  1054. 34.08 s gammaloop-nextest-python-api> test result: FAILED. 0 passed; 1 failed; 0 ignored; 0 measured; 4 filtered out; finished in 0.22s
  1055. 34.08 s gammaloop-nextest-python-api> system-err
  1056. 34.08 s gammaloop-nextest-python-api> Error: Python API test subprocess failed.
  1057. 34.08 s gammaloop-nextest-python-api> stdout:
  1058. 34.08 s gammaloop-nextest-python-api> ┌────────────────────────────────────────────────────────┐
  1059. 34.08 s gammaloop-nextest-python-api> │ You are running a restricted Symbolica instance. │
  1060. 34.08 s gammaloop-nextest-python-api> │ │
  1061. 34.08 s gammaloop-nextest-python-api> │ This mode is only permitted for non-commercial use and │
  1062. 34.08 s gammaloop-nextest-python-api> │ is limited to one instance and core per machine. │
  1063. 34.08 s gammaloop-nextest-python-api> │ │
  1064. 34.08 s gammaloop-nextest-python-api> │ Hobbyists can easily acquire a free license key │
  1065. 34.08 s gammaloop-nextest-python-api> │ that unlocks all cores and removes this banner: │
  1066. 34.08 s gammaloop-nextest-python-api> │ │
  1067. 34.08 s gammaloop-nextest-python-api> │ from symbolica import * │
  1068. 34.08 s gammaloop-nextest-python-api> │ request_hobbyist_license('YOUR_NAME', 'YOUR_EMAIL') │
  1069. 34.08 s gammaloop-nextest-python-api> │ │
  1070. 34.08 s gammaloop-nextest-python-api> │ All other users can obtain a free 30-day trial key: │
  1071. 34.08 s gammaloop-nextest-python-api> │ │
  1072. 34.08 s gammaloop-nextest-python-api> │ from symbolica import * │
  1073. 34.08 s gammaloop-nextest-python-api> │ request_trial_license('NAME', 'EMAIL', 'EMPLOYER') │
  1074. 34.08 s gammaloop-nextest-python-api> │ │
  1075. 34.08 s gammaloop-nextest-python-api> │ See https://symbolica.io/docs/get_started.html#license │
  1076. 34.08 s gammaloop-nextest-python-api> └────────────────────────────────────────────────────────┘
  1077. 34.08 s gammaloop-nextest-python-api> ┌───────────────────────────────────────────────────────────────────────────────────────────────────────────┐
  1078. 34.08 s gammaloop-nextest-python-api> │ Cannot start new unlicensed Symbolica instance since there is already another one running on the machine. │
  1079. 34.08 s gammaloop-nextest-python-api> └───────────────────────────────────────────────────────────────────────────────────────────────────────────┘
  1080. 34.08 s gammaloop-nextest-python-api>
  1081. 34.08 s gammaloop-nextest-python-api> stderr:
  1082. 34.08 s gammaloop-nextest-python-api>
  1083. 34.08 s gammaloop-nextest-python-api> ┌───────────────────────────────────────────────────────────┐
  1084. 34.08 s gammaloop-nextest-python-api> │ Could not resolve the IP of the Symbolica license server. │
  1085. 34.08 s gammaloop-nextest-python-api> │ │
  1086. 34.08 s gammaloop-nextest-python-api> │ Please check your DNS configuration. │
  1087. 34.08 s gammaloop-nextest-python-api> └───────────────────────────────────────────────────────────┘
  1088. 34.08 s gammaloop-nextest-python-api> Error: failed to lookup address information: Temporary failure in name resolution
  1089. 34.08 s gammaloop-nextest-python-api>
  1090. 34.08 s gammaloop-nextest-python-api>
  1091. 34.08 s gammaloop-nextest-python-api> Location:
  1092. 34.08 s gammaloop-nextest-python-api> tests/tests/test_python_api.rs:156:20
  1093. 34.08 s gammaloop-nextest-python-api> =========================================
  1094. 34.12 s error: Cannot build '/nix/store/0y85356skfl9xg7hqjngmsb9xh03dwf2-gammaloop-nextest-python-api.drv'.
  1095. 34.12 s Reason: builder failed with exit code 100.
  1096. 34.12 s Output paths:
  1097. 34.12 s /nix/store/qv9gx72pb7v8mx997s1xlipkhg6cf7s1-gammaloop-nextest-python-api
  1098. 34.12 s Last 1041 log lines:
  1099. 34.12 s > Extracting 1 binary, 1 build script output directory, and 3 linked paths to /build/nextest-archive-J5dUI3
  1100. 34.12 s > Extracted 18 files to /build/nextest-archive-J5dUI3 in 0.07s
  1101. 34.12 s > ------------
  1102. 34.12 s > Nextest run ID 1991f1e6-a793-428e-a18d-828fc205d70b with nextest profile: ci_gammaloop
  1103. 34.12 s > Starting 5 tests across 1 binary
  1104. 34.12 s > FAIL [ 0.118s] (1/5) gammaloop-integration-tests::test_python_api python_evaluate_sample_honors_generate_events_and_observable_snapshots
  1105. 34.12 s > stdout ---
  1106. 34.12 s >
  1107. 34.12 s > running 1 test
  1108. 34.12 s > test python_evaluate_sample_honors_generate_events_and_observable_snapshots ... FAILED
  1109. 34.12 s >
  1110. 34.12 s > failures:
  1111. 34.12 s >
  1112. 34.12 s > failures:
  1113. 34.12 s > python_evaluate_sample_honors_generate_events_and_observable_snapshots
  1114. 34.12 s >
  1115. 34.12 s > test result: FAILED. 0 passed; 1 failed; 0 ignored; 0 measured; 4 filtered out; finished in 0.11s
  1116. 34.12 s >
  1117. 34.12 s > stderr ---
  1118. 34.12 s > Error: Python API test subprocess failed.
  1119. 34.12 s > stdout:
  1120. 34.12 s > ┌────────────────────────────────────────────────────────┐
  1121. 34.12 s > │ You are running a restricted Symbolica instance. │
  1122. 34.12 s > │ │
  1123. 34.12 s > │ This mode is only permitted for non-commercial use and │
  1124. 34.12 s > │ is limited to one instance and core per machine. │
  1125. 34.12 s > │ │
  1126. 34.12 s > │ Hobbyists can easily acquire a free license key │
  1127. 34.12 s > │ that unlocks all cores and removes this banner: │
  1128. 34.12 s > │ │
  1129. 34.12 s > │ from symbolica import * │
  1130. 34.12 s > │ request_hobbyist_license('YOUR_NAME', 'YOUR_EMAIL') │
  1131. 34.12 s > │ │
  1132. 34.12 s > │ All other users can obtain a free 30-day trial key: │
  1133. 34.12 s > │ │
  1134. 34.12 s > │ from symbolica import * │
  1135. 34.12 s > │ request_trial_license('NAME', 'EMAIL', 'EMPLOYER') │
  1136. 34.12 s > │ │
  1137. 34.12 s > │ See https://symbolica.io/docs/get_started.html#license │
  1138. 34.12 s > └────────────────────────────────────────────────────────┘
  1139. 34.12 s > ┌───────────────────────────────────────────────────────────────────────────────────────────────────────────┐
  1140. 34.12 s > │ Cannot start new unlicensed Symbolica instance since there is already another one running on the machine. │
  1141. 34.12 s > └───────────────────────────────────────────────────────────────────────────────────────────────────────────┘
  1142. 34.12 s >
  1143. 34.12 s > stderr:
  1144. 34.12 s >
  1145. 34.12 s > ┌───────────────────────────────────────────────────────────┐
  1146. 34.12 s > │ Could not resolve the IP of the Symbolica license server. │
  1147. 34.12 s > │ │
  1148. 34.12 s > │ Please check your DNS configuration. │
  1149. 34.12 s > └───────────────────────────────────────────────────────────┘
  1150. 34.12 s > Error: failed to lookup address information: Temporary failure in name resolution
  1151. 34.12 s >
  1152. 34.12 s >
  1153. 34.12 s > Location:
  1154. 34.12 s > tests/tests/test_python_api.rs:156:20
  1155. 34.12 s >
  1156. 34.12 s > FAIL [ 0.118s] (2/5) gammaloop-integration-tests::test_python_api python_session_getters_return_live_toml_and_command_blocks
  1157. 34.12 s > stdout ---
  1158. 34.12 s >
  1159. 34.12 s > running 1 test
  1160. 34.12 s > test python_session_getters_return_live_toml_and_command_blocks ... FAILED
  1161. 34.12 s >
  1162. 34.12 s > failures:
  1163. 34.12 s >
  1164. 34.12 s > failures:
  1165. 34.12 s > python_session_getters_return_live_toml_and_command_blocks
  1166. 34.12 s >
  1167. 34.12 s > test result: FAILED. 0 passed; 1 failed; 0 ignored; 0 measured; 4 filtered out; finished in 0.11s
  1168. 34.12 s >
  1169. 34.12 s > stderr ---
  1170. 34.12 s > Error: Python API test subprocess failed.
  1171. 34.12 s > stdout:
  1172. 34.12 s > ┌────────────────────────────────────────────────────────┐
  1173. 34.12 s > │ You are running a restricted Symbolica instance. │
  1174. 34.12 s > │ │
  1175. 34.12 s > │ This mode is only permitted for non-commercial use and │
  1176. 34.12 s > │ is limited to one instance and core per machine. │
  1177. 34.12 s > │ │
  1178. 34.12 s > │ Hobbyists can easily acquire a free license key │
  1179. 34.12 s > │ that unlocks all cores and removes this banner: │
  1180. 34.12 s > │ │
  1181. 34.12 s > │ from symbolica import * │
  1182. 34.12 s > │ request_hobbyist_license('YOUR_NAME', 'YOUR_EMAIL') │
  1183. 34.12 s > │ │
  1184. 34.12 s > │ All other users can obtain a free 30-day trial key: │
  1185. 34.12 s > │ │
  1186. 34.12 s > │ from symbolica import * │
  1187. 34.12 s > │ request_trial_license('NAME', 'EMAIL', 'EMPLOYER') │
  1188. 34.12 s > │ │
  1189. 34.12 s > │ See https://symbolica.io/docs/get_started.html#license │
  1190. 34.12 s > └────────────────────────────────────────────────────────┘
  1191. 34.12 s > ┌───────────────────────────────────────────────────────────────────────────────────────────────────────────┐
  1192. 34.12 s > │ Cannot start new unlicensed Symbolica instance since there is already another one running on the machine. │
  1193. 34.12 s > └───────────────────────────────────────────────────────────────────────────────────────────────────────────┘
  1194. 34.12 s >
  1195. 34.12 s > stderr:
  1196. 34.12 s >
  1197. 34.12 s > ┌───────────────────────────────────────────────────────────┐
  1198. 34.12 s > │ Could not resolve the IP of the Symbolica license server. │
  1199. 34.12 s > │ │
  1200. 34.12 s > │ Please check your DNS configuration. │
  1201. 34.12 s > └───────────────────────────────────────────────────────────┘
  1202. 34.12 s > Error: failed to lookup address information: Temporary failure in name resolution
  1203. 34.12 s >
  1204. 34.12 s >
  1205. 34.12 s > Location:
  1206. 34.12 s > tests/tests/test_python_api.rs:156:20
  1207. 34.12 s >
  1208. 34.12 s > FAIL [ 0.126s] (3/5) gammaloop-integration-tests::test_python_api python_evaluate_sample_preserves_graph_grouping_and_incoming_pdgs
  1209. 34.12 s > stdout ---
  1210. 34.12 s >
  1211. 34.12 s > running 1 test
  1212. 34.12 s > test python_evaluate_sample_preserves_graph_grouping_and_incoming_pdgs ... FAILED
  1213. 34.12 s >
  1214. 34.12 s > failures:
  1215. 34.12 s >
  1216. 34.12 s > failures:
  1217. 34.12 s > python_evaluate_sample_preserves_graph_grouping_and_incoming_pdgs
  1218. 34.12 s >
  1219. 34.12 s > test result: FAILED. 0 passed; 1 failed; 0 ignored; 0 measured; 4 filtered out; finished in 0.12s
  1220. 34.12 s >
  1221. 34.12 s > stderr ---
  1222. 34.12 s > Error: Python API test subprocess failed.
  1223. 34.12 s > stdout:
  1224. 34.12 s > ┌────────────────────────────────────────────────────────┐
  1225. 34.12 s > │ You are running a restricted Symbolica instance. │
  1226. 34.12 s > │ │
  1227. 34.12 s > │ This mode is only permitted for non-commercial use and │
  1228. 34.12 s > │ is limited to one instance and core per machine. │
  1229. 34.12 s > │ │
  1230. 34.12 s > │ Hobbyists can easily acquire a free license key │
  1231. 34.12 s > │ that unlocks all cores and removes this banner: │
  1232. 34.12 s > │ │
  1233. 34.12 s > │ from symbolica import * │
  1234. 34.12 s > │ request_hobbyist_license('YOUR_NAME', 'YOUR_EMAIL') │
  1235. 34.12 s > │ │
  1236. 34.12 s > │ All other users can obtain a free 30-day trial key: │
  1237. 34.12 s > │ │
  1238. 34.12 s > │ from symbolica import * │
  1239. 34.12 s > │ request_trial_license('NAME', 'EMAIL', 'EMPLOYER') │
  1240. 34.12 s > │ │
  1241. 34.12 s > │ See https://symbolica.io/docs/get_started.html#license │
  1242. 34.12 s > └────────────────────────────────────────────────────────┘
  1243. 34.12 s > ┌───────────────────────────────────────────────────────────────────────────────────────────────────────────┐
  1244. 34.12 s > │ Cannot start new unlicensed Symbolica instance since there is already another one running on the machine. │
  1245. 34.12 s > └───────────────────────────────────────────────────────────────────────────────────────────────────────────┘
  1246. 34.12 s >
  1247. 34.12 s > stderr:
  1248. 34.12 s >
  1249. 34.12 s > ┌───────────────────────────────────────────────────────────┐
  1250. 34.12 s > │ Could not resolve the IP of the Symbolica license server. │
  1251. 34.12 s > │ │
  1252. 34.12 s > │ Please check your DNS configuration. │
  1253. 34.12 s > └───────────────────────────────────────────────────────────┘
  1254. 34.12 s > Error: failed to lookup address information: Temporary failure in name resolution
  1255. 34.12 s >
  1256. 34.12 s >
  1257. 34.12 s > Location:
  1258. 34.12 s > tests/tests/test_python_api.rs:156:20
  1259. 34.12 s >
  1260. 34.12 s > FAIL [ 0.211s] (4/5) gammaloop-integration-tests::test_python_api python_evaluate_samples_batch_and_momentum_space_have_expected_shape
  1261. 34.12 s > stdout ---
  1262. 34.12 s >
  1263. 34.12 s > running 1 test
  1264. 34.12 s > test python_evaluate_samples_batch_and_momentum_space_have_expected_shape ... FAILED
  1265. 34.12 s >
  1266. 34.12 s > failures:
  1267. 34.12 s >
  1268. 34.12 s > failures:
  1269. 34.12 s > python_evaluate_samples_batch_and_momentum_space_have_expected_shape
  1270. 34.12 s >
  1271. 34.12 s > test result: FAILED. 0 passed; 1 failed; 0 ignored; 0 measured; 4 filtered out; finished in 0.21s
  1272. 34.12 s >
  1273. 34.12 s > stderr ---
  1274. 34.12 s > Error: Python API test subprocess failed.
  1275. 34.12 s > stdout:
  1276. 34.12 s > ┌────────────────────────────────────────────────────────┐
  1277. 34.12 s > │ You are running a restricted Symbolica instance. │
  1278. 34.12 s > │ │
  1279. 34.12 s > │ This mode is only permitted for non-commercial use and │
  1280. 34.12 s > │ is limited to one instance and core per machine. │
  1281. 34.12 s > │ │
  1282. 34.12 s > │ Hobbyists can easily acquire a free license key │
  1283. 34.12 s > │ that unlocks all cores and removes this banner: │
  1284. 34.12 s > │ │
  1285. 34.12 s > │ from symbolica import * │
  1286. 34.12 s > │ request_hobbyist_license('YOUR_NAME', 'YOUR_EMAIL') │
  1287. 34.12 s > │ │
  1288. 34.12 s > │ All other users can obtain a free 30-day trial key: │
  1289. 34.12 s > │ │
  1290. 34.12 s > │ from symbolica import * │
  1291. 34.12 s > │ request_trial_license('NAME', 'EMAIL', 'EMPLOYER') │
  1292. 34.12 s > │ │
  1293. 34.12 s > │ See https://symbolica.io/docs/get_started.html#license │
  1294. 34.12 s > └────────────────────────────────────────────────────────┘
  1295. 34.12 s > ┌───────────────────────────────────────────────────────────────────────────────────────────────────────────┐
  1296. 34.12 s > │ Cannot start new unlicensed Symbolica instance since there is already another one running on the machine. │
  1297. 34.12 s > └───────────────────────────────────────────────────────────────────────────────────────────────────────────┘
  1298. 34.12 s >
  1299. 34.12 s > stderr:
  1300. 34.12 s >
  1301. 34.12 s > ┌───────────────────────────────────────────────────────────┐
  1302. 34.12 s > │ Could not resolve the IP of the Symbolica license server. │
  1303. 34.12 s > │ │
  1304. 34.12 s > │ Please check your DNS configuration. │
  1305. 34.12 s > └───────────────────────────────────────────────────────────┘
  1306. 34.12 s > Error: failed to lookup address information: Temporary failure in name resolution
  1307. 34.12 s > [2026-09-14 22:20:37.313] @gammaloop_api::se... INFO : Running command import model sm-default
  1308. 34.12 s > [2026-09-14 22:20:37.313] @import::model INFO : Loading built-in JSON model sm-default
  1309. 34.12 s > [2026-09-14 22:20:37.348] @gammalooprs::model INFO : The following 11 external parameters were forced to zero by the restriction card:
  1310. 34.12 s > lamWS, AWS, rhoWS, etaWS, ymc, yme, ymm, MC, Me, MM, WTau
  1311. 34.12 s > [2026-09-14 22:20:37.348] @gammalooprs::model INFO : The following 34 vertex rules were removed by the restriction card:
  1312. 34.12 s > V_82 -> (c~, d, G+) | V_83 -> (t~, d, G+) | V_84 -> (c~, s, G+) | V_85 -> (t~, s, G+) | V_86 -> (u~, b, G+) | V_87 -> (c~, b, G+) | V_90 -> (c~, d, W+) | V_91 -> (t~, d, W+) | V_92 -> (u~, s, W+) | V_94 -> (t~, s, W+) | V_95 -> (u~, b, W+) | V_96 -> (c~, b, W+) | V_101 -> (e+, e-, G0) | V_102 -> (mu+, mu-, G0) | V_104 -> (e+, e-, H) | V_105 -> (mu+, mu-, H) | V_110 -> (ve~, e-, G+) | V_111 -> (vm~, mu-, G+) | V_116 -> (b~, u, G-) | V_117 -> (d~, c, G-) | V_118 -> (s~, c, G-) | V_119 -> (b~, c, G-) | V_120 -> (d~, t, G-) | V_121 -> (s~, t, G-) | V_124 -> (s~, u, W-) | V_125 -> (b~, u, W-) | V_126 -> (d~, c, W-) | V_128 -> (b~, c, W-) | V_129 -> (d~, t, W-) | V_130 -> (s~, t, W-) | V_138 -> (c~, c, G0) | V_140 -> (c~, c, H) | V_145 -> (e+, ve, G-) | V_146 -> (mu+, vm, G-)
  1313. 34.12 s > [2026-09-14 22:20:37.348] @gammalooprs::model INFO : The following 36 couplings were removed by the restriction card:
  1314. 34.12 s > GC_13, GC_14, GC_16, GC_17, GC_18, GC_19, GC_20, GC_22, GC_23, GC_24, GC_25, GC_26, GC_28, GC_29, GC_42, GC_43, GC_44, GC_46, GC_47, GC_48, GC_84, GC_85, GC_86, GC_87, GC_88, GC_89, GC_90, GC_91, GC_92, GC_93, GC_101, GC_102, GC_103, GC_105, GC_106, GC_107
  1315. 34.12 s > [2026-09-14 22:20:37.348] @gammaloop_api::se... INFO : Running command set default-runtime kv kinematics.externals='{"type":"constant","data":{"momenta":[[32.0,0.0,0.0,32.0],[32.0,0.0,0.0,-32.0]],"helicities":[1,1]}}'
  1316. 34.12 s > [2026-09-14 22:20:37.349] @gammaloop_api::se... INFO : Running command set default-runtime kv subtraction.disable_threshold_subtraction=true
  1317. 34.12 s > [2026-09-14 22:20:37.350] @gammaloop_api::se... INFO : Running command generate xs e+ e- > d d~ g | e- a d g QED^2==4 [{{2}} QCD=0] --numerator-grouping group_identical_graphs_up_to_sign --clear-existing-processes --only-diagrams
  1318. 34.12 s > [2026-09-14 22:20:37.352] @feyngen::diagram_... INFO : 0s | Δ=0s | Starting Feynman graph generation with Symbolica...
  1319. 34.12 s > [2026-09-14 22:20:37.355] @feyngen::diagram_... INFO : 0s | Δ=0s | Number of graphs resulting from Symbolica generation: 246
  1320. 34.12 s > [2026-09-14 22:20:37.356] @feyngen::diagram_... INFO : 0s | Δ=0s | Number of graphs retained after enforcing supergraph particle content: 8
  1321. 34.12 s > [2026-09-14 22:20:37.356] @feyngen::diagram_... INFO : 0s | Δ=0s | Number of graphs retained after removal of vetoed topologies: 8
  1322. 34.12 s > [2026-09-14 22:20:37.356] @feyngen::diagram_... INFO : 0s | Δ=0s | Number of graphs after vertex info assignment: 8
  1323. 34.12 s > [2026-09-14 22:20:37.356] @feyngen::diagram_... INFO : 0s | Δ=0s | Number of graphs after all complete graphs filters are applied: 8
  1324. 34.12 s >
  1325. 34.12 s >
  1326. 34.12 s > Location:
  1327. 34.12 s > tests/tests/test_python_api.rs:156:20
  1328. 34.12 s >
  1329. 34.12 s > FAIL [ 0.225s] (5/5) gammaloop-integration-tests::test_python_api python_settings_wrappers_expose_nested_runtime_and_global_settings
  1330. 34.12 s > stdout ---
  1331. 34.12 s >
  1332. 34.12 s > running 1 test
  1333. 34.12 s > test python_settings_wrappers_expose_nested_runtime_and_global_settings ... FAILED
  1334. 34.12 s >
  1335. 34.12 s > failures:
  1336. 34.12 s >
  1337. 34.12 s > failures:
  1338. 34.12 s > python_settings_wrappers_expose_nested_runtime_and_global_settings
  1339. 34.12 s >
  1340. 34.12 s > test result: FAILED. 0 passed; 1 failed; 0 ignored; 0 measured; 4 filtered out; finished in 0.22s
  1341. 34.12 s >
  1342. 34.12 s > stderr ---
  1343. 34.12 s > Error: Python API test subprocess failed.
  1344. 34.12 s > stdout:
  1345. 34.12 s > ┌────────────────────────────────────────────────────────┐
  1346. 34.12 s > │ You are running a restricted Symbolica instance. │
  1347. 34.12 s > │ │
  1348. 34.12 s > │ This mode is only permitted for non-commercial use and │
  1349. 34.12 s > │ is limited to one instance and core per machine. │
  1350. 34.12 s > │ │
  1351. 34.12 s > │ Hobbyists can easily acquire a free license key │
  1352. 34.12 s > │ that unlocks all cores and removes this banner: │
  1353. 34.12 s > │ │
  1354. 34.12 s > │ from symbolica import * │
  1355. 34.12 s > │ request_hobbyist_license('YOUR_NAME', 'YOUR_EMAIL') │
  1356. 34.12 s > │ │
  1357. 34.12 s > │ All other users can obtain a free 30-day trial key: │
  1358. 34.12 s > │ │
  1359. 34.12 s > │ from symbolica import * │
  1360. 34.12 s > │ request_trial_license('NAME', 'EMAIL', 'EMPLOYER') │
  1361. 34.12 s > │ │
  1362. 34.12 s > │ See https://symbolica.io/docs/get_started.html#license │
  1363. 34.12 s > └────────────────────────────────────────────────────────┘
  1364. 34.12 s > ┌───────────────────────────────────────────────────────────────────────────────────────────────────────────┐
  1365. 34.12 s > │ Cannot start new unlicensed Symbolica instance since there is already another one running on the machine. │
  1366. 34.12 s > └───────────────────────────────────────────────────────────────────────────────────────────────────────────┘
  1367. 34.12 s >
  1368. 34.12 s > stderr:
  1369. 34.12 s >
  1370. 34.12 s > ┌───────────────────────────────────────────────────────────┐
  1371. 34.12 s > │ Could not resolve the IP of the Symbolica license server. │
  1372. 34.12 s > │ │
  1373. 34.12 s > │ Please check your DNS configuration. │
  1374. 34.12 s > └───────────────────────────────────────────────────────────┘
  1375. 34.12 s > Error: failed to lookup address information: Temporary failure in name resolution
  1376. 34.12 s >
  1377. 34.12 s >
  1378. 34.12 s > Location:
  1379. 34.12 s > tests/tests/test_python_api.rs:156:20
  1380. 34.12 s >
  1381. 34.12 s > ------------
  1382. 34.12 s > Summary [ 0.226s] 5 tests run: 0 passed, 5 failed, 0 skipped
  1383. 34.12 s > FAIL [ 0.118s] (1/5) gammaloop-integration-tests::test_python_api python_evaluate_sample_honors_generate_events_and_observable_snapshots
  1384. 34.12 s > stdout ---
  1385. 34.12 s >
  1386. 34.12 s > running 1 test
  1387. 34.12 s > test python_evaluate_sample_honors_generate_events_and_observable_snapshots ... FAILED
  1388. 34.12 s >
  1389. 34.12 s > failures:
  1390. 34.12 s >
  1391. 34.12 s > failures:
  1392. 34.12 s > python_evaluate_sample_honors_generate_events_and_observable_snapshots
  1393. 34.12 s >
  1394. 34.12 s > test result: FAILED. 0 passed; 1 failed; 0 ignored; 0 measured; 4 filtered out; finished in 0.11s
  1395. 34.12 s >
  1396. 34.12 s > stderr ---
  1397. 34.12 s > Error: Python API test subprocess failed.
  1398. 34.12 s > stdout:
  1399. 34.12 s > ┌────────────────────────────────────────────────────────┐
  1400. 34.12 s > │ You are running a restricted Symbolica instance. │
  1401. 34.12 s > │ │
  1402. 34.12 s > │ This mode is only permitted for non-commercial use and │
  1403. 34.12 s > │ is limited to one instance and core per machine. │
  1404. 34.12 s > │ │
  1405. 34.12 s > │ Hobbyists can easily acquire a free license key │
  1406. 34.12 s > │ that unlocks all cores and removes this banner: │
  1407. 34.12 s > │ │
  1408. 34.12 s > │ from symbolica import * │
  1409. 34.12 s > │ request_hobbyist_license('YOUR_NAME', 'YOUR_EMAIL') │
  1410. 34.12 s > │ │
  1411. 34.12 s > │ All other users can obtain a free 30-day trial key: │
  1412. 34.12 s > │ │
  1413. 34.12 s > │ from symbolica import * │
  1414. 34.12 s > │ request_trial_license('NAME', 'EMAIL', 'EMPLOYER') │
  1415. 34.12 s > │ │
  1416. 34.12 s > │ See https://symbolica.io/docs/get_started.html#license │
  1417. 34.12 s > └────────────────────────────────────────────────────────┘
  1418. 34.12 s > ┌───────────────────────────────────────────────────────────────────────────────────────────────────────────┐
  1419. 34.12 s > │ Cannot start new unlicensed Symbolica instance since there is already another one running on the machine. │
  1420. 34.12 s > └───────────────────────────────────────────────────────────────────────────────────────────────────────────┘
  1421. 34.12 s >
  1422. 34.12 s > stderr:
  1423. 34.12 s >
  1424. 34.13 s > ┌───────────────────────────────────────────────────────────┐
  1425. 34.13 s > │ Could not resolve the IP of the Symbolica license server. │
  1426. 34.13 s > │ │
  1427. 34.13 s > │ Please check your DNS configuration. │
  1428. 34.13 s > └───────────────────────────────────────────────────────────┘
  1429. 34.13 s > Error: failed to lookup address information: Temporary failure in name resolution
  1430. 34.13 s >
  1431. 34.13 s >
  1432. 34.13 s > Location:
  1433. 34.13 s > tests/tests/test_python_api.rs:156:20
  1434. 34.13 s >
  1435. 34.13 s > FAIL [ 0.118s] (2/5) gammaloop-integration-tests::test_python_api python_session_getters_return_live_toml_and_command_blocks
  1436. 34.13 s > stdout ---
  1437. 34.13 s >
  1438. 34.13 s > running 1 test
  1439. 34.13 s > test python_session_getters_return_live_toml_and_command_blocks ... FAILED
  1440. 34.13 s >
  1441. 34.13 s > failures:
  1442. 34.13 s >
  1443. 34.13 s > failures:
  1444. 34.13 s > python_session_getters_return_live_toml_and_command_blocks
  1445. 34.13 s >
  1446. 34.13 s > test result: FAILED. 0 passed; 1 failed; 0 ignored; 0 measured; 4 filtered out; finished in 0.11s
  1447. 34.13 s >
  1448. 34.13 s > stderr ---
  1449. 34.13 s > Error: Python API test subprocess failed.
  1450. 34.13 s > stdout:
  1451. 34.13 s > ┌────────────────────────────────────────────────────────┐
  1452. 34.13 s > │ You are running a restricted Symbolica instance. │
  1453. 34.13 s > │ │
  1454. 34.13 s > │ This mode is only permitted for non-commercial use and │
  1455. 34.13 s > │ is limited to one instance and core per machine. │
  1456. 34.13 s > │ │
  1457. 34.13 s > │ Hobbyists can easily acquire a free license key │
  1458. 34.13 s > │ that unlocks all cores and removes this banner: │
  1459. 34.13 s > │ │
  1460. 34.13 s > │ from symbolica import * │
  1461. 34.13 s > │ request_hobbyist_license('YOUR_NAME', 'YOUR_EMAIL') │
  1462. 34.13 s > │ │
  1463. 34.13 s > │ All other users can obtain a free 30-day trial key: │
  1464. 34.13 s > │ │
  1465. 34.13 s > │ from symbolica import * │
  1466. 34.13 s > │ request_trial_license('NAME', 'EMAIL', 'EMPLOYER') │
  1467. 34.13 s > │ │
  1468. 34.13 s > │ See https://symbolica.io/docs/get_started.html#license │
  1469. 34.13 s > └────────────────────────────────────────────────────────┘
  1470. 34.13 s > ┌───────────────────────────────────────────────────────────────────────────────────────────────────────────┐
  1471. 34.13 s > │ Cannot start new unlicensed Symbolica instance since there is already another one running on the machine. │
  1472. 34.13 s > └───────────────────────────────────────────────────────────────────────────────────────────────────────────┘
  1473. 34.13 s >
  1474. 34.13 s > stderr:
  1475. 34.13 s >
  1476. 34.13 s > ┌───────────────────────────────────────────────────────────┐
  1477. 34.13 s > │ Could not resolve the IP of the Symbolica license server. │
  1478. 34.13 s > │ │
  1479. 34.13 s > │ Please check your DNS configuration. │
  1480. 34.13 s > └───────────────────────────────────────────────────────────┘
  1481. 34.13 s > Error: failed to lookup address information: Temporary failure in name resolution
  1482. 34.13 s >
  1483. 34.13 s >
  1484. 34.13 s > Location:
  1485. 34.13 s > tests/tests/test_python_api.rs:156:20
  1486. 34.13 s >
  1487. 34.13 s > FAIL [ 0.126s] (3/5) gammaloop-integration-tests::test_python_api python_evaluate_sample_preserves_graph_grouping_and_incoming_pdgs
  1488. 34.13 s > stdout ---
  1489. 34.13 s >
  1490. 34.13 s > running 1 test
  1491. 34.13 s > test python_evaluate_sample_preserves_graph_grouping_and_incoming_pdgs ... FAILED
  1492. 34.13 s >
  1493. 34.13 s > failures:
  1494. 34.13 s >
  1495. 34.13 s > failures:
  1496. 34.13 s > python_evaluate_sample_preserves_graph_grouping_and_incoming_pdgs
  1497. 34.13 s >
  1498. 34.13 s > test result: FAILED. 0 passed; 1 failed; 0 ignored; 0 measured; 4 filtered out; finished in 0.12s
  1499. 34.13 s >
  1500. 34.13 s > stderr ---
  1501. 34.13 s > Error: Python API test subprocess failed.
  1502. 34.13 s > stdout:
  1503. 34.13 s > ┌────────────────────────────────────────────────────────┐
  1504. 34.13 s > │ You are running a restricted Symbolica instance. │
  1505. 34.13 s > │ │
  1506. 34.13 s > │ This mode is only permitted for non-commercial use and │
  1507. 34.13 s > │ is limited to one instance and core per machine. │
  1508. 34.13 s > │ │
  1509. 34.13 s > │ Hobbyists can easily acquire a free license key │
  1510. 34.13 s > │ that unlocks all cores and removes this banner: │
  1511. 34.13 s > │ │
  1512. 34.13 s > │ from symbolica import * │
  1513. 34.13 s > │ request_hobbyist_license('YOUR_NAME', 'YOUR_EMAIL') │
  1514. 34.13 s > │ │
  1515. 34.13 s > │ All other users can obtain a free 30-day trial key: │
  1516. 34.13 s > │ │
  1517. 34.13 s > │ from symbolica import * │
  1518. 34.13 s > │ request_trial_license('NAME', 'EMAIL', 'EMPLOYER') │
  1519. 34.13 s > │ │
  1520. 34.13 s > │ See https://symbolica.io/docs/get_started.html#license │
  1521. 34.13 s > └────────────────────────────────────────────────────────┘
  1522. 34.13 s > ┌───────────────────────────────────────────────────────────────────────────────────────────────────────────┐
  1523. 34.13 s > │ Cannot start new unlicensed Symbolica instance since there is already another one running on the machine. │
  1524. 34.13 s > └───────────────────────────────────────────────────────────────────────────────────────────────────────────┘
  1525. 34.13 s >
  1526. 34.13 s > stderr:
  1527. 34.13 s >
  1528. 34.13 s > ┌───────────────────────────────────────────────────────────┐
  1529. 34.13 s > │ Could not resolve the IP of the Symbolica license server. │
  1530. 34.13 s > │ │
  1531. 34.13 s > │ Please check your DNS configuration. │
  1532. 34.13 s > └───────────────────────────────────────────────────────────┘
  1533. 34.13 s > Error: failed to lookup address information: Temporary failure in name resolution
  1534. 34.13 s >
  1535. 34.13 s >
  1536. 34.13 s > Location:
  1537. 34.13 s > tests/tests/test_python_api.rs:156:20
  1538. 34.13 s >
  1539. 34.13 s > FAIL [ 0.211s] (4/5) gammaloop-integration-tests::test_python_api python_evaluate_samples_batch_and_momentum_space_have_expected_shape
  1540. 34.13 s > stdout ---
  1541. 34.13 s >
  1542. 34.13 s > running 1 test
  1543. 34.13 s > test python_evaluate_samples_batch_and_momentum_space_have_expected_shape ... FAILED
  1544. 34.13 s >
  1545. 34.13 s > failures:
  1546. 34.13 s >
  1547. 34.13 s > failures:
  1548. 34.13 s > python_evaluate_samples_batch_and_momentum_space_have_expected_shape
  1549. 34.13 s >
  1550. 34.13 s > test result: FAILED. 0 passed; 1 failed; 0 ignored; 0 measured; 4 filtered out; finished in 0.21s
  1551. 34.13 s >
  1552. 34.13 s > stderr ---
  1553. 34.13 s > Error: Python API test subprocess failed.
  1554. 34.13 s > stdout:
  1555. 34.13 s > ┌────────────────────────────────────────────────────────┐
  1556. 34.13 s > │ You are running a restricted Symbolica instance. │
  1557. 34.13 s > │ │
  1558. 34.13 s > │ This mode is only permitted for non-commercial use and │
  1559. 34.13 s > │ is limited to one instance and core per machine. │
  1560. 34.13 s > │ │
  1561. 34.13 s > │ Hobbyists can easily acquire a free license key │
  1562. 34.13 s > │ that unlocks all cores and removes this banner: │
  1563. 34.13 s > │ │
  1564. 34.13 s > │ from symbolica import * │
  1565. 34.13 s > │ request_hobbyist_license('YOUR_NAME', 'YOUR_EMAIL') │
  1566. 34.13 s > │ │
  1567. 34.13 s > │ All other users can obtain a free 30-day trial key: │
  1568. 34.13 s > │ │
  1569. 34.13 s > │ from symbolica import * │
  1570. 34.13 s > │ request_trial_license('NAME', 'EMAIL', 'EMPLOYER') │
  1571. 34.13 s > │ │
  1572. 34.13 s > │ See https://symbolica.io/docs/get_started.html#license │
  1573. 34.13 s > └────────────────────────────────────────────────────────┘
  1574. 34.13 s > ┌───────────────────────────────────────────────────────────────────────────────────────────────────────────┐
  1575. 34.13 s > │ Cannot start new unlicensed Symbolica instance since there is already another one running on the machine. │
  1576. 34.13 s > └───────────────────────────────────────────────────────────────────────────────────────────────────────────┘
  1577. 34.13 s >
  1578. 34.13 s > stderr:
  1579. 34.13 s >
  1580. 34.13 s > ┌───────────────────────────────────────────────────────────┐
  1581. 34.13 s > │ Could not resolve the IP of the Symbolica license server. │
  1582. 34.13 s > │ │
  1583. 34.13 s > │ Please check your DNS configuration. │
  1584. 34.13 s > └───────────────────────────────────────────────────────────┘
  1585. 34.13 s > Error: failed to lookup address information: Temporary failure in name resolution
  1586. 34.13 s > [2026-09-14 22:20:37.313] @gammaloop_api::se... INFO : Running command import model sm-default
  1587. 34.13 s > [2026-09-14 22:20:37.313] @import::model INFO : Loading built-in JSON model sm-default
  1588. 34.13 s > [2026-09-14 22:20:37.348] @gammalooprs::model INFO : The following 11 external parameters were forced to zero by the restriction card:
  1589. 34.13 s > lamWS, AWS, rhoWS, etaWS, ymc, yme, ymm, MC, Me, MM, WTau
  1590. 34.13 s > [2026-09-14 22:20:37.348] @gammalooprs::model INFO : The following 34 vertex rules were removed by the restriction card:
  1591. 34.13 s > V_82 -> (c~, d, G+) | V_83 -> (t~, d, G+) | V_84 -> (c~, s, G+) | V_85 -> (t~, s, G+) | V_86 -> (u~, b, G+) | V_87 -> (c~, b, G+) | V_90 -> (c~, d, W+) | V_91 -> (t~, d, W+) | V_92 -> (u~, s, W+) | V_94 -> (t~, s, W+) | V_95 -> (u~, b, W+) | V_96 -> (c~, b, W+) | V_101 -> (e+, e-, G0) | V_102 -> (mu+, mu-, G0) | V_104 -> (e+, e-, H) | V_105 -> (mu+, mu-, H) | V_110 -> (ve~, e-, G+) | V_111 -> (vm~, mu-, G+) | V_116 -> (b~, u, G-) | V_117 -> (d~, c, G-) | V_118 -> (s~, c, G-) | V_119 -> (b~, c, G-) | V_120 -> (d~, t, G-) | V_121 -> (s~, t, G-) | V_124 -> (s~, u, W-) | V_125 -> (b~, u, W-) | V_126 -> (d~, c, W-) | V_128 -> (b~, c, W-) | V_129 -> (d~, t, W-) | V_130 -> (s~, t, W-) | V_138 -> (c~, c, G0) | V_140 -> (c~, c, H) | V_145 -> (e+, ve, G-) | V_146 -> (mu+, vm, G-)
  1592. 34.13 s > [2026-09-14 22:20:37.348] @gammalooprs::model INFO : The following 36 couplings were removed by the restriction card:
  1593. 34.13 s > GC_13, GC_14, GC_16, GC_17, GC_18, GC_19, GC_20, GC_22, GC_23, GC_24, GC_25, GC_26, GC_28, GC_29, GC_42, GC_43, GC_44, GC_46, GC_47, GC_48, GC_84, GC_85, GC_86, GC_87, GC_88, GC_89, GC_90, GC_91, GC_92, GC_93, GC_101, GC_102, GC_103, GC_105, GC_106, GC_107
  1594. 34.13 s > [2026-09-14 22:20:37.348] @gammaloop_api::se... INFO : Running command set default-runtime kv kinematics.externals='{"type":"constant","data":{"momenta":[[32.0,0.0,0.0,32.0],[32.0,0.0,0.0,-32.0]],"helicities":[1,1]}}'
  1595. 34.13 s > [2026-09-14 22:20:37.349] @gammaloop_api::se... INFO : Running command set default-runtime kv subtraction.disable_threshold_subtraction=true
  1596. 34.13 s > [2026-09-14 22:20:37.350] @gammaloop_api::se... INFO : Running command generate xs e+ e- > d d~ g | e- a d g QED^2==4 [{{2}} QCD=0] --numerator-grouping group_identical_graphs_up_to_sign --clear-existing-processes --only-diagrams
  1597. 34.13 s > [2026-09-14 22:20:37.352] @feyngen::diagram_... INFO : 0s | Δ=0s | Starting Feynman graph generation with Symbolica...
  1598. 34.13 s > [2026-09-14 22:20:37.355] @feyngen::diagram_... INFO : 0s | Δ=0s | Number of graphs resulting from Symbolica generation: 246
  1599. 34.13 s > [2026-09-14 22:20:37.356] @feyngen::diagram_... INFO : 0s | Δ=0s | Number of graphs retained after enforcing supergraph particle content: 8
  1600. 34.13 s > [2026-09-14 22:20:37.356] @feyngen::diagram_... INFO : 0s | Δ=0s | Number of graphs retained after removal of vetoed topologies: 8
  1601. 34.13 s > [2026-09-14 22:20:37.356] @feyngen::diagram_... INFO : 0s | Δ=0s | Number of graphs after vertex info assignment: 8
  1602. 34.13 s > [2026-09-14 22:20:37.356] @feyngen::diagram_... INFO : 0s | Δ=0s | Number of graphs after all complete graphs filters are applied: 8
  1603. 34.13 s >
  1604. 34.13 s >
  1605. 34.13 s > Location:
  1606. 34.13 s > tests/tests/test_python_api.rs:156:20
  1607. 34.13 s >
  1608. 34.13 s > FAIL [ 0.225s] (5/5) gammaloop-integration-tests::test_python_api python_settings_wrappers_expose_nested_runtime_and_global_settings
  1609. 34.13 s > stdout ---
  1610. 34.13 s >
  1611. 34.13 s > running 1 test
  1612. 34.13 s > test python_settings_wrappers_expose_nested_runtime_and_global_settings ... FAILED
  1613. 34.13 s >
  1614. 34.13 s > failures:
  1615. 34.13 s >
  1616. 34.13 s > failures:
  1617. 34.13 s > python_settings_wrappers_expose_nested_runtime_and_global_settings
  1618. 34.13 s >
  1619. 34.13 s > test result: FAILED. 0 passed; 1 failed; 0 ignored; 0 measured; 4 filtered out; finished in 0.22s
  1620. 34.13 s >
  1621. 34.13 s > stderr ---
  1622. 34.13 s > Error: Python API test subprocess failed.
  1623. 34.13 s > stdout:
  1624. 34.13 s > ┌────────────────────────────────────────────────────────┐
  1625. 34.13 s > │ You are running a restricted Symbolica instance. │
  1626. 34.13 s > │ │
  1627. 34.13 s > │ This mode is only permitted for non-commercial use and │
  1628. 34.13 s > │ is limited to one instance and core per machine. │
  1629. 34.13 s > │ │
  1630. 34.13 s > │ Hobbyists can easily acquire a free license key │
  1631. 34.13 s > │ that unlocks all cores and removes this banner: │
  1632. 34.13 s > │ │
  1633. 34.13 s > │ from symbolica import * │
  1634. 34.13 s > │ request_hobbyist_license('YOUR_NAME', 'YOUR_EMAIL') │
  1635. 34.13 s > │ │
  1636. 34.13 s > │ All other users can obtain a free 30-day trial key: │
  1637. 34.13 s > │ │
  1638. 34.13 s > │ from symbolica import * │
  1639. 34.13 s > │ request_trial_license('NAME', 'EMAIL', 'EMPLOYER') │
  1640. 34.13 s > │ │
  1641. 34.13 s > │ See https://symbolica.io/docs/get_started.html#license │
  1642. 34.13 s > └────────────────────────────────────────────────────────┘
  1643. 34.13 s > ┌───────────────────────────────────────────────────────────────────────────────────────────────────────────┐
  1644. 34.13 s > │ Cannot start new unlicensed Symbolica instance since there is already another one running on the machine. │
  1645. 34.13 s > └───────────────────────────────────────────────────────────────────────────────────────────────────────────┘
  1646. 34.13 s >
  1647. 34.13 s > stderr:
  1648. 34.13 s >
  1649. 34.13 s > ┌───────────────────────────────────────────────────────────┐
  1650. 34.13 s > │ Could not resolve the IP of the Symbolica license server. │
  1651. 34.13 s > │ │
  1652. 34.13 s > │ Please check your DNS configuration. │
  1653. 34.13 s > └───────────────────────────────────────────────────────────┘
  1654. 34.13 s > Error: failed to lookup address information: Temporary failure in name resolution
  1655. 34.13 s >
  1656. 34.13 s >
  1657. 34.13 s > Location:
  1658. 34.13 s > tests/tests/test_python_api.rs:156:20
  1659. 34.13 s >
  1660. 34.13 s > error: test run failed
  1661. 34.13 s >
  1662. 34.13 s > ========== nextest test summary ==========
  1663. 34.13 s > report: target/nextest/ci_gammaloop/junit.xml
  1664. 34.13 s > tests: 5, failures: 5, errors: 0
  1665. 34.13 s >
  1666. 34.13 s > 1. gammaloop-integration-tests::test_python_api::python_evaluate_sample_honors_generate_events_and_observable_snapshots
  1667. 34.13 s > failure: test failure with exit code 101
  1668. 34.13 s > Error: Python API test subprocess failed.
  1669. 34.13 s > stdout:
  1670. 34.13 s > ┌────────────────────────────────────────────────────────┐
  1671. 34.13 s > │ You are running a restricted Symbolica instance. │
  1672. 34.13 s > │ │
  1673. 34.13 s > │ This mode is only permitted for non-commercial use and │
  1674. 34.13 s > │ is limited to one instance and core per machine. │
  1675. 34.13 s > │ │
  1676. 34.13 s > │ Hobbyists can easily acquire a free license key │
  1677. 34.13 s > │ that unlocks all cores and removes this banner: │
  1678. 34.13 s > │ │
  1679. 34.13 s > │ from symbolica import * │
  1680. 34.13 s > │ request_hobbyist_license('YOUR_NAME', 'YOUR_EMAIL') │
  1681. 34.13 s > │ │
  1682. 34.13 s > │ All other users can obtain a free 30-day trial key: │
  1683. 34.13 s > │ │
  1684. 34.13 s > │ from symbolica import * │
  1685. 34.13 s > │ request_trial_license('NAME', 'EMAIL', 'EMPLOYER') │
  1686. 34.13 s > │ │
  1687. 34.13 s > │ See https://symbolica.io/docs/get_started.html#license │
  1688. 34.13 s > └────────────────────────────────────────────────────────┘
  1689. 34.13 s > ┌───────────────────────────────────────────────────────────────────────────────────────────────────────────┐
  1690. 34.13 s > │ Cannot start new unlicensed Symbolica instance since there is already another one running on the machine. │
  1691. 34.13 s > └───────────────────────────────────────────────────────────────────────────────────────────────────────────┘
  1692. 34.13 s >
  1693. 34.13 s > stderr:
  1694. 34.13 s >
  1695. 34.13 s > ┌───────────────────────────────────────────────────────────┐
  1696. 34.13 s > │ Could not resolve the IP of the Symbolica license server. │
  1697. 34.13 s > │ │
  1698. 34.13 s > │ Please check your DNS configuration. │
  1699. 34.13 s > └───────────────────────────────────────────────────────────┘
  1700. 34.13 s > Error: failed to lookup address information: Temporary failure in name resolution
  1701. 34.13 s >
  1702. 34.13 s >
  1703. 34.13 s > Location:
  1704. 34.13 s > tests/tests/test_python_api.rs:156:20
  1705. 34.13 s > system-out
  1706. 34.13 s > running 1 test
  1707. 34.13 s > test python_evaluate_sample_honors_generate_events_and_observable_snapshots ... FAILED
  1708. 34.13 s >
  1709. 34.13 s > failures:
  1710. 34.13 s >
  1711. 34.13 s > failures:
  1712. 34.13 s > python_evaluate_sample_honors_generate_events_and_observable_snapshots
  1713. 34.13 s >
  1714. 34.13 s > test result: FAILED. 0 passed; 1 failed; 0 ignored; 0 measured; 4 filtered out; finished in 0.11s
  1715. 34.13 s > system-err
  1716. 34.13 s > Error: Python API test subprocess failed.
  1717. 34.13 s > stdout:
  1718. 34.13 s > ┌────────────────────────────────────────────────────────┐
  1719. 34.13 s > │ You are running a restricted Symbolica instance. │
  1720. 34.13 s > │ │
  1721. 34.13 s > │ This mode is only permitted for non-commercial use and │
  1722. 34.13 s > │ is limited to one instance and core per machine. │
  1723. 34.13 s > │ │
  1724. 34.13 s > │ Hobbyists can easily acquire a free license key │
  1725. 34.13 s > │ that unlocks all cores and removes this banner: │
  1726. 34.13 s > │ │
  1727. 34.13 s > │ from symbolica import * │
  1728. 34.13 s > │ request_hobbyist_license('YOUR_NAME', 'YOUR_EMAIL') │
  1729. 34.13 s > │ │
  1730. 34.13 s > │ All other users can obtain a free 30-day trial key: │
  1731. 34.13 s > │ │
  1732. 34.13 s > │ from symbolica import * │
  1733. 34.13 s > │ request_trial_license('NAME', 'EMAIL', 'EMPLOYER') │
  1734. 34.13 s > │ │
  1735. 34.13 s > │ See https://symbolica.io/docs/get_started.html#license │
  1736. 34.13 s > └────────────────────────────────────────────────────────┘
  1737. 34.13 s > ┌───────────────────────────────────────────────────────────────────────────────────────────────────────────┐
  1738. 34.13 s > │ Cannot start new unlicensed Symbolica instance since there is already another one running on the machine. │
  1739. 34.13 s > └───────────────────────────────────────────────────────────────────────────────────────────────────────────┘
  1740. 34.13 s >
  1741. 34.13 s > stderr:
  1742. 34.13 s >
  1743. 34.13 s > ┌───────────────────────────────────────────────────────────┐
  1744. 34.13 s > │ Could not resolve the IP of the Symbolica license server. │
  1745. 34.13 s > │ │
  1746. 34.13 s > │ Please check your DNS configuration. │
  1747. 34.13 s > └───────────────────────────────────────────────────────────┘
  1748. 34.13 s > Error: failed to lookup address information: Temporary failure in name resolution
  1749. 34.13 s >
  1750. 34.13 s >
  1751. 34.13 s > Location:
  1752. 34.13 s > tests/tests/test_python_api.rs:156:20
  1753. 34.13 s >
  1754. 34.13 s > 2. gammaloop-integration-tests::test_python_api::python_session_getters_return_live_toml_and_command_blocks
  1755. 34.13 s > failure: test failure with exit code 101
  1756. 34.13 s > Error: Python API test subprocess failed.
  1757. 34.13 s > stdout:
  1758. 34.13 s > ┌────────────────────────────────────────────────────────┐
  1759. 34.13 s > │ You are running a restricted Symbolica instance. │
  1760. 34.13 s > │ │
  1761. 34.13 s > │ This mode is only permitted for non-commercial use and │
  1762. 34.13 s > │ is limited to one instance and core per machine. │
  1763. 34.13 s > │ │
  1764. 34.13 s > │ Hobbyists can easily acquire a free license key │
  1765. 34.13 s > │ that unlocks all cores and removes this banner: │
  1766. 34.13 s > │ │
  1767. 34.13 s > │ from symbolica import * │
  1768. 34.13 s > │ request_hobbyist_license('YOUR_NAME', 'YOUR_EMAIL') │
  1769. 34.13 s > │ │
  1770. 34.13 s > │ All other users can obtain a free 30-day trial key: │
  1771. 34.13 s > │ │
  1772. 34.13 s > │ from symbolica import * │
  1773. 34.13 s > │ request_trial_license('NAME', 'EMAIL', 'EMPLOYER') │
  1774. 34.13 s > │ │
  1775. 34.13 s > │ See https://symbolica.io/docs/get_started.html#license │
  1776. 34.13 s > └────────────────────────────────────────────────────────┘
  1777. 34.13 s > ┌───────────────────────────────────────────────────────────────────────────────────────────────────────────┐
  1778. 34.13 s > │ Cannot start new unlicensed Symbolica instance since there is already another one running on the machine. │
  1779. 34.13 s > └───────────────────────────────────────────────────────────────────────────────────────────────────────────┘
  1780. 34.13 s >
  1781. 34.13 s > stderr:
  1782. 34.13 s >
  1783. 34.13 s > ┌───────────────────────────────────────────────────────────┐
  1784. 34.13 s > │ Could not resolve the IP of the Symbolica license server. │
  1785. 34.13 s > │ │
  1786. 34.13 s > │ Please check your DNS configuration. │
  1787. 34.13 s > └───────────────────────────────────────────────────────────┘
  1788. 34.13 s > Error: failed to lookup address information: Temporary failure in name resolution
  1789. 34.13 s >
  1790. 34.13 s >
  1791. 34.13 s > Location:
  1792. 34.13 s > tests/tests/test_python_api.rs:156:20
  1793. 34.13 s > system-out
  1794. 34.13 s > running 1 test
  1795. 34.13 s > test python_session_getters_return_live_toml_and_command_blocks ... FAILED
  1796. 34.13 s >
  1797. 34.13 s > failures:
  1798. 34.13 s >
  1799. 34.13 s > failures:
  1800. 34.13 s > python_session_getters_return_live_toml_and_command_blocks
  1801. 34.13 s >
  1802. 34.13 s > test result: FAILED. 0 passed; 1 failed; 0 ignored; 0 measured; 4 filtered out; finished in 0.11s
  1803. 34.13 s > system-err
  1804. 34.13 s > Error: Python API test subprocess failed.
  1805. 34.13 s > stdout:
  1806. 34.13 s > ┌────────────────────────────────────────────────────────┐
  1807. 34.13 s > │ You are running a restricted Symbolica instance. │
  1808. 34.13 s > │ │
  1809. 34.13 s > │ This mode is only permitted for non-commercial use and │
  1810. 34.13 s > │ is limited to one instance and core per machine. │
  1811. 34.13 s > │ │
  1812. 34.13 s > │ Hobbyists can easily acquire a free license key │
  1813. 34.13 s > │ that unlocks all cores and removes this banner: │
  1814. 34.13 s > │ │
  1815. 34.13 s > │ from symbolica import * │
  1816. 34.13 s > │ request_hobbyist_license('YOUR_NAME', 'YOUR_EMAIL') │
  1817. 34.13 s > │ │
  1818. 34.13 s > │ All other users can obtain a free 30-day trial key: │
  1819. 34.13 s > │ │
  1820. 34.13 s > │ from symbolica import * │
  1821. 34.13 s > │ request_trial_license('NAME', 'EMAIL', 'EMPLOYER') │
  1822. 34.13 s > │ │
  1823. 34.13 s > │ See https://symbolica.io/docs/get_started.html#license │
  1824. 34.13 s > └────────────────────────────────────────────────────────┘
  1825. 34.13 s > ┌───────────────────────────────────────────────────────────────────────────────────────────────────────────┐
  1826. 34.13 s > │ Cannot start new unlicensed Symbolica instance since there is already another one running on the machine. │
  1827. 34.13 s > └───────────────────────────────────────────────────────────────────────────────────────────────────────────┘
  1828. 34.13 s >
  1829. 34.13 s > stderr:
  1830. 34.13 s >
  1831. 34.13 s > ┌───────────────────────────────────────────────────────────┐
  1832. 34.13 s > │ Could not resolve the IP of the Symbolica license server. │
  1833. 34.13 s > │ │
  1834. 34.13 s > │ Please check your DNS configuration. │
  1835. 34.13 s > └───────────────────────────────────────────────────────────┘
  1836. 34.13 s > Error: failed to lookup address information: Temporary failure in name resolution
  1837. 34.13 s >
  1838. 34.13 s >
  1839. 34.13 s > Location:
  1840. 34.13 s > tests/tests/test_python_api.rs:156:20
  1841. 34.13 s >
  1842. 34.13 s > 3. gammaloop-integration-tests::test_python_api::python_evaluate_sample_preserves_graph_grouping_and_incoming_pdgs
  1843. 34.13 s > failure: test failure with exit code 101
  1844. 34.13 s > Error: Python API test subprocess failed.
  1845. 34.13 s > stdout:
  1846. 34.13 s > ┌────────────────────────────────────────────────────────┐
  1847. 34.13 s > │ You are running a restricted Symbolica instance. │
  1848. 34.13 s > │ │
  1849. 34.13 s > │ This mode is only permitted for non-commercial use and │
  1850. 34.13 s > │ is limited to one instance and core per machine. │
  1851. 34.13 s > │ │
  1852. 34.13 s > │ Hobbyists can easily acquire a free license key │
  1853. 34.13 s > │ that unlocks all cores and removes this banner: │
  1854. 34.13 s > │ │
  1855. 34.13 s > │ from symbolica import * │
  1856. 34.13 s > │ request_hobbyist_license('YOUR_NAME', 'YOUR_EMAIL') │
  1857. 34.13 s > │ │
  1858. 34.13 s > │ All other users can obtain a free 30-day trial key: │
  1859. 34.13 s > │ │
  1860. 34.13 s > │ from symbolica import * │
  1861. 34.13 s > │ request_trial_license('NAME', 'EMAIL', 'EMPLOYER') │
  1862. 34.13 s > │ │
  1863. 34.13 s > │ See https://symbolica.io/docs/get_started.html#license │
  1864. 34.13 s > └────────────────────────────────────────────────────────┘
  1865. 34.13 s > ┌───────────────────────────────────────────────────────────────────────────────────────────────────────────┐
  1866. 34.13 s > │ Cannot start new unlicensed Symbolica instance since there is already another one running on the machine. │
  1867. 34.13 s > └───────────────────────────────────────────────────────────────────────────────────────────────────────────┘
  1868. 34.13 s >
  1869. 34.13 s > stderr:
  1870. 34.13 s >
  1871. 34.13 s > ┌───────────────────────────────────────────────────────────┐
  1872. 34.13 s > │ Could not resolve the IP of the Symbolica license server. │
  1873. 34.13 s > │ │
  1874. 34.13 s > │ Please check your DNS configuration. │
  1875. 34.13 s > └───────────────────────────────────────────────────────────┘
  1876. 34.13 s > Error: failed to lookup address information: Temporary failure in name resolution
  1877. 34.13 s >
  1878. 34.13 s >
  1879. 34.13 s > Location:
  1880. 34.13 s > tests/tests/test_python_api.rs:156:20
  1881. 34.13 s > system-out
  1882. 34.13 s > running 1 test
  1883. 34.13 s > test python_evaluate_sample_preserves_graph_grouping_and_incoming_pdgs ... FAILED
  1884. 34.13 s >
  1885. 34.13 s > failures:
  1886. 34.13 s >
  1887. 34.13 s > failures:
  1888. 34.13 s > python_evaluate_sample_preserves_graph_grouping_and_incoming_pdgs
  1889. 34.13 s >
  1890. 34.13 s > test result: FAILED. 0 passed; 1 failed; 0 ignored; 0 measured; 4 filtered out; finished in 0.12s
  1891. 34.13 s > system-err
  1892. 34.13 s > Error: Python API test subprocess failed.
  1893. 34.13 s > stdout:
  1894. 34.13 s > ┌────────────────────────────────────────────────────────┐
  1895. 34.13 s > │ You are running a restricted Symbolica instance. │
  1896. 34.13 s > │ │
  1897. 34.13 s > │ This mode is only permitted for non-commercial use and │
  1898. 34.13 s > │ is limited to one instance and core per machine. │
  1899. 34.13 s > │ │
  1900. 34.13 s > │ Hobbyists can easily acquire a free license key │
  1901. 34.13 s > │ that unlocks all cores and removes this banner: │
  1902. 34.13 s > │ │
  1903. 34.13 s > │ from symbolica import * │
  1904. 34.13 s > │ request_hobbyist_license('YOUR_NAME', 'YOUR_EMAIL') │
  1905. 34.13 s > │ │
  1906. 34.13 s > │ All other users can obtain a free 30-day trial key: │
  1907. 34.13 s > │ │
  1908. 34.13 s > │ from symbolica import * │
  1909. 34.13 s > │ request_trial_license('NAME', 'EMAIL', 'EMPLOYER') │
  1910. 34.13 s > │ │
  1911. 34.13 s > │ See https://symbolica.io/docs/get_started.html#license │
  1912. 34.13 s > └────────────────────────────────────────────────────────┘
  1913. 34.13 s > ┌───────────────────────────────────────────────────────────────────────────────────────────────────────────┐
  1914. 34.13 s > │ Cannot start new unlicensed Symbolica instance since there is already another one running on the machine. │
  1915. 34.13 s > └───────────────────────────────────────────────────────────────────────────────────────────────────────────┘
  1916. 34.13 s >
  1917. 34.13 s > stderr:
  1918. 34.13 s >
  1919. 34.13 s > ┌───────────────────────────────────────────────────────────┐
  1920. 34.13 s > │ Could not resolve the IP of the Symbolica license server. │
  1921. 34.13 s > │ │
  1922. 34.13 s > │ Please check your DNS configuration. │
  1923. 34.13 s > └───────────────────────────────────────────────────────────┘
  1924. 34.13 s > Error: failed to lookup address information: Temporary failure in name resolution
  1925. 34.13 s >
  1926. 34.13 s >
  1927. 34.13 s > Location:
  1928. 34.13 s > tests/tests/test_python_api.rs:156:20
  1929. 34.13 s >
  1930. 34.13 s > 4. gammaloop-integration-tests::test_python_api::python_evaluate_samples_batch_and_momentum_space_have_expected_shape
  1931. 34.13 s > failure: test failure with exit code 101
  1932. 34.13 s > Error: Python API test subprocess failed.
  1933. 34.13 s > stdout:
  1934. 34.13 s > ┌────────────────────────────────────────────────────────┐
  1935. 34.13 s > │ You are running a restricted Symbolica instance. │
  1936. 34.13 s > │ │
  1937. 34.13 s > │ This mode is only permitted for non-commercial use and │
  1938. 34.13 s > │ is limited to one instance and core per machine. │
  1939. 34.13 s > │ │
  1940. 34.13 s > │ Hobbyists can easily acquire a free license key │
  1941. 34.13 s > │ that unlocks all cores and removes this banner: │
  1942. 34.13 s > │ │
  1943. 34.13 s > │ from symbolica import * │
  1944. 34.13 s > │ request_hobbyist_license('YOUR_NAME', 'YOUR_EMAIL') │
  1945. 34.13 s > │ │
  1946. 34.13 s > │ All other users can obtain a free 30-day trial key: │
  1947. 34.13 s > │ │
  1948. 34.13 s > │ from symbolica import * │
  1949. 34.13 s > │ request_trial_license('NAME', 'EMAIL', 'EMPLOYER') │
  1950. 34.13 s > │ │
  1951. 34.13 s > │ See https://symbolica.io/docs/get_started.html#license │
  1952. 34.13 s > └────────────────────────────────────────────────────────┘
  1953. 34.13 s > ┌───────────────────────────────────────────────────────────────────────────────────────────────────────────┐
  1954. 34.13 s > │ Cannot start new unlicensed Symbolica instance since there is already another one running on the machine. │
  1955. 34.13 s > └───────────────────────────────────────────────────────────────────────────────────────────────────────────┘
  1956. 34.13 s >
  1957. 34.13 s > stderr:
  1958. 34.13 s >
  1959. 34.13 s > ┌───────────────────────────────────────────────────────────┐
  1960. 34.13 s > │ Could not resolve the IP of the Symbolica license server. │
  1961. 34.13 s > │ │
  1962. 34.13 s > │ Please check your DNS configuration. │
  1963. 34.13 s > └───────────────────────────────────────────────────────────┘
  1964. 34.13 s > Error: failed to lookup address information: Temporary failure in name resolution
  1965. 34.13 s > [2026-09-14 22:20:37.313] @gammaloop_api::se... INFO : Running command import model sm-default
  1966. 34.13 s > [2026-09-14 22:20:37.313] @import::model INFO : Loading built-in JSON model sm-default
  1967. 34.13 s > [2026-09-14 22:20:37.348] @gammalooprs::model INFO : The following 11 external parameters were forced to zero by the restriction card:
  1968. 34.13 s > lamWS, AWS, rhoWS, etaWS, ymc, yme, ymm, MC, Me, MM, WTau
  1969. 34.13 s > [2026-09-14 22:20:37.348] @gammalooprs::model INFO : The following 34 vertex rules were removed by the restriction card:
  1970. 34.13 s > V_82 -> (c~, d, G+) | V_83 -> (t~, d, G+) | V_84 -> (c~, s, G+) | V_85 -> (t~, s, G+) | V_86 -> (u~, b, G+) | V_87 -> (c~, b, G+) | V_90 -> (c~, d, W+) | V_91 -> (t~, d, W+) | V_92 -> (u~, s, W+) | V_94 -> (t~, s, W+) | V_95 -> (u~, b, W+) | V_96 -> (c~, b, W+) | V_101 -> (e+, e-, G0) | V_102 -> (mu+, mu-, G0) | V_104 -> (e+, e-, H) | V_105 -> (mu+, mu-, H) | V_110 -> (ve~, e-, G+) | V_111 -> (vm~, mu-, G+) | V_116 -> (b~, u, G-) | V_117 -> (d~, c, G-) | V_118 -> (s~, c, G-) | V_119 -> (b~, c, G-) | V_120 -> (d~, t, G-) | V_121 -> (s~, t, G-) | V_124 -> (s~, u, W-) | V_125 -> (b~, u, W-) | V_126 -> (d~, c, W-) | V_128 -> (b~, c, W-) | V_129 -> (d~, t, W-) | V_130 -> (s~, t, W-) | V_138 -> (c~, c, G0) | V_140 -> (c~, c, H) | V_145 -> (e+, ve, G-) | V_146 -> (mu+, vm, G-)
  1971. 34.13 s > [2026-09-14 22:20:37.348] @gammalooprs::model INFO : The following 36 couplings were removed by the restriction card:
  1972. 34.13 s > GC_13, GC_14, GC_16, GC_17, GC_18, GC_19, GC_20, GC_22, GC_23, GC_24, GC_25, GC_26, GC_28, GC_29, GC_42, GC_43, GC_44, GC_46, GC_47, GC_48, GC_84, GC_85, GC_86, GC_87, GC_88, GC_89, GC_90, GC_91, GC_92, GC_93, GC_101, GC_102, GC_103, GC_105, GC_106, GC_107
  1973. 34.13 s > [2026-09-14 22:20:37.348] @gammaloop_api::se... INFO : Running command set default-runtime kv kinematics.externals='{"type":"constant","data":{"momenta":[[32.0,0.0,0.0,32.0],[32.0,0.0,0.0,-32.0]],"helicities":[1,1]}}'
  1974. 34.13 s > [2026-09-14 22:20:37.349] @gammaloop_api::se... INFO : Running command set default-runtime kv subtraction.disable_threshold_subtraction=true
  1975. 34.13 s > [2026-09-14 22:20:37.350] @gammaloop_api::se... INFO : Running command generate xs e+ e- > d d~ g | e- a d g QED^2==4 [{{2}} QCD=0] --numerator-grouping group_identical_graphs_up_to_sign --clear-existing-processes --only-diagrams
  1976. 34.13 s > [2026-09-14 22:20:37.352] @feyngen::diagram_... INFO : 0s | Δ=0s | Starting Feynman graph generation with Symbolica...
  1977. 34.13 s > [2026-09-14 22:20:37.355] @feyngen::diagram_... INFO : 0s | Δ=0s | Number of graphs resulting from Symbolica generation: 246
  1978. 34.13 s > [2026-09-14 22:20:37.356] @feyngen::diagram_... INFO : 0s | Δ=0s | Number of graphs retained after enforcing supergraph particle content: 8
  1979. 34.13 s > [2026-09-14 22:20:37.356] @feyngen::diagram_... INFO : 0s | Δ=0s | Number of graphs retained after removal of vetoed topologies: 8
  1980. 34.13 s > [2026-09-14 22:20:37.356] @feyngen::diagram_... INFO : 0s | Δ=0s | Number of graphs after vertex info assignment: 8
  1981. 34.13 s > [2026-09-14 22:20:37.356] @feyngen::diagram_... INFO : 0s | Δ=0s | Number of graphs after all complete graphs filters are applied: 8
  1982. 34.13 s >
  1983. 34.13 s >
  1984. 34.13 s > Location:
  1985. 34.13 s > tests/tests/test_python_api.rs:156:20
  1986. 34.13 s > system-out
  1987. 34.13 s > running 1 test
  1988. 34.13 s > test python_evaluate_samples_batch_and_momentum_space_have_expected_shape ... FAILED
  1989. 34.13 s >
  1990. 34.13 s > failures:
  1991. 34.13 s >
  1992. 34.13 s > failures:
  1993. 34.13 s > python_evaluate_samples_batch_and_momentum_space_have_expected_shape
  1994. 34.13 s >
  1995. 34.13 s > test result: FAILED. 0 passed; 1 failed; 0 ignored; 0 measured; 4 filtered out; finished in 0.21s
  1996. 34.13 s > system-err
  1997. 34.13 s > Error: Python API test subprocess failed.
  1998. 34.13 s > stdout:
  1999. 34.13 s > ┌────────────────────────────────────────────────────────┐
  2000. 34.13 s > │ You are running a restricted Symbolica instance. │
  2001. 34.13 s > │ │
  2002. 34.13 s > │ This mode is only permitted for non-commercial use and │
  2003. 34.13 s > │ is limited to one instance and core per machine. │
  2004. 34.13 s > │ │
  2005. 34.13 s > │ Hobbyists can easily acquire a free license key │
  2006. 34.13 s > │ that unlocks all cores and removes this banner: │
  2007. 34.13 s > │ │
  2008. 34.13 s > │ from symbolica import * │
  2009. 34.13 s > │ request_hobbyist_license('YOUR_NAME', 'YOUR_EMAIL') │
  2010. 34.13 s > │ │
  2011. 34.13 s > │ All other users can obtain a free 30-day trial key: │
  2012. 34.13 s > │ │
  2013. 34.13 s > │ from symbolica import * │
  2014. 34.13 s > │ request_trial_license('NAME', 'EMAIL', 'EMPLOYER') │
  2015. 34.13 s > │ │
  2016. 34.13 s > │ See https://symbolica.io/docs/get_started.html#license │
  2017. 34.13 s > └────────────────────────────────────────────────────────┘
  2018. 34.13 s > ┌───────────────────────────────────────────────────────────────────────────────────────────────────────────┐
  2019. 34.13 s > │ Cannot start new unlicensed Symbolica instance since there is already another one running on the machine. │
  2020. 34.13 s > └───────────────────────────────────────────────────────────────────────────────────────────────────────────┘
  2021. 34.13 s >
  2022. 34.13 s > stderr:
  2023. 34.13 s >
  2024. 34.13 s > ┌───────────────────────────────────────────────────────────┐
  2025. 34.13 s > │ Could not resolve the IP of the Symbolica license server. │
  2026. 34.13 s > │ │
  2027. 34.13 s > │ Please check your DNS configuration. │
  2028. 34.13 s > └───────────────────────────────────────────────────────────┘
  2029. 34.13 s > Error: failed to lookup address information: Temporary failure in name resolution
  2030. 34.13 s > [2026-09-14 22:20:37.313] @gammaloop_api::se... INFO : Running command import model sm-default
  2031. 34.13 s > [2026-09-14 22:20:37.313] @import::model INFO : Loading built-in JSON model sm-default
  2032. 34.13 s > [2026-09-14 22:20:37.348] @gammalooprs::model INFO : The following 11 external parameters were forced to zero by the restriction card:
  2033. 34.13 s > lamWS, AWS, rhoWS, etaWS, ymc, yme, ymm, MC, Me, MM, WTau
  2034. 34.13 s > [2026-09-14 22:20:37.348] @gammalooprs::model INFO : The following 34 vertex rules were removed by the restriction card:
  2035. 34.13 s > V_82 -> (c~, d, G+) | V_83 -> (t~, d, G+) | V_84 -> (c~, s, G+) | V_85 -> (t~, s, G+) | V_86 -> (u~, b, G+) | V_87 -> (c~, b, G+) | V_90 -> (c~, d, W+) | V_91 -> (t~, d, W+) | V_92 -> (u~, s, W+) | V_94 -> (t~, s, W+) | V_95 -> (u~, b, W+) | V_96 -> (c~, b, W+) | V_101 -> (e+, e-, G0) | V_102 -> (mu+, mu-, G0) | V_104 -> (e+, e-, H) | V_105 -> (mu+, mu-, H) | V_110 -> (ve~, e-, G+) | V_111 -> (vm~, mu-, G+) | V_116 -> (b~, u, G-) | V_117 -> (d~, c, G-) | V_118 -> (s~, c, G-) | V_119 -> (b~, c, G-) | V_120 -> (d~, t, G-) | V_121 -> (s~, t, G-) | V_124 -> (s~, u, W-) | V_125 -> (b~, u, W-) | V_126 -> (d~, c, W-) | V_128 -> (b~, c, W-) | V_129 -> (d~, t, W-) | V_130 -> (s~, t, W-) | V_138 -> (c~, c, G0) | V_140 -> (c~, c, H) | V_145 -> (e+, ve, G-) | V_146 -> (mu+, vm, G-)
  2036. 34.13 s > [2026-09-14 22:20:37.348] @gammalooprs::model INFO : The following 36 couplings were removed by the restriction card:
  2037. 34.13 s > GC_13, GC_14, GC_16, GC_17, GC_18, GC_19, GC_20, GC_22, GC_23, GC_24, GC_25, GC_26, GC_28, GC_29, GC_42, GC_43, GC_44, GC_46, GC_47, GC_48, GC_84, GC_85, GC_86, GC_87, GC_88, GC_89, GC_90, GC_91, GC_92, GC_93, GC_101, GC_102, GC_103, GC_105, GC_106, GC_107
  2038. 34.13 s > [2026-09-14 22:20:37.348] @gammaloop_api::se... INFO : Running command set default-runtime kv kinematics.externals='{"type":"constant","data":{"momenta":[[32.0,0.0,0.0,32.0],[32.0,0.0,0.0,-32.0]],"helicities":[1,1]}}'
  2039. 34.13 s > [2026-09-14 22:20:37.349] @gammaloop_api::se... INFO : Running command set default-runtime kv subtraction.disable_threshold_subtraction=true
  2040. 34.13 s > [2026-09-14 22:20:37.350] @gammaloop_api::se... INFO : Running command generate xs e+ e- > d d~ g | e- a d g QED^2==4 [{{2}} QCD=0] --numerator-grouping group_identical_graphs_up_to_sign --clear-existing-processes --only-diagrams
  2041. 34.13 s > [2026-09-14 22:20:37.352] @feyngen::diagram_... INFO : 0s | Δ=0s | Starting Feynman graph generation with Symbolica...
  2042. 34.13 s > [2026-09-14 22:20:37.355] @feyngen::diagram_... INFO : 0s | Δ=0s | Number of graphs resulting from Symbolica generation: 246
  2043. 34.13 s > [2026-09-14 22:20:37.356] @feyngen::diagram_... INFO : 0s | Δ=0s | Number of graphs retained after enforcing supergraph particle content: 8
  2044. 34.13 s > [2026-09-14 22:20:37.356] @feyngen::diagram_... INFO : 0s | Δ=0s | Number of graphs retained after removal of vetoed topologies: 8
  2045. 34.13 s > [2026-09-14 22:20:37.356] @feyngen::diagram_... INFO : 0s | Δ=0s | Number of graphs after vertex info assignment: 8
  2046. 34.13 s > [2026-09-14 22:20:37.356] @feyngen::diagram_... INFO : 0s | Δ=0s | Number of graphs after all complete graphs filters are applied: 8
  2047. 34.13 s >
  2048. 34.13 s >
  2049. 34.13 s > Location:
  2050. 34.13 s > tests/tests/test_python_api.rs:156:20
  2051. 34.13 s >
  2052. 34.13 s > 5. gammaloop-integration-tests::test_python_api::python_settings_wrappers_expose_nested_runtime_and_global_settings
  2053. 34.13 s > failure: test failure with exit code 101
  2054. 34.13 s > Error: Python API test subprocess failed.
  2055. 34.13 s > stdout:
  2056. 34.13 s > ┌────────────────────────────────────────────────────────┐
  2057. 34.13 s > │ You are running a restricted Symbolica instance. │
  2058. 34.13 s > │ │
  2059. 34.13 s > │ This mode is only permitted for non-commercial use and │
  2060. 34.13 s > │ is limited to one instance and core per machine. │
  2061. 34.13 s > │ │
  2062. 34.13 s > │ Hobbyists can easily acquire a free license key │
  2063. 34.13 s > │ that unlocks all cores and removes this banner: │
  2064. 34.13 s > │ │
  2065. 34.13 s > │ from symbolica import * │
  2066. 34.13 s > │ request_hobbyist_license('YOUR_NAME', 'YOUR_EMAIL') │
  2067. 34.13 s > │ │
  2068. 34.13 s > │ All other users can obtain a free 30-day trial key: │
  2069. 34.13 s > │ │
  2070. 34.13 s > │ from symbolica import * │
  2071. 34.13 s > │ request_trial_license('NAME', 'EMAIL', 'EMPLOYER') │
  2072. 34.13 s > │ │
  2073. 34.13 s > │ See https://symbolica.io/docs/get_started.html#license │
  2074. 34.13 s > └────────────────────────────────────────────────────────┘
  2075. 34.13 s > ┌───────────────────────────────────────────────────────────────────────────────────────────────────────────┐
  2076. 34.13 s > │ Cannot start new unlicensed Symbolica instance since there is already another one running on the machine. │
  2077. 34.13 s > └───────────────────────────────────────────────────────────────────────────────────────────────────────────┘
  2078. 34.13 s >
  2079. 34.13 s > stderr:
  2080. 34.13 s >
  2081. 34.13 s > ┌───────────────────────────────────────────────────────────┐
  2082. 34.13 s > │ Could not resolve the IP of the Symbolica license server. │
  2083. 34.13 s > │ │
  2084. 34.13 s > │ Please check your DNS configuration. │
  2085. 34.13 s > └───────────────────────────────────────────────────────────┘
  2086. 34.13 s > Error: failed to lookup address information: Temporary failure in name resolution
  2087. 34.13 s >
  2088. 34.13 s >
  2089. 34.13 s > Location:
  2090. 34.13 s > tests/tests/test_python_api.rs:156:20
  2091. 34.13 s > system-out
  2092. 34.13 s > running 1 test
  2093. 34.13 s > test python_settings_wrappers_expose_nested_runtime_and_global_settings ... FAILED
  2094. 34.13 s >
  2095. 34.13 s > failures:
  2096. 34.13 s >
  2097. 34.13 s > failures:
  2098. 34.13 s > python_settings_wrappers_expose_nested_runtime_and_global_settings
  2099. 34.13 s >
  2100. 34.13 s > test result: FAILED. 0 passed; 1 failed; 0 ignored; 0 measured; 4 filtered out; finished in 0.22s
  2101. 34.13 s > system-err
  2102. 34.13 s > Error: Python API test subprocess failed.
  2103. 34.13 s > stdout:
  2104. 34.13 s > ┌────────────────────────────────────────────────────────┐
  2105. 34.13 s > │ You are running a restricted Symbolica instance. │
  2106. 34.13 s > │ │
  2107. 34.13 s > │ This mode is only permitted for non-commercial use and │
  2108. 34.13 s > │ is limited to one instance and core per machine. │
  2109. 34.13 s > │ │
  2110. 34.13 s > │ Hobbyists can easily acquire a free license key │
  2111. 34.13 s > │ that unlocks all cores and removes this banner: │
  2112. 34.13 s > │ │
  2113. 34.13 s > │ from symbolica import * │
  2114. 34.13 s > │ request_hobbyist_license('YOUR_NAME', 'YOUR_EMAIL') │
  2115. 34.13 s > │ │
  2116. 34.13 s > │ All other users can obtain a free 30-day trial key: │
  2117. 34.13 s > │ │
  2118. 34.13 s > │ from symbolica import * │
  2119. 34.13 s > │ request_trial_license('NAME', 'EMAIL', 'EMPLOYER') │
  2120. 34.13 s > │ │
  2121. 34.13 s > │ See https://symbolica.io/docs/get_started.html#license │
  2122. 34.13 s > └────────────────────────────────────────────────────────┘
  2123. 34.13 s > ┌───────────────────────────────────────────────────────────────────────────────────────────────────────────┐
  2124. 34.13 s > │ Cannot start new unlicensed Symbolica instance since there is already another one running on the machine. │
  2125. 34.13 s > └───────────────────────────────────────────────────────────────────────────────────────────────────────────┘
  2126. 34.13 s >
  2127. 34.13 s > stderr:
  2128. 34.13 s >
  2129. 34.13 s > ┌───────────────────────────────────────────────────────────┐
  2130. 34.13 s > │ Could not resolve the IP of the Symbolica license server. │
  2131. 34.13 s > │ │
  2132. 34.13 s > │ Please check your DNS configuration. │
  2133. 34.13 s > └───────────────────────────────────────────────────────────┘
  2134. 34.13 s > Error: failed to lookup address information: Temporary failure in name resolution
  2135. 34.13 s >
  2136. 34.13 s >
  2137. 34.13 s > Location:
  2138. 34.13 s > tests/tests/test_python_api.rs:156:20
  2139. 34.13 s > =========================================
  2140. 34.13 s For full logs, run:
  2141. 34.13 s nix log /nix/store/0y85356skfl9xg7hqjngmsb9xh03dwf2-gammaloop-nextest-python-api.drv
  2142. 34.31 s [2 built (1 failed), 12 Run failed.