test packages.x86_64-linux.nix-ci-check-gammaloop-nextest-python-api

Reproduce this run
Retry Run
  1. 0.00 s $ /nix/store/9ypz3flqsrl5xl495mm8h645gadjsxi1-coreutils-9.11/bin/timeout --kill-after=15s 7200s /nix/store/23zk8sgzamrbmj1fday15szf7f2279s8-nix-2.34.7/bin/nix --extra-experimental-features nix-command --extra-experimental-features flakes flake clone git+https://github.com/alphal00p/gammaloop --dest /tmp/nix-ci-worker/stable-pwd/repo/
  2. 0.07 s Cloning into '/tmp/nix-ci-worker/stable-pwd/repo'...
  3. 1.65 s remote: Enumerating objects: 87083 remote: Enumerating objects: 93878, done.
  4. 1.76 s remote: Counting objects: 0% (1/9199) remote: Counting objects: 1% (92/9199) remote: Counting objects: 2% (184/9199) remote: Counting objects: 3% (276/9199) remote: Counting objects: 4% (368/9199) remote: Counting objects: 5% (460/9199) remote: Counting objects: 6% (552/9199) remote: Counting objects: 7% (644/9199) remote: Counting objects: 8% (736/9199) remote: Counting objects: 9% (828/9199) remote: Counting objects: 10% (920/9199) remote: Counting objects: 11% (1012/9199) remote: Counting objects: 12% (1104/9199) remote: Counting objects: 13% (1196/9199) remote: Counting objects: 14% (1288/9199) remote: Counting objects: 15% (1380/9199) remote: Counting objects: 16% (1472/9199) remote: Counting objects: 17% (1564/9199) remote: Counting objects: 18% (1656/9199) remote: Counting objects: 19% (1748/9199) remote: Counting objects: 20% (1840/9199) remote: Counting objects: 21% (1932/9199) remote: Counting objects: 22% (2024/9199) remote: Counting objects: 23% (2116/9199) remote: Counting objects: 24% (2208/9199) remote: Counting objects: 25% (2300/9199) remote: Counting objects: 26% (2392/9199) remote: Counting objects: 27% (2484/9199) remote: Counting objects: 28% (2576/9199) remote: Counting objects: 29% (2668/9199) remote: Counting objects: 30% (2760/9199) remote: Counting objects: 31% (2852/9199) remote: Counting objects: 32% (2944/9199) remote: Counting objects: 33% (3036/9199) remote: Counting objects: 34% (3128/9199) remote: Counting objects: 35% (3220/9199) remote: Counting objects: 36% (3312/9199) remote: Counting objects: 37% (3404/9199) remote: Counting objects: 38% (3496/9199) remote: Counting objects: 39% (3588/9199) remote: Counting objects: 40% (3680/9199) remote: Counting objects: 41% (3772/9199) remote: Counting objects: 42% (3864/9199) remote: Counting objects: 43% (3956/9199) remote: Counting objects: 44% (4048/9199) remote: Counting objects: 45% (4140/9199) remote: Counting objects: 46% (4232/9199) remote: Counting objects: 47% (4324/9199) remote: Counting objects: 48% (4416/9199) remote: Counting objects: 49% (4508/9199) remote: Counting objects: 50% (4600/9199) remote: Counting objects: 51% (4692/9199) remote: Counting objects: 52% (4784/9199) remote: Counting objects: 53% (4876/9199) remote: Counting objects: 54% (4968/9199) remote: Counting objects: 55% (5060/9199) remote: Counting objects: 56% (5152/9199) remote: Counting objects: 57% (5244/9199) remote: Counting objects: 58% (5336/9199) remote: Counting objects: 59% (5428/9199) remote: Counting objects: 60% (5520/9199) remote: Counting objects: 61% (5612/9199) remote: Counting objects: 62% (5704/9199) remote: Counting objects: 63% (5796/9199) remote: Counting objects: 64% (5888/9199) remote: Counting objects: 65% (5980/9199) remote: Counting objects: 66% (6072/9199) remote: Counting objects: 67% (6164/9199) remote: Counting objects: 68% (6256/9199) remote: Counting objects: 69% (6348/9199) remote: Counting objects: 70% (6440/9199) remote: Counting objects: 71% (6532/9199) remote: Counting objects: 72% (6624/9199) remote: Counting objects: 73% (6716/9199) remote: Counting objects: 74% (6808/9199) remote: Counting objects: 75% (6900/9199) remote: Counting objects: 76% (6992/9199) remote: Counting objects: 77% (7084/9199) remote: Counting objects: 78% (7176/9199) remote: Counting objects: 79% (7268/9199) remote: Counting objects: 80% (7360/9199) remote: Counting objects: 81% (7452/9199) remote: Counting objects: 82% (7544/9199) remote: Counting objects: 83% (7636/9199) remote: Counting objects: 84% (7728/9199) remote: Counting objects: 85% (7820/9199) remote: Counting objects: 86% (7912/9199) remote: Counting objects: 87% (8004/9199) remote: Counting objects: 88% (8096/9199) remote: Counting objects: 89% (8188/9199) remote: Counting objects: 90% (8280/9199) remote: Counting objects: 91% (8372/9199) remote: Counting objects: 92% (8464/9199) remote: Counting objects: 93% (8556/9199) remote: Counting objects: 94% (8648/9199) remote: Counting objects: 95% (8740/9199) remote: Counting objects: 96% (8832/9199) remote: Counting objects: 97% (8924/9199) remote: Counting objects: 98% (9016/9199) remote: Counting objects: 99% (9108/9199) remote: Counting objects: 100% (9199/9199) remote: Counting objects: 100% (9199/9199), done.
  5. 3.86 s remote: Compressing objects: 0% (1/1927) remote: Compressing objects: 1% (20/1927) remote: Compressing objects: 2% (39/1927) remote: Compressing objects: 3% (58/1927) remote: Compressing objects: 4% (78/1927) remote: Compressing objects: 5% (97/1927) remote: Compressing objects: 6% (116/1927) remote: Compressing objects: 7% (135/1927) remote: Compressing objects: 8% (155/1927) remote: Compressing objects: 8% (168/1927) remote: Compressing objects: 9% (174/1927) remote: Compressing objects: 10% (193/1927) remote: Compressing objects: 11% (212/1927) remote: Compressing objects: 12% (232/1927) remote: Compressing objects: 13% (251/1927) remote: Compressing objects: 14% (270/1927) remote: Compressing objects: 15% (290/1927) remote: Compressing objects: 16% (309/1927) remote: Compressing objects: 17% (328/1927) remote: Compressing objects: 18% (347/1927) remote: Compressing objects: 19% (367/1927) remote: Compressing objects: 20% (386/1927) remote: Compressing objects: 21% (405/1927) remote: Compressing objects: 22% (424/1927) remote: Compressing objects: 23% (444/1927) remote: Compressing objects: 24% (463/1927) remote: Compressing objects: 25% (482/1927) remote: Compressing objects: 25% (488/1927) remote: Compressing objects: 26% (502/1927) remote: Compressing objects: 27% (521/1927) remote: Compressing objects: 28% (540/1927) remote: Compressing objects: 29% (559/1927) remote: Compressing objects: 30% (579/1927) remote: Compressing objects: 31% (598/1927) remote: Compressing objects: 32% (617/1927) remote: Compressing objects: 33% (636/1927) remote: Compressing objects: 34% (656/1927) remote: Compressing objects: 35% (675/1927) remote: Compressing objects: 36% (694/1927) remote: Compressing objects: 37% (713/1927) remote: Compressing objects: 38% (733/1927) remote: Compressing objects: 39% (752/1927) remote: Compressing objects: 40% (771/1927) remote: Compressing objects: 41% (791/1927) remote: Compressing objects: 42% (810/1927) remote: Compressing objects: 43% (829/1927) remote: Compressing objects: 44% (848/1927) remote: Compressing objects: 45% (868/1927) remote: Compressing objects: 46% (887/1927) remote: Compressing objects: 47% (906/1927) remote: Compressing objects: 48% (925/1927) remote: Compressing objects: 49% (945/1927) remote: Compressing objects: 50% (964/1927) remote: Compressing objects: 51% (983/1927) remote: Compressing objects: 52% (1003/1927) remote: Compressing objects: 53% (1022/1927) remote: Compressing objects: 54% (1041/1927) remote: Compressing objects: 55% (1060/1927) remote: Compressing objects: 56% (1080/1927) remote: Compressing objects: 57% (1099/1927) remote: Compressing objects: 58% (1118/1927) remote: Compressing objects: 59% (1137/1927) remote: Compressing objects: 60% (1157/1927) remote: Compressing objects: 61% (1176/1927) remote: Compressing objects: 62% (1195/1927) remote: Compressing objects: 63% (1215/1927) remote: Compressing objects: 64% (1234/1927) remote: Compressing objects: 65% (1253/1927) remote: Compressing objects: 66% (1272/1927) remote: Compressing objects: 67% (1292/1927) remote: Compressing objects: 68% (1311/1927) remote: Compressing objects: 69% (1330/1927) remote: Compressing objects: 70% (1349/1927) remote: Compressing objects: 71% (1369/1927) remote: Compressing objects: 72% (1388/1927) remote: Compressing objects: 73% (1407/1927) remote: Compressing objects: 74% (1426/1927) remote: Compressing objects: 75% (1446/1927) remote: Compressing objects: 76% (1465/1927) remote: Compressing objects: 77% (1484/1927) remote: Compressing objects: 78% (1504/1927) remote: Compressing objects: 79% (1523/1927) remote: Compressing objects: 80% (1542/1927) remote: Compressing objects: 81% (1561/1927) remote: Compressing objects: 82% (1581/1927) remote: Compressing objects: 83% (1600/1927) remote: Compressing objects: 84% (1619/1927) remote: Compressing objects: 85% (1638/1927) remote: Compressing objects: 86% (1658/1927) remote: Compressing objects: 87% (1677/1927) remote: Compressing objects: 88% (1696/1927) remote: Compressing objects: 89% (1716/1927) remote: Compressing objects: 90% (1735/1927) remote: Compressing objects: 91% (1754/1927) remote: Compressing objects: 92% (1773/1927) remote: Compressing objects: 93% (1793/1927) remote: Compressing objects: 94% (1812/1927) remote: Compressing objects: 95% (1831/1927) remote: Compressing objects: 96% (1850/1927) remote: Compressing objects: 97% (1870/1927) remote: Compressing objects: 98% (1889/1927) remote: Compressing objects: 99% (1908/1927) remote: Compressing objects: 100% (1927/1927) remote: Compressing objects: 100% (1927/1927), done.
  6. 13.10 s Receiving objects: 0% (1/93878) Receiving objects: 1% (939/93878) Receiving objects: 2% (1878/93878) Receiving objects: 3% (2817/93878) Receiving objects: 4% (3756/93878) Receiving objects: 5% (4694/93878) Receiving objects: 6% (5633/93878) Receiving objects: 7% (6572/93878) Receiving objects: 8% (7511/93878), 16.14 MiB | 32.27 MiB/s Receiving objects: 9% (8450/93878), 16.14 MiB | 32.27 MiB/s Receiving objects: 10% (9388/93878), 16.14 MiB | 32.27 MiB/s Receiving objects: 11% (10327/93878), 16.14 MiB | 32.27 MiB/s Receiving objects: 12% (11266/93878), 16.14 MiB | 32.27 MiB/s Receiving objects: 13% (12205/93878), 16.14 MiB | 32.27 MiB/s Receiving objects: 14% (13143/93878), 16.14 MiB | 32.27 MiB/s Receiving objects: 15% (14082/93878), 16.14 MiB | 32.27 MiB/s Receiving objects: 16% (15021/93878), 16.14 MiB | 32.27 MiB/s Receiving objects: 17% (15960/93878), 16.14 MiB | 32.27 MiB/s Receiving objects: 18% (16899/93878), 16.14 MiB | 32.27 MiB/s Receiving objects: 19% (17837/93878), 16.14 MiB | 32.27 MiB/s Receiving objects: 20% (18776/93878), 16.14 MiB | 32.27 MiB/s Receiving objects: 21% (19715/93878), 16.14 MiB | 32.27 MiB/s Receiving objects: 22% (20654/93878), 16.14 MiB | 32.27 MiB/s Receiving objects: 23% (21592/93878), 16.14 MiB | 32.27 MiB/s Receiving objects: 24% (22531/93878), 16.14 MiB | 32.27 MiB/s Receiving objects: 25% (23470/93878), 16.14 MiB | 32.27 MiB/s Receiving objects: 26% (24409/93878), 16.14 MiB | 32.27 MiB/s Receiving objects: 27% (25348/93878), 16.14 MiB | 32.27 MiB/s Receiving objects: 28% (26286/93878), 16.14 MiB | 32.27 MiB/s Receiving objects: 29% (27225/93878), 16.14 MiB | 32.27 MiB/s Receiving objects: 30% (28164/93878), 16.14 MiB | 32.27 MiB/s Receiving objects: 31% (29103/93878), 16.14 MiB | 32.27 MiB/s Receiving objects: 32% (30041/93878), 16.14 MiB | 32.27 MiB/s Receiving objects: 33% (30980/93878), 16.14 MiB | 32.27 MiB/s Receiving objects: 34% (31919/93878), 16.14 MiB | 32.27 MiB/s Receiving objects: 35% (32858/93878), 16.14 MiB | 32.27 MiB/s Receiving objects: 36% (33797/93878), 16.14 MiB | 32.27 MiB/s Receiving objects: 36% (34070/93878), 34.12 MiB | 34.11 MiB/s Receiving objects: 37% (34735/93878), 34.12 MiB | 34.11 MiB/s Receiving objects: 38% (35674/93878), 34.12 MiB | 34.11 MiB/s Receiving objects: 39% (36613/93878), 34.12 MiB | 34.11 MiB/s Receiving objects: 40% (37552/93878), 34.12 MiB | 34.11 MiB/s Receiving objects: 41% (38490/93878), 34.12 MiB | 34.11 MiB/s Receiving objects: 42% (39429/93878), 34.12 MiB | 34.11 MiB/s Receiving objects: 43% (40368/93878), 34.12 MiB | 34.11 MiB/s Receiving objects: 44% (41307/93878), 34.12 MiB | 34.11 MiB/s Receiving objects: 45% (42246/93878), 34.12 MiB | 34.11 MiB/s Receiving objects: 46% (43184/93878), 51.22 MiB | 34.14 MiB/s Receiving objects: 47% (44123/93878), 51.22 MiB | 34.14 MiB/s Receiving objects: 48% (45062/93878), 51.22 MiB | 34.14 MiB/s Receiving objects: 49% (46001/93878), 51.22 MiB | 34.14 MiB/s Receiving objects: 50% (46939/93878), 51.22 MiB | 34.14 MiB/s Receiving objects: 51% (47878/93878), 51.22 MiB | 34.14 MiB/s Receiving objects: 52% (48817/93878), 51.22 MiB | 34.14 MiB/s Receiving objects: 52% (49261/93878), 68.07 MiB | 33.63 MiB/s Receiving objects: 53% (49756/93878), 68.07 MiB | 33.63 MiB/s Receiving objects: 54% (50695/93878), 68.07 MiB | 33.63 MiB/s Receiving objects: 55% (51633/93878), 68.07 MiB | 33.63 MiB/s Receiving objects: 56% (52572/93878), 68.07 MiB | 33.63 MiB/s Receiving objects: 57% (53511/93878), 68.07 MiB | 33.63 MiB/s Receiving objects: 58% (54450/93878), 68.07 MiB | 33.63 MiB/s Receiving objects: 59% (55389/93878), 68.07 MiB | 33.63 MiB/s Receiving objects: 60% (56327/93878), 68.07 MiB | 33.63 MiB/s Receiving objects: 60% (57045/93878), 102.50 MiB | 33.64 MiB/s Receiving objects: 60% (57153/93878), 120.39 MiB | 33.94 MiB/s Receiving objects: 61% (57266/93878), 154.61 MiB | 33.83 MiB/s Receiving objects: 61% (57626/93878), 171.24 MiB | 33.76 MiB/s Receiving objects: 62% (58205/93878), 171.24 MiB | 33.76 MiB/s Receiving objects: 63% (59144/93878), 171.24 MiB | 33.76 MiB/s Receiving objects: 64% (60082/93878), 187.21 MiB | 33.32 MiB/s Receiving objects: 65% (61021/93878), 187.21 MiB | 33.32 MiB/s Receiving objects: 66% (61960/93878), 187.21 MiB | 33.32 MiB/s Receiving objects: 67% (62899/93878), 187.21 MiB | 33.32 MiB/s Receiving objects: 67% (63514/93878), 187.21 MiB | 33.32 MiB/s Receiving objects: 68% (63838/93878), 187.21 MiB | 33.32 MiB/s Receiving objects: 69% (64776/93878), 203.29 MiB | 33.10 MiB/s Receiving objects: 70% (65715/93878), 203.29 MiB | 33.10 MiB/s Receiving objects: 71% (66654/93878), 203.29 MiB | 33.10 MiB/s Receiving objects: 72% (67593/93878), 203.29 MiB | 33.10 MiB/s Receiving objects: 73% (68531/93878), 203.29 MiB | 33.10 MiB/s Receiving objects: 74% (69470/93878), 203.29 MiB | 33.10 MiB/s Receiving objects: 75% (70409/93878), 203.29 MiB | 33.10 MiB/s Receiving objects: 76% (71348/93878), 203.29 MiB | 33.10 MiB/s Receiving objects: 77% (72287/93878), 203.29 MiB | 33.10 MiB/s Receiving objects: 78% (73225/93878), 203.29 MiB | 33.10 MiB/s Receiving objects: 79% (74164/93878), 203.29 MiB | 33.10 MiB/s Receiving objects: 80% (75103/93878), 220.48 MiB | 33.35 MiB/s Receiving objects: 81% (76042/93878), 220.48 MiB | 33.35 MiB/s Receiving objects: 81% (76731/93878), 220.48 MiB | 33.35 MiB/s Receiving objects: 82% (76980/93878), 238.44 MiB | 33.35 MiB/s Receiving objects: 83% (77919/93878), 238.44 MiB | 33.35 MiB/s Receiving objects: 84% (78858/93878), 238.44 MiB | 33.35 MiB/s Receiving objects: 85% (79797/93878), 254.20 MiB | 33.34 MiB/s Receiving objects: 86% (80736/93878), 254.20 MiB | 33.34 MiB/s Receiving objects: 87% (81674/93878), 254.20 MiB | 33.34 MiB/s Receiving objects: 88% (82613/93878), 254.20 MiB | 33.34 MiB/s Receiving objects: 89% (83552/93878), 254.20 MiB | 33.34 MiB/s Receiving objects: 89% (83808/93878), 254.20 MiB | 33.34 MiB/s Receiving objects: 90% (84491/93878), 271.86 MiB | 33.29 MiB/s Receiving objects: 90% (84663/93878), 289.36 MiB | 33.62 MiB/s Receiving objects: 91% (85429/93878), 289.36 MiB | 33.62 MiB/s Receiving objects: 92% (86368/93878), 289.36 MiB | 33.62 MiB/s Receiving objects: 93% (87307/93878), 289.36 MiB | 33.62 MiB/s Receiving objects: 94% (88246/93878), 289.36 MiB | 33.62 MiB/s Receiving objects: 95% (89185/93878), 289.36 MiB | 33.62 MiB/s Receiving objects: 96% (90123/93878), 305.46 MiB | 33.33 MiB/s Receiving objects: 97% (91062/93878), 305.46 MiB | 33.33 MiB/s Receiving objects: 98% (92001/93878), 305.46 MiB | 33.33 MiB/s Receiving objects: 99% (92940/93878), 305.46 MiB | 33.33 MiB/s remote: Total 93878 (delta 7979), reused 7335 (delta 7271), pack-reused 84679 (from 3)
  7. 13.10 s Receiving objects: 100% (93878/93878), 305.46 MiB | 33.33 MiB/s Receiving objects: 100% (93878/93878), 309.94 MiB | 33.56 MiB/s, done.
  8. 14.19 s Resolving deltas: 0% (0/63138) Resolving deltas: 1% (632/63138) Resolving deltas: 2% (1264/63138) Resolving deltas: 3% (1895/63138) Resolving deltas: 4% (2526/63138) Resolving deltas: 5% (3157/63138) Resolving deltas: 6% (3789/63138) Resolving deltas: 7% (4420/63138) Resolving deltas: 8% (5052/63138) Resolving deltas: 9% (5683/63138) Resolving deltas: 10% (6314/63138) Resolving deltas: 11% (6946/63138) Resolving deltas: 12% (7577/63138) Resolving deltas: 13% (8208/63138) Resolving deltas: 14% (8842/63138) Resolving deltas: 15% (9471/63138) Resolving deltas: 16% (10103/63138) Resolving deltas: 17% (10734/63138) Resolving deltas: 18% (11366/63138) Resolving deltas: 19% (11997/63138) Resolving deltas: 20% (12628/63138) Resolving deltas: 21% (13259/63138) Resolving deltas: 22% (13891/63138) Resolving deltas: 23% (14522/63138) Resolving deltas: 24% (15156/63138) Resolving deltas: 25% (15785/63138) Resolving deltas: 26% (16416/63138) Resolving deltas: 27% (17048/63138) Resolving deltas: 28% (17679/63138) Resolving deltas: 29% (18311/63138) Resolving deltas: 30% (18942/63138) Resolving deltas: 31% (19573/63138) Resolving deltas: 32% (20205/63138) Resolving deltas: 33% (20836/63138) Resolving deltas: 34% (21468/63138) Resolving deltas: 35% (22099/63138) Resolving deltas: 36% (22732/63138) Resolving deltas: 37% (23363/63138) Resolving deltas: 38% (23993/63138) Resolving deltas: 39% (24624/63138) Resolving deltas: 40% (25257/63138) Resolving deltas: 41% (25887/63138) Resolving deltas: 42% (26518/63138) Resolving deltas: 43% (27151/63138) Resolving deltas: 44% (27782/63138) Resolving deltas: 45% (28413/63138) Resolving deltas: 46% (29044/63138) Resolving deltas: 47% (29675/63138) Resolving deltas: 48% (30307/63138) Resolving deltas: 49% (30938/63138) Resolving deltas: 50% (31569/63138) Resolving deltas: 51% (32201/63138) Resolving deltas: 52% (32832/63138) Resolving deltas: 53% (33464/63138) Resolving deltas: 54% (34097/63138) Resolving deltas: 55% (34726/63138) Resolving deltas: 56% (35358/63138) Resolving deltas: 57% (35989/63138) Resolving deltas: 58% (36621/63138) Resolving deltas: 59% (37252/63138) Resolving deltas: 60% (37883/63138) Resolving deltas: 61% (38518/63138) Resolving deltas: 62% (39146/63138) Resolving deltas: 63% (39777/63138) Resolving deltas: 64% (40409/63138) Resolving deltas: 65% (41043/63138) Resolving deltas: 66% (41672/63138) Resolving deltas: 67% (42304/63138) Resolving deltas: 68% (42935/63138) Resolving deltas: 69% (43567/63138) Resolving deltas: 70% (44198/63138) Resolving deltas: 71% (44829/63138) Resolving deltas: 72% (45463/63138) Resolving deltas: 73% (46091/63138) Resolving deltas: 74% (46723/63138) Resolving deltas: 75% (47354/63138) Resolving deltas: 76% (47985/63138) Resolving deltas: 77% (48617/63138) Resolving deltas: 78% (49248/63138) Resolving deltas: 79% (49880/63138) Resolving deltas: 80% (50511/63138) Resolving deltas: 81% (51142/63138) Resolving deltas: 82% (51774/63138) Resolving deltas: 83% (52405/63138) Resolving deltas: 84% (53036/63138) Resolving deltas: 85% (53668/63138) Resolving deltas: 86% (54299/63138) Resolving deltas: 87% (54931/63138) Resolving deltas: 88% (55562/63138) Resolving deltas: 88% (56037/63138) Resolving deltas: 89% (56193/63138) Resolving deltas: 90% (56825/63138) Resolving deltas: 91% (57456/63138) Resolving deltas: 92% (58087/63138) Resolving deltas: 93% (58719/63138) Resolving deltas: 94% (59350/63138) Resolving deltas: 95% (59982/63138) Resolving deltas: 96% (60614/63138) Resolving deltas: 97% (61244/63138) Resolving deltas: 98% (61876/63138) Resolving deltas: 99% (62507/63138) Resolving deltas: 100% (63138/63138) Resolving deltas: 100% (63138/63138), done.
  9. 14.67 s Fetching commit 3f9429122eb2e371af39dd0423cbb68dcf4c90ba for advanced_sampling ...
  10. 14.67 s $ /nix/store/bcnisk3ydfgv26v2gw3zlky24g00yww2-git-2.54.0/bin/git fetch origin 3f9429122eb2e371af39dd0423cbb68dcf4c90ba
  11. 15.10 s From https://github.com/alphal00p/gammaloop
  12. 15.10 s * branch 3f9429122eb2e371af39dd0423cbb68dcf4c90ba -> FETCH_HEAD
  13. 15.11 s $ /nix/store/9ypz3flqsrl5xl495mm8h645gadjsxi1-coreutils-9.11/bin/timeout --kill-after=15s 7200s /nix/store/bcnisk3ydfgv26v2gw3zlky24g00yww2-git-2.54.0/bin/git -c advice.detachedHead=false checkout 3f9429122eb2e371af39dd0423cbb68dcf4c90ba
  14. 15.51 s HEAD is now at 3f9429122 handle fully weighted underflow in stability checks
  15. 15.52 s $ /nix/store/9ypz3flqsrl5xl495mm8h645gadjsxi1-coreutils-9.11/bin/timeout --kill-after=15s 7200s /nix/store/23zk8sgzamrbmj1fday15szf7f2279s8-nix-2.34.7/bin/nix --extra-experimental-features nix-command --extra-experimental-features flakes --log-format internal-json run .#packages.x86_64-linux.nix-ci-check-gammaloop-nextest-python-api --print-build-logs
  16. 22.85 s
  17. 22.90 s Downloading cached gammaloop-nextest-binaries-python-api-gammaloop-integration-tests from https://cache.nix-ci.com
  18. 22.96 s Downloaded cached gammaloop-nextest-binaries-python-api-gammaloop-integration-tests (8.5 MiB) in 56ms
  19. 22.96 s Progress: 0 of 1 built, 1 of 3 downloaded from cache
  20. 22.96 s Downloading cached gammaloop-nextest-binaries-python-api from https://cache.nix-ci.com
  21. 22.97 s Downloaded cached gammaloop-nextest-binaries-python-api (520 B) in 4ms
  22. 22.97 s Progress: 0 of 1 built, 2 of 3 downloaded from cache
  23. 22.97 s Downloading cached nix-ci-check-gammaloop-nextest-python-api from https://cache.nix-ci.com
  24. 22.97 s Downloaded cached nix-ci-check-gammaloop-nextest-python-api (1104 B) in 3ms
  25. 22.97 s Progress: 0 of 1 built, 3 of 3 downloaded from cache
  26. 30.89 s evaluating derivation 'g copying '/nix/store/881j evaluating derivation 'g copying '/nix/store/881j evaluating derivation 'g copying '/nix/store/881j evaluating derivation 'g copying '/nix/store/881j evaluating derivation 'g copying '/nix/store/881j evaluating derivation 'g copying '/nix/store/881j evaluating derivation 'g copying '/nix/store/881j evaluating derivation 'g copying '/nix/store/881j evaluating derivation 'g copying '/nix/store/881j evaluating derivation 'g copying '/nix/store/881j evaluating derivation 'g querying gammaloop-nexte querying info about miss querying gammaloop-nexte [0/1 built, 0.0 KiB DL] [1/0/1 built, 0.0 KiB DLgammaloop-nextest-python-api> Extracting 1 binary, 1 build script output directory, and 3 linked paths to /build/nextest-archive-G2UoWd
  27. 30.95 s gammaloop-nextest-python-api> Extracted 18 files to /build/nextest-archive-G2UoWd in 0.07s
  28. 30.96 s gammaloop-nextest-python-api> ------------
  29. 30.96 s gammaloop-nextest-python-api> Nextest run ID 5a508d5f-a544-49c6-b0be-f2f3b3e408d5 with nextest profile: ci_gammaloop
  30. 30.96 s gammaloop-nextest-python-api> Starting 5 tests across 1 binary
  31. 31.08 s gammaloop-nextest-python-api> FAIL [ 0.115s] (1/5) gammaloop-integration-tests::test_python_api python_evaluate_sample_honors_generate_events_and_observable_snapshots
  32. 31.08 s gammaloop-nextest-python-api> stdout ---
  33. 31.08 s gammaloop-nextest-python-api>
  34. 31.08 s gammaloop-nextest-python-api> running 1 test
  35. 31.08 s gammaloop-nextest-python-api> test python_evaluate_sample_honors_generate_events_and_observable_snapshots ... FAILED
  36. 31.08 s gammaloop-nextest-python-api>
  37. 31.08 s gammaloop-nextest-python-api> failures:
  38. 31.08 s gammaloop-nextest-python-api>
  39. 31.08 s gammaloop-nextest-python-api> failures:
  40. 31.08 s gammaloop-nextest-python-api> python_evaluate_sample_honors_generate_events_and_observable_snapshots
  41. 31.08 s gammaloop-nextest-python-api>
  42. 31.08 s gammaloop-nextest-python-api> test result: FAILED. 0 passed; 1 failed; 0 ignored; 0 measured; 4 filtered out; finished in 0.11s
  43. 31.08 s gammaloop-nextest-python-api>
  44. 31.08 s gammaloop-nextest-python-api> stderr ---
  45. 31.08 s gammaloop-nextest-python-api> Error: Python API test subprocess failed.
  46. 31.08 s gammaloop-nextest-python-api> stdout:
  47. 31.08 s gammaloop-nextest-python-api> ┌────────────────────────────────────────────────────────┐
  48. 31.08 s gammaloop-nextest-python-api> │ You are running a restricted Symbolica instance. │
  49. 31.08 s gammaloop-nextest-python-api> │ │
  50. 31.08 s gammaloop-nextest-python-api> │ This mode is only permitted for non-commercial use and │
  51. 31.08 s gammaloop-nextest-python-api> │ is limited to one instance and core per machine. │
  52. 31.08 s gammaloop-nextest-python-api> │ │
  53. 31.08 s gammaloop-nextest-python-api> │ Hobbyists can easily acquire a free license key │
  54. 31.08 s gammaloop-nextest-python-api> │ that unlocks all cores and removes this banner: │
  55. 31.08 s gammaloop-nextest-python-api> │ │
  56. 31.08 s gammaloop-nextest-python-api> │ from symbolica import * │
  57. 31.08 s gammaloop-nextest-python-api> │ request_hobbyist_license('YOUR_NAME', 'YOUR_EMAIL') │
  58. 31.08 s gammaloop-nextest-python-api> │ │
  59. 31.08 s gammaloop-nextest-python-api> │ All other users can obtain a free 30-day trial key: │
  60. 31.08 s gammaloop-nextest-python-api> │ │
  61. 31.08 s gammaloop-nextest-python-api> │ from symbolica import * │
  62. 31.08 s gammaloop-nextest-python-api> │ request_trial_license('NAME', 'EMAIL', 'EMPLOYER') │
  63. 31.08 s gammaloop-nextest-python-api> │ │
  64. 31.08 s gammaloop-nextest-python-api> │ See https://symbolica.io/docs/get_started.html#license │
  65. 31.08 s gammaloop-nextest-python-api> └────────────────────────────────────────────────────────┘
  66. 31.08 s gammaloop-nextest-python-api> ┌───────────────────────────────────────────────────────────────────────────────────────────────────────────┐
  67. 31.08 s gammaloop-nextest-python-api> │ Cannot start new unlicensed Symbolica instance since there is already another one running on the machine. │
  68. 31.08 s gammaloop-nextest-python-api> └───────────────────────────────────────────────────────────────────────────────────────────────────────────┘
  69. 31.08 s gammaloop-nextest-python-api>
  70. 31.08 s gammaloop-nextest-python-api> stderr:
  71. 31.08 s gammaloop-nextest-python-api>
  72. 31.08 s gammaloop-nextest-python-api> ┌───────────────────────────────────────────────────────────┐
  73. 31.08 s gammaloop-nextest-python-api> │ Could not resolve the IP of the Symbolica license server. │
  74. 31.08 s gammaloop-nextest-python-api> │ │
  75. 31.08 s gammaloop-nextest-python-api> │ Please check your DNS configuration. │
  76. 31.08 s gammaloop-nextest-python-api> └───────────────────────────────────────────────────────────┘
  77. 31.08 s gammaloop-nextest-python-api> Error: failed to lookup address information: Temporary failure in name resolution
  78. 31.08 s gammaloop-nextest-python-api>
  79. 31.08 s gammaloop-nextest-python-api>
  80. 31.08 s gammaloop-nextest-python-api> Location:
  81. 31.08 s gammaloop-nextest-python-api> tests/tests/test_python_api.rs:156:20
  82. 31.08 s gammaloop-nextest-python-api>
  83. 31.08 s gammaloop-nextest-python-api> FAIL [ 0.115s] (2/5) gammaloop-integration-tests::test_python_api python_session_getters_return_live_toml_and_command_blocks
  84. 31.08 s gammaloop-nextest-python-api> stdout ---
  85. 31.08 s gammaloop-nextest-python-api>
  86. 31.08 s gammaloop-nextest-python-api> running 1 test
  87. 31.08 s gammaloop-nextest-python-api> test python_session_getters_return_live_toml_and_command_blocks ... FAILED
  88. 31.08 s gammaloop-nextest-python-api>
  89. 31.08 s gammaloop-nextest-python-api> failures:
  90. 31.08 s gammaloop-nextest-python-api>
  91. 31.08 s gammaloop-nextest-python-api> failures:
  92. 31.08 s gammaloop-nextest-python-api> python_session_getters_return_live_toml_and_command_blocks
  93. 31.08 s gammaloop-nextest-python-api>
  94. 31.08 s gammaloop-nextest-python-api> test result: FAILED. 0 passed; 1 failed; 0 ignored; 0 measured; 4 filtered out; finished in 0.11s
  95. 31.08 s gammaloop-nextest-python-api>
  96. 31.08 s gammaloop-nextest-python-api> stderr ---
  97. 31.08 s gammaloop-nextest-python-api> Error: Python API test subprocess failed.
  98. 31.08 s gammaloop-nextest-python-api> stdout:
  99. 31.08 s gammaloop-nextest-python-api> ┌────────────────────────────────────────────────────────┐
  100. 31.08 s gammaloop-nextest-python-api> │ You are running a restricted Symbolica instance. │
  101. 31.08 s gammaloop-nextest-python-api> │ │
  102. 31.08 s gammaloop-nextest-python-api> │ This mode is only permitted for non-commercial use and │
  103. 31.08 s gammaloop-nextest-python-api> │ is limited to one instance and core per machine. │
  104. 31.08 s gammaloop-nextest-python-api> │ │
  105. 31.08 s gammaloop-nextest-python-api> │ Hobbyists can easily acquire a free license key │
  106. 31.08 s gammaloop-nextest-python-api> │ that unlocks all cores and removes this banner: │
  107. 31.08 s gammaloop-nextest-python-api> │ │
  108. 31.08 s gammaloop-nextest-python-api> │ from symbolica import * │
  109. 31.08 s gammaloop-nextest-python-api> │ request_hobbyist_license('YOUR_NAME', 'YOUR_EMAIL') │
  110. 31.08 s gammaloop-nextest-python-api> │ │
  111. 31.08 s gammaloop-nextest-python-api> │ All other users can obtain a free 30-day trial key: │
  112. 31.08 s gammaloop-nextest-python-api> │ │
  113. 31.08 s gammaloop-nextest-python-api> │ from symbolica import * │
  114. 31.08 s gammaloop-nextest-python-api> │ request_trial_license('NAME', 'EMAIL', 'EMPLOYER') │
  115. 31.08 s gammaloop-nextest-python-api> │ │
  116. 31.08 s gammaloop-nextest-python-api> │ See https://symbolica.io/docs/get_started.html#license │
  117. 31.08 s gammaloop-nextest-python-api> └────────────────────────────────────────────────────────┘
  118. 31.08 s gammaloop-nextest-python-api> ┌───────────────────────────────────────────────────────────────────────────────────────────────────────────┐
  119. 31.08 s gammaloop-nextest-python-api> │ Cannot start new unlicensed Symbolica instance since there is already another one running on the machine. │
  120. 31.08 s gammaloop-nextest-python-api> └───────────────────────────────────────────────────────────────────────────────────────────────────────────┘
  121. 31.08 s gammaloop-nextest-python-api>
  122. 31.08 s gammaloop-nextest-python-api> stderr:
  123. 31.08 s gammaloop-nextest-python-api>
  124. 31.08 s gammaloop-nextest-python-api> ┌───────────────────────────────────────────────────────────┐
  125. 31.08 s gammaloop-nextest-python-api> │ Could not resolve the IP of the Symbolica license server. │
  126. 31.08 s gammaloop-nextest-python-api> │ │
  127. 31.08 s gammaloop-nextest-python-api> │ Please check your DNS configuration. │
  128. 31.08 s gammaloop-nextest-python-api> └───────────────────────────────────────────────────────────┘
  129. 31.08 s gammaloop-nextest-python-api> Error: failed to lookup address information: Temporary failure in name resolution
  130. 31.08 s gammaloop-nextest-python-api>
  131. 31.08 s gammaloop-nextest-python-api>
  132. 31.08 s gammaloop-nextest-python-api> Location:
  133. 31.08 s gammaloop-nextest-python-api> tests/tests/test_python_api.rs:156:20
  134. 31.08 s gammaloop-nextest-python-api>
  135. 31.08 s gammaloop-nextest-python-api> FAIL [ 0.115s] (3/5) gammaloop-integration-tests::test_python_api python_evaluate_samples_batch_and_momentum_space_have_expected_shape
  136. 31.08 s gammaloop-nextest-python-api> stdout ---
  137. 31.08 s gammaloop-nextest-python-api>
  138. 31.08 s gammaloop-nextest-python-api> running 1 test
  139. 31.08 s gammaloop-nextest-python-api> test python_evaluate_samples_batch_and_momentum_space_have_expected_shape ... FAILED
  140. 31.08 s gammaloop-nextest-python-api>
  141. 31.08 s gammaloop-nextest-python-api> failures:
  142. 31.08 s gammaloop-nextest-python-api>
  143. 31.08 s gammaloop-nextest-python-api> failures:
  144. 31.08 s gammaloop-nextest-python-api> python_evaluate_samples_batch_and_momentum_space_have_expected_shape
  145. 31.08 s gammaloop-nextest-python-api>
  146. 31.08 s gammaloop-nextest-python-api> test result: FAILED. 0 passed; 1 failed; 0 ignored; 0 measured; 4 filtered out; finished in 0.11s
  147. 31.08 s gammaloop-nextest-python-api>
  148. 31.08 s gammaloop-nextest-python-api> stderr ---
  149. 31.08 s gammaloop-nextest-python-api> Error: Python API test subprocess failed.
  150. 31.08 s gammaloop-nextest-python-api> stdout:
  151. 31.08 s gammaloop-nextest-python-api> ┌────────────────────────────────────────────────────────┐
  152. 31.08 s gammaloop-nextest-python-api> │ You are running a restricted Symbolica instance. │
  153. 31.08 s gammaloop-nextest-python-api> │ │
  154. 31.08 s gammaloop-nextest-python-api> │ This mode is only permitted for non-commercial use and │
  155. 31.08 s gammaloop-nextest-python-api> │ is limited to one instance and core per machine. │
  156. 31.08 s gammaloop-nextest-python-api> │ │
  157. 31.08 s gammaloop-nextest-python-api> │ Hobbyists can easily acquire a free license key │
  158. 31.08 s gammaloop-nextest-python-api> │ that unlocks all cores and removes this banner: │
  159. 31.08 s gammaloop-nextest-python-api> │ │
  160. 31.08 s gammaloop-nextest-python-api> │ from symbolica import * │
  161. 31.08 s gammaloop-nextest-python-api> │ request_hobbyist_license('YOUR_NAME', 'YOUR_EMAIL') │
  162. 31.08 s gammaloop-nextest-python-api> │ │
  163. 31.08 s gammaloop-nextest-python-api> │ All other users can obtain a free 30-day trial key: │
  164. 31.08 s gammaloop-nextest-python-api> │ │
  165. 31.08 s gammaloop-nextest-python-api> │ from symbolica import * │
  166. 31.08 s gammaloop-nextest-python-api> │ request_trial_license('NAME', 'EMAIL', 'EMPLOYER') │
  167. 31.08 s gammaloop-nextest-python-api> │ │
  168. 31.08 s gammaloop-nextest-python-api> │ See https://symbolica.io/docs/get_started.html#license │
  169. 31.08 s gammaloop-nextest-python-api> └────────────────────────────────────────────────────────┘
  170. 31.08 s gammaloop-nextest-python-api> ┌───────────────────────────────────────────────────────────────────────────────────────────────────────────┐
  171. 31.08 s gammaloop-nextest-python-api> │ Cannot start new unlicensed Symbolica instance since there is already another one running on the machine. │
  172. 31.08 s gammaloop-nextest-python-api> └───────────────────────────────────────────────────────────────────────────────────────────────────────────┘
  173. 31.08 s gammaloop-nextest-python-api>
  174. 31.08 s gammaloop-nextest-python-api> stderr:
  175. 31.08 s gammaloop-nextest-python-api>
  176. 31.08 s gammaloop-nextest-python-api> ┌───────────────────────────────────────────────────────────┐
  177. 31.08 s gammaloop-nextest-python-api> │ Could not resolve the IP of the Symbolica license server. │
  178. 31.08 s gammaloop-nextest-python-api> │ │
  179. 31.08 s gammaloop-nextest-python-api> │ Please check your DNS configuration. │
  180. 31.08 s gammaloop-nextest-python-api> └───────────────────────────────────────────────────────────┘
  181. 31.08 s gammaloop-nextest-python-api> Error: failed to lookup address information: Temporary failure in name resolution
  182. 31.08 s gammaloop-nextest-python-api>
  183. 31.08 s gammaloop-nextest-python-api>
  184. 31.08 s gammaloop-nextest-python-api> Location:
  185. 31.08 s gammaloop-nextest-python-api> tests/tests/test_python_api.rs:156:20
  186. 31.08 s gammaloop-nextest-python-api>
  187. 31.08 s gammaloop-nextest-python-api> FAIL [ 0.121s] (4/5) gammaloop-integration-tests::test_python_api python_evaluate_sample_preserves_graph_grouping_and_incoming_pdgs
  188. 31.08 s gammaloop-nextest-python-api> stdout ---
  189. 31.08 s gammaloop-nextest-python-api>
  190. 31.08 s gammaloop-nextest-python-api> running 1 test
  191. 31.08 s gammaloop-nextest-python-api> test python_evaluate_sample_preserves_graph_grouping_and_incoming_pdgs ... FAILED
  192. 31.08 s gammaloop-nextest-python-api>
  193. 31.08 s gammaloop-nextest-python-api> failures:
  194. 31.08 s gammaloop-nextest-python-api>
  195. 31.08 s gammaloop-nextest-python-api> failures:
  196. 31.08 s gammaloop-nextest-python-api> python_evaluate_sample_preserves_graph_grouping_and_incoming_pdgs
  197. 31.08 s gammaloop-nextest-python-api>
  198. 31.08 s gammaloop-nextest-python-api> test result: FAILED. 0 passed; 1 failed; 0 ignored; 0 measured; 4 filtered out; finished in 0.12s
  199. 31.08 s gammaloop-nextest-python-api>
  200. 31.08 s gammaloop-nextest-python-api> stderr ---
  201. 31.08 s gammaloop-nextest-python-api> Error: Python API test subprocess failed.
  202. 31.08 s gammaloop-nextest-python-api> stdout:
  203. 31.08 s gammaloop-nextest-python-api> ┌────────────────────────────────────────────────────────┐
  204. 31.08 s gammaloop-nextest-python-api> │ You are running a restricted Symbolica instance. │
  205. 31.08 s gammaloop-nextest-python-api> │ │
  206. 31.08 s gammaloop-nextest-python-api> │ This mode is only permitted for non-commercial use and │
  207. 31.08 s gammaloop-nextest-python-api> │ is limited to one instance and core per machine. │
  208. 31.08 s gammaloop-nextest-python-api> │ │
  209. 31.08 s gammaloop-nextest-python-api> │ Hobbyists can easily acquire a free license key │
  210. 31.08 s gammaloop-nextest-python-api> │ that unlocks all cores and removes this banner: │
  211. 31.08 s gammaloop-nextest-python-api> │ │
  212. 31.08 s gammaloop-nextest-python-api> │ from symbolica import * │
  213. 31.08 s gammaloop-nextest-python-api> │ request_hobbyist_license('YOUR_NAME', 'YOUR_EMAIL') │
  214. 31.08 s gammaloop-nextest-python-api> │ │
  215. 31.08 s gammaloop-nextest-python-api> │ All other users can obtain a free 30-day trial key: │
  216. 31.08 s gammaloop-nextest-python-api> │ │
  217. 31.08 s gammaloop-nextest-python-api> │ from symbolica import * │
  218. 31.08 s gammaloop-nextest-python-api> │ request_trial_license('NAME', 'EMAIL', 'EMPLOYER') │
  219. 31.08 s gammaloop-nextest-python-api> │ │
  220. 31.08 s gammaloop-nextest-python-api> │ See https://symbolica.io/docs/get_started.html#license │
  221. 31.08 s gammaloop-nextest-python-api> └────────────────────────────────────────────────────────┘
  222. 31.08 s gammaloop-nextest-python-api> ┌───────────────────────────────────────────────────────────────────────────────────────────────────────────┐
  223. 31.08 s gammaloop-nextest-python-api> │ Cannot start new unlicensed Symbolica instance since there is already another one running on the machine. │
  224. 31.08 s gammaloop-nextest-python-api> └───────────────────────────────────────────────────────────────────────────────────────────────────────────┘
  225. 31.08 s gammaloop-nextest-python-api>
  226. 31.08 s gammaloop-nextest-python-api> stderr:
  227. 31.08 s gammaloop-nextest-python-api>
  228. 31.08 s gammaloop-nextest-python-api> ┌───────────────────────────────────────────────────────────┐
  229. 31.08 s gammaloop-nextest-python-api> │ Could not resolve the IP of the Symbolica license server. │
  230. 31.08 s gammaloop-nextest-python-api> │ │
  231. 31.08 s gammaloop-nextest-python-api> │ Please check your DNS configuration. │
  232. 31.08 s gammaloop-nextest-python-api> └───────────────────────────────────────────────────────────┘
  233. 31.08 s gammaloop-nextest-python-api> Error: failed to lookup address information: Temporary failure in name resolution
  234. 31.08 s gammaloop-nextest-python-api>
  235. 31.08 s gammaloop-nextest-python-api>
  236. 31.08 s gammaloop-nextest-python-api> Location:
  237. 31.08 s gammaloop-nextest-python-api> tests/tests/test_python_api.rs:156:20
  238. 31.08 s gammaloop-nextest-python-api>
  239. 31.24 s gammaloop-nextest-python-api> ------------
  240. 31.24 s gammaloop-nextest-python-api> Summary [ 0.282s] 5 tests run: 1 passed, 4 failed, 0 skipped
  241. 31.24 s gammaloop-nextest-python-api> FAIL [ 0.115s] (1/5) gammaloop-integration-tests::test_python_api python_evaluate_sample_honors_generate_events_and_observable_snapshots
  242. 31.24 s gammaloop-nextest-python-api> stdout ---
  243. 31.24 s gammaloop-nextest-python-api>
  244. 31.24 s gammaloop-nextest-python-api> running 1 test
  245. 31.24 s gammaloop-nextest-python-api> test python_evaluate_sample_honors_generate_events_and_observable_snapshots ... FAILED
  246. 31.24 s gammaloop-nextest-python-api>
  247. 31.24 s gammaloop-nextest-python-api> failures:
  248. 31.24 s gammaloop-nextest-python-api>
  249. 31.24 s gammaloop-nextest-python-api> failures:
  250. 31.24 s gammaloop-nextest-python-api> python_evaluate_sample_honors_generate_events_and_observable_snapshots
  251. 31.24 s gammaloop-nextest-python-api>
  252. 31.24 s gammaloop-nextest-python-api> test result: FAILED. 0 passed; 1 failed; 0 ignored; 0 measured; 4 filtered out; finished in 0.11s
  253. 31.24 s gammaloop-nextest-python-api>
  254. 31.24 s gammaloop-nextest-python-api> stderr ---
  255. 31.24 s gammaloop-nextest-python-api> Error: Python API test subprocess failed.
  256. 31.24 s gammaloop-nextest-python-api> stdout:
  257. 31.24 s gammaloop-nextest-python-api> ┌────────────────────────────────────────────────────────┐
  258. 31.24 s gammaloop-nextest-python-api> │ You are running a restricted Symbolica instance. │
  259. 31.24 s gammaloop-nextest-python-api> │ │
  260. 31.24 s gammaloop-nextest-python-api> │ This mode is only permitted for non-commercial use and │
  261. 31.24 s gammaloop-nextest-python-api> │ is limited to one instance and core per machine. │
  262. 31.24 s gammaloop-nextest-python-api> │ │
  263. 31.24 s gammaloop-nextest-python-api> │ Hobbyists can easily acquire a free license key │
  264. 31.24 s gammaloop-nextest-python-api> │ that unlocks all cores and removes this banner: │
  265. 31.24 s gammaloop-nextest-python-api> │ │
  266. 31.24 s gammaloop-nextest-python-api> │ from symbolica import * │
  267. 31.24 s gammaloop-nextest-python-api> │ request_hobbyist_license('YOUR_NAME', 'YOUR_EMAIL') │
  268. 31.24 s gammaloop-nextest-python-api> │ │
  269. 31.24 s gammaloop-nextest-python-api> │ All other users can obtain a free 30-day trial key: │
  270. 31.24 s gammaloop-nextest-python-api> │ │
  271. 31.24 s gammaloop-nextest-python-api> │ from symbolica import * │
  272. 31.24 s gammaloop-nextest-python-api> │ request_trial_license('NAME', 'EMAIL', 'EMPLOYER') │
  273. 31.24 s gammaloop-nextest-python-api> │ │
  274. 31.24 s gammaloop-nextest-python-api> │ See https://symbolica.io/docs/get_started.html#license │
  275. 31.24 s gammaloop-nextest-python-api> └────────────────────────────────────────────────────────┘
  276. 31.24 s gammaloop-nextest-python-api> ┌───────────────────────────────────────────────────────────────────────────────────────────────────────────┐
  277. 31.24 s gammaloop-nextest-python-api> │ Cannot start new unlicensed Symbolica instance since there is already another one running on the machine. │
  278. 31.24 s gammaloop-nextest-python-api> └───────────────────────────────────────────────────────────────────────────────────────────────────────────┘
  279. 31.24 s gammaloop-nextest-python-api>
  280. 31.24 s gammaloop-nextest-python-api> stderr:
  281. 31.24 s gammaloop-nextest-python-api>
  282. 31.24 s gammaloop-nextest-python-api> ┌───────────────────────────────────────────────────────────┐
  283. 31.24 s gammaloop-nextest-python-api> │ Could not resolve the IP of the Symbolica license server. │
  284. 31.24 s gammaloop-nextest-python-api> │ │
  285. 31.24 s gammaloop-nextest-python-api> │ Please check your DNS configuration. │
  286. 31.24 s gammaloop-nextest-python-api> └───────────────────────────────────────────────────────────┘
  287. 31.24 s gammaloop-nextest-python-api> Error: failed to lookup address information: Temporary failure in name resolution
  288. 31.24 s gammaloop-nextest-python-api>
  289. 31.24 s gammaloop-nextest-python-api>
  290. 31.24 s gammaloop-nextest-python-api> Location:
  291. 31.24 s gammaloop-nextest-python-api> tests/tests/test_python_api.rs:156:20
  292. 31.24 s gammaloop-nextest-python-api>
  293. 31.24 s gammaloop-nextest-python-api> FAIL [ 0.115s] (2/5) gammaloop-integration-tests::test_python_api python_session_getters_return_live_toml_and_command_blocks
  294. 31.24 s gammaloop-nextest-python-api> stdout ---
  295. 31.24 s gammaloop-nextest-python-api>
  296. 31.24 s gammaloop-nextest-python-api> running 1 test
  297. 31.24 s gammaloop-nextest-python-api> test python_session_getters_return_live_toml_and_command_blocks ... FAILED
  298. 31.24 s gammaloop-nextest-python-api>
  299. 31.24 s gammaloop-nextest-python-api> failures:
  300. 31.24 s gammaloop-nextest-python-api>
  301. 31.24 s gammaloop-nextest-python-api> failures:
  302. 31.24 s gammaloop-nextest-python-api> python_session_getters_return_live_toml_and_command_blocks
  303. 31.24 s gammaloop-nextest-python-api>
  304. 31.24 s gammaloop-nextest-python-api> test result: FAILED. 0 passed; 1 failed; 0 ignored; 0 measured; 4 filtered out; finished in 0.11s
  305. 31.24 s gammaloop-nextest-python-api>
  306. 31.24 s gammaloop-nextest-python-api> stderr ---
  307. 31.24 s gammaloop-nextest-python-api> Error: Python API test subprocess failed.
  308. 31.24 s gammaloop-nextest-python-api> stdout:
  309. 31.24 s gammaloop-nextest-python-api> ┌────────────────────────────────────────────────────────┐
  310. 31.24 s gammaloop-nextest-python-api> │ You are running a restricted Symbolica instance. │
  311. 31.24 s gammaloop-nextest-python-api> │ │
  312. 31.24 s gammaloop-nextest-python-api> │ This mode is only permitted for non-commercial use and │
  313. 31.24 s gammaloop-nextest-python-api> │ is limited to one instance and core per machine. │
  314. 31.24 s gammaloop-nextest-python-api> │ │
  315. 31.24 s gammaloop-nextest-python-api> │ Hobbyists can easily acquire a free license key │
  316. 31.24 s gammaloop-nextest-python-api> │ that unlocks all cores and removes this banner: │
  317. 31.24 s gammaloop-nextest-python-api> │ │
  318. 31.24 s gammaloop-nextest-python-api> │ from symbolica import * │
  319. 31.24 s gammaloop-nextest-python-api> │ request_hobbyist_license('YOUR_NAME', 'YOUR_EMAIL') │
  320. 31.24 s gammaloop-nextest-python-api> │ │
  321. 31.24 s gammaloop-nextest-python-api> │ All other users can obtain a free 30-day trial key: │
  322. 31.24 s gammaloop-nextest-python-api> │ │
  323. 31.24 s gammaloop-nextest-python-api> │ from symbolica import * │
  324. 31.24 s gammaloop-nextest-python-api> │ request_trial_license('NAME', 'EMAIL', 'EMPLOYER') │
  325. 31.24 s gammaloop-nextest-python-api> │ │
  326. 31.24 s gammaloop-nextest-python-api> │ See https://symbolica.io/docs/get_started.html#license │
  327. 31.24 s gammaloop-nextest-python-api> └────────────────────────────────────────────────────────┘
  328. 31.24 s gammaloop-nextest-python-api> ┌───────────────────────────────────────────────────────────────────────────────────────────────────────────┐
  329. 31.24 s gammaloop-nextest-python-api> │ Cannot start new unlicensed Symbolica instance since there is already another one running on the machine. │
  330. 31.24 s gammaloop-nextest-python-api> └───────────────────────────────────────────────────────────────────────────────────────────────────────────┘
  331. 31.24 s gammaloop-nextest-python-api>
  332. 31.24 s gammaloop-nextest-python-api> stderr:
  333. 31.24 s gammaloop-nextest-python-api>
  334. 31.24 s gammaloop-nextest-python-api> ┌───────────────────────────────────────────────────────────┐
  335. 31.24 s gammaloop-nextest-python-api> │ Could not resolve the IP of the Symbolica license server. │
  336. 31.24 s gammaloop-nextest-python-api> │ │
  337. 31.24 s gammaloop-nextest-python-api> │ Please check your DNS configuration. │
  338. 31.24 s gammaloop-nextest-python-api> └───────────────────────────────────────────────────────────┘
  339. 31.24 s gammaloop-nextest-python-api> Error: failed to lookup address information: Temporary failure in name resolution
  340. 31.24 s gammaloop-nextest-python-api>
  341. 31.24 s gammaloop-nextest-python-api>
  342. 31.24 s gammaloop-nextest-python-api> Location:
  343. 31.24 s gammaloop-nextest-python-api> tests/tests/test_python_api.rs:156:20
  344. 31.24 s gammaloop-nextest-python-api>
  345. 31.24 s gammaloop-nextest-python-api> FAIL [ 0.115s] (3/5) gammaloop-integration-tests::test_python_api python_evaluate_samples_batch_and_momentum_space_have_expected_shape
  346. 31.24 s gammaloop-nextest-python-api> stdout ---
  347. 31.24 s gammaloop-nextest-python-api>
  348. 31.24 s gammaloop-nextest-python-api> running 1 test
  349. 31.24 s gammaloop-nextest-python-api> test python_evaluate_samples_batch_and_momentum_space_have_expected_shape ... FAILED
  350. 31.24 s gammaloop-nextest-python-api>
  351. 31.24 s gammaloop-nextest-python-api> failures:
  352. 31.24 s gammaloop-nextest-python-api>
  353. 31.24 s gammaloop-nextest-python-api> failures:
  354. 31.24 s gammaloop-nextest-python-api> python_evaluate_samples_batch_and_momentum_space_have_expected_shape
  355. 31.24 s gammaloop-nextest-python-api>
  356. 31.24 s gammaloop-nextest-python-api> test result: FAILED. 0 passed; 1 failed; 0 ignored; 0 measured; 4 filtered out; finished in 0.11s
  357. 31.24 s gammaloop-nextest-python-api>
  358. 31.24 s gammaloop-nextest-python-api> stderr ---
  359. 31.24 s gammaloop-nextest-python-api> Error: Python API test subprocess failed.
  360. 31.24 s gammaloop-nextest-python-api> stdout:
  361. 31.24 s gammaloop-nextest-python-api> ┌────────────────────────────────────────────────────────┐
  362. 31.24 s gammaloop-nextest-python-api> │ You are running a restricted Symbolica instance. │
  363. 31.24 s gammaloop-nextest-python-api> │ │
  364. 31.24 s gammaloop-nextest-python-api> │ This mode is only permitted for non-commercial use and │
  365. 31.24 s gammaloop-nextest-python-api> │ is limited to one instance and core per machine. │
  366. 31.24 s gammaloop-nextest-python-api> │ │
  367. 31.24 s gammaloop-nextest-python-api> │ Hobbyists can easily acquire a free license key │
  368. 31.24 s gammaloop-nextest-python-api> │ that unlocks all cores and removes this banner: │
  369. 31.24 s gammaloop-nextest-python-api> │ │
  370. 31.24 s gammaloop-nextest-python-api> │ from symbolica import * │
  371. 31.24 s gammaloop-nextest-python-api> │ request_hobbyist_license('YOUR_NAME', 'YOUR_EMAIL') │
  372. 31.24 s gammaloop-nextest-python-api> │ │
  373. 31.24 s gammaloop-nextest-python-api> │ All other users can obtain a free 30-day trial key: │
  374. 31.24 s gammaloop-nextest-python-api> │ │
  375. 31.24 s gammaloop-nextest-python-api> │ from symbolica import * │
  376. 31.24 s gammaloop-nextest-python-api> │ request_trial_license('NAME', 'EMAIL', 'EMPLOYER') │
  377. 31.24 s gammaloop-nextest-python-api> │ │
  378. 31.24 s gammaloop-nextest-python-api> │ See https://symbolica.io/docs/get_started.html#license │
  379. 31.24 s gammaloop-nextest-python-api> └────────────────────────────────────────────────────────┘
  380. 31.24 s gammaloop-nextest-python-api> ┌───────────────────────────────────────────────────────────────────────────────────────────────────────────┐
  381. 31.24 s gammaloop-nextest-python-api> │ Cannot start new unlicensed Symbolica instance since there is already another one running on the machine. │
  382. 31.24 s gammaloop-nextest-python-api> └───────────────────────────────────────────────────────────────────────────────────────────────────────────┘
  383. 31.24 s gammaloop-nextest-python-api>
  384. 31.24 s gammaloop-nextest-python-api> stderr:
  385. 31.24 s gammaloop-nextest-python-api>
  386. 31.24 s gammaloop-nextest-python-api> ┌───────────────────────────────────────────────────────────┐
  387. 31.24 s gammaloop-nextest-python-api> │ Could not resolve the IP of the Symbolica license server. │
  388. 31.24 s gammaloop-nextest-python-api> │ │
  389. 31.24 s gammaloop-nextest-python-api> │ Please check your DNS configuration. │
  390. 31.24 s gammaloop-nextest-python-api> └───────────────────────────────────────────────────────────┘
  391. 31.24 s gammaloop-nextest-python-api> Error: failed to lookup address information: Temporary failure in name resolution
  392. 31.24 s gammaloop-nextest-python-api>
  393. 31.24 s gammaloop-nextest-python-api>
  394. 31.24 s gammaloop-nextest-python-api> Location:
  395. 31.24 s gammaloop-nextest-python-api> tests/tests/test_python_api.rs:156:20
  396. 31.24 s gammaloop-nextest-python-api>
  397. 31.24 s gammaloop-nextest-python-api> FAIL [ 0.121s] (4/5) gammaloop-integration-tests::test_python_api python_evaluate_sample_preserves_graph_grouping_and_incoming_pdgs
  398. 31.24 s gammaloop-nextest-python-api> stdout ---
  399. 31.24 s gammaloop-nextest-python-api>
  400. 31.24 s gammaloop-nextest-python-api> running 1 test
  401. 31.24 s gammaloop-nextest-python-api> test python_evaluate_sample_preserves_graph_grouping_and_incoming_pdgs ... FAILED
  402. 31.24 s gammaloop-nextest-python-api>
  403. 31.24 s gammaloop-nextest-python-api> failures:
  404. 31.24 s gammaloop-nextest-python-api>
  405. 31.24 s gammaloop-nextest-python-api> failures:
  406. 31.24 s gammaloop-nextest-python-api> python_evaluate_sample_preserves_graph_grouping_and_incoming_pdgs
  407. 31.24 s gammaloop-nextest-python-api>
  408. 31.24 s gammaloop-nextest-python-api> test result: FAILED. 0 passed; 1 failed; 0 ignored; 0 measured; 4 filtered out; finished in 0.12s
  409. 31.24 s gammaloop-nextest-python-api>
  410. 31.24 s gammaloop-nextest-python-api> stderr ---
  411. 31.24 s gammaloop-nextest-python-api> Error: Python API test subprocess failed.
  412. 31.24 s gammaloop-nextest-python-api> stdout:
  413. 31.24 s gammaloop-nextest-python-api> ┌────────────────────────────────────────────────────────┐
  414. 31.24 s gammaloop-nextest-python-api> │ You are running a restricted Symbolica instance. │
  415. 31.24 s gammaloop-nextest-python-api> │ │
  416. 31.24 s gammaloop-nextest-python-api> │ This mode is only permitted for non-commercial use and │
  417. 31.24 s gammaloop-nextest-python-api> │ is limited to one instance and core per machine. │
  418. 31.24 s gammaloop-nextest-python-api> │ │
  419. 31.24 s gammaloop-nextest-python-api> │ Hobbyists can easily acquire a free license key │
  420. 31.24 s gammaloop-nextest-python-api> │ that unlocks all cores and removes this banner: │
  421. 31.24 s gammaloop-nextest-python-api> │ │
  422. 31.24 s gammaloop-nextest-python-api> │ from symbolica import * │
  423. 31.24 s gammaloop-nextest-python-api> │ request_hobbyist_license('YOUR_NAME', 'YOUR_EMAIL') │
  424. 31.24 s gammaloop-nextest-python-api> │ │
  425. 31.24 s gammaloop-nextest-python-api> │ All other users can obtain a free 30-day trial key: │
  426. 31.24 s gammaloop-nextest-python-api> │ │
  427. 31.24 s gammaloop-nextest-python-api> │ from symbolica import * │
  428. 31.24 s gammaloop-nextest-python-api> │ request_trial_license('NAME', 'EMAIL', 'EMPLOYER') │
  429. 31.24 s gammaloop-nextest-python-api> │ │
  430. 31.24 s gammaloop-nextest-python-api> │ See https://symbolica.io/docs/get_started.html#license │
  431. 31.24 s gammaloop-nextest-python-api> └────────────────────────────────────────────────────────┘
  432. 31.24 s gammaloop-nextest-python-api> ┌───────────────────────────────────────────────────────────────────────────────────────────────────────────┐
  433. 31.24 s gammaloop-nextest-python-api> │ Cannot start new unlicensed Symbolica instance since there is already another one running on the machine. │
  434. 31.24 s gammaloop-nextest-python-api> └───────────────────────────────────────────────────────────────────────────────────────────────────────────┘
  435. 31.24 s gammaloop-nextest-python-api>
  436. 31.24 s gammaloop-nextest-python-api> stderr:
  437. 31.24 s gammaloop-nextest-python-api>
  438. 31.24 s gammaloop-nextest-python-api> ┌───────────────────────────────────────────────────────────┐
  439. 31.24 s gammaloop-nextest-python-api> │ Could not resolve the IP of the Symbolica license server. │
  440. 31.24 s gammaloop-nextest-python-api> │ │
  441. 31.24 s gammaloop-nextest-python-api> │ Please check your DNS configuration. │
  442. 31.24 s gammaloop-nextest-python-api> └───────────────────────────────────────────────────────────┘
  443. 31.24 s gammaloop-nextest-python-api> Error: failed to lookup address information: Temporary failure in name resolution
  444. 31.24 s gammaloop-nextest-python-api>
  445. 31.24 s gammaloop-nextest-python-api>
  446. 31.24 s gammaloop-nextest-python-api> Location:
  447. 31.24 s gammaloop-nextest-python-api> tests/tests/test_python_api.rs:156:20
  448. 31.24 s gammaloop-nextest-python-api>
  449. 31.25 s gammaloop-nextest-python-api> error: test run failed
  450. 31.28 s gammaloop-nextest-python-api>
  451. 31.28 s gammaloop-nextest-python-api> ========== nextest test summary ==========
  452. 31.28 s gammaloop-nextest-python-api> report: target/nextest/ci_gammaloop/junit.xml
  453. 31.28 s gammaloop-nextest-python-api> tests: 5, failures: 4, errors: 0
  454. 31.28 s gammaloop-nextest-python-api>
  455. 31.28 s gammaloop-nextest-python-api> 1. gammaloop-integration-tests::test_python_api::python_evaluate_sample_honors_generate_events_and_observable_snapshots
  456. 31.28 s gammaloop-nextest-python-api> failure: test failure with exit code 101
  457. 31.28 s gammaloop-nextest-python-api> Error: Python API test subprocess failed.
  458. 31.28 s gammaloop-nextest-python-api> stdout:
  459. 31.28 s gammaloop-nextest-python-api> ┌────────────────────────────────────────────────────────┐
  460. 31.28 s gammaloop-nextest-python-api> │ You are running a restricted Symbolica instance. │
  461. 31.28 s gammaloop-nextest-python-api> │ │
  462. 31.28 s gammaloop-nextest-python-api> │ This mode is only permitted for non-commercial use and │
  463. 31.28 s gammaloop-nextest-python-api> │ is limited to one instance and core per machine. │
  464. 31.28 s gammaloop-nextest-python-api> │ │
  465. 31.28 s gammaloop-nextest-python-api> │ Hobbyists can easily acquire a free license key │
  466. 31.28 s gammaloop-nextest-python-api> │ that unlocks all cores and removes this banner: │
  467. 31.28 s gammaloop-nextest-python-api> │ │
  468. 31.28 s gammaloop-nextest-python-api> │ from symbolica import * │
  469. 31.28 s gammaloop-nextest-python-api> │ request_hobbyist_license('YOUR_NAME', 'YOUR_EMAIL') │
  470. 31.28 s gammaloop-nextest-python-api> │ │
  471. 31.28 s gammaloop-nextest-python-api> │ All other users can obtain a free 30-day trial key: │
  472. 31.28 s gammaloop-nextest-python-api> │ │
  473. 31.28 s gammaloop-nextest-python-api> │ from symbolica import * │
  474. 31.28 s gammaloop-nextest-python-api> │ request_trial_license('NAME', 'EMAIL', 'EMPLOYER') │
  475. 31.28 s gammaloop-nextest-python-api> │ │
  476. 31.28 s gammaloop-nextest-python-api> │ See https://symbolica.io/docs/get_started.html#license │
  477. 31.28 s gammaloop-nextest-python-api> └────────────────────────────────────────────────────────┘
  478. 31.28 s gammaloop-nextest-python-api> ┌───────────────────────────────────────────────────────────────────────────────────────────────────────────┐
  479. 31.28 s gammaloop-nextest-python-api> │ Cannot start new unlicensed Symbolica instance since there is already another one running on the machine. │
  480. 31.28 s gammaloop-nextest-python-api> └───────────────────────────────────────────────────────────────────────────────────────────────────────────┘
  481. 31.28 s gammaloop-nextest-python-api>
  482. 31.28 s gammaloop-nextest-python-api> stderr:
  483. 31.28 s gammaloop-nextest-python-api>
  484. 31.28 s gammaloop-nextest-python-api> ┌───────────────────────────────────────────────────────────┐
  485. 31.28 s gammaloop-nextest-python-api> │ Could not resolve the IP of the Symbolica license server. │
  486. 31.28 s gammaloop-nextest-python-api> │ │
  487. 31.28 s gammaloop-nextest-python-api> │ Please check your DNS configuration. │
  488. 31.28 s gammaloop-nextest-python-api> └───────────────────────────────────────────────────────────┘
  489. 31.28 s gammaloop-nextest-python-api> Error: failed to lookup address information: Temporary failure in name resolution
  490. 31.28 s gammaloop-nextest-python-api>
  491. 31.28 s gammaloop-nextest-python-api>
  492. 31.28 s gammaloop-nextest-python-api> Location:
  493. 31.28 s gammaloop-nextest-python-api> tests/tests/test_python_api.rs:156:20
  494. 31.28 s gammaloop-nextest-python-api> system-out
  495. 31.28 s gammaloop-nextest-python-api> running 1 test
  496. 31.28 s gammaloop-nextest-python-api> test python_evaluate_sample_honors_generate_events_and_observable_snapshots ... FAILED
  497. 31.28 s gammaloop-nextest-python-api>
  498. 31.28 s gammaloop-nextest-python-api> failures:
  499. 31.28 s gammaloop-nextest-python-api>
  500. 31.28 s gammaloop-nextest-python-api> failures:
  501. 31.28 s gammaloop-nextest-python-api> python_evaluate_sample_honors_generate_events_and_observable_snapshots
  502. 31.28 s gammaloop-nextest-python-api>
  503. 31.28 s gammaloop-nextest-python-api> test result: FAILED. 0 passed; 1 failed; 0 ignored; 0 measured; 4 filtered out; finished in 0.11s
  504. 31.28 s gammaloop-nextest-python-api> system-err
  505. 31.28 s gammaloop-nextest-python-api> Error: Python API test subprocess failed.
  506. 31.28 s gammaloop-nextest-python-api> stdout:
  507. 31.28 s gammaloop-nextest-python-api> ┌────────────────────────────────────────────────────────┐
  508. 31.28 s gammaloop-nextest-python-api> │ You are running a restricted Symbolica instance. │
  509. 31.28 s gammaloop-nextest-python-api> │ │
  510. 31.28 s gammaloop-nextest-python-api> │ This mode is only permitted for non-commercial use and │
  511. 31.28 s gammaloop-nextest-python-api> │ is limited to one instance and core per machine. │
  512. 31.28 s gammaloop-nextest-python-api> │ │
  513. 31.28 s gammaloop-nextest-python-api> │ Hobbyists can easily acquire a free license key │
  514. 31.28 s gammaloop-nextest-python-api> │ that unlocks all cores and removes this banner: │
  515. 31.28 s gammaloop-nextest-python-api> │ │
  516. 31.28 s gammaloop-nextest-python-api> │ from symbolica import * │
  517. 31.28 s gammaloop-nextest-python-api> │ request_hobbyist_license('YOUR_NAME', 'YOUR_EMAIL') │
  518. 31.28 s gammaloop-nextest-python-api> │ │
  519. 31.28 s gammaloop-nextest-python-api> │ All other users can obtain a free 30-day trial key: │
  520. 31.28 s gammaloop-nextest-python-api> │ │
  521. 31.28 s gammaloop-nextest-python-api> │ from symbolica import * │
  522. 31.28 s gammaloop-nextest-python-api> │ request_trial_license('NAME', 'EMAIL', 'EMPLOYER') │
  523. 31.28 s gammaloop-nextest-python-api> │ │
  524. 31.28 s gammaloop-nextest-python-api> │ See https://symbolica.io/docs/get_started.html#license │
  525. 31.28 s gammaloop-nextest-python-api> └────────────────────────────────────────────────────────┘
  526. 31.28 s gammaloop-nextest-python-api> ┌───────────────────────────────────────────────────────────────────────────────────────────────────────────┐
  527. 31.28 s gammaloop-nextest-python-api> │ Cannot start new unlicensed Symbolica instance since there is already another one running on the machine. │
  528. 31.28 s gammaloop-nextest-python-api> └───────────────────────────────────────────────────────────────────────────────────────────────────────────┘
  529. 31.28 s gammaloop-nextest-python-api>
  530. 31.28 s gammaloop-nextest-python-api> stderr:
  531. 31.28 s gammaloop-nextest-python-api>
  532. 31.28 s gammaloop-nextest-python-api> ┌───────────────────────────────────────────────────────────┐
  533. 31.28 s gammaloop-nextest-python-api> │ Could not resolve the IP of the Symbolica license server. │
  534. 31.28 s gammaloop-nextest-python-api> │ │
  535. 31.28 s gammaloop-nextest-python-api> │ Please check your DNS configuration. │
  536. 31.28 s gammaloop-nextest-python-api> └───────────────────────────────────────────────────────────┘
  537. 31.28 s gammaloop-nextest-python-api> Error: failed to lookup address information: Temporary failure in name resolution
  538. 31.28 s gammaloop-nextest-python-api>
  539. 31.28 s gammaloop-nextest-python-api>
  540. 31.28 s gammaloop-nextest-python-api> Location:
  541. 31.28 s gammaloop-nextest-python-api> tests/tests/test_python_api.rs:156:20
  542. 31.28 s gammaloop-nextest-python-api>
  543. 31.28 s gammaloop-nextest-python-api> 2. gammaloop-integration-tests::test_python_api::python_session_getters_return_live_toml_and_command_blocks
  544. 31.28 s gammaloop-nextest-python-api> failure: test failure with exit code 101
  545. 31.28 s gammaloop-nextest-python-api> Error: Python API test subprocess failed.
  546. 31.28 s gammaloop-nextest-python-api> stdout:
  547. 31.28 s gammaloop-nextest-python-api> ┌────────────────────────────────────────────────────────┐
  548. 31.28 s gammaloop-nextest-python-api> │ You are running a restricted Symbolica instance. │
  549. 31.28 s gammaloop-nextest-python-api> │ │
  550. 31.28 s gammaloop-nextest-python-api> │ This mode is only permitted for non-commercial use and │
  551. 31.28 s gammaloop-nextest-python-api> │ is limited to one instance and core per machine. │
  552. 31.28 s gammaloop-nextest-python-api> │ │
  553. 31.28 s gammaloop-nextest-python-api> │ Hobbyists can easily acquire a free license key │
  554. 31.28 s gammaloop-nextest-python-api> │ that unlocks all cores and removes this banner: │
  555. 31.28 s gammaloop-nextest-python-api> │ │
  556. 31.28 s gammaloop-nextest-python-api> │ from symbolica import * │
  557. 31.28 s gammaloop-nextest-python-api> │ request_hobbyist_license('YOUR_NAME', 'YOUR_EMAIL') │
  558. 31.28 s gammaloop-nextest-python-api> │ │
  559. 31.28 s gammaloop-nextest-python-api> │ All other users can obtain a free 30-day trial key: │
  560. 31.28 s gammaloop-nextest-python-api> │ │
  561. 31.28 s gammaloop-nextest-python-api> │ from symbolica import * │
  562. 31.28 s gammaloop-nextest-python-api> │ request_trial_license('NAME', 'EMAIL', 'EMPLOYER') │
  563. 31.28 s gammaloop-nextest-python-api> │ │
  564. 31.28 s gammaloop-nextest-python-api> │ See https://symbolica.io/docs/get_started.html#license │
  565. 31.28 s gammaloop-nextest-python-api> └────────────────────────────────────────────────────────┘
  566. 31.28 s gammaloop-nextest-python-api> ┌───────────────────────────────────────────────────────────────────────────────────────────────────────────┐
  567. 31.28 s gammaloop-nextest-python-api> │ Cannot start new unlicensed Symbolica instance since there is already another one running on the machine. │
  568. 31.28 s gammaloop-nextest-python-api> └───────────────────────────────────────────────────────────────────────────────────────────────────────────┘
  569. 31.28 s gammaloop-nextest-python-api>
  570. 31.28 s gammaloop-nextest-python-api> stderr:
  571. 31.28 s gammaloop-nextest-python-api>
  572. 31.28 s gammaloop-nextest-python-api> ┌───────────────────────────────────────────────────────────┐
  573. 31.28 s gammaloop-nextest-python-api> │ Could not resolve the IP of the Symbolica license server. │
  574. 31.28 s gammaloop-nextest-python-api> │ │
  575. 31.28 s gammaloop-nextest-python-api> │ Please check your DNS configuration. │
  576. 31.28 s gammaloop-nextest-python-api> └───────────────────────────────────────────────────────────┘
  577. 31.28 s gammaloop-nextest-python-api> Error: failed to lookup address information: Temporary failure in name resolution
  578. 31.28 s gammaloop-nextest-python-api>
  579. 31.28 s gammaloop-nextest-python-api>
  580. 31.28 s gammaloop-nextest-python-api> Location:
  581. 31.28 s gammaloop-nextest-python-api> tests/tests/test_python_api.rs:156:20
  582. 31.28 s gammaloop-nextest-python-api> system-out
  583. 31.28 s gammaloop-nextest-python-api> running 1 test
  584. 31.28 s gammaloop-nextest-python-api> test python_session_getters_return_live_toml_and_command_blocks ... FAILED
  585. 31.28 s gammaloop-nextest-python-api>
  586. 31.28 s gammaloop-nextest-python-api> failures:
  587. 31.28 s gammaloop-nextest-python-api>
  588. 31.28 s gammaloop-nextest-python-api> failures:
  589. 31.28 s gammaloop-nextest-python-api> python_session_getters_return_live_toml_and_command_blocks
  590. 31.28 s gammaloop-nextest-python-api>
  591. 31.28 s gammaloop-nextest-python-api> test result: FAILED. 0 passed; 1 failed; 0 ignored; 0 measured; 4 filtered out; finished in 0.11s
  592. 31.28 s gammaloop-nextest-python-api> system-err
  593. 31.28 s gammaloop-nextest-python-api> Error: Python API test subprocess failed.
  594. 31.28 s gammaloop-nextest-python-api> stdout:
  595. 31.28 s gammaloop-nextest-python-api> ┌────────────────────────────────────────────────────────┐
  596. 31.28 s gammaloop-nextest-python-api> │ You are running a restricted Symbolica instance. │
  597. 31.28 s gammaloop-nextest-python-api> │ │
  598. 31.28 s gammaloop-nextest-python-api> │ This mode is only permitted for non-commercial use and │
  599. 31.28 s gammaloop-nextest-python-api> │ is limited to one instance and core per machine. │
  600. 31.28 s gammaloop-nextest-python-api> │ │
  601. 31.28 s gammaloop-nextest-python-api> │ Hobbyists can easily acquire a free license key │
  602. 31.28 s gammaloop-nextest-python-api> │ that unlocks all cores and removes this banner: │
  603. 31.28 s gammaloop-nextest-python-api> │ │
  604. 31.28 s gammaloop-nextest-python-api> │ from symbolica import * │
  605. 31.28 s gammaloop-nextest-python-api> │ request_hobbyist_license('YOUR_NAME', 'YOUR_EMAIL') │
  606. 31.28 s gammaloop-nextest-python-api> │ │
  607. 31.28 s gammaloop-nextest-python-api> │ All other users can obtain a free 30-day trial key: │
  608. 31.28 s gammaloop-nextest-python-api> │ │
  609. 31.28 s gammaloop-nextest-python-api> │ from symbolica import * │
  610. 31.28 s gammaloop-nextest-python-api> │ request_trial_license('NAME', 'EMAIL', 'EMPLOYER') │
  611. 31.28 s gammaloop-nextest-python-api> │ │
  612. 31.28 s gammaloop-nextest-python-api> │ See https://symbolica.io/docs/get_started.html#license │
  613. 31.28 s gammaloop-nextest-python-api> └────────────────────────────────────────────────────────┘
  614. 31.28 s gammaloop-nextest-python-api> ┌───────────────────────────────────────────────────────────────────────────────────────────────────────────┐
  615. 31.28 s gammaloop-nextest-python-api> │ Cannot start new unlicensed Symbolica instance since there is already another one running on the machine. │
  616. 31.28 s gammaloop-nextest-python-api> └───────────────────────────────────────────────────────────────────────────────────────────────────────────┘
  617. 31.28 s gammaloop-nextest-python-api>
  618. 31.28 s gammaloop-nextest-python-api> stderr:
  619. 31.28 s gammaloop-nextest-python-api>
  620. 31.28 s gammaloop-nextest-python-api> ┌───────────────────────────────────────────────────────────┐
  621. 31.28 s gammaloop-nextest-python-api> │ Could not resolve the IP of the Symbolica license server. │
  622. 31.28 s gammaloop-nextest-python-api> │ │
  623. 31.28 s gammaloop-nextest-python-api> │ Please check your DNS configuration. │
  624. 31.28 s gammaloop-nextest-python-api> └───────────────────────────────────────────────────────────┘
  625. 31.28 s gammaloop-nextest-python-api> Error: failed to lookup address information: Temporary failure in name resolution
  626. 31.28 s gammaloop-nextest-python-api>
  627. 31.28 s gammaloop-nextest-python-api>
  628. 31.28 s gammaloop-nextest-python-api> Location:
  629. 31.28 s gammaloop-nextest-python-api> tests/tests/test_python_api.rs:156:20
  630. 31.28 s gammaloop-nextest-python-api>
  631. 31.28 s gammaloop-nextest-python-api> 3. gammaloop-integration-tests::test_python_api::python_evaluate_samples_batch_and_momentum_space_have_expected_shape
  632. 31.28 s gammaloop-nextest-python-api> failure: test failure with exit code 101
  633. 31.28 s gammaloop-nextest-python-api> Error: Python API test subprocess failed.
  634. 31.28 s gammaloop-nextest-python-api> stdout:
  635. 31.28 s gammaloop-nextest-python-api> ┌────────────────────────────────────────────────────────┐
  636. 31.28 s gammaloop-nextest-python-api> │ You are running a restricted Symbolica instance. │
  637. 31.28 s gammaloop-nextest-python-api> │ │
  638. 31.28 s gammaloop-nextest-python-api> │ This mode is only permitted for non-commercial use and │
  639. 31.28 s gammaloop-nextest-python-api> │ is limited to one instance and core per machine. │
  640. 31.28 s gammaloop-nextest-python-api> │ │
  641. 31.28 s gammaloop-nextest-python-api> │ Hobbyists can easily acquire a free license key │
  642. 31.28 s gammaloop-nextest-python-api> │ that unlocks all cores and removes this banner: │
  643. 31.28 s gammaloop-nextest-python-api> │ │
  644. 31.28 s gammaloop-nextest-python-api> │ from symbolica import * │
  645. 31.28 s gammaloop-nextest-python-api> │ request_hobbyist_license('YOUR_NAME', 'YOUR_EMAIL') │
  646. 31.28 s gammaloop-nextest-python-api> │ │
  647. 31.28 s gammaloop-nextest-python-api> │ All other users can obtain a free 30-day trial key: │
  648. 31.28 s gammaloop-nextest-python-api> │ │
  649. 31.28 s gammaloop-nextest-python-api> │ from symbolica import * │
  650. 31.28 s gammaloop-nextest-python-api> │ request_trial_license('NAME', 'EMAIL', 'EMPLOYER') │
  651. 31.28 s gammaloop-nextest-python-api> │ │
  652. 31.28 s gammaloop-nextest-python-api> │ See https://symbolica.io/docs/get_started.html#license │
  653. 31.28 s gammaloop-nextest-python-api> └────────────────────────────────────────────────────────┘
  654. 31.28 s gammaloop-nextest-python-api> ┌───────────────────────────────────────────────────────────────────────────────────────────────────────────┐
  655. 31.28 s gammaloop-nextest-python-api> │ Cannot start new unlicensed Symbolica instance since there is already another one running on the machine. │
  656. 31.28 s gammaloop-nextest-python-api> └───────────────────────────────────────────────────────────────────────────────────────────────────────────┘
  657. 31.28 s gammaloop-nextest-python-api>
  658. 31.28 s gammaloop-nextest-python-api> stderr:
  659. 31.28 s gammaloop-nextest-python-api>
  660. 31.28 s gammaloop-nextest-python-api> ┌───────────────────────────────────────────────────────────┐
  661. 31.28 s gammaloop-nextest-python-api> │ Could not resolve the IP of the Symbolica license server. │
  662. 31.28 s gammaloop-nextest-python-api> │ │
  663. 31.28 s gammaloop-nextest-python-api> │ Please check your DNS configuration. │
  664. 31.28 s gammaloop-nextest-python-api> └───────────────────────────────────────────────────────────┘
  665. 31.28 s gammaloop-nextest-python-api> Error: failed to lookup address information: Temporary failure in name resolution
  666. 31.28 s gammaloop-nextest-python-api>
  667. 31.28 s gammaloop-nextest-python-api>
  668. 31.28 s gammaloop-nextest-python-api> Location:
  669. 31.28 s gammaloop-nextest-python-api> tests/tests/test_python_api.rs:156:20
  670. 31.28 s gammaloop-nextest-python-api> system-out
  671. 31.28 s gammaloop-nextest-python-api> running 1 test
  672. 31.28 s gammaloop-nextest-python-api> test python_evaluate_samples_batch_and_momentum_space_have_expected_shape ... FAILED
  673. 31.28 s gammaloop-nextest-python-api>
  674. 31.28 s gammaloop-nextest-python-api> failures:
  675. 31.28 s gammaloop-nextest-python-api>
  676. 31.28 s gammaloop-nextest-python-api> failures:
  677. 31.28 s gammaloop-nextest-python-api> python_evaluate_samples_batch_and_momentum_space_have_expected_shape
  678. 31.28 s gammaloop-nextest-python-api>
  679. 31.28 s gammaloop-nextest-python-api> test result: FAILED. 0 passed; 1 failed; 0 ignored; 0 measured; 4 filtered out; finished in 0.11s
  680. 31.28 s gammaloop-nextest-python-api> system-err
  681. 31.28 s gammaloop-nextest-python-api> Error: Python API test subprocess failed.
  682. 31.28 s gammaloop-nextest-python-api> stdout:
  683. 31.28 s gammaloop-nextest-python-api> ┌────────────────────────────────────────────────────────┐
  684. 31.28 s gammaloop-nextest-python-api> │ You are running a restricted Symbolica instance. │
  685. 31.28 s gammaloop-nextest-python-api> │ │
  686. 31.28 s gammaloop-nextest-python-api> │ This mode is only permitted for non-commercial use and │
  687. 31.28 s gammaloop-nextest-python-api> │ is limited to one instance and core per machine. │
  688. 31.28 s gammaloop-nextest-python-api> │ │
  689. 31.28 s gammaloop-nextest-python-api> │ Hobbyists can easily acquire a free license key │
  690. 31.28 s gammaloop-nextest-python-api> │ that unlocks all cores and removes this banner: │
  691. 31.28 s gammaloop-nextest-python-api> │ │
  692. 31.28 s gammaloop-nextest-python-api> │ from symbolica import * │
  693. 31.28 s gammaloop-nextest-python-api> │ request_hobbyist_license('YOUR_NAME', 'YOUR_EMAIL') │
  694. 31.28 s gammaloop-nextest-python-api> │ │
  695. 31.28 s gammaloop-nextest-python-api> │ All other users can obtain a free 30-day trial key: │
  696. 31.28 s gammaloop-nextest-python-api> │ │
  697. 31.28 s gammaloop-nextest-python-api> │ from symbolica import * │
  698. 31.28 s gammaloop-nextest-python-api> │ request_trial_license('NAME', 'EMAIL', 'EMPLOYER') │
  699. 31.28 s gammaloop-nextest-python-api> │ │
  700. 31.28 s gammaloop-nextest-python-api> │ See https://symbolica.io/docs/get_started.html#license │
  701. 31.28 s gammaloop-nextest-python-api> └────────────────────────────────────────────────────────┘
  702. 31.28 s gammaloop-nextest-python-api> ┌───────────────────────────────────────────────────────────────────────────────────────────────────────────┐
  703. 31.28 s gammaloop-nextest-python-api> │ Cannot start new unlicensed Symbolica instance since there is already another one running on the machine. │
  704. 31.28 s gammaloop-nextest-python-api> └───────────────────────────────────────────────────────────────────────────────────────────────────────────┘
  705. 31.28 s gammaloop-nextest-python-api>
  706. 31.28 s gammaloop-nextest-python-api> stderr:
  707. 31.28 s gammaloop-nextest-python-api>
  708. 31.28 s gammaloop-nextest-python-api> ┌───────────────────────────────────────────────────────────┐
  709. 31.28 s gammaloop-nextest-python-api> │ Could not resolve the IP of the Symbolica license server. │
  710. 31.28 s gammaloop-nextest-python-api> │ │
  711. 31.28 s gammaloop-nextest-python-api> │ Please check your DNS configuration. │
  712. 31.28 s gammaloop-nextest-python-api> └───────────────────────────────────────────────────────────┘
  713. 31.28 s gammaloop-nextest-python-api> Error: failed to lookup address information: Temporary failure in name resolution
  714. 31.28 s gammaloop-nextest-python-api>
  715. 31.28 s gammaloop-nextest-python-api>
  716. 31.28 s gammaloop-nextest-python-api> Location:
  717. 31.28 s gammaloop-nextest-python-api> tests/tests/test_python_api.rs:156:20
  718. 31.28 s gammaloop-nextest-python-api>
  719. 31.28 s gammaloop-nextest-python-api> 4. gammaloop-integration-tests::test_python_api::python_evaluate_sample_preserves_graph_grouping_and_incoming_pdgs
  720. 31.28 s gammaloop-nextest-python-api> failure: test failure with exit code 101
  721. 31.28 s gammaloop-nextest-python-api> Error: Python API test subprocess failed.
  722. 31.28 s gammaloop-nextest-python-api> stdout:
  723. 31.28 s gammaloop-nextest-python-api> ┌────────────────────────────────────────────────────────┐
  724. 31.28 s gammaloop-nextest-python-api> │ You are running a restricted Symbolica instance. │
  725. 31.28 s gammaloop-nextest-python-api> │ │
  726. 31.28 s gammaloop-nextest-python-api> │ This mode is only permitted for non-commercial use and │
  727. 31.28 s gammaloop-nextest-python-api> │ is limited to one instance and core per machine. │
  728. 31.28 s gammaloop-nextest-python-api> │ │
  729. 31.28 s gammaloop-nextest-python-api> │ Hobbyists can easily acquire a free license key │
  730. 31.28 s gammaloop-nextest-python-api> │ that unlocks all cores and removes this banner: │
  731. 31.28 s gammaloop-nextest-python-api> │ │
  732. 31.28 s gammaloop-nextest-python-api> │ from symbolica import * │
  733. 31.28 s gammaloop-nextest-python-api> │ request_hobbyist_license('YOUR_NAME', 'YOUR_EMAIL') │
  734. 31.28 s gammaloop-nextest-python-api> │ │
  735. 31.28 s gammaloop-nextest-python-api> │ All other users can obtain a free 30-day trial key: │
  736. 31.28 s gammaloop-nextest-python-api> │ │
  737. 31.28 s gammaloop-nextest-python-api> │ from symbolica import * │
  738. 31.28 s gammaloop-nextest-python-api> │ request_trial_license('NAME', 'EMAIL', 'EMPLOYER') │
  739. 31.28 s gammaloop-nextest-python-api> │ │
  740. 31.28 s gammaloop-nextest-python-api> │ See https://symbolica.io/docs/get_started.html#license │
  741. 31.28 s gammaloop-nextest-python-api> └────────────────────────────────────────────────────────┘
  742. 31.28 s gammaloop-nextest-python-api> ┌───────────────────────────────────────────────────────────────────────────────────────────────────────────┐
  743. 31.28 s gammaloop-nextest-python-api> │ Cannot start new unlicensed Symbolica instance since there is already another one running on the machine. │
  744. 31.28 s gammaloop-nextest-python-api> └───────────────────────────────────────────────────────────────────────────────────────────────────────────┘
  745. 31.28 s gammaloop-nextest-python-api>
  746. 31.28 s gammaloop-nextest-python-api> stderr:
  747. 31.28 s gammaloop-nextest-python-api>
  748. 31.28 s gammaloop-nextest-python-api> ┌───────────────────────────────────────────────────────────┐
  749. 31.28 s gammaloop-nextest-python-api> │ Could not resolve the IP of the Symbolica license server. │
  750. 31.28 s gammaloop-nextest-python-api> │ │
  751. 31.28 s gammaloop-nextest-python-api> │ Please check your DNS configuration. │
  752. 31.28 s gammaloop-nextest-python-api> └───────────────────────────────────────────────────────────┘
  753. 31.28 s gammaloop-nextest-python-api> Error: failed to lookup address information: Temporary failure in name resolution
  754. 31.28 s gammaloop-nextest-python-api>
  755. 31.28 s gammaloop-nextest-python-api>
  756. 31.28 s gammaloop-nextest-python-api> Location:
  757. 31.28 s gammaloop-nextest-python-api> tests/tests/test_python_api.rs:156:20
  758. 31.28 s gammaloop-nextest-python-api> system-out
  759. 31.28 s gammaloop-nextest-python-api> running 1 test
  760. 31.28 s gammaloop-nextest-python-api> test python_evaluate_sample_preserves_graph_grouping_and_incoming_pdgs ... FAILED
  761. 31.28 s gammaloop-nextest-python-api>
  762. 31.28 s gammaloop-nextest-python-api> failures:
  763. 31.28 s gammaloop-nextest-python-api>
  764. 31.28 s gammaloop-nextest-python-api> failures:
  765. 31.28 s gammaloop-nextest-python-api> python_evaluate_sample_preserves_graph_grouping_and_incoming_pdgs
  766. 31.28 s gammaloop-nextest-python-api>
  767. 31.28 s gammaloop-nextest-python-api> test result: FAILED. 0 passed; 1 failed; 0 ignored; 0 measured; 4 filtered out; finished in 0.12s
  768. 31.28 s gammaloop-nextest-python-api> system-err
  769. 31.28 s gammaloop-nextest-python-api> Error: Python API test subprocess failed.
  770. 31.28 s gammaloop-nextest-python-api> stdout:
  771. 31.28 s gammaloop-nextest-python-api> ┌────────────────────────────────────────────────────────┐
  772. 31.28 s gammaloop-nextest-python-api> │ You are running a restricted Symbolica instance. │
  773. 31.28 s gammaloop-nextest-python-api> │ │
  774. 31.28 s gammaloop-nextest-python-api> │ This mode is only permitted for non-commercial use and │
  775. 31.28 s gammaloop-nextest-python-api> │ is limited to one instance and core per machine. │
  776. 31.28 s gammaloop-nextest-python-api> │ │
  777. 31.28 s gammaloop-nextest-python-api> │ Hobbyists can easily acquire a free license key │
  778. 31.28 s gammaloop-nextest-python-api> │ that unlocks all cores and removes this banner: │
  779. 31.28 s gammaloop-nextest-python-api> │ │
  780. 31.28 s gammaloop-nextest-python-api> │ from symbolica import * │
  781. 31.28 s gammaloop-nextest-python-api> │ request_hobbyist_license('YOUR_NAME', 'YOUR_EMAIL') │
  782. 31.28 s gammaloop-nextest-python-api> │ │
  783. 31.28 s gammaloop-nextest-python-api> │ All other users can obtain a free 30-day trial key: │
  784. 31.28 s gammaloop-nextest-python-api> │ │
  785. 31.28 s gammaloop-nextest-python-api> │ from symbolica import * │
  786. 31.28 s gammaloop-nextest-python-api> │ request_trial_license('NAME', 'EMAIL', 'EMPLOYER') │
  787. 31.28 s gammaloop-nextest-python-api> │ │
  788. 31.28 s gammaloop-nextest-python-api> │ See https://symbolica.io/docs/get_started.html#license │
  789. 31.28 s gammaloop-nextest-python-api> └────────────────────────────────────────────────────────┘
  790. 31.28 s gammaloop-nextest-python-api> ┌───────────────────────────────────────────────────────────────────────────────────────────────────────────┐
  791. 31.28 s gammaloop-nextest-python-api> │ Cannot start new unlicensed Symbolica instance since there is already another one running on the machine. │
  792. 31.28 s gammaloop-nextest-python-api> └───────────────────────────────────────────────────────────────────────────────────────────────────────────┘
  793. 31.28 s gammaloop-nextest-python-api>
  794. 31.28 s gammaloop-nextest-python-api> stderr:
  795. 31.28 s gammaloop-nextest-python-api>
  796. 31.28 s gammaloop-nextest-python-api> ┌───────────────────────────────────────────────────────────┐
  797. 31.28 s gammaloop-nextest-python-api> │ Could not resolve the IP of the Symbolica license server. │
  798. 31.28 s gammaloop-nextest-python-api> │ │
  799. 31.28 s gammaloop-nextest-python-api> │ Please check your DNS configuration. │
  800. 31.28 s gammaloop-nextest-python-api> └───────────────────────────────────────────────────────────┘
  801. 31.28 s gammaloop-nextest-python-api> Error: failed to lookup address information: Temporary failure in name resolution
  802. 31.28 s gammaloop-nextest-python-api>
  803. 31.28 s gammaloop-nextest-python-api>
  804. 31.28 s gammaloop-nextest-python-api> Location:
  805. 31.28 s gammaloop-nextest-python-api> tests/tests/test_python_api.rs:156:20
  806. 31.28 s gammaloop-nextest-python-api> =========================================
  807. 31.32 s [0/1 built (1 failed), 0error: Cannot build '/nix/store/0y85356skfl9xg7hqjngmsb9xh03dwf2-gammaloop-nextest-python-api.drv'.
  808. 31.32 s Reason: builder failed with exit code 100.
  809. 31.32 s Output paths:
  810. 31.32 s /nix/store/qv9gx72pb7v8mx997s1xlipkhg6cf7s1-gammaloop-nextest-python-api
  811. 31.32 s Last 781 log lines:
  812. 31.32 s > Extracting 1 binary, 1 build script output directory, and 3 linked paths to /build/nextest-archive-G2UoWd
  813. 31.32 s > Extracted 18 files to /build/nextest-archive-G2UoWd in 0.07s
  814. 31.32 s > ------------
  815. 31.32 s > Nextest run ID 5a508d5f-a544-49c6-b0be-f2f3b3e408d5 with nextest profile: ci_gammaloop
  816. 31.32 s > Starting 5 tests across 1 binary
  817. 31.32 s > FAIL [ 0.115s] (1/5) gammaloop-integration-tests::test_python_api python_evaluate_sample_honors_generate_events_and_observable_snapshots
  818. 31.32 s > stdout ---
  819. 31.32 s >
  820. 31.32 s > running 1 test
  821. 31.32 s > test python_evaluate_sample_honors_generate_events_and_observable_snapshots ... FAILED
  822. 31.32 s >
  823. 31.32 s > failures:
  824. 31.32 s >
  825. 31.32 s > failures:
  826. 31.32 s > python_evaluate_sample_honors_generate_events_and_observable_snapshots
  827. 31.32 s >
  828. 31.32 s > test result: FAILED. 0 passed; 1 failed; 0 ignored; 0 measured; 4 filtered out; finished in 0.11s
  829. 31.32 s >
  830. 31.32 s > stderr ---
  831. 31.32 s > Error: Python API test subprocess failed.
  832. 31.32 s > stdout:
  833. 31.32 s > ┌────────────────────────────────────────────────────────┐
  834. 31.32 s > │ You are running a restricted Symbolica instance. │
  835. 31.32 s > │ │
  836. 31.32 s > │ This mode is only permitted for non-commercial use and │
  837. 31.32 s > │ is limited to one instance and core per machine. │
  838. 31.32 s > │ │
  839. 31.32 s > │ Hobbyists can easily acquire a free license key │
  840. 31.32 s > │ that unlocks all cores and removes this banner: │
  841. 31.32 s > │ │
  842. 31.32 s > │ from symbolica import * │
  843. 31.32 s > │ request_hobbyist_license('YOUR_NAME', 'YOUR_EMAIL') │
  844. 31.32 s > │ │
  845. 31.32 s > │ All other users can obtain a free 30-day trial key: │
  846. 31.32 s > │ │
  847. 31.32 s > │ from symbolica import * │
  848. 31.32 s > │ request_trial_license('NAME', 'EMAIL', 'EMPLOYER') │
  849. 31.32 s > │ │
  850. 31.32 s > │ See https://symbolica.io/docs/get_started.html#license │
  851. 31.32 s > └────────────────────────────────────────────────────────┘
  852. 31.32 s > ┌───────────────────────────────────────────────────────────────────────────────────────────────────────────┐
  853. 31.32 s > │ Cannot start new unlicensed Symbolica instance since there is already another one running on the machine. │
  854. 31.32 s > └───────────────────────────────────────────────────────────────────────────────────────────────────────────┘
  855. 31.32 s >
  856. 31.32 s > stderr:
  857. 31.32 s >
  858. 31.32 s > ┌───────────────────────────────────────────────────────────┐
  859. 31.32 s > │ Could not resolve the IP of the Symbolica license server. │
  860. 31.32 s > │ │
  861. 31.32 s > │ Please check your DNS configuration. │
  862. 31.32 s > └───────────────────────────────────────────────────────────┘
  863. 31.32 s > Error: failed to lookup address information: Temporary failure in name resolution
  864. 31.32 s >
  865. 31.32 s >
  866. 31.32 s > Location:
  867. 31.32 s > tests/tests/test_python_api.rs:156:20
  868. 31.32 s >
  869. 31.32 s > FAIL [ 0.115s] (2/5) gammaloop-integration-tests::test_python_api python_session_getters_return_live_toml_and_command_blocks
  870. 31.32 s > stdout ---
  871. 31.32 s >
  872. 31.32 s > running 1 test
  873. 31.32 s > test python_session_getters_return_live_toml_and_command_blocks ... FAILED
  874. 31.32 s >
  875. 31.32 s > failures:
  876. 31.32 s >
  877. 31.32 s > failures:
  878. 31.32 s > python_session_getters_return_live_toml_and_command_blocks
  879. 31.32 s >
  880. 31.32 s > test result: FAILED. 0 passed; 1 failed; 0 ignored; 0 measured; 4 filtered out; finished in 0.11s
  881. 31.32 s >
  882. 31.32 s > stderr ---
  883. 31.32 s > Error: Python API test subprocess failed.
  884. 31.32 s > stdout:
  885. 31.32 s > ┌────────────────────────────────────────────────────────┐
  886. 31.32 s > │ You are running a restricted Symbolica instance. │
  887. 31.32 s > │ │
  888. 31.32 s > │ This mode is only permitted for non-commercial use and │
  889. 31.32 s > │ is limited to one instance and core per machine. │
  890. 31.32 s > │ │
  891. 31.32 s > │ Hobbyists can easily acquire a free license key │
  892. 31.32 s > │ that unlocks all cores and removes this banner: │
  893. 31.32 s > │ │
  894. 31.32 s > │ from symbolica import * │
  895. 31.32 s > │ request_hobbyist_license('YOUR_NAME', 'YOUR_EMAIL') │
  896. 31.32 s > │ │
  897. 31.32 s > │ All other users can obtain a free 30-day trial key: │
  898. 31.32 s > │ │
  899. 31.32 s > │ from symbolica import * │
  900. 31.32 s > │ request_trial_license('NAME', 'EMAIL', 'EMPLOYER') │
  901. 31.32 s > │ │
  902. 31.32 s > │ See https://symbolica.io/docs/get_started.html#license │
  903. 31.32 s > └────────────────────────────────────────────────────────┘
  904. 31.32 s > ┌───────────────────────────────────────────────────────────────────────────────────────────────────────────┐
  905. 31.32 s > │ Cannot start new unlicensed Symbolica instance since there is already another one running on the machine. │
  906. 31.32 s > └───────────────────────────────────────────────────────────────────────────────────────────────────────────┘
  907. 31.32 s >
  908. 31.32 s > stderr:
  909. 31.32 s >
  910. 31.32 s > ┌───────────────────────────────────────────────────────────┐
  911. 31.32 s > │ Could not resolve the IP of the Symbolica license server. │
  912. 31.32 s > │ │
  913. 31.32 s > │ Please check your DNS configuration. │
  914. 31.32 s > └───────────────────────────────────────────────────────────┘
  915. 31.32 s > Error: failed to lookup address information: Temporary failure in name resolution
  916. 31.32 s >
  917. 31.32 s >
  918. 31.32 s > Location:
  919. 31.32 s > tests/tests/test_python_api.rs:156:20
  920. 31.32 s >
  921. 31.32 s > FAIL [ 0.115s] (3/5) gammaloop-integration-tests::test_python_api python_evaluate_samples_batch_and_momentum_space_have_expected_shape
  922. 31.32 s > stdout ---
  923. 31.32 s >
  924. 31.32 s > running 1 test
  925. 31.32 s > test python_evaluate_samples_batch_and_momentum_space_have_expected_shape ... FAILED
  926. 31.32 s >
  927. 31.32 s > failures:
  928. 31.32 s >
  929. 31.32 s > failures:
  930. 31.32 s > python_evaluate_samples_batch_and_momentum_space_have_expected_shape
  931. 31.32 s >
  932. 31.32 s > test result: FAILED. 0 passed; 1 failed; 0 ignored; 0 measured; 4 filtered out; finished in 0.11s
  933. 31.32 s >
  934. 31.32 s > stderr ---
  935. 31.32 s > Error: Python API test subprocess failed.
  936. 31.32 s > stdout:
  937. 31.32 s > ┌────────────────────────────────────────────────────────┐
  938. 31.32 s > │ You are running a restricted Symbolica instance. │
  939. 31.32 s > │ │
  940. 31.32 s > │ This mode is only permitted for non-commercial use and │
  941. 31.32 s > │ is limited to one instance and core per machine. │
  942. 31.32 s > │ │
  943. 31.32 s > │ Hobbyists can easily acquire a free license key │
  944. 31.32 s > │ that unlocks all cores and removes this banner: │
  945. 31.32 s > │ │
  946. 31.32 s > │ from symbolica import * │
  947. 31.32 s > │ request_hobbyist_license('YOUR_NAME', 'YOUR_EMAIL') │
  948. 31.32 s > │ │
  949. 31.32 s > │ All other users can obtain a free 30-day trial key: │
  950. 31.32 s > │ │
  951. 31.32 s > │ from symbolica import * │
  952. 31.32 s > │ request_trial_license('NAME', 'EMAIL', 'EMPLOYER') │
  953. 31.32 s > │ │
  954. 31.32 s > │ See https://symbolica.io/docs/get_started.html#license │
  955. 31.32 s > └────────────────────────────────────────────────────────┘
  956. 31.32 s > ┌───────────────────────────────────────────────────────────────────────────────────────────────────────────┐
  957. 31.32 s > │ Cannot start new unlicensed Symbolica instance since there is already another one running on the machine. │
  958. 31.32 s > └───────────────────────────────────────────────────────────────────────────────────────────────────────────┘
  959. 31.32 s >
  960. 31.32 s > stderr:
  961. 31.32 s >
  962. 31.32 s > ┌───────────────────────────────────────────────────────────┐
  963. 31.32 s > │ Could not resolve the IP of the Symbolica license server. │
  964. 31.32 s > │ │
  965. 31.32 s > │ Please check your DNS configuration. │
  966. 31.32 s > └───────────────────────────────────────────────────────────┘
  967. 31.32 s > Error: failed to lookup address information: Temporary failure in name resolution
  968. 31.32 s >
  969. 31.32 s >
  970. 31.32 s > Location:
  971. 31.32 s > tests/tests/test_python_api.rs:156:20
  972. 31.32 s >
  973. 31.32 s > FAIL [ 0.121s] (4/5) gammaloop-integration-tests::test_python_api python_evaluate_sample_preserves_graph_grouping_and_incoming_pdgs
  974. 31.32 s > stdout ---
  975. 31.32 s >
  976. 31.32 s > running 1 test
  977. 31.32 s > test python_evaluate_sample_preserves_graph_grouping_and_incoming_pdgs ... FAILED
  978. 31.32 s >
  979. 31.32 s > failures:
  980. 31.32 s >
  981. 31.32 s > failures:
  982. 31.32 s > python_evaluate_sample_preserves_graph_grouping_and_incoming_pdgs
  983. 31.32 s >
  984. 31.32 s > test result: FAILED. 0 passed; 1 failed; 0 ignored; 0 measured; 4 filtered out; finished in 0.12s
  985. 31.32 s >
  986. 31.32 s > stderr ---
  987. 31.32 s > Error: Python API test subprocess failed.
  988. 31.32 s > stdout:
  989. 31.32 s > ┌────────────────────────────────────────────────────────┐
  990. 31.32 s > │ You are running a restricted Symbolica instance. │
  991. 31.32 s > │ │
  992. 31.32 s > │ This mode is only permitted for non-commercial use and │
  993. 31.32 s > │ is limited to one instance and core per machine. │
  994. 31.32 s > │ │
  995. 31.32 s > │ Hobbyists can easily acquire a free license key │
  996. 31.32 s > │ that unlocks all cores and removes this banner: │
  997. 31.32 s > │ │
  998. 31.32 s > │ from symbolica import * │
  999. 31.32 s > │ request_hobbyist_license('YOUR_NAME', 'YOUR_EMAIL') │
  1000. 31.32 s > │ │
  1001. 31.32 s > │ All other users can obtain a free 30-day trial key: │
  1002. 31.32 s > │ │
  1003. 31.32 s > │ from symbolica import * │
  1004. 31.32 s > │ request_trial_license('NAME', 'EMAIL', 'EMPLOYER') │
  1005. 31.32 s > │ │
  1006. 31.32 s > │ See https://symbolica.io/docs/get_started.html#license │
  1007. 31.32 s > └────────────────────────────────────────────────────────┘
  1008. 31.32 s > ┌───────────────────────────────────────────────────────────────────────────────────────────────────────────┐
  1009. 31.32 s > │ Cannot start new unlicensed Symbolica instance since there is already another one running on the machine. │
  1010. 31.32 s > └───────────────────────────────────────────────────────────────────────────────────────────────────────────┘
  1011. 31.32 s >
  1012. 31.32 s > stderr:
  1013. 31.32 s >
  1014. 31.32 s > ┌───────────────────────────────────────────────────────────┐
  1015. 31.32 s > │ Could not resolve the IP of the Symbolica license server. │
  1016. 31.32 s > │ │
  1017. 31.32 s > │ Please check your DNS configuration. │
  1018. 31.32 s > └───────────────────────────────────────────────────────────┘
  1019. 31.32 s > Error: failed to lookup address information: Temporary failure in name resolution
  1020. 31.32 s >
  1021. 31.32 s >
  1022. 31.32 s > Location:
  1023. 31.32 s > tests/tests/test_python_api.rs:156:20
  1024. 31.32 s >
  1025. 31.32 s > ------------
  1026. 31.32 s > Summary [ 0.282s] 5 tests run: 1 passed, 4 failed, 0 skipped
  1027. 31.32 s > FAIL [ 0.115s] (1/5) gammaloop-integration-tests::test_python_api python_evaluate_sample_honors_generate_events_and_observable_snapshots
  1028. 31.32 s > stdout ---
  1029. 31.32 s >
  1030. 31.32 s > running 1 test
  1031. 31.32 s > test python_evaluate_sample_honors_generate_events_and_observable_snapshots ... FAILED
  1032. 31.32 s >
  1033. 31.32 s > failures:
  1034. 31.32 s >
  1035. 31.32 s > failures:
  1036. 31.32 s > python_evaluate_sample_honors_generate_events_and_observable_snapshots
  1037. 31.32 s >
  1038. 31.32 s > test result: FAILED. 0 passed; 1 failed; 0 ignored; 0 measured; 4 filtered out; finished in 0.11s
  1039. 31.32 s >
  1040. 31.32 s > stderr ---
  1041. 31.32 s > Error: Python API test subprocess failed.
  1042. 31.32 s > stdout:
  1043. 31.32 s > ┌────────────────────────────────────────────────────────┐
  1044. 31.32 s > │ You are running a restricted Symbolica instance. │
  1045. 31.32 s > │ │
  1046. 31.32 s > │ This mode is only permitted for non-commercial use and │
  1047. 31.32 s > │ is limited to one instance and core per machine. │
  1048. 31.32 s > │ │
  1049. 31.32 s > │ Hobbyists can easily acquire a free license key │
  1050. 31.32 s > │ that unlocks all cores and removes this banner: │
  1051. 31.32 s > │ │
  1052. 31.32 s > │ from symbolica import * │
  1053. 31.32 s > │ request_hobbyist_license('YOUR_NAME', 'YOUR_EMAIL') │
  1054. 31.32 s > │ │
  1055. 31.32 s > │ All other users can obtain a free 30-day trial key: │
  1056. 31.32 s > │ │
  1057. 31.32 s > │ from symbolica import * │
  1058. 31.32 s > │ request_trial_license('NAME', 'EMAIL', 'EMPLOYER') │
  1059. 31.32 s > │ │
  1060. 31.32 s > │ See https://symbolica.io/docs/get_started.html#license │
  1061. 31.32 s > └────────────────────────────────────────────────────────┘
  1062. 31.32 s > ┌───────────────────────────────────────────────────────────────────────────────────────────────────────────┐
  1063. 31.32 s > │ Cannot start new unlicensed Symbolica instance since there is already another one running on the machine. │
  1064. 31.32 s > └───────────────────────────────────────────────────────────────────────────────────────────────────────────┘
  1065. 31.32 s >
  1066. 31.32 s > stderr:
  1067. 31.32 s >
  1068. 31.32 s > ┌───────────────────────────────────────────────────────────┐
  1069. 31.32 s > │ Could not resolve the IP of the Symbolica license server. │
  1070. 31.32 s > │ │
  1071. 31.32 s > │ Please check your DNS configuration. │
  1072. 31.32 s > └───────────────────────────────────────────────────────────┘
  1073. 31.32 s > Error: failed to lookup address information: Temporary failure in name resolution
  1074. 31.32 s >
  1075. 31.32 s >
  1076. 31.32 s > Location:
  1077. 31.32 s > tests/tests/test_python_api.rs:156:20
  1078. 31.32 s >
  1079. 31.32 s > FAIL [ 0.115s] (2/5) gammaloop-integration-tests::test_python_api python_session_getters_return_live_toml_and_command_blocks
  1080. 31.32 s > stdout ---
  1081. 31.32 s >
  1082. 31.32 s > running 1 test
  1083. 31.32 s > test python_session_getters_return_live_toml_and_command_blocks ... FAILED
  1084. 31.32 s >
  1085. 31.32 s > failures:
  1086. 31.32 s >
  1087. 31.32 s > failures:
  1088. 31.32 s > python_session_getters_return_live_toml_and_command_blocks
  1089. 31.32 s >
  1090. 31.32 s > test result: FAILED. 0 passed; 1 failed; 0 ignored; 0 measured; 4 filtered out; finished in 0.11s
  1091. 31.32 s >
  1092. 31.32 s > stderr ---
  1093. 31.32 s > Error: Python API test subprocess failed.
  1094. 31.32 s > stdout:
  1095. 31.32 s > ┌────────────────────────────────────────────────────────┐
  1096. 31.32 s > │ You are running a restricted Symbolica instance. │
  1097. 31.32 s > │ │
  1098. 31.32 s > │ This mode is only permitted for non-commercial use and │
  1099. 31.32 s > │ is limited to one instance and core per machine. │
  1100. 31.32 s > │ │
  1101. 31.32 s > │ Hobbyists can easily acquire a free license key │
  1102. 31.32 s > │ that unlocks all cores and removes this banner: │
  1103. 31.32 s > │ │
  1104. 31.32 s > │ from symbolica import * │
  1105. 31.32 s > │ request_hobbyist_license('YOUR_NAME', 'YOUR_EMAIL') │
  1106. 31.32 s > │ │
  1107. 31.32 s > │ All other users can obtain a free 30-day trial key: │
  1108. 31.32 s > │ │
  1109. 31.32 s > │ from symbolica import * │
  1110. 31.32 s > │ request_trial_license('NAME', 'EMAIL', 'EMPLOYER') │
  1111. 31.32 s > │ │
  1112. 31.32 s > │ See https://symbolica.io/docs/get_started.html#license │
  1113. 31.32 s > └────────────────────────────────────────────────────────┘
  1114. 31.32 s > ┌───────────────────────────────────────────────────────────────────────────────────────────────────────────┐
  1115. 31.32 s > │ Cannot start new unlicensed Symbolica instance since there is already another one running on the machine. │
  1116. 31.32 s > └───────────────────────────────────────────────────────────────────────────────────────────────────────────┘
  1117. 31.32 s >
  1118. 31.32 s > stderr:
  1119. 31.32 s >
  1120. 31.32 s > ┌───────────────────────────────────────────────────────────┐
  1121. 31.32 s > │ Could not resolve the IP of the Symbolica license server. │
  1122. 31.32 s > │ │
  1123. 31.32 s > │ Please check your DNS configuration. │
  1124. 31.32 s > └───────────────────────────────────────────────────────────┘
  1125. 31.32 s > Error: failed to lookup address information: Temporary failure in name resolution
  1126. 31.32 s >
  1127. 31.32 s >
  1128. 31.32 s > Location:
  1129. 31.32 s > tests/tests/test_python_api.rs:156:20
  1130. 31.32 s >
  1131. 31.32 s > FAIL [ 0.115s] (3/5) gammaloop-integration-tests::test_python_api python_evaluate_samples_batch_and_momentum_space_have_expected_shape
  1132. 31.32 s > stdout ---
  1133. 31.32 s >
  1134. 31.32 s > running 1 test
  1135. 31.32 s > test python_evaluate_samples_batch_and_momentum_space_have_expected_shape ... FAILED
  1136. 31.32 s >
  1137. 31.32 s > failures:
  1138. 31.32 s >
  1139. 31.32 s > failures:
  1140. 31.32 s > python_evaluate_samples_batch_and_momentum_space_have_expected_shape
  1141. 31.32 s >
  1142. 31.32 s > test result: FAILED. 0 passed; 1 failed; 0 ignored; 0 measured; 4 filtered out; finished in 0.11s
  1143. 31.32 s >
  1144. 31.32 s > stderr ---
  1145. 31.32 s > Error: Python API test subprocess failed.
  1146. 31.32 s > stdout:
  1147. 31.32 s > ┌────────────────────────────────────────────────────────┐
  1148. 31.32 s > │ You are running a restricted Symbolica instance. │
  1149. 31.32 s > │ │
  1150. 31.32 s > │ This mode is only permitted for non-commercial use and │
  1151. 31.32 s > │ is limited to one instance and core per machine. │
  1152. 31.32 s > │ │
  1153. 31.32 s > │ Hobbyists can easily acquire a free license key │
  1154. 31.32 s > │ that unlocks all cores and removes this banner: │
  1155. 31.32 s > │ │
  1156. 31.32 s > │ from symbolica import * │
  1157. 31.32 s > │ request_hobbyist_license('YOUR_NAME', 'YOUR_EMAIL') │
  1158. 31.32 s > │ │
  1159. 31.32 s > │ All other users can obtain a free 30-day trial key: │
  1160. 31.32 s > │ │
  1161. 31.32 s > │ from symbolica import * │
  1162. 31.32 s > │ request_trial_license('NAME', 'EMAIL', 'EMPLOYER') │
  1163. 31.32 s > │ │
  1164. 31.32 s > │ See https://symbolica.io/docs/get_started.html#license │
  1165. 31.32 s > └────────────────────────────────────────────────────────┘
  1166. 31.32 s > ┌───────────────────────────────────────────────────────────────────────────────────────────────────────────┐
  1167. 31.32 s > │ Cannot start new unlicensed Symbolica instance since there is already another one running on the machine. │
  1168. 31.32 s > └───────────────────────────────────────────────────────────────────────────────────────────────────────────┘
  1169. 31.32 s >
  1170. 31.32 s > stderr:
  1171. 31.32 s >
  1172. 31.32 s > ┌───────────────────────────────────────────────────────────┐
  1173. 31.32 s > │ Could not resolve the IP of the Symbolica license server. │
  1174. 31.32 s > │ │
  1175. 31.32 s > │ Please check your DNS configuration. │
  1176. 31.32 s > └───────────────────────────────────────────────────────────┘
  1177. 31.32 s > Error: failed to lookup address information: Temporary failure in name resolution
  1178. 31.32 s >
  1179. 31.32 s >
  1180. 31.32 s > Location:
  1181. 31.32 s > tests/tests/test_python_api.rs:156:20
  1182. 31.32 s >
  1183. 31.32 s > FAIL [ 0.121s] (4/5) gammaloop-integration-tests::test_python_api python_evaluate_sample_preserves_graph_grouping_and_incoming_pdgs
  1184. 31.32 s > stdout ---
  1185. 31.32 s >
  1186. 31.32 s > running 1 test
  1187. 31.32 s > test python_evaluate_sample_preserves_graph_grouping_and_incoming_pdgs ... FAILED
  1188. 31.32 s >
  1189. 31.32 s > failures:
  1190. 31.32 s >
  1191. 31.32 s > failures:
  1192. 31.32 s > python_evaluate_sample_preserves_graph_grouping_and_incoming_pdgs
  1193. 31.32 s >
  1194. 31.32 s > test result: FAILED. 0 passed; 1 failed; 0 ignored; 0 measured; 4 filtered out; finished in 0.12s
  1195. 31.32 s >
  1196. 31.32 s > stderr ---
  1197. 31.32 s > Error: Python API test subprocess failed.
  1198. 31.32 s > stdout:
  1199. 31.32 s > ┌────────────────────────────────────────────────────────┐
  1200. 31.32 s > │ You are running a restricted Symbolica instance. │
  1201. 31.32 s > │ │
  1202. 31.32 s > │ This mode is only permitted for non-commercial use and │
  1203. 31.32 s > │ is limited to one instance and core per machine. │
  1204. 31.32 s > │ │
  1205. 31.32 s > │ Hobbyists can easily acquire a free license key │
  1206. 31.32 s > │ that unlocks all cores and removes this banner: │
  1207. 31.32 s > │ │
  1208. 31.32 s > │ from symbolica import * │
  1209. 31.32 s > │ request_hobbyist_license('YOUR_NAME', 'YOUR_EMAIL') │
  1210. 31.32 s > │ │
  1211. 31.32 s > │ All other users can obtain a free 30-day trial key: │
  1212. 31.32 s > │ │
  1213. 31.32 s > │ from symbolica import * │
  1214. 31.32 s > │ request_trial_license('NAME', 'EMAIL', 'EMPLOYER') │
  1215. 31.32 s > │ │
  1216. 31.32 s > │ See https://symbolica.io/docs/get_started.html#license │
  1217. 31.32 s > └────────────────────────────────────────────────────────┘
  1218. 31.32 s > ┌───────────────────────────────────────────────────────────────────────────────────────────────────────────┐
  1219. 31.32 s > │ Cannot start new unlicensed Symbolica instance since there is already another one running on the machine. │
  1220. 31.32 s > └───────────────────────────────────────────────────────────────────────────────────────────────────────────┘
  1221. 31.32 s >
  1222. 31.32 s > stderr:
  1223. 31.32 s >
  1224. 31.32 s > ┌───────────────────────────────────────────────────────────┐
  1225. 31.32 s > │ Could not resolve the IP of the Symbolica license server. │
  1226. 31.32 s > │ │
  1227. 31.32 s > │ Please check your DNS configuration. │
  1228. 31.32 s > └───────────────────────────────────────────────────────────┘
  1229. 31.32 s > Error: failed to lookup address information: Temporary failure in name resolution
  1230. 31.32 s >
  1231. 31.32 s >
  1232. 31.32 s > Location:
  1233. 31.32 s > tests/tests/test_python_api.rs:156:20
  1234. 31.32 s >
  1235. 31.32 s > error: test run failed
  1236. 31.32 s >
  1237. 31.32 s > ========== nextest test summary ==========
  1238. 31.32 s > report: target/nextest/ci_gammaloop/junit.xml
  1239. 31.32 s > tests: 5, failures: 4, errors: 0
  1240. 31.32 s >
  1241. 31.32 s > 1. gammaloop-integration-tests::test_python_api::python_evaluate_sample_honors_generate_events_and_observable_snapshots
  1242. 31.32 s > failure: test failure with exit code 101
  1243. 31.32 s > Error: Python API test subprocess failed.
  1244. 31.32 s > stdout:
  1245. 31.32 s > ┌────────────────────────────────────────────────────────┐
  1246. 31.32 s > │ You are running a restricted Symbolica instance. │
  1247. 31.32 s > │ │
  1248. 31.32 s > │ This mode is only permitted for non-commercial use and │
  1249. 31.32 s > │ is limited to one instance and core per machine. │
  1250. 31.32 s > │ │
  1251. 31.32 s > │ Hobbyists can easily acquire a free license key │
  1252. 31.32 s > │ that unlocks all cores and removes this banner: │
  1253. 31.32 s > │ │
  1254. 31.32 s > │ from symbolica import * │
  1255. 31.32 s > │ request_hobbyist_license('YOUR_NAME', 'YOUR_EMAIL') │
  1256. 31.32 s > │ │
  1257. 31.32 s > │ All other users can obtain a free 30-day trial key: │
  1258. 31.32 s > │ │
  1259. 31.32 s > │ from symbolica import * │
  1260. 31.32 s > │ request_trial_license('NAME', 'EMAIL', 'EMPLOYER') │
  1261. 31.32 s > │ │
  1262. 31.32 s > │ See https://symbolica.io/docs/get_started.html#license │
  1263. 31.32 s > └────────────────────────────────────────────────────────┘
  1264. 31.32 s > ┌───────────────────────────────────────────────────────────────────────────────────────────────────────────┐
  1265. 31.32 s > │ Cannot start new unlicensed Symbolica instance since there is already another one running on the machine. │
  1266. 31.32 s > └───────────────────────────────────────────────────────────────────────────────────────────────────────────┘
  1267. 31.32 s >
  1268. 31.32 s > stderr:
  1269. 31.32 s >
  1270. 31.32 s > ┌───────────────────────────────────────────────────────────┐
  1271. 31.32 s > │ Could not resolve the IP of the Symbolica license server. │
  1272. 31.32 s > │ │
  1273. 31.32 s > │ Please check your DNS configuration. │
  1274. 31.32 s > └───────────────────────────────────────────────────────────┘
  1275. 31.32 s > Error: failed to lookup address information: Temporary failure in name resolution
  1276. 31.32 s >
  1277. 31.32 s >
  1278. 31.32 s > Location:
  1279. 31.32 s > tests/tests/test_python_api.rs:156:20
  1280. 31.32 s > system-out
  1281. 31.32 s > running 1 test
  1282. 31.32 s > test python_evaluate_sample_honors_generate_events_and_observable_snapshots ... FAILED
  1283. 31.32 s >
  1284. 31.32 s > failures:
  1285. 31.32 s >
  1286. 31.32 s > failures:
  1287. 31.32 s > python_evaluate_sample_honors_generate_events_and_observable_snapshots
  1288. 31.32 s >
  1289. 31.32 s > test result: FAILED. 0 passed; 1 failed; 0 ignored; 0 measured; 4 filtered out; finished in 0.11s
  1290. 31.32 s > system-err
  1291. 31.32 s > Error: Python API test subprocess failed.
  1292. 31.32 s > stdout:
  1293. 31.32 s > ┌────────────────────────────────────────────────────────┐
  1294. 31.32 s > │ You are running a restricted Symbolica instance. │
  1295. 31.32 s > │ │
  1296. 31.32 s > │ This mode is only permitted for non-commercial use and │
  1297. 31.32 s > │ is limited to one instance and core per machine. │
  1298. 31.32 s > │ │
  1299. 31.32 s > │ Hobbyists can easily acquire a free license key │
  1300. 31.32 s > │ that unlocks all cores and removes this banner: │
  1301. 31.32 s > │ │
  1302. 31.32 s > │ from symbolica import * │
  1303. 31.32 s > │ request_hobbyist_license('YOUR_NAME', 'YOUR_EMAIL') │
  1304. 31.32 s > │ │
  1305. 31.32 s > │ All other users can obtain a free 30-day trial key: │
  1306. 31.32 s > │ │
  1307. 31.32 s > │ from symbolica import * │
  1308. 31.32 s > │ request_trial_license('NAME', 'EMAIL', 'EMPLOYER') │
  1309. 31.32 s > │ │
  1310. 31.32 s > │ See https://symbolica.io/docs/get_started.html#license │
  1311. 31.32 s > └────────────────────────────────────────────────────────┘
  1312. 31.32 s > ┌───────────────────────────────────────────────────────────────────────────────────────────────────────────┐
  1313. 31.32 s > │ Cannot start new unlicensed Symbolica instance since there is already another one running on the machine. │
  1314. 31.32 s > └───────────────────────────────────────────────────────────────────────────────────────────────────────────┘
  1315. 31.32 s >
  1316. 31.32 s > stderr:
  1317. 31.32 s >
  1318. 31.32 s > ┌───────────────────────────────────────────────────────────┐
  1319. 31.32 s > │ Could not resolve the IP of the Symbolica license server. │
  1320. 31.32 s > │ │
  1321. 31.32 s > │ Please check your DNS configuration. │
  1322. 31.32 s > └───────────────────────────────────────────────────────────┘
  1323. 31.32 s > Error: failed to lookup address information: Temporary failure in name resolution
  1324. 31.32 s >
  1325. 31.32 s >
  1326. 31.32 s > Location:
  1327. 31.32 s > tests/tests/test_python_api.rs:156:20
  1328. 31.32 s >
  1329. 31.32 s > 2. gammaloop-integration-tests::test_python_api::python_session_getters_return_live_toml_and_command_blocks
  1330. 31.32 s > failure: test failure with exit code 101
  1331. 31.32 s > Error: Python API test subprocess failed.
  1332. 31.32 s > stdout:
  1333. 31.32 s > ┌────────────────────────────────────────────────────────┐
  1334. 31.32 s > │ You are running a restricted Symbolica instance. │
  1335. 31.32 s > │ │
  1336. 31.32 s > │ This mode is only permitted for non-commercial use and │
  1337. 31.32 s > │ is limited to one instance and core per machine. │
  1338. 31.32 s > │ │
  1339. 31.32 s > │ Hobbyists can easily acquire a free license key │
  1340. 31.32 s > │ that unlocks all cores and removes this banner: │
  1341. 31.32 s > │ │
  1342. 31.32 s > │ from symbolica import * │
  1343. 31.32 s > │ request_hobbyist_license('YOUR_NAME', 'YOUR_EMAIL') │
  1344. 31.32 s > │ │
  1345. 31.32 s > │ All other users can obtain a free 30-day trial key: │
  1346. 31.32 s > │ │
  1347. 31.32 s > │ from symbolica import * │
  1348. 31.32 s > │ request_trial_license('NAME', 'EMAIL', 'EMPLOYER') │
  1349. 31.32 s > │ │
  1350. 31.32 s > │ See https://symbolica.io/docs/get_started.html#license │
  1351. 31.32 s > └────────────────────────────────────────────────────────┘
  1352. 31.32 s > ┌───────────────────────────────────────────────────────────────────────────────────────────────────────────┐
  1353. 31.32 s > │ Cannot start new unlicensed Symbolica instance since there is already another one running on the machine. │
  1354. 31.32 s > └───────────────────────────────────────────────────────────────────────────────────────────────────────────┘
  1355. 31.32 s >
  1356. 31.32 s > stderr:
  1357. 31.32 s >
  1358. 31.32 s > ┌───────────────────────────────────────────────────────────┐
  1359. 31.32 s > │ Could not resolve the IP of the Symbolica license server. │
  1360. 31.32 s > │ │
  1361. 31.32 s > │ Please check your DNS configuration. │
  1362. 31.32 s > └───────────────────────────────────────────────────────────┘
  1363. 31.32 s > Error: failed to lookup address information: Temporary failure in name resolution
  1364. 31.32 s >
  1365. 31.32 s >
  1366. 31.32 s > Location:
  1367. 31.32 s > tests/tests/test_python_api.rs:156:20
  1368. 31.32 s > system-out
  1369. 31.32 s > running 1 test
  1370. 31.32 s > test python_session_getters_return_live_toml_and_command_blocks ... FAILED
  1371. 31.32 s >
  1372. 31.32 s > failures:
  1373. 31.32 s >
  1374. 31.32 s > failures:
  1375. 31.32 s > python_session_getters_return_live_toml_and_command_blocks
  1376. 31.32 s >
  1377. 31.32 s > test result: FAILED. 0 passed; 1 failed; 0 ignored; 0 measured; 4 filtered out; finished in 0.11s
  1378. 31.32 s > system-err
  1379. 31.32 s > Error: Python API test subprocess failed.
  1380. 31.32 s > stdout:
  1381. 31.32 s > ┌────────────────────────────────────────────────────────┐
  1382. 31.32 s > │ You are running a restricted Symbolica instance. │
  1383. 31.32 s > │ │
  1384. 31.32 s > │ This mode is only permitted for non-commercial use and │
  1385. 31.32 s > │ is limited to one instance and core per machine. │
  1386. 31.32 s > │ │
  1387. 31.32 s > │ Hobbyists can easily acquire a free license key │
  1388. 31.32 s > │ that unlocks all cores and removes this banner: │
  1389. 31.32 s > │ │
  1390. 31.32 s > │ from symbolica import * │
  1391. 31.32 s > │ request_hobbyist_license('YOUR_NAME', 'YOUR_EMAIL') │
  1392. 31.32 s > │ │
  1393. 31.32 s > │ All other users can obtain a free 30-day trial key: │
  1394. 31.32 s > │ │
  1395. 31.32 s > │ from symbolica import * │
  1396. 31.32 s > │ request_trial_license('NAME', 'EMAIL', 'EMPLOYER') │
  1397. 31.32 s > │ │
  1398. 31.32 s > │ See https://symbolica.io/docs/get_started.html#license │
  1399. 31.32 s > └────────────────────────────────────────────────────────┘
  1400. 31.32 s > ┌───────────────────────────────────────────────────────────────────────────────────────────────────────────┐
  1401. 31.32 s > │ Cannot start new unlicensed Symbolica instance since there is already another one running on the machine. │
  1402. 31.32 s > └───────────────────────────────────────────────────────────────────────────────────────────────────────────┘
  1403. 31.32 s >
  1404. 31.32 s > stderr:
  1405. 31.32 s >
  1406. 31.32 s > ┌───────────────────────────────────────────────────────────┐
  1407. 31.32 s > │ Could not resolve the IP of the Symbolica license server. │
  1408. 31.32 s > │ │
  1409. 31.32 s > │ Please check your DNS configuration. │
  1410. 31.32 s > └───────────────────────────────────────────────────────────┘
  1411. 31.32 s > Error: failed to lookup address information: Temporary failure in name resolution
  1412. 31.32 s >
  1413. 31.32 s >
  1414. 31.32 s > Location:
  1415. 31.32 s > tests/tests/test_python_api.rs:156:20
  1416. 31.32 s >
  1417. 31.32 s > 3. gammaloop-integration-tests::test_python_api::python_evaluate_samples_batch_and_momentum_space_have_expected_shape
  1418. 31.32 s > failure: test failure with exit code 101
  1419. 31.32 s > Error: Python API test subprocess failed.
  1420. 31.32 s > stdout:
  1421. 31.32 s > ┌────────────────────────────────────────────────────────┐
  1422. 31.32 s > │ You are running a restricted Symbolica instance. │
  1423. 31.32 s > │ │
  1424. 31.32 s > │ This mode is only permitted for non-commercial use and │
  1425. 31.32 s > │ is limited to one instance and core per machine. │
  1426. 31.32 s > │ │
  1427. 31.32 s > │ Hobbyists can easily acquire a free license key │
  1428. 31.32 s > │ that unlocks all cores and removes this banner: │
  1429. 31.32 s > │ │
  1430. 31.32 s > │ from symbolica import * │
  1431. 31.32 s > │ request_hobbyist_license('YOUR_NAME', 'YOUR_EMAIL') │
  1432. 31.32 s > │ │
  1433. 31.32 s > │ All other users can obtain a free 30-day trial key: │
  1434. 31.32 s > │ │
  1435. 31.32 s > │ from symbolica import * │
  1436. 31.32 s > │ request_trial_license('NAME', 'EMAIL', 'EMPLOYER') │
  1437. 31.32 s > │ │
  1438. 31.32 s > │ See https://symbolica.io/docs/get_started.html#license │
  1439. 31.32 s > └────────────────────────────────────────────────────────┘
  1440. 31.32 s > ┌───────────────────────────────────────────────────────────────────────────────────────────────────────────┐
  1441. 31.32 s > │ Cannot start new unlicensed Symbolica instance since there is already another one running on the machine. │
  1442. 31.32 s > └───────────────────────────────────────────────────────────────────────────────────────────────────────────┘
  1443. 31.32 s >
  1444. 31.32 s > stderr:
  1445. 31.32 s >
  1446. 31.32 s > ┌───────────────────────────────────────────────────────────┐
  1447. 31.32 s > │ Could not resolve the IP of the Symbolica license server. │
  1448. 31.32 s > │ │
  1449. 31.32 s > │ Please check your DNS configuration. │
  1450. 31.32 s > └───────────────────────────────────────────────────────────┘
  1451. 31.32 s > Error: failed to lookup address information: Temporary failure in name resolution
  1452. 31.32 s >
  1453. 31.32 s >
  1454. 31.32 s > Location:
  1455. 31.32 s > tests/tests/test_python_api.rs:156:20
  1456. 31.32 s > system-out
  1457. 31.32 s > running 1 test
  1458. 31.32 s > test python_evaluate_samples_batch_and_momentum_space_have_expected_shape ... FAILED
  1459. 31.32 s >
  1460. 31.32 s > failures:
  1461. 31.32 s >
  1462. 31.32 s > failures:
  1463. 31.32 s > python_evaluate_samples_batch_and_momentum_space_have_expected_shape
  1464. 31.32 s >
  1465. 31.32 s > test result: FAILED. 0 passed; 1 failed; 0 ignored; 0 measured; 4 filtered out; finished in 0.11s
  1466. 31.32 s > system-err
  1467. 31.32 s > Error: Python API test subprocess failed.
  1468. 31.32 s > stdout:
  1469. 31.32 s > ┌────────────────────────────────────────────────────────┐
  1470. 31.32 s > │ You are running a restricted Symbolica instance. │
  1471. 31.32 s > │ │
  1472. 31.32 s > │ This mode is only permitted for non-commercial use and │
  1473. 31.32 s > │ is limited to one instance and core per machine. │
  1474. 31.32 s > │ │
  1475. 31.32 s > │ Hobbyists can easily acquire a free license key │
  1476. 31.32 s > │ that unlocks all cores and removes this banner: │
  1477. 31.32 s > │ │
  1478. 31.32 s > │ from symbolica import * │
  1479. 31.32 s > │ request_hobbyist_license('YOUR_NAME', 'YOUR_EMAIL') │
  1480. 31.32 s > │ │
  1481. 31.32 s > │ All other users can obtain a free 30-day trial key: │
  1482. 31.32 s > │ │
  1483. 31.32 s > │ from symbolica import * │
  1484. 31.32 s > │ request_trial_license('NAME', 'EMAIL', 'EMPLOYER') │
  1485. 31.32 s > │ │
  1486. 31.32 s > │ See https://symbolica.io/docs/get_started.html#license │
  1487. 31.32 s > └────────────────────────────────────────────────────────┘
  1488. 31.32 s > ┌───────────────────────────────────────────────────────────────────────────────────────────────────────────┐
  1489. 31.32 s > │ Cannot start new unlicensed Symbolica instance since there is already another one running on the machine. │
  1490. 31.32 s > └───────────────────────────────────────────────────────────────────────────────────────────────────────────┘
  1491. 31.32 s >
  1492. 31.32 s > stderr:
  1493. 31.32 s >
  1494. 31.32 s > ┌───────────────────────────────────────────────────────────┐
  1495. 31.32 s > │ Could not resolve the IP of the Symbolica license server. │
  1496. 31.32 s > │ │
  1497. 31.32 s > │ Please check your DNS configuration. │
  1498. 31.32 s > └───────────────────────────────────────────────────────────┘
  1499. 31.32 s > Error: failed to lookup address information: Temporary failure in name resolution
  1500. 31.32 s >
  1501. 31.32 s >
  1502. 31.32 s > Location:
  1503. 31.32 s > tests/tests/test_python_api.rs:156:20
  1504. 31.32 s >
  1505. 31.32 s > 4. gammaloop-integration-tests::test_python_api::python_evaluate_sample_preserves_graph_grouping_and_incoming_pdgs
  1506. 31.32 s > failure: test failure with exit code 101
  1507. 31.32 s > Error: Python API test subprocess failed.
  1508. 31.32 s > stdout:
  1509. 31.32 s > ┌────────────────────────────────────────────────────────┐
  1510. 31.32 s > │ You are running a restricted Symbolica instance. │
  1511. 31.32 s > │ │
  1512. 31.32 s > │ This mode is only permitted for non-commercial use and │
  1513. 31.32 s > │ is limited to one instance and core per machine. │
  1514. 31.32 s > │ │
  1515. 31.32 s > │ Hobbyists can easily acquire a free license key │
  1516. 31.32 s > │ that unlocks all cores and removes this banner: │
  1517. 31.32 s > │ │
  1518. 31.32 s > │ from symbolica import * │
  1519. 31.32 s > │ request_hobbyist_license('YOUR_NAME', 'YOUR_EMAIL') │
  1520. 31.32 s > │ │
  1521. 31.32 s > │ All other users can obtain a free 30-day trial key: │
  1522. 31.32 s > │ │
  1523. 31.32 s > │ from symbolica import * │
  1524. 31.32 s > │ request_trial_license('NAME', 'EMAIL', 'EMPLOYER') │
  1525. 31.32 s > │ │
  1526. 31.32 s > │ See https://symbolica.io/docs/get_started.html#license │
  1527. 31.32 s > └────────────────────────────────────────────────────────┘
  1528. 31.32 s > ┌───────────────────────────────────────────────────────────────────────────────────────────────────────────┐
  1529. 31.32 s > │ Cannot start new unlicensed Symbolica instance since there is already another one running on the machine. │
  1530. 31.32 s > └───────────────────────────────────────────────────────────────────────────────────────────────────────────┘
  1531. 31.32 s >
  1532. 31.32 s > stderr:
  1533. 31.32 s >
  1534. 31.32 s > ┌───────────────────────────────────────────────────────────┐
  1535. 31.32 s > │ Could not resolve the IP of the Symbolica license server. │
  1536. 31.32 s > │ │
  1537. 31.32 s > │ Please check your DNS configuration. │
  1538. 31.32 s > └───────────────────────────────────────────────────────────┘
  1539. 31.32 s > Error: failed to lookup address information: Temporary failure in name resolution
  1540. 31.32 s >
  1541. 31.32 s >
  1542. 31.32 s > Location:
  1543. 31.32 s > tests/tests/test_python_api.rs:156:20
  1544. 31.32 s > system-out
  1545. 31.32 s > running 1 test
  1546. 31.32 s > test python_evaluate_sample_preserves_graph_grouping_and_incoming_pdgs ... FAILED
  1547. 31.32 s >
  1548. 31.32 s > failures:
  1549. 31.32 s >
  1550. 31.32 s > failures:
  1551. 31.32 s > python_evaluate_sample_preserves_graph_grouping_and_incoming_pdgs
  1552. 31.32 s >
  1553. 31.32 s > test result: FAILED. 0 passed; 1 failed; 0 ignored; 0 measured; 4 filtered out; finished in 0.12s
  1554. 31.32 s > system-err
  1555. 31.32 s > Error: Python API test subprocess failed.
  1556. 31.32 s > stdout:
  1557. 31.32 s > ┌────────────────────────────────────────────────────────┐
  1558. 31.32 s > │ You are running a restricted Symbolica instance. │
  1559. 31.32 s > │ │
  1560. 31.32 s > │ This mode is only permitted for non-commercial use and │
  1561. 31.32 s > │ is limited to one instance and core per machine. │
  1562. 31.32 s > │ │
  1563. 31.32 s > │ Hobbyists can easily acquire a free license key │
  1564. 31.32 s > │ that unlocks all cores and removes this banner: │
  1565. 31.32 s > │ │
  1566. 31.32 s > │ from symbolica import * │
  1567. 31.32 s > │ request_hobbyist_license('YOUR_NAME', 'YOUR_EMAIL') │
  1568. 31.32 s > │ │
  1569. 31.32 s > │ All other users can obtain a free 30-day trial key: │
  1570. 31.32 s > │ │
  1571. 31.32 s > │ from symbolica import * │
  1572. 31.32 s > │ request_trial_license('NAME', 'EMAIL', 'EMPLOYER') │
  1573. 31.32 s > │ │
  1574. 31.32 s > │ See https://symbolica.io/docs/get_started.html#license │
  1575. 31.32 s > └────────────────────────────────────────────────────────┘
  1576. 31.32 s > ┌───────────────────────────────────────────────────────────────────────────────────────────────────────────┐
  1577. 31.32 s > │ Cannot start new unlicensed Symbolica instance since there is already another one running on the machine. │
  1578. 31.32 s > └───────────────────────────────────────────────────────────────────────────────────────────────────────────┘
  1579. 31.32 s >
  1580. 31.32 s > stderr:
  1581. 31.32 s >
  1582. 31.32 s > ┌───────────────────────────────────────────────────────────┐
  1583. 31.32 s > │ Could not resolve the IP of the Symbolica license server. │
  1584. 31.32 s > │ │
  1585. 31.32 s > │ Please check your DNS configuration. │
  1586. 31.32 s > └───────────────────────────────────────────────────────────┘
  1587. 31.32 s > Error: failed to lookup address information: Temporary failure in name resolution
  1588. 31.32 s >
  1589. 31.32 s >
  1590. 31.32 s > Location:
  1591. 31.32 s > tests/tests/test_python_api.rs:156:20
  1592. 31.32 s > =========================================
  1593. 31.32 s For full logs, run:
  1594. 31.32 s nix log /nix/store/0y85356skfl9xg7hqjngmsb9xh03dwf2-gammaloop-nextest-python-api.drv
  1595. 31.52 s [0 built (1 failed), 0.0Run failed.