build checks.x86_64-linux.gammaloop-check
0.00 s
$ /nix/store/9ypz3flqsrl5xl495mm8h645gadjsxi1-coreutils-9.11/bin/timeout --kill-after=15s 7200s /nix/store/23zk8sgzamrbmj1fday15szf7f2279s8-nix-2.34.7/bin/nix --extra-experimental-features nix-command --extra-experimental-features flakes --log-format internal-json build --no-link --print-out-paths git+https://github.com/alphal00p/gammaloop?ref=advanced_sampling&rev=3f9b1a28473f313d6242a556ada2e8dbcd6f6477&shallow=1#checks.x86_64-linux.gammaloop-check --print-build-logs
2.52 s
2.76 s
Building /nix/store/gmbpv2azznl3dd48abbm33lq79pdf6qb-gammaloop-workspace-check-0.1.0.drv
2.83 s
[gammaloop-workspace-check] Phase: unpackPhase
2.83 s
[gammaloop-workspace-check] unpacking source archive /nix/store/453bxmlhly4wvsiv1az9yc5fqq6c327k-source
2.99 s
[gammaloop-workspace-check] source root is source
3.02 s
[gammaloop-workspace-check] Phase: patchPhase
3.02 s
[gammaloop-workspace-check] Executing configureCargoCommonVars
3.02 s
[gammaloop-workspace-check] decompressing cargo artifacts from /nix/store/50vpxlcgfxf2d57i27v3d10zjwxxbm2r-gammaloop-workspace-deps-deps-0.1.0/target.tar.zst to target
4.32 s
[gammaloop-workspace-check] Phase: updateAutotoolsGnuConfigScriptsPhase
4.36 s
[gammaloop-workspace-check] Phase: configurePhase
4.36 s
[gammaloop-workspace-check] will append /build/source/.cargo-home/config.toml with contents of /nix/store/5drf77x6km4ky7gwlrzdx9bbd6fz09g3-vendor-cargo-deps/config.toml
4.36 s
[gammaloop-workspace-check] default configurePhase, nothing to do
4.36 s
[gammaloop-workspace-check] Phase: buildPhase
4.37 s
[gammaloop-workspace-check] +++ command cargo --version
4.37 s
[gammaloop-workspace-check] cargo 1.97.0 (c980f4866 2026-06-30)
4.40 s
[gammaloop-workspace-check] +++ command cargo check --profile ci-optim --locked --workspace --features gammaloop-tracing-filter/clap,gammaloop-tracing-filter/symbolica,idenso/bincode,idenso/reference-cases,linnet/bincode,linnet/drawing,linnet/rkyv,linnet/serde,linnet/symbolica,spenso-macros/shadowing,spenso/shadowing,symbolica/tracing_max_level_info,three-dimensional-reps/display,three-dimensional-reps/eval,three-dimensional-reps/serde --all-targets
4.89 s
[gammaloop-workspace-check] Checking cfg-if v1.0.4
4.89 s
[gammaloop-workspace-check] Checking memchr v2.8.0
4.89 s
[gammaloop-workspace-check] Checking once_cell v1.21.4
4.91 s
[gammaloop-workspace-check] Checking either v1.15.0
4.91 s
[gammaloop-workspace-check] Checking serde_core v1.0.228
4.91 s
[gammaloop-workspace-check] Checking libc v0.2.186
4.91 s
[gammaloop-workspace-check] Checking libm v0.2.16
4.92 s
[gammaloop-workspace-check] Checking itoa v1.0.18
4.93 s
[gammaloop-workspace-check] Checking log v0.4.29
4.93 s
[gammaloop-workspace-check] Checking regex-syntax v0.8.10
4.94 s
[gammaloop-workspace-check] Checking zerocopy v0.8.48
4.94 s
[gammaloop-workspace-check] Checking crossbeam-utils v0.8.21
4.94 s
[gammaloop-workspace-check] Checking equivalent v1.0.2
4.95 s
[gammaloop-workspace-check] Checking zmij v1.0.21
4.95 s
[gammaloop-workspace-check] Checking bytemuck v1.25.0
4.95 s
[gammaloop-workspace-check] Checking lazy_static v1.5.0
4.95 s
[gammaloop-workspace-check] Compiling target-lexicon v0.13.5
5.00 s
[gammaloop-workspace-check] Checking arrayvec v0.7.6
5.00 s
[gammaloop-workspace-check] Checking powerfmt v0.2.0
5.02 s
[gammaloop-workspace-check] Checking time-core v0.1.8
5.03 s
[gammaloop-workspace-check] Checking num_threads v0.1.7
5.09 s
[gammaloop-workspace-check] Checking num-conv v0.2.1
5.10 s
[gammaloop-workspace-check] Checking pin-project-lite v0.2.17
5.12 s
[gammaloop-workspace-check] Checking deranged v0.5.8
5.13 s
[gammaloop-workspace-check] Checking tracing-core v0.1.36
5.15 s
[gammaloop-workspace-check] Checking itertools v0.14.0
5.15 s
[gammaloop-workspace-check] Checking allocator-api2 v0.2.21
5.19 s
[gammaloop-workspace-check] Checking foldhash v0.2.0
5.21 s
[gammaloop-workspace-check] Checking const-random v0.1.18
5.23 s
[gammaloop-workspace-check] Checking safe_arch v0.7.4
5.23 s
[gammaloop-workspace-check] Checking static_assertions v1.1.0
5.28 s
[gammaloop-workspace-check] Checking unty v0.0.4
5.29 s
[gammaloop-workspace-check] Checking winnow v1.0.2
5.29 s
[gammaloop-workspace-check] Checking aho-corasick v1.1.4
5.30 s
[gammaloop-workspace-check] Checking crossbeam-epoch v0.9.18
5.31 s
[gammaloop-workspace-check] Checking nu-ansi-term v0.50.3
5.33 s
[gammaloop-workspace-check] Checking safe_arch v1.0.0
5.43 s
[gammaloop-workspace-check] Checking tracing v0.1.44
5.44 s
[gammaloop-workspace-check] Checking hashbrown v0.16.1
5.49 s
[gammaloop-workspace-check] Checking wide v0.7.33
5.50 s
[gammaloop-workspace-check] Checking crossbeam-deque v0.8.6
5.54 s
[gammaloop-workspace-check] Checking tracing-log v0.2.0
5.62 s
[gammaloop-workspace-check] Checking sharded-slab v0.1.7
5.66 s
[gammaloop-workspace-check] Checking thread_local v1.1.9
5.68 s
[gammaloop-workspace-check] Checking rayon-core v1.13.0
5.71 s
[gammaloop-workspace-check] Checking az v1.3.0
5.79 s
[gammaloop-workspace-check] Checking indenter v0.3.4
5.87 s
[gammaloop-workspace-check] Checking toml_writer v1.1.1+spec-1.1.0
5.95 s
[gammaloop-workspace-check] Checking wide v1.3.0
5.97 s
[gammaloop-workspace-check] Compiling phf_shared v0.11.3
5.99 s
[gammaloop-workspace-check] Checking num-traits v0.2.19
6.03 s
[gammaloop-workspace-check] Checking anyhow v1.0.102
6.05 s
[gammaloop-workspace-check] Checking rayon v1.12.0
6.06 s
[gammaloop-workspace-check] Checking rawpointer v0.2.1
6.15 s
[gammaloop-workspace-check] Checking utf8parse v0.2.2
6.18 s
[gammaloop-workspace-check] Checking dyn-clone v1.0.20
6.22 s
[gammaloop-workspace-check] Checking alloc-no-stdlib v2.0.4
6.24 s
[gammaloop-workspace-check] Checking anstyle-parse v1.0.0
6.26 s
[gammaloop-workspace-check] Checking matrixmultiply v0.3.10
6.29 s
[gammaloop-workspace-check] Checking is_terminal_polyfill v1.70.2
6.30 s
[gammaloop-workspace-check] Checking alloc-stdlib v0.2.2
6.31 s
[gammaloop-workspace-check] Checking colorchoice v1.0.5
6.33 s
[gammaloop-workspace-check] Checking getrandom v0.3.4
6.34 s
[gammaloop-workspace-check] Checking regex-automata v0.4.14
6.35 s
[gammaloop-workspace-check] Checking time v0.3.47
6.36 s
[gammaloop-workspace-check] Checking gmp-mpfr-sys v1.7.1
6.39 s
[gammaloop-workspace-check] Checking anstyle v1.0.14
6.40 s
[gammaloop-workspace-check] Checking colored v3.1.1
6.48 s
[gammaloop-workspace-check] Checking rand_core v0.9.5
6.51 s
[gammaloop-workspace-check] Checking anstyle-query v1.1.5
6.51 s
[gammaloop-workspace-check] Compiling phf_generator v0.11.3
6.52 s
[gammaloop-workspace-check] Checking serde v1.0.228
6.57 s
[gammaloop-workspace-check] Checking serde_json v1.0.149
6.60 s
[gammaloop-workspace-check] Checking bitflags v2.11.1
6.62 s
[gammaloop-workspace-check] Checking serde_spanned v1.1.1
6.62 s
[gammaloop-workspace-check] Checking toml_datetime v1.1.1+spec-1.1.0
6.62 s
[gammaloop-workspace-check] Checking anstream v1.0.0
6.64 s
[gammaloop-workspace-check] Checking toml_parser v1.1.2+spec-1.1.0
6.67 s
[gammaloop-workspace-check] Checking approx v0.5.1
6.74 s
[gammaloop-workspace-check] Checking num-integer v0.1.46
6.75 s
[gammaloop-workspace-check] Checking eyre v0.6.12
6.77 s
[gammaloop-workspace-check] Checking bitflags v1.3.2
6.80 s
[gammaloop-workspace-check] Checking unicode-width v0.2.2
6.83 s
[gammaloop-workspace-check] Compiling phf_codegen v0.11.3
6.84 s
[gammaloop-workspace-check] Checking region v3.0.2
6.85 s
[gammaloop-workspace-check] Checking brotli-decompressor v5.0.0
6.86 s
[gammaloop-workspace-check] Compiling pyo3-build-config v0.28.3
6.96 s
[gammaloop-workspace-check] Checking wasmtime-jit-icache-coherence v34.0.2
6.97 s
[gammaloop-workspace-check] Checking hugepage-rs v0.1.1
6.97 s
[gammaloop-workspace-check] Checking spec_math v0.1.6
6.98 s
[gammaloop-workspace-check] Checking inventory v0.3.24
7.01 s
[gammaloop-workspace-check] Checking thiserror v2.0.18
7.02 s
[gammaloop-workspace-check] Compiling getopts v0.2.24
7.03 s
[gammaloop-workspace-check] Checking toml v1.1.2+spec-1.1.0
7.03 s
[gammaloop-workspace-check] Checking libloading v0.9.0
7.05 s
[gammaloop-workspace-check] Checking smallvec v1.15.1
7.05 s
[gammaloop-workspace-check] Checking num-complex v0.4.6
7.07 s
[gammaloop-workspace-check] Checking bincode v2.0.1
7.07 s
[gammaloop-workspace-check] Checking tracing-serde v0.2.0
7.19 s
[gammaloop-workspace-check] Checking smartstring v1.0.1
7.24 s
[gammaloop-workspace-check] Checking bytes v1.11.1
7.28 s
[gammaloop-workspace-check] Checking append-only-vec v0.1.8
7.38 s
[gammaloop-workspace-check] Checking byteorder v1.5.0
7.41 s
[gammaloop-workspace-check] Checking self_cell v1.2.2
7.44 s
[gammaloop-workspace-check] Checking tinyjson v2.5.1
7.51 s
[gammaloop-workspace-check] Compiling unicode_names2_generator v1.3.0
7.54 s
[gammaloop-workspace-check] Compiling unic-common v0.9.0
7.59 s
[gammaloop-workspace-check] Checking linux-raw-sys v0.12.1
7.59 s
[gammaloop-workspace-check] Checking simba v0.9.1
7.67 s
[gammaloop-workspace-check] Compiling unic-char-range v0.9.0
7.73 s
[gammaloop-workspace-check] Compiling unic-ucd-version v0.9.0
7.76 s
[gammaloop-workspace-check] Compiling is-macro v0.3.7
7.82 s
[gammaloop-workspace-check] Compiling unic-char-property v0.9.0
7.88 s
[gammaloop-workspace-check] Compiling rustpython-parser-vendored v0.4.0
7.93 s
[gammaloop-workspace-check] Checking brotli v8.0.2
7.95 s
[gammaloop-workspace-check] Checking iana-time-zone v0.1.65
7.99 s
[gammaloop-workspace-check] Compiling rustpython-parser v0.4.0
8.00 s
[gammaloop-workspace-check] Compiling phf v0.11.3
8.00 s
[gammaloop-workspace-check] Checking rustc-hash v2.1.2
8.03 s
[gammaloop-workspace-check] Checking rustix v1.1.4
8.07 s
[gammaloop-workspace-check] Checking chrono v0.4.44
8.07 s
[gammaloop-workspace-check] Compiling unic-ucd-ident v0.9.0
8.11 s
[gammaloop-workspace-check] Compiling unic-emoji-char v0.9.0
8.19 s
[gammaloop-workspace-check] Checking ndarray v0.17.2
8.21 s
[gammaloop-workspace-check] Compiling rustc-hash v1.1.0
8.28 s
[gammaloop-workspace-check] Compiling lalrpop-util v0.20.2
8.29 s
[gammaloop-workspace-check] Checking rug v1.30.0
8.31 s
[gammaloop-workspace-check] Checking unicode-segmentation v1.13.2
8.48 s
[gammaloop-workspace-check] Compiling symbolica v2.2.0 (https://github.com/alphal00p/symbolica?rev=a277a8dadbaae5a8d6605f2f381991a601e1f345#a277a8da)
8.52 s
[gammaloop-workspace-check] Checking typenum v1.20.0
8.67 s
[gammaloop-workspace-check] Checking getrandom v0.2.17
8.74 s
[gammaloop-workspace-check] Checking scopeguard v1.2.0
8.82 s
[gammaloop-workspace-check] Checking lock_api v0.4.14
8.86 s
[gammaloop-workspace-check] Checking parking_lot_core v0.9.12
9.05 s
[gammaloop-workspace-check] Checking unicode-ident v1.0.24
9.14 s
[gammaloop-workspace-check] Checking hashbrown v0.17.0
9.15 s
[gammaloop-workspace-check] Checking parking_lot v0.12.5
9.24 s
[gammaloop-workspace-check] Checking matchers v0.2.0
9.26 s
[gammaloop-workspace-check] Checking regex v1.12.3
9.32 s
[gammaloop-workspace-check] Checking tracing-subscriber v0.3.23
9.32 s
[gammaloop-workspace-check] Checking generic-array v0.14.7
9.40 s
[gammaloop-workspace-check] Checking errno v0.3.14
9.51 s
[gammaloop-workspace-check] Checking unicase v2.9.0
9.54 s
[gammaloop-workspace-check] Checking strsim v0.11.1
9.55 s
[gammaloop-workspace-check] Checking clap_lex v1.1.0
9.59 s
[gammaloop-workspace-check] Checking ppv-lite86 v0.2.21
9.65 s
[gammaloop-workspace-check] Checking ahash v0.8.12
9.68 s
[gammaloop-workspace-check] Checking signal-hook-registry v1.4.8
9.69 s
[gammaloop-workspace-check] Checking indexmap v2.14.0
9.70 s
[gammaloop-workspace-check] Checking vte v0.14.1
9.74 s
[gammaloop-workspace-check] Checking same-file v1.0.6
9.82 s
[gammaloop-workspace-check] Checking signal-hook v0.3.18
9.83 s
[gammaloop-workspace-check] Checking half v2.7.1
9.86 s
[gammaloop-workspace-check] Checking terminal_size v0.4.4
9.87 s
[gammaloop-workspace-check] Checking walkdir v2.5.0
9.96 s
[gammaloop-workspace-check] Checking block-buffer v0.10.4
9.98 s
[gammaloop-workspace-check] Checking clap_builder v4.6.0
10.00 s
[gammaloop-workspace-check] Checking crypto-common v0.1.7
10.02 s
[gammaloop-workspace-check] Checking rand_chacha v0.9.0
10.03 s
[gammaloop-workspace-check] Checking mio v1.2.0
10.07 s
[gammaloop-workspace-check] Checking minimal-lexical v0.2.1
10.09 s
[gammaloop-workspace-check] Checking ciborium-io v0.2.2
10.09 s
[gammaloop-workspace-check] Checking digest v0.10.7
10.13 s
[gammaloop-workspace-check] Checking ciborium-ll v0.2.2
10.16 s
[gammaloop-workspace-check] Checking rand v0.9.4
10.22 s
[gammaloop-workspace-check] Checking derive_more v2.1.1
10.27 s
[gammaloop-workspace-check] Checking num-bigint v0.4.6
10.29 s
[gammaloop-workspace-check] Checking console v0.16.3
10.30 s
[gammaloop-workspace-check] Checking bstr v1.12.1
10.31 s
[gammaloop-workspace-check] Checking signal-hook-mio v0.2.5
10.38 s
[gammaloop-workspace-check] Checking nom v7.1.3
10.40 s
[gammaloop-workspace-check] Checking linux-raw-sys v0.4.15
10.47 s
[gammaloop-workspace-check] Checking cpufeatures v0.2.17
10.52 s
[gammaloop-workspace-check] Checking winnow v0.7.15
10.53 s
[gammaloop-workspace-check] Checking symjit v2.21.0
10.59 s
[gammaloop-workspace-check] Checking rustix v0.38.44
10.60 s
[gammaloop-workspace-check] Checking globset v0.4.18
10.76 s
[gammaloop-workspace-check] Checking sha2 v0.10.9
10.89 s
[gammaloop-workspace-check] Checking ciborium v0.2.2
10.97 s
[gammaloop-workspace-check] Checking rand_core v0.6.4
11.01 s
[gammaloop-workspace-check] Checking getrandom v0.4.2
11.07 s
[gammaloop-workspace-check] Checking fnv v1.0.7
11.13 s
[gammaloop-workspace-check] Checking plotters-backend v0.3.7
11.13 s
[gammaloop-workspace-check] Checking fastrand v2.4.1
11.15 s
[gammaloop-workspace-check] Checking crossterm v0.28.1
11.23 s
[gammaloop-workspace-check] Checking tempfile v3.27.0
11.26 s
[gammaloop-workspace-check] Checking plotters-svg v0.3.7
11.31 s
[gammaloop-workspace-check] Checking rust-embed-utils v8.11.0
11.38 s
[gammaloop-workspace-check] Checking serde_spanned v0.6.9
11.47 s
[gammaloop-workspace-check] Checking toml_datetime v0.6.11
11.48 s
[gammaloop-workspace-check] Checking itertools v0.10.5
11.49 s
[gammaloop-workspace-check] Checking tap v1.0.1
11.50 s
[gammaloop-workspace-check] Checking toml_write v0.1.2
11.52 s
[gammaloop-workspace-check] Checking cast v0.3.0
11.58 s
[gammaloop-workspace-check] Checking wyz v0.5.1
11.61 s
[gammaloop-workspace-check] Checking ansitok v0.3.0
11.64 s
[gammaloop-workspace-check] Checking plotters v0.3.7
11.65 s
[gammaloop-workspace-check] Checking rand_chacha v0.3.1
11.66 s
[gammaloop-workspace-check] Checking clap v4.6.1
11.68 s
[gammaloop-workspace-check] Checking radium v0.7.0
11.69 s
[gammaloop-workspace-check] Checking toml_edit v0.22.27
11.71 s
[gammaloop-workspace-check] Compiling unicode_names2 v1.3.0
11.73 s
[gammaloop-workspace-check] Checking typeid v1.0.3
11.75 s
[gammaloop-workspace-check] Checking similar v2.7.0
11.82 s
[gammaloop-workspace-check] Checking tinytemplate v1.2.1
11.82 s
[gammaloop-workspace-check] Checking is-terminal v0.4.17
11.84 s
[gammaloop-workspace-check] Checking anes v0.1.6
11.91 s
[gammaloop-workspace-check] Checking bytecount v0.6.9
11.95 s
[gammaloop-workspace-check] Checking ansi-str v0.9.0
11.98 s
[gammaloop-workspace-check] Checking oorandom v11.1.5
12.01 s
[gammaloop-workspace-check] Checking funty v2.0.0
12.07 s
[gammaloop-workspace-check] Checking xprec v0.2.2
12.08 s
[gammaloop-workspace-check] Checking testing_table v0.3.0
12.09 s
[gammaloop-workspace-check] Checking rand v0.8.6
12.14 s
[gammaloop-workspace-check] Checking ron v0.12.1
12.15 s
[gammaloop-workspace-check] Checking papergrid v0.17.0
12.16 s
[gammaloop-workspace-check] Checking toml_edit v0.25.11+spec-1.1.0
12.22 s
[gammaloop-workspace-check] Checking uncased v0.9.10
12.23 s
[gammaloop-workspace-check] Checking env_filter v1.0.1
12.36 s
[gammaloop-workspace-check] Checking jiff v0.2.24
12.39 s
[gammaloop-workspace-check] Checking bitvec v1.0.1
12.45 s
[gammaloop-workspace-check] Checking ptr_meta v0.1.4
12.46 s
[gammaloop-workspace-check] Checking criterion-plot v0.5.0
12.52 s
[gammaloop-workspace-check] Checking simdutf8 v0.1.5
12.53 s
[gammaloop-workspace-check] Checking ucd-trie v0.1.7
12.68 s
[gammaloop-workspace-check] Checking pest v2.8.6
12.70 s
[gammaloop-workspace-check] Checking criterion v0.5.1
12.75 s
[gammaloop-workspace-check] Checking bytecheck v0.6.12
12.75 s
[gammaloop-workspace-check] Checking ahash v0.7.8
12.88 s
[gammaloop-workspace-check] Checking approx v0.4.0
12.92 s
[gammaloop-workspace-check] Checking hashbrown v0.12.3
12.93 s
[gammaloop-workspace-check] Checking tabled v0.20.0
12.97 s
[gammaloop-workspace-check] Checking seahash v4.1.0
12.99 s
[gammaloop-workspace-check] Checking cgmath v0.18.0
13.04 s
[gammaloop-workspace-check] Checking num-rational v0.4.2
13.15 s
[gammaloop-workspace-check] Checking insta v1.47.2
13.17 s
[gammaloop-workspace-check] Checking toml v0.8.23
13.27 s
[gammaloop-workspace-check] Checking num-iter v0.1.45
13.33 s
[gammaloop-workspace-check] Checking ref-ops v0.2.5
13.33 s
[gammaloop-workspace-check] Checking rend v0.4.2
13.34 s
[gammaloop-workspace-check] Checking num v0.4.3
13.40 s
[gammaloop-workspace-check] Checking rand_xoshiro v0.6.0
13.41 s
[gammaloop-workspace-check] Checking features v0.10.0
13.47 s
[gammaloop-workspace-check] Checking gat-lending-iterator v0.1.8
13.56 s
[gammaloop-workspace-check] Checking figment v0.10.19
13.61 s
[gammaloop-workspace-check] Checking constcat v0.5.1
13.62 s
[gammaloop-workspace-check] Compiling pyo3-ffi v0.28.3
13.63 s
[gammaloop-workspace-check] Compiling pyo3-macros-backend v0.28.3
13.76 s
[gammaloop-workspace-check] Compiling pyo3 v0.28.3
13.78 s
[gammaloop-workspace-check] Compiling numpy v0.28.0
13.85 s
[gammaloop-workspace-check] Checking dot-parser v0.5.1
14.15 s
[gammaloop-workspace-check] Checking colored v2.2.0
14.16 s
[gammaloop-workspace-check] Checking constant_time_eq v0.4.2
14.16 s
[gammaloop-workspace-check] Checking cpufeatures v0.3.0
14.20 s
[gammaloop-workspace-check] Checking arrayref v0.3.9
14.22 s
[gammaloop-workspace-check] Checking base64 v0.22.1
14.25 s
[gammaloop-workspace-check] Checking joinery v2.1.0
14.26 s
[gammaloop-workspace-check] Checking blake3 v1.8.5
14.27 s
[gammaloop-workspace-check] Checking siphasher v1.0.2
14.33 s
[gammaloop-workspace-check] Checking subprocess v0.2.15
14.35 s
[gammaloop-workspace-check] Checking rust_lisp v0.18.0
14.36 s
[gammaloop-workspace-check] Checking titlecase v2.2.1
14.38 s
[gammaloop-workspace-check] Checking phf_shared v0.13.1
14.40 s
[gammaloop-workspace-check] Compiling vakint v0.1.2 (/build/source/crates/vakint)
14.46 s
[gammaloop-workspace-check] Checking version-compare v0.2.1
14.47 s
[gammaloop-workspace-check] Checking xpct v0.5.1
14.57 s
[gammaloop-workspace-check] Checking phf v0.13.1
14.62 s
[gammaloop-workspace-check] Checking ryu v1.0.23
14.65 s
[gammaloop-workspace-check] Checking castaway v0.2.4
14.67 s
[gammaloop-workspace-check] Checking toml_datetime v0.7.5+spec-1.1.0
14.69 s
[gammaloop-workspace-check] Checking strum v0.27.2
14.71 s
[gammaloop-workspace-check] Checking unicode-truncate v2.0.1
14.72 s
[gammaloop-workspace-check] Checking kasuari v0.4.12
14.72 s
[gammaloop-workspace-check] Checking lru v0.16.4
14.76 s
[gammaloop-workspace-check] Checking vte v0.15.0
14.76 s
[gammaloop-workspace-check] Checking portable-atomic v1.13.1
14.78 s
[gammaloop-workspace-check] Checking string-template-plus v0.4.3
14.78 s
[gammaloop-workspace-check] Checking compact_str v0.9.0
14.82 s
[gammaloop-workspace-check] Checking toml v0.9.12+spec-1.1.0
14.83 s
[gammaloop-workspace-check] Checking unit-prefix v0.5.2
14.87 s
[gammaloop-workspace-check] Checking rand_distr v0.4.3
14.88 s
[gammaloop-workspace-check] Checking simba v0.6.0
14.90 s
[gammaloop-workspace-check] Checking vt100 v0.16.2
14.91 s
[gammaloop-workspace-check] Checking line-clipping v0.3.7
14.93 s
[gammaloop-workspace-check] Compiling three-dimensional-reps v0.1.0 (/build/source/crates/three-dimensional-reps)
14.95 s
[gammaloop-workspace-check] Compiling rustpython-parser-core v0.4.0
14.97 s
[gammaloop-workspace-check] Checking adler2 v2.0.1
14.98 s
[gammaloop-workspace-check] Checking gimli v0.32.3
15.03 s
[gammaloop-workspace-check] Checking miniz_oxide v0.8.9
15.05 s
[gammaloop-workspace-check] Checking thiserror v1.0.69
15.08 s
[gammaloop-workspace-check] Checking derive_builder v0.11.2
15.12 s
[gammaloop-workspace-check] Compiling rustpython-ast v0.4.0
15.14 s
[gammaloop-workspace-check] Checking ratatui-core v0.1.0
15.17 s
[gammaloop-workspace-check] Checking object v0.37.3
15.20 s
[gammaloop-workspace-check] Checking crossterm v0.29.0
15.22 s
[gammaloop-workspace-check] Checking owo-colors v4.3.0
15.23 s
[gammaloop-workspace-check] Checking tracing-error v0.2.1
15.25 s
[gammaloop-workspace-check] Checking env_logger v0.11.10
15.26 s
[gammaloop-workspace-check] Checking indicatif v0.18.4
15.28 s
[gammaloop-workspace-check] Checking typed-index-collections v3.5.0
15.30 s
[gammaloop-workspace-check] Checking serde-big-array v0.5.1
15.39 s
[gammaloop-workspace-check] Checking amd v0.2.2
15.48 s
[gammaloop-workspace-check] Checking itertools v0.11.0
15.52 s
[gammaloop-workspace-check] Compiling gammaloop-tracing-filter-macros v0.1.0 (/build/source/crates/gammaloop-tracing-filter-macros)
15.58 s
[gammaloop-workspace-check] Checking option-ext v0.2.0
15.58 s
[gammaloop-workspace-check] Checking rustc-demangle v0.1.27
15.61 s
[gammaloop-workspace-check] Checking ref-cast v1.0.25
15.62 s
[gammaloop-workspace-check] Checking dirs-sys v0.5.0
15.68 s
[gammaloop-workspace-check] Checking nix v0.31.2
15.71 s
[gammaloop-workspace-check] Checking integer-sqrt v0.1.5
15.79 s
[gammaloop-workspace-check] Checking rkyv v0.7.46
15.80 s
[gammaloop-workspace-check] Checking brotli-decompressor v4.0.3
15.80 s
[gammaloop-workspace-check] Checking crossbeam-channel v0.5.15
15.82 s
[gammaloop-workspace-check] Checking itertools v0.12.1
15.90 s
[gammaloop-workspace-check] Checking symlink v0.1.0
15.95 s
[gammaloop-workspace-check] Compiling gammalooprs v0.3.4 (/build/source/crates/gammalooprs)
15.98 s
[gammaloop-workspace-check] Checking color-spantrace v0.3.0
16.07 s
[gammaloop-workspace-check] Checking unsafe-libyaml v0.2.11
16.12 s
[gammaloop-workspace-check] Checking tracing-appender v0.2.5
16.14 s
[gammaloop-workspace-check] Checking ratatui-widgets v0.3.0
16.23 s
[gammaloop-workspace-check] Checking ratatui-crossterm v0.1.0
16.27 s
[gammaloop-workspace-check] Checking include_dir v0.7.4
16.34 s
[gammaloop-workspace-check] Checking tracing-indicatif v0.3.14
16.35 s
[gammaloop-workspace-check] Checking ctrlc v3.5.2
16.37 s
[gammaloop-workspace-check] Checking clarabel v0.11.1
16.37 s
[gammaloop-workspace-check] Checking pathfinding v4.15.0
16.41 s
[gammaloop-workspace-check] Checking dirs v6.0.0
16.49 s
[gammaloop-workspace-check] Checking schemars v1.2.1
16.50 s
[gammaloop-workspace-check] Checking slotmap v1.1.1
16.53 s
[gammaloop-workspace-check] Checking json5 v0.4.1
16.55 s
[gammaloop-workspace-check] Checking brotli v7.0.0
16.78 s
[gammaloop-workspace-check] Checking addr2line v0.25.1
16.84 s
[gammaloop-workspace-check] Checking serde_yaml v0.9.34+deprecated
17.03 s
[gammaloop-workspace-check] Checking vectorize v0.2.0
17.07 s
[gammaloop-workspace-check] Checking base62 v2.2.4
17.08 s
[gammaloop-workspace-check] Checking ringbuffer v0.16.0
17.12 s
[gammaloop-workspace-check] Checking ratatui-macros v0.7.0
17.13 s
[gammaloop-workspace-check] Checking rust-embed v8.11.0
17.16 s
[gammaloop-workspace-check] Checking clap_complete v4.6.3
17.20 s
[gammaloop-workspace-check] Checking ratatui v0.30.0
17.21 s
[gammaloop-workspace-check] Checking fd-lock v4.0.4
17.26 s
[gammaloop-workspace-check] Checking strip-ansi-escapes v0.2.1
17.26 s
[gammaloop-workspace-check] Compiling gammaloop-api v0.1.0 (/build/source/crates/gammaloop-api)
17.28 s
[gammaloop-workspace-check] Checking itertools v0.13.0
17.31 s
[gammaloop-workspace-check] Checking strum v0.26.3
17.32 s
[gammaloop-workspace-check] Checking sysinfo v0.33.1
17.32 s
[gammaloop-workspace-check] Checking shlex v1.3.0
17.43 s
[gammaloop-workspace-check] Checking futures-task v0.3.32
17.45 s
[gammaloop-workspace-check] Checking futures-core v0.3.32
17.47 s
[gammaloop-workspace-check] Checking slab v0.4.12
17.47 s
[gammaloop-workspace-check] Checking clap_complete_nushell v4.6.0
17.55 s
[gammaloop-workspace-check] Checking sdd v3.0.10
17.56 s
[gammaloop-workspace-check] Compiling gammaloop-integration-tests v0.1.0 (/build/source/tests)
17.60 s
[gammaloop-workspace-check] Compiling test-log-core v0.2.20
17.61 s
[gammaloop-workspace-check] Checking futures-util v0.3.32
17.73 s
[gammaloop-workspace-check] Compiling rustc_version v0.4.1
17.74 s
[gammaloop-workspace-check] Checking scc v2.4.0
17.79 s
[gammaloop-workspace-check] Checking which v8.0.2
17.94 s
[gammaloop-workspace-check] Checking bincode v1.3.3
17.99 s
[gammaloop-workspace-check] Compiling gungraun-runner v0.18.2
18.13 s
[gammaloop-workspace-check] Checking nalgebra v0.29.0
18.21 s
[gammaloop-workspace-check] Checking reedline v0.42.0
18.24 s
[gammaloop-workspace-check] Checking proc-macro2 v1.0.106
18.44 s
[gammaloop-workspace-check] Checking backtrace v0.3.76
18.65 s
[gammaloop-workspace-check] Checking quote v1.0.45
18.67 s
[gammaloop-workspace-check] Compiling gungraun-macros v0.8.0
18.75 s
[gammaloop-workspace-check] Checking base64 v0.21.7
18.80 s
[gammaloop-workspace-check] Checking maplit v1.0.2
18.83 s
[gammaloop-workspace-check] Checking color-eyre v0.6.5
18.90 s
[gammaloop-workspace-check] Compiling iai-callgrind-runner v0.14.2
18.96 s
[gammaloop-workspace-check] Checking ron v0.8.1
19.11 s
[gammaloop-workspace-check] Compiling numerica v2.2.0 (https://github.com/alphal00p/symbolica?rev=a277a8dadbaae5a8d6605f2f381991a601e1f345#a277a8da)
19.19 s
[gammaloop-workspace-check] Checking futures-executor v0.3.32
19.22 s
[gammaloop-workspace-check] Checking kurbo v0.13.0
19.25 s
[gammaloop-workspace-check] Checking wait-timeout v0.2.1
19.30 s
[gammaloop-workspace-check] Checking serial_test v3.4.0
19.36 s
[gammaloop-workspace-check] Checking quick-error v1.2.3
19.41 s
[gammaloop-workspace-check] Checking bit-vec v0.8.0
19.43 s
[gammaloop-workspace-check] Compiling iai-callgrind v0.14.2
19.44 s
[gammaloop-workspace-check] Checking rusty-fork v0.3.1
19.61 s
[gammaloop-workspace-check] Checking bit-set v0.8.0
19.65 s
[gammaloop-workspace-check] Checking syn v2.0.117
19.68 s
[gammaloop-workspace-check] Compiling test-log-macros v0.2.20
19.70 s
[gammaloop-workspace-check] Compiling iai-callgrind-macros v0.5.1
19.72 s
[gammaloop-workspace-check] Checking rand_xorshift v0.4.0
19.73 s
[gammaloop-workspace-check] Checking console v0.15.11
19.82 s
[gammaloop-workspace-check] Checking pathdiff v0.2.3
19.88 s
[gammaloop-workspace-check] Checking unarray v0.1.4
19.92 s
[gammaloop-workspace-check] Checking proptest v1.11.0
20.19 s
[gammaloop-workspace-check] Checking kurvst v0.1.0 (/build/source/crates/kurvst)
20.22 s
[gammaloop-workspace-check] Checking similar-asserts v1.7.0
20.36 s
[gammaloop-workspace-check] Checking clinnet v0.1.8 (/build/source/crates/clinnet)
22.15 s
[gammaloop-workspace-check] Compiling graphica v2.1.0 (https://github.com/alphal00p/symbolica?rev=a277a8dadbaae5a8d6605f2f381991a601e1f345#a277a8da)
22.26 s
[gammaloop-workspace-check] Checking test-log v0.2.20
22.94 s
[gammaloop-workspace-check] Checking statrs v0.16.1
23.42 s
[gammaloop-workspace-check] Checking momtrop v0.3.0
26.16 s
[gammaloop-workspace-check] Checking gungraun v0.18.2
26.20 s
[gammaloop-workspace-check] Compiling pyo3-stub-gen-derive v0.17.2
27.01 s
[gammaloop-workspace-check] Compiling pyo3-macros v0.28.3
31.86 s
[gammaloop-workspace-check] Checking pyo3-stub-gen v0.17.2
37.92 s
[gammaloop-workspace-check] Checking symbolica-utils v0.1.0 (/build/source/crates/symbolica-utils)
37.92 s
[gammaloop-workspace-check] Checking spenso-macros v0.3.2 (/build/source/crates/spenso-macros)
259.11 s
[gammaloop-workspace-check] Compiling gammaloop-workspace-hack v0.1.0 (/build/source/crates/gammaloop-workspace-hack)
259.39 s
[gammaloop-workspace-check] Checking linnet v0.17.0 (/build/source/crates/linnet)
262.80 s
[gammaloop-workspace-check] Checking spenso v0.6.0 (/build/source/crates/spenso)
262.80 s
[gammaloop-workspace-check] Checking linnet-py v0.1.0 (/build/source/crates/linnet-py)
262.80 s
[gammaloop-workspace-check] Checking linnest v0.1.0 (/build/source/crates/linnest)
267.98 s
[gammaloop-workspace-check] Checking idenso v0.3.0 (/build/source/crates/idenso)
267.98 s
[gammaloop-workspace-check] Checking gammaloop-tracing-filter v0.1.0 (/build/source/crates/gammaloop-tracing-filter)
270.80 s
[gammaloop-workspace-check] Checking spenso-hep-lib v0.1.7 (/build/source/crates/spenso-hep-lib)
271.03 s
[gammaloop-workspace-check] Checking spynso3 v0.1.2 (/build/source/crates/spynso3)
326.79 s
[gammaloop-workspace-check] error[E0560] : struct `CutInfo` has no field named `lmb_channel_id`
326.79 s
[gammaloop-workspace-check] --> tests/tests/test_differential.rs:86:13
326.79 s
[gammaloop-workspace-check] |
326.79 s
[gammaloop-workspace-check] 86 | lmb_channel_id: None,
326.79 s
[gammaloop-workspace-check] | ^^^^^^^^^^^^^^ `CutInfo` does not have this field
326.79 s
[gammaloop-workspace-check] |
326.79 s
[gammaloop-workspace-check] = note : available fields are: `sampling_channel_id`, `sampling_channel_edge_ids`
326.79 s
[gammaloop-workspace-check]
326.79 s
[gammaloop-workspace-check] error[E0560] : struct `CutInfo` has no field named `lmb_channel_edge_ids`
326.79 s
[gammaloop-workspace-check] --> tests/tests/test_differential.rs:87:13
326.79 s
[gammaloop-workspace-check] |
326.79 s
[gammaloop-workspace-check] 87 | lmb_channel_edge_ids: None,
326.79 s
[gammaloop-workspace-check] | ^^^^^^^^^^^^^^^^^^^^ `CutInfo` does not have this field
326.79 s
[gammaloop-workspace-check] |
326.79 s
[gammaloop-workspace-check] = note : available fields are: `sampling_channel_id`, `sampling_channel_edge_ids`
326.79 s
[gammaloop-workspace-check]
326.81 s
[gammaloop-workspace-check] error[E0063] : missing field `reference_moments` in initializer of `GraphEvaluationResult<_>`
326.81 s
[gammaloop-workspace-check] --> tests/tests/test_differential.rs:532:19
326.81 s
[gammaloop-workspace-check] |
326.81 s
[gammaloop-workspace-check] 532 | let mut lhs = GraphEvaluationResult {
326.81 s
[gammaloop-workspace-check] | ^^^^^^^^^^^^^^^^^^^^^ missing `reference_moments`
326.81 s
[gammaloop-workspace-check]
326.81 s
[gammaloop-workspace-check] error[E0063] : missing field `reference_moments` in initializer of `GraphEvaluationResult<_>`
326.81 s
[gammaloop-workspace-check] --> tests/tests/test_differential.rs:539:15
326.81 s
[gammaloop-workspace-check] |
326.81 s
[gammaloop-workspace-check] 539 | let rhs = GraphEvaluationResult {
326.81 s
[gammaloop-workspace-check] | ^^^^^^^^^^^^^^^^^^^^^ missing `reference_moments`
326.81 s
[gammaloop-workspace-check]
326.92 s
[gammaloop-workspace-check] Some errors have detailed explanations: E0063, E0560.
326.92 s
[gammaloop-workspace-check] For more information about an error, try `rustc --explain E0063`.
326.93 s
[gammaloop-workspace-check] error : could not compile `gammaloop-integration-tests` (test "test_differential") due to 4 previous errors
326.93 s
[gammaloop-workspace-check] warning : build failed, waiting for other jobs to finish...
327.87 s
[gammaloop-workspace-check] error[E0609] : no field `lmb_channel_id` on type `CutInfo`
327.87 s
[gammaloop-workspace-check] --> tests/tests/test_runs/utils.rs:568:36
327.87 s
[gammaloop-workspace-check] |
327.87 s
[gammaloop-workspace-check] 568 | event.cut_info.lmb_channel_id,
327.87 s
[gammaloop-workspace-check] | ^^^^^^^^^^^^^^ unknown field
327.87 s
[gammaloop-workspace-check] |
327.87 s
[gammaloop-workspace-check] = note : available fields are: `particle_pdgs`, `cut_id`, `graph_id`, `graph_group_id`, `orientation_id` ... and 2 others
327.87 s
[gammaloop-workspace-check]
327.87 s
[gammaloop-workspace-check] error[E0609] : no field `lmb_channel_id` on type `CutInfo`
327.87 s
[gammaloop-workspace-check] --> tests/tests/test_runs/utils.rs:580:36
327.87 s
[gammaloop-workspace-check] |
327.87 s
[gammaloop-workspace-check] 580 | event.cut_info.lmb_channel_id,
327.87 s
[gammaloop-workspace-check] | ^^^^^^^^^^^^^^ unknown field
327.87 s
[gammaloop-workspace-check] |
327.87 s
[gammaloop-workspace-check] = note : available fields are: `particle_pdgs`, `cut_id`, `graph_id`, `graph_group_id`, `orientation_id` ... and 2 others
327.87 s
[gammaloop-workspace-check]
328.44 s
[gammaloop-workspace-check] For more information about this error, try `rustc --explain E0609`.
328.46 s
[gammaloop-workspace-check] error : could not compile `gammaloop-integration-tests` (test "test_runs") due to 2 previous errors
329.07 s
Progress: 0 of 1 built (1 failed)
329.07 s
Failed to build gammaloop-workspace-check after 5m26s
329.08 s
Cannot build ' /nix/store/gmbpv2azznl3dd48abbm33lq79pdf6qb-gammaloop-workspace-check-0.1.0.drv '.
329.08 s
Reason: builder failed with exit code 101 .
329.08 s
Output paths:
329.08 s
/nix/store/8rmjky42njpx16i1pybw197fgff2qc5d-gammaloop-workspace-check-0.1.0
329.08 s
Last 475 log lines:
329.08 s
> Running phase: unpackPhase
329.08 s
> unpacking source archive /nix/store/453bxmlhly4wvsiv1az9yc5fqq6c327k-source
329.08 s
> source root is source
329.08 s
> Running phase: patchPhase
329.08 s
> Executing configureCargoCommonVars
329.08 s
> decompressing cargo artifacts from /nix/store/50vpxlcgfxf2d57i27v3d10zjwxxbm2r-gammaloop-workspace-deps-deps-0.1.0/target.tar.zst to target
329.08 s
> Running phase: updateAutotoolsGnuConfigScriptsPhase
329.08 s
> Running phase: configurePhase
329.08 s
> will append /build/source/.cargo-home/config.toml with contents of /nix/store/5drf77x6km4ky7gwlrzdx9bbd6fz09g3-vendor-cargo-deps/config.toml
329.08 s
> default configurePhase, nothing to do
329.08 s
> Running phase: buildPhase
329.08 s
> +++ command cargo --version
329.08 s
> cargo 1.97.0 (c980f4866 2026-06-30)
329.08 s
> +++ command cargo check --profile ci-optim --locked --workspace --features gammaloop-tracing-filter/clap,gammaloop-tracing-filter/symbolica,idenso/bincode,idenso/reference-cases,linnet/bincode,linnet/drawing,linnet/rkyv,linnet/serde,linnet/symbolica,spenso-macros/shadowing,spenso/shadowing,symbolica/tracing_max_level_info,three-dimensional-reps/display,three-dimensional-reps/eval,three-dimensional-reps/serde --all-targets
329.08 s
> Checking cfg-if v1.0.4
329.08 s
> Checking memchr v2.8.0
329.08 s
> Checking once_cell v1.21.4
329.08 s
> Checking either v1.15.0
329.08 s
> Checking serde_core v1.0.228
329.08 s
> Checking libc v0.2.186
329.08 s
> Checking libm v0.2.16
329.08 s
> Checking itoa v1.0.18
329.08 s
> Checking log v0.4.29
329.08 s
> Checking regex-syntax v0.8.10
329.08 s
> Checking zerocopy v0.8.48
329.08 s
> Checking crossbeam-utils v0.8.21
329.08 s
> Checking equivalent v1.0.2
329.08 s
> Checking zmij v1.0.21
329.08 s
> Checking bytemuck v1.25.0
329.08 s
> Checking lazy_static v1.5.0
329.08 s
> Compiling target-lexicon v0.13.5
329.08 s
> Checking arrayvec v0.7.6
329.08 s
> Checking powerfmt v0.2.0
329.08 s
> Checking time-core v0.1.8
329.08 s
> Checking num_threads v0.1.7
329.08 s
> Checking num-conv v0.2.1
329.08 s
> Checking pin-project-lite v0.2.17
329.08 s
> Checking deranged v0.5.8
329.08 s
> Checking tracing-core v0.1.36
329.08 s
> Checking itertools v0.14.0
329.08 s
> Checking allocator-api2 v0.2.21
329.08 s
> Checking foldhash v0.2.0
329.08 s
> Checking const-random v0.1.18
329.08 s
> Checking safe_arch v0.7.4
329.08 s
> Checking static_assertions v1.1.0
329.08 s
> Checking unty v0.0.4
329.08 s
> Checking winnow v1.0.2
329.08 s
> Checking aho-corasick v1.1.4
329.08 s
> Checking crossbeam-epoch v0.9.18
329.08 s
> Checking nu-ansi-term v0.50.3
329.08 s
> Checking safe_arch v1.0.0
329.08 s
> Checking tracing v0.1.44
329.08 s
> Checking hashbrown v0.16.1
329.08 s
> Checking wide v0.7.33
329.08 s
> Checking crossbeam-deque v0.8.6
329.08 s
> Checking tracing-log v0.2.0
329.08 s
> Checking sharded-slab v0.1.7
329.08 s
> Checking thread_local v1.1.9
329.08 s
> Checking rayon-core v1.13.0
329.08 s
> Checking az v1.3.0
329.08 s
> Checking indenter v0.3.4
329.08 s
> Checking toml_writer v1.1.1+spec-1.1.0
329.08 s
> Checking wide v1.3.0
329.08 s
> Compiling phf_shared v0.11.3
329.08 s
> Checking num-traits v0.2.19
329.08 s
> Checking anyhow v1.0.102
329.08 s
> Checking rayon v1.12.0
329.08 s
> Checking rawpointer v0.2.1
329.08 s
> Checking utf8parse v0.2.2
329.08 s
> Checking dyn-clone v1.0.20
329.08 s
> Checking alloc-no-stdlib v2.0.4
329.08 s
> Checking anstyle-parse v1.0.0
329.08 s
> Checking matrixmultiply v0.3.10
329.08 s
> Checking is_terminal_polyfill v1.70.2
329.08 s
> Checking alloc-stdlib v0.2.2
329.08 s
> Checking colorchoice v1.0.5
329.08 s
> Checking getrandom v0.3.4
329.08 s
> Checking regex-automata v0.4.14
329.08 s
> Checking time v0.3.47
329.08 s
> Checking gmp-mpfr-sys v1.7.1
329.08 s
> Checking anstyle v1.0.14
329.08 s
> Checking colored v3.1.1
329.08 s
> Checking rand_core v0.9.5
329.08 s
> Checking anstyle-query v1.1.5
329.08 s
> Compiling phf_generator v0.11.3
329.08 s
> Checking serde v1.0.228
329.08 s
> Checking serde_json v1.0.149
329.08 s
> Checking bitflags v2.11.1
329.08 s
> Checking serde_spanned v1.1.1
329.08 s
> Checking toml_datetime v1.1.1+spec-1.1.0
329.08 s
> Checking anstream v1.0.0
329.08 s
> Checking toml_parser v1.1.2+spec-1.1.0
329.08 s
> Checking approx v0.5.1
329.08 s
> Checking num-integer v0.1.46
329.08 s
> Checking eyre v0.6.12
329.08 s
> Checking bitflags v1.3.2
329.08 s
> Checking unicode-width v0.2.2
329.08 s
> Compiling phf_codegen v0.11.3
329.08 s
> Checking region v3.0.2
329.08 s
> Checking brotli-decompressor v5.0.0
329.08 s
> Compiling pyo3-build-config v0.28.3
329.08 s
> Checking wasmtime-jit-icache-coherence v34.0.2
329.08 s
> Checking hugepage-rs v0.1.1
329.08 s
> Checking spec_math v0.1.6
329.08 s
> Checking inventory v0.3.24
329.08 s
> Checking thiserror v2.0.18
329.08 s
> Compiling getopts v0.2.24
329.08 s
> Checking toml v1.1.2+spec-1.1.0
329.08 s
> Checking libloading v0.9.0
329.08 s
> Checking smallvec v1.15.1
329.08 s
> Checking num-complex v0.4.6
329.08 s
> Checking bincode v2.0.1
329.08 s
> Checking tracing-serde v0.2.0
329.08 s
> Checking smartstring v1.0.1
329.08 s
> Checking bytes v1.11.1
329.08 s
> Checking append-only-vec v0.1.8
329.08 s
> Checking byteorder v1.5.0
329.08 s
> Checking self_cell v1.2.2
329.08 s
> Checking tinyjson v2.5.1
329.08 s
> Compiling unicode_names2_generator v1.3.0
329.08 s
> Compiling unic-common v0.9.0
329.08 s
> Checking linux-raw-sys v0.12.1
329.08 s
> Checking simba v0.9.1
329.08 s
> Compiling unic-char-range v0.9.0
329.08 s
> Compiling unic-ucd-version v0.9.0
329.08 s
> Compiling is-macro v0.3.7
329.08 s
> Compiling unic-char-property v0.9.0
329.08 s
> Compiling rustpython-parser-vendored v0.4.0
329.08 s
> Checking brotli v8.0.2
329.08 s
> Checking iana-time-zone v0.1.65
329.08 s
> Compiling rustpython-parser v0.4.0
329.08 s
> Compiling phf v0.11.3
329.08 s
> Checking rustc-hash v2.1.2
329.08 s
> Checking rustix v1.1.4
329.08 s
> Checking chrono v0.4.44
329.08 s
> Compiling unic-ucd-ident v0.9.0
329.08 s
> Compiling unic-emoji-char v0.9.0
329.08 s
> Checking ndarray v0.17.2
329.08 s
> Compiling rustc-hash v1.1.0
329.08 s
> Compiling lalrpop-util v0.20.2
329.08 s
> Checking rug v1.30.0
329.08 s
> Checking unicode-segmentation v1.13.2
329.08 s
> Compiling symbolica v2.2.0 (https://github.com/alphal00p/symbolica?rev=a277a8dadbaae5a8d6605f2f381991a601e1f345#a277a8da)
329.08 s
> Checking typenum v1.20.0
329.08 s
> Checking getrandom v0.2.17
329.08 s
> Checking scopeguard v1.2.0
329.08 s
> Checking lock_api v0.4.14
329.08 s
> Checking parking_lot_core v0.9.12
329.08 s
> Checking unicode-ident v1.0.24
329.08 s
> Checking hashbrown v0.17.0
329.08 s
> Checking parking_lot v0.12.5
329.08 s
> Checking matchers v0.2.0
329.08 s
> Checking regex v1.12.3
329.08 s
> Checking tracing-subscriber v0.3.23
329.08 s
> Checking generic-array v0.14.7
329.08 s
> Checking errno v0.3.14
329.08 s
> Checking unicase v2.9.0
329.08 s
> Checking strsim v0.11.1
329.08 s
> Checking clap_lex v1.1.0
329.08 s
> Checking ppv-lite86 v0.2.21
329.08 s
> Checking ahash v0.8.12
329.08 s
> Checking signal-hook-registry v1.4.8
329.08 s
> Checking indexmap v2.14.0
329.08 s
> Checking vte v0.14.1
329.08 s
> Checking same-file v1.0.6
329.08 s
> Checking signal-hook v0.3.18
329.08 s
> Checking half v2.7.1
329.08 s
> Checking terminal_size v0.4.4
329.08 s
> Checking walkdir v2.5.0
329.08 s
> Checking block-buffer v0.10.4
329.08 s
> Checking clap_builder v4.6.0
329.08 s
> Checking crypto-common v0.1.7
329.08 s
> Checking rand_chacha v0.9.0
329.08 s
> Checking mio v1.2.0
329.08 s
> Checking minimal-lexical v0.2.1
329.08 s
> Checking ciborium-io v0.2.2
329.08 s
> Checking digest v0.10.7
329.08 s
> Checking ciborium-ll v0.2.2
329.08 s
> Checking rand v0.9.4
329.08 s
> Checking derive_more v2.1.1
329.08 s
> Checking num-bigint v0.4.6
329.08 s
> Checking console v0.16.3
329.08 s
> Checking bstr v1.12.1
329.08 s
> Checking signal-hook-mio v0.2.5
329.08 s
> Checking nom v7.1.3
329.08 s
> Checking linux-raw-sys v0.4.15
329.08 s
> Checking cpufeatures v0.2.17
329.08 s
> Checking winnow v0.7.15
329.08 s
> Checking symjit v2.21.0
329.08 s
> Checking rustix v0.38.44
329.08 s
> Checking globset v0.4.18
329.08 s
> Checking sha2 v0.10.9
329.08 s
> Checking ciborium v0.2.2
329.08 s
> Checking rand_core v0.6.4
329.08 s
> Checking getrandom v0.4.2
329.08 s
> Checking fnv v1.0.7
329.08 s
> Checking plotters-backend v0.3.7
329.08 s
> Checking fastrand v2.4.1
329.08 s
> Checking crossterm v0.28.1
329.08 s
> Checking tempfile v3.27.0
329.08 s
> Checking plotters-svg v0.3.7
329.08 s
> Checking rust-embed-utils v8.11.0
329.08 s
> Checking serde_spanned v0.6.9
329.08 s
> Checking toml_datetime v0.6.11
329.08 s
> Checking itertools v0.10.5
329.08 s
> Checking tap v1.0.1
329.08 s
> Checking toml_write v0.1.2
329.08 s
> Checking cast v0.3.0
329.08 s
> Checking wyz v0.5.1
329.08 s
> Checking ansitok v0.3.0
329.08 s
> Checking plotters v0.3.7
329.08 s
> Checking rand_chacha v0.3.1
329.08 s
> Checking clap v4.6.1
329.08 s
> Checking radium v0.7.0
329.08 s
> Checking toml_edit v0.22.27
329.08 s
> Compiling unicode_names2 v1.3.0
329.08 s
> Checking typeid v1.0.3
329.08 s
> Checking similar v2.7.0
329.08 s
> Checking tinytemplate v1.2.1
329.08 s
> Checking is-terminal v0.4.17
329.08 s
> Checking anes v0.1.6
329.08 s
> Checking bytecount v0.6.9
329.08 s
> Checking ansi-str v0.9.0
329.08 s
> Checking oorandom v11.1.5
329.08 s
> Checking funty v2.0.0
329.08 s
> Checking xprec v0.2.2
329.08 s
> Checking testing_table v0.3.0
329.08 s
> Checking rand v0.8.6
329.08 s
> Checking ron v0.12.1
329.08 s
> Checking papergrid v0.17.0
329.08 s
> Checking toml_edit v0.25.11+spec-1.1.0
329.08 s
> Checking uncased v0.9.10
329.08 s
> Checking env_filter v1.0.1
329.08 s
> Checking jiff v0.2.24
329.08 s
> Checking bitvec v1.0.1
329.08 s
> Checking ptr_meta v0.1.4
329.08 s
> Checking criterion-plot v0.5.0
329.08 s
> Checking simdutf8 v0.1.5
329.08 s
> Checking ucd-trie v0.1.7
329.08 s
> Checking pest v2.8.6
329.08 s
> Checking criterion v0.5.1
329.08 s
> Checking bytecheck v0.6.12
329.08 s
> Checking ahash v0.7.8
329.08 s
> Checking approx v0.4.0
329.08 s
> Checking hashbrown v0.12.3
329.08 s
> Checking tabled v0.20.0
329.08 s
> Checking seahash v4.1.0
329.08 s
> Checking cgmath v0.18.0
329.08 s
> Checking num-rational v0.4.2
329.08 s
> Checking insta v1.47.2
329.08 s
> Checking toml v0.8.23
329.08 s
> Checking num-iter v0.1.45
329.08 s
> Checking ref-ops v0.2.5
329.08 s
> Checking rend v0.4.2
329.08 s
> Checking num v0.4.3
329.08 s
> Checking rand_xoshiro v0.6.0
329.08 s
> Checking features v0.10.0
329.08 s
> Checking gat-lending-iterator v0.1.8
329.08 s
> Checking figment v0.10.19
329.08 s
> Checking constcat v0.5.1
329.08 s
> Compiling pyo3-ffi v0.28.3
329.08 s
> Compiling pyo3-macros-backend v0.28.3
329.08 s
> Compiling pyo3 v0.28.3
329.08 s
> Compiling numpy v0.28.0
329.08 s
> Checking dot-parser v0.5.1
329.08 s
> Checking colored v2.2.0
329.08 s
> Checking constant_time_eq v0.4.2
329.08 s
> Checking cpufeatures v0.3.0
329.08 s
> Checking arrayref v0.3.9
329.08 s
> Checking base64 v0.22.1
329.08 s
> Checking joinery v2.1.0
329.08 s
> Checking blake3 v1.8.5
329.08 s
> Checking siphasher v1.0.2
329.08 s
> Checking subprocess v0.2.15
329.08 s
> Checking rust_lisp v0.18.0
329.08 s
> Checking titlecase v2.2.1
329.08 s
> Checking phf_shared v0.13.1
329.08 s
> Compiling vakint v0.1.2 (/build/source/crates/vakint)
329.08 s
> Checking version-compare v0.2.1
329.08 s
> Checking xpct v0.5.1
329.08 s
> Checking phf v0.13.1
329.08 s
> Checking ryu v1.0.23
329.08 s
> Checking castaway v0.2.4
329.08 s
> Checking toml_datetime v0.7.5+spec-1.1.0
329.08 s
> Checking strum v0.27.2
329.08 s
> Checking unicode-truncate v2.0.1
329.08 s
> Checking kasuari v0.4.12
329.08 s
> Checking lru v0.16.4
329.08 s
> Checking vte v0.15.0
329.08 s
> Checking portable-atomic v1.13.1
329.08 s
> Checking string-template-plus v0.4.3
329.08 s
> Checking compact_str v0.9.0
329.08 s
> Checking toml v0.9.12+spec-1.1.0
329.08 s
> Checking unit-prefix v0.5.2
329.08 s
> Checking rand_distr v0.4.3
329.08 s
> Checking simba v0.6.0
329.08 s
> Checking vt100 v0.16.2
329.08 s
> Checking line-clipping v0.3.7
329.08 s
> Compiling three-dimensional-reps v0.1.0 (/build/source/crates/three-dimensional-reps)
329.08 s
> Compiling rustpython-parser-core v0.4.0
329.08 s
> Checking adler2 v2.0.1
329.08 s
> Checking gimli v0.32.3
329.08 s
> Checking miniz_oxide v0.8.9
329.08 s
> Checking thiserror v1.0.69
329.08 s
> Checking derive_builder v0.11.2
329.08 s
> Compiling rustpython-ast v0.4.0
329.08 s
> Checking ratatui-core v0.1.0
329.08 s
> Checking object v0.37.3
329.08 s
> Checking crossterm v0.29.0
329.08 s
> Checking owo-colors v4.3.0
329.08 s
> Checking tracing-error v0.2.1
329.08 s
> Checking env_logger v0.11.10
329.08 s
> Checking indicatif v0.18.4
329.08 s
> Checking typed-index-collections v3.5.0
329.08 s
> Checking serde-big-array v0.5.1
329.08 s
> Checking amd v0.2.2
329.08 s
> Checking itertools v0.11.0
329.08 s
> Compiling gammaloop-tracing-filter-macros v0.1.0 (/build/source/crates/gammaloop-tracing-filter-macros)
329.08 s
> Checking option-ext v0.2.0
329.08 s
> Checking rustc-demangle v0.1.27
329.08 s
> Checking ref-cast v1.0.25
329.08 s
> Checking dirs-sys v0.5.0
329.08 s
> Checking nix v0.31.2
329.08 s
> Checking integer-sqrt v0.1.5
329.08 s
> Checking rkyv v0.7.46
329.08 s
> Checking brotli-decompressor v4.0.3
329.08 s
> Checking crossbeam-channel v0.5.15
329.08 s
> Checking itertools v0.12.1
329.08 s
> Checking symlink v0.1.0
329.08 s
> Compiling gammalooprs v0.3.4 (/build/source/crates/gammalooprs)
329.08 s
> Checking color-spantrace v0.3.0
329.08 s
> Checking unsafe-libyaml v0.2.11
329.08 s
> Checking tracing-appender v0.2.5
329.08 s
> Checking ratatui-widgets v0.3.0
329.08 s
> Checking ratatui-crossterm v0.1.0
329.08 s
> Checking include_dir v0.7.4
329.08 s
> Checking tracing-indicatif v0.3.14
329.08 s
> Checking ctrlc v3.5.2
329.08 s
> Checking clarabel v0.11.1
329.08 s
> Checking pathfinding v4.15.0
329.08 s
> Checking dirs v6.0.0
329.08 s
> Checking schemars v1.2.1
329.08 s
> Checking slotmap v1.1.1
329.08 s
> Checking json5 v0.4.1
329.08 s
> Checking brotli v7.0.0
329.08 s
> Checking addr2line v0.25.1
329.08 s
> Checking serde_yaml v0.9.34+deprecated
329.08 s
> Checking vectorize v0.2.0
329.08 s
> Checking base62 v2.2.4
329.08 s
> Checking ringbuffer v0.16.0
329.08 s
> Checking ratatui-macros v0.7.0
329.08 s
> Checking rust-embed v8.11.0
329.08 s
> Checking clap_complete v4.6.3
329.08 s
> Checking ratatui v0.30.0
329.08 s
> Checking fd-lock v4.0.4
329.08 s
> Checking strip-ansi-escapes v0.2.1
329.08 s
> Compiling gammaloop-api v0.1.0 (/build/source/crates/gammaloop-api)
329.08 s
> Checking itertools v0.13.0
329.08 s
> Checking strum v0.26.3
329.08 s
> Checking sysinfo v0.33.1
329.08 s
> Checking shlex v1.3.0
329.08 s
> Checking futures-task v0.3.32
329.08 s
> Checking futures-core v0.3.32
329.08 s
> Checking slab v0.4.12
329.08 s
> Checking clap_complete_nushell v4.6.0
329.08 s
> Checking sdd v3.0.10
329.08 s
> Compiling gammaloop-integration-tests v0.1.0 (/build/source/tests)
329.08 s
> Compiling test-log-core v0.2.20
329.08 s
> Checking futures-util v0.3.32
329.08 s
> Compiling rustc_version v0.4.1
329.08 s
> Checking scc v2.4.0
329.08 s
> Checking which v8.0.2
329.08 s
> Checking bincode v1.3.3
329.08 s
> Compiling gungraun-runner v0.18.2
329.08 s
> Checking nalgebra v0.29.0
329.08 s
> Checking reedline v0.42.0
329.08 s
> Checking proc-macro2 v1.0.106
329.08 s
> Checking backtrace v0.3.76
329.08 s
> Checking quote v1.0.45
329.08 s
> Compiling gungraun-macros v0.8.0
329.08 s
> Checking base64 v0.21.7
329.08 s
> Checking maplit v1.0.2
329.08 s
> Checking color-eyre v0.6.5
329.08 s
> Compiling iai-callgrind-runner v0.14.2
329.08 s
> Checking ron v0.8.1
329.08 s
> Compiling numerica v2.2.0 (https://github.com/alphal00p/symbolica?rev=a277a8dadbaae5a8d6605f2f381991a601e1f345#a277a8da)
329.08 s
> Checking futures-executor v0.3.32
329.08 s
> Checking kurbo v0.13.0
329.08 s
> Checking wait-timeout v0.2.1
329.08 s
> Checking serial_test v3.4.0
329.08 s
> Checking quick-error v1.2.3
329.08 s
> Checking bit-vec v0.8.0
329.08 s
> Compiling iai-callgrind v0.14.2
329.08 s
> Checking rusty-fork v0.3.1
329.08 s
> Checking bit-set v0.8.0
329.08 s
> Checking syn v2.0.117
329.08 s
> Compiling test-log-macros v0.2.20
329.08 s
> Compiling iai-callgrind-macros v0.5.1
329.08 s
> Checking rand_xorshift v0.4.0
329.08 s
> Checking console v0.15.11
329.08 s
> Checking pathdiff v0.2.3
329.08 s
> Checking unarray v0.1.4
329.08 s
> Checking proptest v1.11.0
329.08 s
> Checking kurvst v0.1.0 (/build/source/crates/kurvst)
329.08 s
> Checking similar-asserts v1.7.0
329.08 s
> Checking clinnet v0.1.8 (/build/source/crates/clinnet)
329.08 s
> Compiling graphica v2.1.0 (https://github.com/alphal00p/symbolica?rev=a277a8dadbaae5a8d6605f2f381991a601e1f345#a277a8da)
329.08 s
> Checking test-log v0.2.20
329.08 s
> Checking statrs v0.16.1
329.08 s
> Checking momtrop v0.3.0
329.08 s
> Checking gungraun v0.18.2
329.08 s
> Compiling pyo3-stub-gen-derive v0.17.2
329.08 s
> Compiling pyo3-macros v0.28.3
329.08 s
> Checking pyo3-stub-gen v0.17.2
329.08 s
> Checking symbolica-utils v0.1.0 (/build/source/crates/symbolica-utils)
329.08 s
> Checking spenso-macros v0.3.2 (/build/source/crates/spenso-macros)
329.08 s
> Compiling gammaloop-workspace-hack v0.1.0 (/build/source/crates/gammaloop-workspace-hack)
329.08 s
> Checking linnet v0.17.0 (/build/source/crates/linnet)
329.08 s
> Checking spenso v0.6.0 (/build/source/crates/spenso)
329.08 s
> Checking linnet-py v0.1.0 (/build/source/crates/linnet-py)
329.08 s
> Checking linnest v0.1.0 (/build/source/crates/linnest)
329.08 s
> Checking idenso v0.3.0 (/build/source/crates/idenso)
329.08 s
> Checking gammaloop-tracing-filter v0.1.0 (/build/source/crates/gammaloop-tracing-filter)
329.08 s
> Checking spenso-hep-lib v0.1.7 (/build/source/crates/spenso-hep-lib)
329.08 s
> Checking spynso3 v0.1.2 (/build/source/crates/spynso3)
329.08 s
> error[E0560] : struct `CutInfo` has no field named `lmb_channel_id`
329.08 s
> --> tests/tests/test_differential.rs:86:13
329.08 s
> |
329.08 s
> 86 | lmb_channel_id: None,
329.08 s
> | ^^^^^^^^^^^^^^ `CutInfo` does not have this field
329.08 s
> |
329.08 s
> = note : available fields are: `sampling_channel_id`, `sampling_channel_edge_ids`
329.08 s
>
329.08 s
> error[E0560] : struct `CutInfo` has no field named `lmb_channel_edge_ids`
329.08 s
> --> tests/tests/test_differential.rs:87:13
329.08 s
> |
329.08 s
> 87 | lmb_channel_edge_ids: None,
329.08 s
> | ^^^^^^^^^^^^^^^^^^^^ `CutInfo` does not have this field
329.08 s
> |
329.08 s
> = note : available fields are: `sampling_channel_id`, `sampling_channel_edge_ids`
329.08 s
>
329.08 s
> error[E0063] : missing field `reference_moments` in initializer of `GraphEvaluationResult<_>`
329.08 s
> --> tests/tests/test_differential.rs:532:19
329.08 s
> |
329.08 s
> 532 | let mut lhs = GraphEvaluationResult {
329.08 s
> | ^^^^^^^^^^^^^^^^^^^^^ missing `reference_moments`
329.08 s
>
329.08 s
> error[E0063] : missing field `reference_moments` in initializer of `GraphEvaluationResult<_>`
329.08 s
> --> tests/tests/test_differential.rs:539:15
329.08 s
> |
329.08 s
> 539 | let rhs = GraphEvaluationResult {
329.08 s
> | ^^^^^^^^^^^^^^^^^^^^^ missing `reference_moments`
329.08 s
>
329.08 s
> Some errors have detailed explanations: E0063, E0560.
329.08 s
> For more information about an error, try `rustc --explain E0063`.
329.08 s
> error : could not compile `gammaloop-integration-tests` (test "test_differential") due to 4 previous errors
329.08 s
> warning : build failed, waiting for other jobs to finish...
329.08 s
> error[E0609] : no field `lmb_channel_id` on type `CutInfo`
329.08 s
> --> tests/tests/test_runs/utils.rs:568:36
329.08 s
> |
329.08 s
> 568 | event.cut_info.lmb_channel_id,
329.08 s
> | ^^^^^^^^^^^^^^ unknown field
329.08 s
> |
329.08 s
> = note : available fields are: `particle_pdgs`, `cut_id`, `graph_id`, `graph_group_id`, `orientation_id` ... and 2 others
329.08 s
>
329.08 s
> error[E0609] : no field `lmb_channel_id` on type `CutInfo`
329.08 s
> --> tests/tests/test_runs/utils.rs:580:36
329.08 s
> |
329.08 s
> 580 | event.cut_info.lmb_channel_id,
329.08 s
> | ^^^^^^^^^^^^^^ unknown field
329.08 s
> |
329.08 s
> = note : available fields are: `particle_pdgs`, `cut_id`, `graph_id`, `graph_group_id`, `orientation_id` ... and 2 others
329.08 s
>
329.08 s
> For more information about this error, try `rustc --explain E0609`.
329.08 s
> error : could not compile `gammaloop-integration-tests` (test "test_runs") due to 2 previous errors
329.08 s
For full logs, run:
329.08 s
nix log /nix/store/gmbpv2azznl3dd48abbm33lq79pdf6qb-gammaloop-workspace-check-0.1.0.drv
329.11 s
Build failed.