1. 0.00 s $ /nix/store/9ypz3flqsrl5xl495mm8h645gadjsxi1-coreutils-9.11/bin/timeout --kill-after=15s 7200s /nix/store/23zk8sgzamrbmj1fday15szf7f2279s8-nix-2.34.7/bin/nix --extra-experimental-features nix-command --extra-experimental-features flakes --log-format internal-json build --no-link --print-out-paths git+https://github.com/alphal00p/gammaloop?ref=advanced_sampling&rev=3f9b1a28473f313d6242a556ada2e8dbcd6f6477&shallow=1#checks.x86_64-linux.gammaloop-check --print-build-logs
  2. 2.52 s
  3. 2.76 s Building /nix/store/gmbpv2azznl3dd48abbm33lq79pdf6qb-gammaloop-workspace-check-0.1.0.drv
  4. 2.83 s [gammaloop-workspace-check] Phase: unpackPhase
  5. 2.83 s [gammaloop-workspace-check] unpacking source archive /nix/store/453bxmlhly4wvsiv1az9yc5fqq6c327k-source
  6. 2.99 s [gammaloop-workspace-check] source root is source
  7. 3.02 s [gammaloop-workspace-check] Phase: patchPhase
  8. 3.02 s [gammaloop-workspace-check] Executing configureCargoCommonVars
  9. 3.02 s [gammaloop-workspace-check] decompressing cargo artifacts from /nix/store/50vpxlcgfxf2d57i27v3d10zjwxxbm2r-gammaloop-workspace-deps-deps-0.1.0/target.tar.zst to target
  10. 4.32 s [gammaloop-workspace-check] Phase: updateAutotoolsGnuConfigScriptsPhase
  11. 4.36 s [gammaloop-workspace-check] Phase: configurePhase
  12. 4.36 s [gammaloop-workspace-check] will append /build/source/.cargo-home/config.toml with contents of /nix/store/5drf77x6km4ky7gwlrzdx9bbd6fz09g3-vendor-cargo-deps/config.toml
  13. 4.36 s [gammaloop-workspace-check] default configurePhase, nothing to do
  14. 4.36 s [gammaloop-workspace-check] Phase: buildPhase
  15. 4.37 s [gammaloop-workspace-check] +++ command cargo --version
  16. 4.37 s [gammaloop-workspace-check] cargo 1.97.0 (c980f4866 2026-06-30)
  17. 4.40 s [gammaloop-workspace-check] +++ command cargo check --profile ci-optim --locked --workspace --features gammaloop-tracing-filter/clap,gammaloop-tracing-filter/symbolica,idenso/bincode,idenso/reference-cases,linnet/bincode,linnet/drawing,linnet/rkyv,linnet/serde,linnet/symbolica,spenso-macros/shadowing,spenso/shadowing,symbolica/tracing_max_level_info,three-dimensional-reps/display,three-dimensional-reps/eval,three-dimensional-reps/serde --all-targets
  18. 4.89 s [gammaloop-workspace-check] Checking cfg-if v1.0.4
  19. 4.89 s [gammaloop-workspace-check] Checking memchr v2.8.0
  20. 4.89 s [gammaloop-workspace-check] Checking once_cell v1.21.4
  21. 4.91 s [gammaloop-workspace-check] Checking either v1.15.0
  22. 4.91 s [gammaloop-workspace-check] Checking serde_core v1.0.228
  23. 4.91 s [gammaloop-workspace-check] Checking libc v0.2.186
  24. 4.91 s [gammaloop-workspace-check] Checking libm v0.2.16
  25. 4.92 s [gammaloop-workspace-check] Checking itoa v1.0.18
  26. 4.93 s [gammaloop-workspace-check] Checking log v0.4.29
  27. 4.93 s [gammaloop-workspace-check] Checking regex-syntax v0.8.10
  28. 4.94 s [gammaloop-workspace-check] Checking zerocopy v0.8.48
  29. 4.94 s [gammaloop-workspace-check] Checking crossbeam-utils v0.8.21
  30. 4.94 s [gammaloop-workspace-check] Checking equivalent v1.0.2
  31. 4.95 s [gammaloop-workspace-check] Checking zmij v1.0.21
  32. 4.95 s [gammaloop-workspace-check] Checking bytemuck v1.25.0
  33. 4.95 s [gammaloop-workspace-check] Checking lazy_static v1.5.0
  34. 4.95 s [gammaloop-workspace-check] Compiling target-lexicon v0.13.5
  35. 5.00 s [gammaloop-workspace-check] Checking arrayvec v0.7.6
  36. 5.00 s [gammaloop-workspace-check] Checking powerfmt v0.2.0
  37. 5.02 s [gammaloop-workspace-check] Checking time-core v0.1.8
  38. 5.03 s [gammaloop-workspace-check] Checking num_threads v0.1.7
  39. 5.09 s [gammaloop-workspace-check] Checking num-conv v0.2.1
  40. 5.10 s [gammaloop-workspace-check] Checking pin-project-lite v0.2.17
  41. 5.12 s [gammaloop-workspace-check] Checking deranged v0.5.8
  42. 5.13 s [gammaloop-workspace-check] Checking tracing-core v0.1.36
  43. 5.15 s [gammaloop-workspace-check] Checking itertools v0.14.0
  44. 5.15 s [gammaloop-workspace-check] Checking allocator-api2 v0.2.21
  45. 5.19 s [gammaloop-workspace-check] Checking foldhash v0.2.0
  46. 5.21 s [gammaloop-workspace-check] Checking const-random v0.1.18
  47. 5.23 s [gammaloop-workspace-check] Checking safe_arch v0.7.4
  48. 5.23 s [gammaloop-workspace-check] Checking static_assertions v1.1.0
  49. 5.28 s [gammaloop-workspace-check] Checking unty v0.0.4
  50. 5.29 s [gammaloop-workspace-check] Checking winnow v1.0.2
  51. 5.29 s [gammaloop-workspace-check] Checking aho-corasick v1.1.4
  52. 5.30 s [gammaloop-workspace-check] Checking crossbeam-epoch v0.9.18
  53. 5.31 s [gammaloop-workspace-check] Checking nu-ansi-term v0.50.3
  54. 5.33 s [gammaloop-workspace-check] Checking safe_arch v1.0.0
  55. 5.43 s [gammaloop-workspace-check] Checking tracing v0.1.44
  56. 5.44 s [gammaloop-workspace-check] Checking hashbrown v0.16.1
  57. 5.49 s [gammaloop-workspace-check] Checking wide v0.7.33
  58. 5.50 s [gammaloop-workspace-check] Checking crossbeam-deque v0.8.6
  59. 5.54 s [gammaloop-workspace-check] Checking tracing-log v0.2.0
  60. 5.62 s [gammaloop-workspace-check] Checking sharded-slab v0.1.7
  61. 5.66 s [gammaloop-workspace-check] Checking thread_local v1.1.9
  62. 5.68 s [gammaloop-workspace-check] Checking rayon-core v1.13.0
  63. 5.71 s [gammaloop-workspace-check] Checking az v1.3.0
  64. 5.79 s [gammaloop-workspace-check] Checking indenter v0.3.4
  65. 5.87 s [gammaloop-workspace-check] Checking toml_writer v1.1.1+spec-1.1.0
  66. 5.95 s [gammaloop-workspace-check] Checking wide v1.3.0
  67. 5.97 s [gammaloop-workspace-check] Compiling phf_shared v0.11.3
  68. 5.99 s [gammaloop-workspace-check] Checking num-traits v0.2.19
  69. 6.03 s [gammaloop-workspace-check] Checking anyhow v1.0.102
  70. 6.05 s [gammaloop-workspace-check] Checking rayon v1.12.0
  71. 6.06 s [gammaloop-workspace-check] Checking rawpointer v0.2.1
  72. 6.15 s [gammaloop-workspace-check] Checking utf8parse v0.2.2
  73. 6.18 s [gammaloop-workspace-check] Checking dyn-clone v1.0.20
  74. 6.22 s [gammaloop-workspace-check] Checking alloc-no-stdlib v2.0.4
  75. 6.24 s [gammaloop-workspace-check] Checking anstyle-parse v1.0.0
  76. 6.26 s [gammaloop-workspace-check] Checking matrixmultiply v0.3.10
  77. 6.29 s [gammaloop-workspace-check] Checking is_terminal_polyfill v1.70.2
  78. 6.30 s [gammaloop-workspace-check] Checking alloc-stdlib v0.2.2
  79. 6.31 s [gammaloop-workspace-check] Checking colorchoice v1.0.5
  80. 6.33 s [gammaloop-workspace-check] Checking getrandom v0.3.4
  81. 6.34 s [gammaloop-workspace-check] Checking regex-automata v0.4.14
  82. 6.35 s [gammaloop-workspace-check] Checking time v0.3.47
  83. 6.36 s [gammaloop-workspace-check] Checking gmp-mpfr-sys v1.7.1
  84. 6.39 s [gammaloop-workspace-check] Checking anstyle v1.0.14
  85. 6.40 s [gammaloop-workspace-check] Checking colored v3.1.1
  86. 6.48 s [gammaloop-workspace-check] Checking rand_core v0.9.5
  87. 6.51 s [gammaloop-workspace-check] Checking anstyle-query v1.1.5
  88. 6.51 s [gammaloop-workspace-check] Compiling phf_generator v0.11.3
  89. 6.52 s [gammaloop-workspace-check] Checking serde v1.0.228
  90. 6.57 s [gammaloop-workspace-check] Checking serde_json v1.0.149
  91. 6.60 s [gammaloop-workspace-check] Checking bitflags v2.11.1
  92. 6.62 s [gammaloop-workspace-check] Checking serde_spanned v1.1.1
  93. 6.62 s [gammaloop-workspace-check] Checking toml_datetime v1.1.1+spec-1.1.0
  94. 6.62 s [gammaloop-workspace-check] Checking anstream v1.0.0
  95. 6.64 s [gammaloop-workspace-check] Checking toml_parser v1.1.2+spec-1.1.0
  96. 6.67 s [gammaloop-workspace-check] Checking approx v0.5.1
  97. 6.74 s [gammaloop-workspace-check] Checking num-integer v0.1.46
  98. 6.75 s [gammaloop-workspace-check] Checking eyre v0.6.12
  99. 6.77 s [gammaloop-workspace-check] Checking bitflags v1.3.2
  100. 6.80 s [gammaloop-workspace-check] Checking unicode-width v0.2.2
  101. 6.83 s [gammaloop-workspace-check] Compiling phf_codegen v0.11.3
  102. 6.84 s [gammaloop-workspace-check] Checking region v3.0.2
  103. 6.85 s [gammaloop-workspace-check] Checking brotli-decompressor v5.0.0
  104. 6.86 s [gammaloop-workspace-check] Compiling pyo3-build-config v0.28.3
  105. 6.96 s [gammaloop-workspace-check] Checking wasmtime-jit-icache-coherence v34.0.2
  106. 6.97 s [gammaloop-workspace-check] Checking hugepage-rs v0.1.1
  107. 6.97 s [gammaloop-workspace-check] Checking spec_math v0.1.6
  108. 6.98 s [gammaloop-workspace-check] Checking inventory v0.3.24
  109. 7.01 s [gammaloop-workspace-check] Checking thiserror v2.0.18
  110. 7.02 s [gammaloop-workspace-check] Compiling getopts v0.2.24
  111. 7.03 s [gammaloop-workspace-check] Checking toml v1.1.2+spec-1.1.0
  112. 7.03 s [gammaloop-workspace-check] Checking libloading v0.9.0
  113. 7.05 s [gammaloop-workspace-check] Checking smallvec v1.15.1
  114. 7.05 s [gammaloop-workspace-check] Checking num-complex v0.4.6
  115. 7.07 s [gammaloop-workspace-check] Checking bincode v2.0.1
  116. 7.07 s [gammaloop-workspace-check] Checking tracing-serde v0.2.0
  117. 7.19 s [gammaloop-workspace-check] Checking smartstring v1.0.1
  118. 7.24 s [gammaloop-workspace-check] Checking bytes v1.11.1
  119. 7.28 s [gammaloop-workspace-check] Checking append-only-vec v0.1.8
  120. 7.38 s [gammaloop-workspace-check] Checking byteorder v1.5.0
  121. 7.41 s [gammaloop-workspace-check] Checking self_cell v1.2.2
  122. 7.44 s [gammaloop-workspace-check] Checking tinyjson v2.5.1
  123. 7.51 s [gammaloop-workspace-check] Compiling unicode_names2_generator v1.3.0
  124. 7.54 s [gammaloop-workspace-check] Compiling unic-common v0.9.0
  125. 7.59 s [gammaloop-workspace-check] Checking linux-raw-sys v0.12.1
  126. 7.59 s [gammaloop-workspace-check] Checking simba v0.9.1
  127. 7.67 s [gammaloop-workspace-check] Compiling unic-char-range v0.9.0
  128. 7.73 s [gammaloop-workspace-check] Compiling unic-ucd-version v0.9.0
  129. 7.76 s [gammaloop-workspace-check] Compiling is-macro v0.3.7
  130. 7.82 s [gammaloop-workspace-check] Compiling unic-char-property v0.9.0
  131. 7.88 s [gammaloop-workspace-check] Compiling rustpython-parser-vendored v0.4.0
  132. 7.93 s [gammaloop-workspace-check] Checking brotli v8.0.2
  133. 7.95 s [gammaloop-workspace-check] Checking iana-time-zone v0.1.65
  134. 7.99 s [gammaloop-workspace-check] Compiling rustpython-parser v0.4.0
  135. 8.00 s [gammaloop-workspace-check] Compiling phf v0.11.3
  136. 8.00 s [gammaloop-workspace-check] Checking rustc-hash v2.1.2
  137. 8.03 s [gammaloop-workspace-check] Checking rustix v1.1.4
  138. 8.07 s [gammaloop-workspace-check] Checking chrono v0.4.44
  139. 8.07 s [gammaloop-workspace-check] Compiling unic-ucd-ident v0.9.0
  140. 8.11 s [gammaloop-workspace-check] Compiling unic-emoji-char v0.9.0
  141. 8.19 s [gammaloop-workspace-check] Checking ndarray v0.17.2
  142. 8.21 s [gammaloop-workspace-check] Compiling rustc-hash v1.1.0
  143. 8.28 s [gammaloop-workspace-check] Compiling lalrpop-util v0.20.2
  144. 8.29 s [gammaloop-workspace-check] Checking rug v1.30.0
  145. 8.31 s [gammaloop-workspace-check] Checking unicode-segmentation v1.13.2
  146. 8.48 s [gammaloop-workspace-check] Compiling symbolica v2.2.0 (https://github.com/alphal00p/symbolica?rev=a277a8dadbaae5a8d6605f2f381991a601e1f345#a277a8da)
  147. 8.52 s [gammaloop-workspace-check] Checking typenum v1.20.0
  148. 8.67 s [gammaloop-workspace-check] Checking getrandom v0.2.17
  149. 8.74 s [gammaloop-workspace-check] Checking scopeguard v1.2.0
  150. 8.82 s [gammaloop-workspace-check] Checking lock_api v0.4.14
  151. 8.86 s [gammaloop-workspace-check] Checking parking_lot_core v0.9.12
  152. 9.05 s [gammaloop-workspace-check] Checking unicode-ident v1.0.24
  153. 9.14 s [gammaloop-workspace-check] Checking hashbrown v0.17.0
  154. 9.15 s [gammaloop-workspace-check] Checking parking_lot v0.12.5
  155. 9.24 s [gammaloop-workspace-check] Checking matchers v0.2.0
  156. 9.26 s [gammaloop-workspace-check] Checking regex v1.12.3
  157. 9.32 s [gammaloop-workspace-check] Checking tracing-subscriber v0.3.23
  158. 9.32 s [gammaloop-workspace-check] Checking generic-array v0.14.7
  159. 9.40 s [gammaloop-workspace-check] Checking errno v0.3.14
  160. 9.51 s [gammaloop-workspace-check] Checking unicase v2.9.0
  161. 9.54 s [gammaloop-workspace-check] Checking strsim v0.11.1
  162. 9.55 s [gammaloop-workspace-check] Checking clap_lex v1.1.0
  163. 9.59 s [gammaloop-workspace-check] Checking ppv-lite86 v0.2.21
  164. 9.65 s [gammaloop-workspace-check] Checking ahash v0.8.12
  165. 9.68 s [gammaloop-workspace-check] Checking signal-hook-registry v1.4.8
  166. 9.69 s [gammaloop-workspace-check] Checking indexmap v2.14.0
  167. 9.70 s [gammaloop-workspace-check] Checking vte v0.14.1
  168. 9.74 s [gammaloop-workspace-check] Checking same-file v1.0.6
  169. 9.82 s [gammaloop-workspace-check] Checking signal-hook v0.3.18
  170. 9.83 s [gammaloop-workspace-check] Checking half v2.7.1
  171. 9.86 s [gammaloop-workspace-check] Checking terminal_size v0.4.4
  172. 9.87 s [gammaloop-workspace-check] Checking walkdir v2.5.0
  173. 9.96 s [gammaloop-workspace-check] Checking block-buffer v0.10.4
  174. 9.98 s [gammaloop-workspace-check] Checking clap_builder v4.6.0
  175. 10.00 s [gammaloop-workspace-check] Checking crypto-common v0.1.7
  176. 10.02 s [gammaloop-workspace-check] Checking rand_chacha v0.9.0
  177. 10.03 s [gammaloop-workspace-check] Checking mio v1.2.0
  178. 10.07 s [gammaloop-workspace-check] Checking minimal-lexical v0.2.1
  179. 10.09 s [gammaloop-workspace-check] Checking ciborium-io v0.2.2
  180. 10.09 s [gammaloop-workspace-check] Checking digest v0.10.7
  181. 10.13 s [gammaloop-workspace-check] Checking ciborium-ll v0.2.2
  182. 10.16 s [gammaloop-workspace-check] Checking rand v0.9.4
  183. 10.22 s [gammaloop-workspace-check] Checking derive_more v2.1.1
  184. 10.27 s [gammaloop-workspace-check] Checking num-bigint v0.4.6
  185. 10.29 s [gammaloop-workspace-check] Checking console v0.16.3
  186. 10.30 s [gammaloop-workspace-check] Checking bstr v1.12.1
  187. 10.31 s [gammaloop-workspace-check] Checking signal-hook-mio v0.2.5
  188. 10.38 s [gammaloop-workspace-check] Checking nom v7.1.3
  189. 10.40 s [gammaloop-workspace-check] Checking linux-raw-sys v0.4.15
  190. 10.47 s [gammaloop-workspace-check] Checking cpufeatures v0.2.17
  191. 10.52 s [gammaloop-workspace-check] Checking winnow v0.7.15
  192. 10.53 s [gammaloop-workspace-check] Checking symjit v2.21.0
  193. 10.59 s [gammaloop-workspace-check] Checking rustix v0.38.44
  194. 10.60 s [gammaloop-workspace-check] Checking globset v0.4.18
  195. 10.76 s [gammaloop-workspace-check] Checking sha2 v0.10.9
  196. 10.89 s [gammaloop-workspace-check] Checking ciborium v0.2.2
  197. 10.97 s [gammaloop-workspace-check] Checking rand_core v0.6.4
  198. 11.01 s [gammaloop-workspace-check] Checking getrandom v0.4.2
  199. 11.07 s [gammaloop-workspace-check] Checking fnv v1.0.7
  200. 11.13 s [gammaloop-workspace-check] Checking plotters-backend v0.3.7
  201. 11.13 s [gammaloop-workspace-check] Checking fastrand v2.4.1
  202. 11.15 s [gammaloop-workspace-check] Checking crossterm v0.28.1
  203. 11.23 s [gammaloop-workspace-check] Checking tempfile v3.27.0
  204. 11.26 s [gammaloop-workspace-check] Checking plotters-svg v0.3.7
  205. 11.31 s [gammaloop-workspace-check] Checking rust-embed-utils v8.11.0
  206. 11.38 s [gammaloop-workspace-check] Checking serde_spanned v0.6.9
  207. 11.47 s [gammaloop-workspace-check] Checking toml_datetime v0.6.11
  208. 11.48 s [gammaloop-workspace-check] Checking itertools v0.10.5
  209. 11.49 s [gammaloop-workspace-check] Checking tap v1.0.1
  210. 11.50 s [gammaloop-workspace-check] Checking toml_write v0.1.2
  211. 11.52 s [gammaloop-workspace-check] Checking cast v0.3.0
  212. 11.58 s [gammaloop-workspace-check] Checking wyz v0.5.1
  213. 11.61 s [gammaloop-workspace-check] Checking ansitok v0.3.0
  214. 11.64 s [gammaloop-workspace-check] Checking plotters v0.3.7
  215. 11.65 s [gammaloop-workspace-check] Checking rand_chacha v0.3.1
  216. 11.66 s [gammaloop-workspace-check] Checking clap v4.6.1
  217. 11.68 s [gammaloop-workspace-check] Checking radium v0.7.0
  218. 11.69 s [gammaloop-workspace-check] Checking toml_edit v0.22.27
  219. 11.71 s [gammaloop-workspace-check] Compiling unicode_names2 v1.3.0
  220. 11.73 s [gammaloop-workspace-check] Checking typeid v1.0.3
  221. 11.75 s [gammaloop-workspace-check] Checking similar v2.7.0
  222. 11.82 s [gammaloop-workspace-check] Checking tinytemplate v1.2.1
  223. 11.82 s [gammaloop-workspace-check] Checking is-terminal v0.4.17
  224. 11.84 s [gammaloop-workspace-check] Checking anes v0.1.6
  225. 11.91 s [gammaloop-workspace-check] Checking bytecount v0.6.9
  226. 11.95 s [gammaloop-workspace-check] Checking ansi-str v0.9.0
  227. 11.98 s [gammaloop-workspace-check] Checking oorandom v11.1.5
  228. 12.01 s [gammaloop-workspace-check] Checking funty v2.0.0
  229. 12.07 s [gammaloop-workspace-check] Checking xprec v0.2.2
  230. 12.08 s [gammaloop-workspace-check] Checking testing_table v0.3.0
  231. 12.09 s [gammaloop-workspace-check] Checking rand v0.8.6
  232. 12.14 s [gammaloop-workspace-check] Checking ron v0.12.1
  233. 12.15 s [gammaloop-workspace-check] Checking papergrid v0.17.0
  234. 12.16 s [gammaloop-workspace-check] Checking toml_edit v0.25.11+spec-1.1.0
  235. 12.22 s [gammaloop-workspace-check] Checking uncased v0.9.10
  236. 12.23 s [gammaloop-workspace-check] Checking env_filter v1.0.1
  237. 12.36 s [gammaloop-workspace-check] Checking jiff v0.2.24
  238. 12.39 s [gammaloop-workspace-check] Checking bitvec v1.0.1
  239. 12.45 s [gammaloop-workspace-check] Checking ptr_meta v0.1.4
  240. 12.46 s [gammaloop-workspace-check] Checking criterion-plot v0.5.0
  241. 12.52 s [gammaloop-workspace-check] Checking simdutf8 v0.1.5
  242. 12.53 s [gammaloop-workspace-check] Checking ucd-trie v0.1.7
  243. 12.68 s [gammaloop-workspace-check] Checking pest v2.8.6
  244. 12.70 s [gammaloop-workspace-check] Checking criterion v0.5.1
  245. 12.75 s [gammaloop-workspace-check] Checking bytecheck v0.6.12
  246. 12.75 s [gammaloop-workspace-check] Checking ahash v0.7.8
  247. 12.88 s [gammaloop-workspace-check] Checking approx v0.4.0
  248. 12.92 s [gammaloop-workspace-check] Checking hashbrown v0.12.3
  249. 12.93 s [gammaloop-workspace-check] Checking tabled v0.20.0
  250. 12.97 s [gammaloop-workspace-check] Checking seahash v4.1.0
  251. 12.99 s [gammaloop-workspace-check] Checking cgmath v0.18.0
  252. 13.04 s [gammaloop-workspace-check] Checking num-rational v0.4.2
  253. 13.15 s [gammaloop-workspace-check] Checking insta v1.47.2
  254. 13.17 s [gammaloop-workspace-check] Checking toml v0.8.23
  255. 13.27 s [gammaloop-workspace-check] Checking num-iter v0.1.45
  256. 13.33 s [gammaloop-workspace-check] Checking ref-ops v0.2.5
  257. 13.33 s [gammaloop-workspace-check] Checking rend v0.4.2
  258. 13.34 s [gammaloop-workspace-check] Checking num v0.4.3
  259. 13.40 s [gammaloop-workspace-check] Checking rand_xoshiro v0.6.0
  260. 13.41 s [gammaloop-workspace-check] Checking features v0.10.0
  261. 13.47 s [gammaloop-workspace-check] Checking gat-lending-iterator v0.1.8
  262. 13.56 s [gammaloop-workspace-check] Checking figment v0.10.19
  263. 13.61 s [gammaloop-workspace-check] Checking constcat v0.5.1
  264. 13.62 s [gammaloop-workspace-check] Compiling pyo3-ffi v0.28.3
  265. 13.63 s [gammaloop-workspace-check] Compiling pyo3-macros-backend v0.28.3
  266. 13.76 s [gammaloop-workspace-check] Compiling pyo3 v0.28.3
  267. 13.78 s [gammaloop-workspace-check] Compiling numpy v0.28.0
  268. 13.85 s [gammaloop-workspace-check] Checking dot-parser v0.5.1
  269. 14.15 s [gammaloop-workspace-check] Checking colored v2.2.0
  270. 14.16 s [gammaloop-workspace-check] Checking constant_time_eq v0.4.2
  271. 14.16 s [gammaloop-workspace-check] Checking cpufeatures v0.3.0
  272. 14.20 s [gammaloop-workspace-check] Checking arrayref v0.3.9
  273. 14.22 s [gammaloop-workspace-check] Checking base64 v0.22.1
  274. 14.25 s [gammaloop-workspace-check] Checking joinery v2.1.0
  275. 14.26 s [gammaloop-workspace-check] Checking blake3 v1.8.5
  276. 14.27 s [gammaloop-workspace-check] Checking siphasher v1.0.2
  277. 14.33 s [gammaloop-workspace-check] Checking subprocess v0.2.15
  278. 14.35 s [gammaloop-workspace-check] Checking rust_lisp v0.18.0
  279. 14.36 s [gammaloop-workspace-check] Checking titlecase v2.2.1
  280. 14.38 s [gammaloop-workspace-check] Checking phf_shared v0.13.1
  281. 14.40 s [gammaloop-workspace-check] Compiling vakint v0.1.2 (/build/source/crates/vakint)
  282. 14.46 s [gammaloop-workspace-check] Checking version-compare v0.2.1
  283. 14.47 s [gammaloop-workspace-check] Checking xpct v0.5.1
  284. 14.57 s [gammaloop-workspace-check] Checking phf v0.13.1
  285. 14.62 s [gammaloop-workspace-check] Checking ryu v1.0.23
  286. 14.65 s [gammaloop-workspace-check] Checking castaway v0.2.4
  287. 14.67 s [gammaloop-workspace-check] Checking toml_datetime v0.7.5+spec-1.1.0
  288. 14.69 s [gammaloop-workspace-check] Checking strum v0.27.2
  289. 14.71 s [gammaloop-workspace-check] Checking unicode-truncate v2.0.1
  290. 14.72 s [gammaloop-workspace-check] Checking kasuari v0.4.12
  291. 14.72 s [gammaloop-workspace-check] Checking lru v0.16.4
  292. 14.76 s [gammaloop-workspace-check] Checking vte v0.15.0
  293. 14.76 s [gammaloop-workspace-check] Checking portable-atomic v1.13.1
  294. 14.78 s [gammaloop-workspace-check] Checking string-template-plus v0.4.3
  295. 14.78 s [gammaloop-workspace-check] Checking compact_str v0.9.0
  296. 14.82 s [gammaloop-workspace-check] Checking toml v0.9.12+spec-1.1.0
  297. 14.83 s [gammaloop-workspace-check] Checking unit-prefix v0.5.2
  298. 14.87 s [gammaloop-workspace-check] Checking rand_distr v0.4.3
  299. 14.88 s [gammaloop-workspace-check] Checking simba v0.6.0
  300. 14.90 s [gammaloop-workspace-check] Checking vt100 v0.16.2
  301. 14.91 s [gammaloop-workspace-check] Checking line-clipping v0.3.7
  302. 14.93 s [gammaloop-workspace-check] Compiling three-dimensional-reps v0.1.0 (/build/source/crates/three-dimensional-reps)
  303. 14.95 s [gammaloop-workspace-check] Compiling rustpython-parser-core v0.4.0
  304. 14.97 s [gammaloop-workspace-check] Checking adler2 v2.0.1
  305. 14.98 s [gammaloop-workspace-check] Checking gimli v0.32.3
  306. 15.03 s [gammaloop-workspace-check] Checking miniz_oxide v0.8.9
  307. 15.05 s [gammaloop-workspace-check] Checking thiserror v1.0.69
  308. 15.08 s [gammaloop-workspace-check] Checking derive_builder v0.11.2
  309. 15.12 s [gammaloop-workspace-check] Compiling rustpython-ast v0.4.0
  310. 15.14 s [gammaloop-workspace-check] Checking ratatui-core v0.1.0
  311. 15.17 s [gammaloop-workspace-check] Checking object v0.37.3
  312. 15.20 s [gammaloop-workspace-check] Checking crossterm v0.29.0
  313. 15.22 s [gammaloop-workspace-check] Checking owo-colors v4.3.0
  314. 15.23 s [gammaloop-workspace-check] Checking tracing-error v0.2.1
  315. 15.25 s [gammaloop-workspace-check] Checking env_logger v0.11.10
  316. 15.26 s [gammaloop-workspace-check] Checking indicatif v0.18.4
  317. 15.28 s [gammaloop-workspace-check] Checking typed-index-collections v3.5.0
  318. 15.30 s [gammaloop-workspace-check] Checking serde-big-array v0.5.1
  319. 15.39 s [gammaloop-workspace-check] Checking amd v0.2.2
  320. 15.48 s [gammaloop-workspace-check] Checking itertools v0.11.0
  321. 15.52 s [gammaloop-workspace-check] Compiling gammaloop-tracing-filter-macros v0.1.0 (/build/source/crates/gammaloop-tracing-filter-macros)
  322. 15.58 s [gammaloop-workspace-check] Checking option-ext v0.2.0
  323. 15.58 s [gammaloop-workspace-check] Checking rustc-demangle v0.1.27
  324. 15.61 s [gammaloop-workspace-check] Checking ref-cast v1.0.25
  325. 15.62 s [gammaloop-workspace-check] Checking dirs-sys v0.5.0
  326. 15.68 s [gammaloop-workspace-check] Checking nix v0.31.2
  327. 15.71 s [gammaloop-workspace-check] Checking integer-sqrt v0.1.5
  328. 15.79 s [gammaloop-workspace-check] Checking rkyv v0.7.46
  329. 15.80 s [gammaloop-workspace-check] Checking brotli-decompressor v4.0.3
  330. 15.80 s [gammaloop-workspace-check] Checking crossbeam-channel v0.5.15
  331. 15.82 s [gammaloop-workspace-check] Checking itertools v0.12.1
  332. 15.90 s [gammaloop-workspace-check] Checking symlink v0.1.0
  333. 15.95 s [gammaloop-workspace-check] Compiling gammalooprs v0.3.4 (/build/source/crates/gammalooprs)
  334. 15.98 s [gammaloop-workspace-check] Checking color-spantrace v0.3.0
  335. 16.07 s [gammaloop-workspace-check] Checking unsafe-libyaml v0.2.11
  336. 16.12 s [gammaloop-workspace-check] Checking tracing-appender v0.2.5
  337. 16.14 s [gammaloop-workspace-check] Checking ratatui-widgets v0.3.0
  338. 16.23 s [gammaloop-workspace-check] Checking ratatui-crossterm v0.1.0
  339. 16.27 s [gammaloop-workspace-check] Checking include_dir v0.7.4
  340. 16.34 s [gammaloop-workspace-check] Checking tracing-indicatif v0.3.14
  341. 16.35 s [gammaloop-workspace-check] Checking ctrlc v3.5.2
  342. 16.37 s [gammaloop-workspace-check] Checking clarabel v0.11.1
  343. 16.37 s [gammaloop-workspace-check] Checking pathfinding v4.15.0
  344. 16.41 s [gammaloop-workspace-check] Checking dirs v6.0.0
  345. 16.49 s [gammaloop-workspace-check] Checking schemars v1.2.1
  346. 16.50 s [gammaloop-workspace-check] Checking slotmap v1.1.1
  347. 16.53 s [gammaloop-workspace-check] Checking json5 v0.4.1
  348. 16.55 s [gammaloop-workspace-check] Checking brotli v7.0.0
  349. 16.78 s [gammaloop-workspace-check] Checking addr2line v0.25.1
  350. 16.84 s [gammaloop-workspace-check] Checking serde_yaml v0.9.34+deprecated
  351. 17.03 s [gammaloop-workspace-check] Checking vectorize v0.2.0
  352. 17.07 s [gammaloop-workspace-check] Checking base62 v2.2.4
  353. 17.08 s [gammaloop-workspace-check] Checking ringbuffer v0.16.0
  354. 17.12 s [gammaloop-workspace-check] Checking ratatui-macros v0.7.0
  355. 17.13 s [gammaloop-workspace-check] Checking rust-embed v8.11.0
  356. 17.16 s [gammaloop-workspace-check] Checking clap_complete v4.6.3
  357. 17.20 s [gammaloop-workspace-check] Checking ratatui v0.30.0
  358. 17.21 s [gammaloop-workspace-check] Checking fd-lock v4.0.4
  359. 17.26 s [gammaloop-workspace-check] Checking strip-ansi-escapes v0.2.1
  360. 17.26 s [gammaloop-workspace-check] Compiling gammaloop-api v0.1.0 (/build/source/crates/gammaloop-api)
  361. 17.28 s [gammaloop-workspace-check] Checking itertools v0.13.0
  362. 17.31 s [gammaloop-workspace-check] Checking strum v0.26.3
  363. 17.32 s [gammaloop-workspace-check] Checking sysinfo v0.33.1
  364. 17.32 s [gammaloop-workspace-check] Checking shlex v1.3.0
  365. 17.43 s [gammaloop-workspace-check] Checking futures-task v0.3.32
  366. 17.45 s [gammaloop-workspace-check] Checking futures-core v0.3.32
  367. 17.47 s [gammaloop-workspace-check] Checking slab v0.4.12
  368. 17.47 s [gammaloop-workspace-check] Checking clap_complete_nushell v4.6.0
  369. 17.55 s [gammaloop-workspace-check] Checking sdd v3.0.10
  370. 17.56 s [gammaloop-workspace-check] Compiling gammaloop-integration-tests v0.1.0 (/build/source/tests)
  371. 17.60 s [gammaloop-workspace-check] Compiling test-log-core v0.2.20
  372. 17.61 s [gammaloop-workspace-check] Checking futures-util v0.3.32
  373. 17.73 s [gammaloop-workspace-check] Compiling rustc_version v0.4.1
  374. 17.74 s [gammaloop-workspace-check] Checking scc v2.4.0
  375. 17.79 s [gammaloop-workspace-check] Checking which v8.0.2
  376. 17.94 s [gammaloop-workspace-check] Checking bincode v1.3.3
  377. 17.99 s [gammaloop-workspace-check] Compiling gungraun-runner v0.18.2
  378. 18.13 s [gammaloop-workspace-check] Checking nalgebra v0.29.0
  379. 18.21 s [gammaloop-workspace-check] Checking reedline v0.42.0
  380. 18.24 s [gammaloop-workspace-check] Checking proc-macro2 v1.0.106
  381. 18.44 s [gammaloop-workspace-check] Checking backtrace v0.3.76
  382. 18.65 s [gammaloop-workspace-check] Checking quote v1.0.45
  383. 18.67 s [gammaloop-workspace-check] Compiling gungraun-macros v0.8.0
  384. 18.75 s [gammaloop-workspace-check] Checking base64 v0.21.7
  385. 18.80 s [gammaloop-workspace-check] Checking maplit v1.0.2
  386. 18.83 s [gammaloop-workspace-check] Checking color-eyre v0.6.5
  387. 18.90 s [gammaloop-workspace-check] Compiling iai-callgrind-runner v0.14.2
  388. 18.96 s [gammaloop-workspace-check] Checking ron v0.8.1
  389. 19.11 s [gammaloop-workspace-check] Compiling numerica v2.2.0 (https://github.com/alphal00p/symbolica?rev=a277a8dadbaae5a8d6605f2f381991a601e1f345#a277a8da)
  390. 19.19 s [gammaloop-workspace-check] Checking futures-executor v0.3.32
  391. 19.22 s [gammaloop-workspace-check] Checking kurbo v0.13.0
  392. 19.25 s [gammaloop-workspace-check] Checking wait-timeout v0.2.1
  393. 19.30 s [gammaloop-workspace-check] Checking serial_test v3.4.0
  394. 19.36 s [gammaloop-workspace-check] Checking quick-error v1.2.3
  395. 19.41 s [gammaloop-workspace-check] Checking bit-vec v0.8.0
  396. 19.43 s [gammaloop-workspace-check] Compiling iai-callgrind v0.14.2
  397. 19.44 s [gammaloop-workspace-check] Checking rusty-fork v0.3.1
  398. 19.61 s [gammaloop-workspace-check] Checking bit-set v0.8.0
  399. 19.65 s [gammaloop-workspace-check] Checking syn v2.0.117
  400. 19.68 s [gammaloop-workspace-check] Compiling test-log-macros v0.2.20
  401. 19.70 s [gammaloop-workspace-check] Compiling iai-callgrind-macros v0.5.1
  402. 19.72 s [gammaloop-workspace-check] Checking rand_xorshift v0.4.0
  403. 19.73 s [gammaloop-workspace-check] Checking console v0.15.11
  404. 19.82 s [gammaloop-workspace-check] Checking pathdiff v0.2.3
  405. 19.88 s [gammaloop-workspace-check] Checking unarray v0.1.4
  406. 19.92 s [gammaloop-workspace-check] Checking proptest v1.11.0
  407. 20.19 s [gammaloop-workspace-check] Checking kurvst v0.1.0 (/build/source/crates/kurvst)
  408. 20.22 s [gammaloop-workspace-check] Checking similar-asserts v1.7.0
  409. 20.36 s [gammaloop-workspace-check] Checking clinnet v0.1.8 (/build/source/crates/clinnet)
  410. 22.15 s [gammaloop-workspace-check] Compiling graphica v2.1.0 (https://github.com/alphal00p/symbolica?rev=a277a8dadbaae5a8d6605f2f381991a601e1f345#a277a8da)
  411. 22.26 s [gammaloop-workspace-check] Checking test-log v0.2.20
  412. 22.94 s [gammaloop-workspace-check] Checking statrs v0.16.1
  413. 23.42 s [gammaloop-workspace-check] Checking momtrop v0.3.0
  414. 26.16 s [gammaloop-workspace-check] Checking gungraun v0.18.2
  415. 26.20 s [gammaloop-workspace-check] Compiling pyo3-stub-gen-derive v0.17.2
  416. 27.01 s [gammaloop-workspace-check] Compiling pyo3-macros v0.28.3
  417. 31.86 s [gammaloop-workspace-check] Checking pyo3-stub-gen v0.17.2
  418. 37.92 s [gammaloop-workspace-check] Checking symbolica-utils v0.1.0 (/build/source/crates/symbolica-utils)
  419. 37.92 s [gammaloop-workspace-check] Checking spenso-macros v0.3.2 (/build/source/crates/spenso-macros)
  420. 259.11 s [gammaloop-workspace-check] Compiling gammaloop-workspace-hack v0.1.0 (/build/source/crates/gammaloop-workspace-hack)
  421. 259.39 s [gammaloop-workspace-check] Checking linnet v0.17.0 (/build/source/crates/linnet)
  422. 262.80 s [gammaloop-workspace-check] Checking spenso v0.6.0 (/build/source/crates/spenso)
  423. 262.80 s [gammaloop-workspace-check] Checking linnet-py v0.1.0 (/build/source/crates/linnet-py)
  424. 262.80 s [gammaloop-workspace-check] Checking linnest v0.1.0 (/build/source/crates/linnest)
  425. 267.98 s [gammaloop-workspace-check] Checking idenso v0.3.0 (/build/source/crates/idenso)
  426. 267.98 s [gammaloop-workspace-check] Checking gammaloop-tracing-filter v0.1.0 (/build/source/crates/gammaloop-tracing-filter)
  427. 270.80 s [gammaloop-workspace-check] Checking spenso-hep-lib v0.1.7 (/build/source/crates/spenso-hep-lib)
  428. 271.03 s [gammaloop-workspace-check] Checking spynso3 v0.1.2 (/build/source/crates/spynso3)
  429. 326.79 s [gammaloop-workspace-check] error[E0560]: struct `CutInfo` has no field named `lmb_channel_id`
  430. 326.79 s [gammaloop-workspace-check] --> tests/tests/test_differential.rs:86:13
  431. 326.79 s [gammaloop-workspace-check] |
  432. 326.79 s [gammaloop-workspace-check] 86 | lmb_channel_id: None,
  433. 326.79 s [gammaloop-workspace-check] | ^^^^^^^^^^^^^^ `CutInfo` does not have this field
  434. 326.79 s [gammaloop-workspace-check] |
  435. 326.79 s [gammaloop-workspace-check] = note: available fields are: `sampling_channel_id`, `sampling_channel_edge_ids`
  436. 326.79 s [gammaloop-workspace-check]
  437. 326.79 s [gammaloop-workspace-check] error[E0560]: struct `CutInfo` has no field named `lmb_channel_edge_ids`
  438. 326.79 s [gammaloop-workspace-check] --> tests/tests/test_differential.rs:87:13
  439. 326.79 s [gammaloop-workspace-check] |
  440. 326.79 s [gammaloop-workspace-check] 87 | lmb_channel_edge_ids: None,
  441. 326.79 s [gammaloop-workspace-check] | ^^^^^^^^^^^^^^^^^^^^ `CutInfo` does not have this field
  442. 326.79 s [gammaloop-workspace-check] |
  443. 326.79 s [gammaloop-workspace-check] = note: available fields are: `sampling_channel_id`, `sampling_channel_edge_ids`
  444. 326.79 s [gammaloop-workspace-check]
  445. 326.81 s [gammaloop-workspace-check] error[E0063]: missing field `reference_moments` in initializer of `GraphEvaluationResult<_>`
  446. 326.81 s [gammaloop-workspace-check] --> tests/tests/test_differential.rs:532:19
  447. 326.81 s [gammaloop-workspace-check] |
  448. 326.81 s [gammaloop-workspace-check] 532 | let mut lhs = GraphEvaluationResult {
  449. 326.81 s [gammaloop-workspace-check] | ^^^^^^^^^^^^^^^^^^^^^ missing `reference_moments`
  450. 326.81 s [gammaloop-workspace-check]
  451. 326.81 s [gammaloop-workspace-check] error[E0063]: missing field `reference_moments` in initializer of `GraphEvaluationResult<_>`
  452. 326.81 s [gammaloop-workspace-check] --> tests/tests/test_differential.rs:539:15
  453. 326.81 s [gammaloop-workspace-check] |
  454. 326.81 s [gammaloop-workspace-check] 539 | let rhs = GraphEvaluationResult {
  455. 326.81 s [gammaloop-workspace-check] | ^^^^^^^^^^^^^^^^^^^^^ missing `reference_moments`
  456. 326.81 s [gammaloop-workspace-check]
  457. 326.92 s [gammaloop-workspace-check] Some errors have detailed explanations: E0063, E0560.
  458. 326.92 s [gammaloop-workspace-check] For more information about an error, try `rustc --explain E0063`.
  459. 326.93 s [gammaloop-workspace-check] error: could not compile `gammaloop-integration-tests` (test "test_differential") due to 4 previous errors
  460. 326.93 s [gammaloop-workspace-check] warning: build failed, waiting for other jobs to finish...
  461. 327.87 s [gammaloop-workspace-check] error[E0609]: no field `lmb_channel_id` on type `CutInfo`
  462. 327.87 s [gammaloop-workspace-check] --> tests/tests/test_runs/utils.rs:568:36
  463. 327.87 s [gammaloop-workspace-check] |
  464. 327.87 s [gammaloop-workspace-check] 568 | event.cut_info.lmb_channel_id,
  465. 327.87 s [gammaloop-workspace-check] | ^^^^^^^^^^^^^^ unknown field
  466. 327.87 s [gammaloop-workspace-check] |
  467. 327.87 s [gammaloop-workspace-check] = note: available fields are: `particle_pdgs`, `cut_id`, `graph_id`, `graph_group_id`, `orientation_id` ... and 2 others
  468. 327.87 s [gammaloop-workspace-check]
  469. 327.87 s [gammaloop-workspace-check] error[E0609]: no field `lmb_channel_id` on type `CutInfo`
  470. 327.87 s [gammaloop-workspace-check] --> tests/tests/test_runs/utils.rs:580:36
  471. 327.87 s [gammaloop-workspace-check] |
  472. 327.87 s [gammaloop-workspace-check] 580 | event.cut_info.lmb_channel_id,
  473. 327.87 s [gammaloop-workspace-check] | ^^^^^^^^^^^^^^ unknown field
  474. 327.87 s [gammaloop-workspace-check] |
  475. 327.87 s [gammaloop-workspace-check] = note: available fields are: `particle_pdgs`, `cut_id`, `graph_id`, `graph_group_id`, `orientation_id` ... and 2 others
  476. 327.87 s [gammaloop-workspace-check]
  477. 328.44 s [gammaloop-workspace-check] For more information about this error, try `rustc --explain E0609`.
  478. 328.46 s [gammaloop-workspace-check] error: could not compile `gammaloop-integration-tests` (test "test_runs") due to 2 previous errors
  479. 329.07 s Progress: 0 of 1 built (1 failed)
  480. 329.07 s Failed to build gammaloop-workspace-check after 5m26s
  481. 329.08 s Cannot build '/nix/store/gmbpv2azznl3dd48abbm33lq79pdf6qb-gammaloop-workspace-check-0.1.0.drv'.
  482. 329.08 s Reason: builder failed with exit code 101.
  483. 329.08 s Output paths:
  484. 329.08 s /nix/store/8rmjky42njpx16i1pybw197fgff2qc5d-gammaloop-workspace-check-0.1.0
  485. 329.08 s Last 475 log lines:
  486. 329.08 s > Running phase: unpackPhase
  487. 329.08 s > unpacking source archive /nix/store/453bxmlhly4wvsiv1az9yc5fqq6c327k-source
  488. 329.08 s > source root is source
  489. 329.08 s > Running phase: patchPhase
  490. 329.08 s > Executing configureCargoCommonVars
  491. 329.08 s > decompressing cargo artifacts from /nix/store/50vpxlcgfxf2d57i27v3d10zjwxxbm2r-gammaloop-workspace-deps-deps-0.1.0/target.tar.zst to target
  492. 329.08 s > Running phase: updateAutotoolsGnuConfigScriptsPhase
  493. 329.08 s > Running phase: configurePhase
  494. 329.08 s > will append /build/source/.cargo-home/config.toml with contents of /nix/store/5drf77x6km4ky7gwlrzdx9bbd6fz09g3-vendor-cargo-deps/config.toml
  495. 329.08 s > default configurePhase, nothing to do
  496. 329.08 s > Running phase: buildPhase
  497. 329.08 s > +++ command cargo --version
  498. 329.08 s > cargo 1.97.0 (c980f4866 2026-06-30)
  499. 329.08 s > +++ command cargo check --profile ci-optim --locked --workspace --features gammaloop-tracing-filter/clap,gammaloop-tracing-filter/symbolica,idenso/bincode,idenso/reference-cases,linnet/bincode,linnet/drawing,linnet/rkyv,linnet/serde,linnet/symbolica,spenso-macros/shadowing,spenso/shadowing,symbolica/tracing_max_level_info,three-dimensional-reps/display,three-dimensional-reps/eval,three-dimensional-reps/serde --all-targets
  500. 329.08 s > Checking cfg-if v1.0.4
  501. 329.08 s > Checking memchr v2.8.0
  502. 329.08 s > Checking once_cell v1.21.4
  503. 329.08 s > Checking either v1.15.0
  504. 329.08 s > Checking serde_core v1.0.228
  505. 329.08 s > Checking libc v0.2.186
  506. 329.08 s > Checking libm v0.2.16
  507. 329.08 s > Checking itoa v1.0.18
  508. 329.08 s > Checking log v0.4.29
  509. 329.08 s > Checking regex-syntax v0.8.10
  510. 329.08 s > Checking zerocopy v0.8.48
  511. 329.08 s > Checking crossbeam-utils v0.8.21
  512. 329.08 s > Checking equivalent v1.0.2
  513. 329.08 s > Checking zmij v1.0.21
  514. 329.08 s > Checking bytemuck v1.25.0
  515. 329.08 s > Checking lazy_static v1.5.0
  516. 329.08 s > Compiling target-lexicon v0.13.5
  517. 329.08 s > Checking arrayvec v0.7.6
  518. 329.08 s > Checking powerfmt v0.2.0
  519. 329.08 s > Checking time-core v0.1.8
  520. 329.08 s > Checking num_threads v0.1.7
  521. 329.08 s > Checking num-conv v0.2.1
  522. 329.08 s > Checking pin-project-lite v0.2.17
  523. 329.08 s > Checking deranged v0.5.8
  524. 329.08 s > Checking tracing-core v0.1.36
  525. 329.08 s > Checking itertools v0.14.0
  526. 329.08 s > Checking allocator-api2 v0.2.21
  527. 329.08 s > Checking foldhash v0.2.0
  528. 329.08 s > Checking const-random v0.1.18
  529. 329.08 s > Checking safe_arch v0.7.4
  530. 329.08 s > Checking static_assertions v1.1.0
  531. 329.08 s > Checking unty v0.0.4
  532. 329.08 s > Checking winnow v1.0.2
  533. 329.08 s > Checking aho-corasick v1.1.4
  534. 329.08 s > Checking crossbeam-epoch v0.9.18
  535. 329.08 s > Checking nu-ansi-term v0.50.3
  536. 329.08 s > Checking safe_arch v1.0.0
  537. 329.08 s > Checking tracing v0.1.44
  538. 329.08 s > Checking hashbrown v0.16.1
  539. 329.08 s > Checking wide v0.7.33
  540. 329.08 s > Checking crossbeam-deque v0.8.6
  541. 329.08 s > Checking tracing-log v0.2.0
  542. 329.08 s > Checking sharded-slab v0.1.7
  543. 329.08 s > Checking thread_local v1.1.9
  544. 329.08 s > Checking rayon-core v1.13.0
  545. 329.08 s > Checking az v1.3.0
  546. 329.08 s > Checking indenter v0.3.4
  547. 329.08 s > Checking toml_writer v1.1.1+spec-1.1.0
  548. 329.08 s > Checking wide v1.3.0
  549. 329.08 s > Compiling phf_shared v0.11.3
  550. 329.08 s > Checking num-traits v0.2.19
  551. 329.08 s > Checking anyhow v1.0.102
  552. 329.08 s > Checking rayon v1.12.0
  553. 329.08 s > Checking rawpointer v0.2.1
  554. 329.08 s > Checking utf8parse v0.2.2
  555. 329.08 s > Checking dyn-clone v1.0.20
  556. 329.08 s > Checking alloc-no-stdlib v2.0.4
  557. 329.08 s > Checking anstyle-parse v1.0.0
  558. 329.08 s > Checking matrixmultiply v0.3.10
  559. 329.08 s > Checking is_terminal_polyfill v1.70.2
  560. 329.08 s > Checking alloc-stdlib v0.2.2
  561. 329.08 s > Checking colorchoice v1.0.5
  562. 329.08 s > Checking getrandom v0.3.4
  563. 329.08 s > Checking regex-automata v0.4.14
  564. 329.08 s > Checking time v0.3.47
  565. 329.08 s > Checking gmp-mpfr-sys v1.7.1
  566. 329.08 s > Checking anstyle v1.0.14
  567. 329.08 s > Checking colored v3.1.1
  568. 329.08 s > Checking rand_core v0.9.5
  569. 329.08 s > Checking anstyle-query v1.1.5
  570. 329.08 s > Compiling phf_generator v0.11.3
  571. 329.08 s > Checking serde v1.0.228
  572. 329.08 s > Checking serde_json v1.0.149
  573. 329.08 s > Checking bitflags v2.11.1
  574. 329.08 s > Checking serde_spanned v1.1.1
  575. 329.08 s > Checking toml_datetime v1.1.1+spec-1.1.0
  576. 329.08 s > Checking anstream v1.0.0
  577. 329.08 s > Checking toml_parser v1.1.2+spec-1.1.0
  578. 329.08 s > Checking approx v0.5.1
  579. 329.08 s > Checking num-integer v0.1.46
  580. 329.08 s > Checking eyre v0.6.12
  581. 329.08 s > Checking bitflags v1.3.2
  582. 329.08 s > Checking unicode-width v0.2.2
  583. 329.08 s > Compiling phf_codegen v0.11.3
  584. 329.08 s > Checking region v3.0.2
  585. 329.08 s > Checking brotli-decompressor v5.0.0
  586. 329.08 s > Compiling pyo3-build-config v0.28.3
  587. 329.08 s > Checking wasmtime-jit-icache-coherence v34.0.2
  588. 329.08 s > Checking hugepage-rs v0.1.1
  589. 329.08 s > Checking spec_math v0.1.6
  590. 329.08 s > Checking inventory v0.3.24
  591. 329.08 s > Checking thiserror v2.0.18
  592. 329.08 s > Compiling getopts v0.2.24
  593. 329.08 s > Checking toml v1.1.2+spec-1.1.0
  594. 329.08 s > Checking libloading v0.9.0
  595. 329.08 s > Checking smallvec v1.15.1
  596. 329.08 s > Checking num-complex v0.4.6
  597. 329.08 s > Checking bincode v2.0.1
  598. 329.08 s > Checking tracing-serde v0.2.0
  599. 329.08 s > Checking smartstring v1.0.1
  600. 329.08 s > Checking bytes v1.11.1
  601. 329.08 s > Checking append-only-vec v0.1.8
  602. 329.08 s > Checking byteorder v1.5.0
  603. 329.08 s > Checking self_cell v1.2.2
  604. 329.08 s > Checking tinyjson v2.5.1
  605. 329.08 s > Compiling unicode_names2_generator v1.3.0
  606. 329.08 s > Compiling unic-common v0.9.0
  607. 329.08 s > Checking linux-raw-sys v0.12.1
  608. 329.08 s > Checking simba v0.9.1
  609. 329.08 s > Compiling unic-char-range v0.9.0
  610. 329.08 s > Compiling unic-ucd-version v0.9.0
  611. 329.08 s > Compiling is-macro v0.3.7
  612. 329.08 s > Compiling unic-char-property v0.9.0
  613. 329.08 s > Compiling rustpython-parser-vendored v0.4.0
  614. 329.08 s > Checking brotli v8.0.2
  615. 329.08 s > Checking iana-time-zone v0.1.65
  616. 329.08 s > Compiling rustpython-parser v0.4.0
  617. 329.08 s > Compiling phf v0.11.3
  618. 329.08 s > Checking rustc-hash v2.1.2
  619. 329.08 s > Checking rustix v1.1.4
  620. 329.08 s > Checking chrono v0.4.44
  621. 329.08 s > Compiling unic-ucd-ident v0.9.0
  622. 329.08 s > Compiling unic-emoji-char v0.9.0
  623. 329.08 s > Checking ndarray v0.17.2
  624. 329.08 s > Compiling rustc-hash v1.1.0
  625. 329.08 s > Compiling lalrpop-util v0.20.2
  626. 329.08 s > Checking rug v1.30.0
  627. 329.08 s > Checking unicode-segmentation v1.13.2
  628. 329.08 s > Compiling symbolica v2.2.0 (https://github.com/alphal00p/symbolica?rev=a277a8dadbaae5a8d6605f2f381991a601e1f345#a277a8da)
  629. 329.08 s > Checking typenum v1.20.0
  630. 329.08 s > Checking getrandom v0.2.17
  631. 329.08 s > Checking scopeguard v1.2.0
  632. 329.08 s > Checking lock_api v0.4.14
  633. 329.08 s > Checking parking_lot_core v0.9.12
  634. 329.08 s > Checking unicode-ident v1.0.24
  635. 329.08 s > Checking hashbrown v0.17.0
  636. 329.08 s > Checking parking_lot v0.12.5
  637. 329.08 s > Checking matchers v0.2.0
  638. 329.08 s > Checking regex v1.12.3
  639. 329.08 s > Checking tracing-subscriber v0.3.23
  640. 329.08 s > Checking generic-array v0.14.7
  641. 329.08 s > Checking errno v0.3.14
  642. 329.08 s > Checking unicase v2.9.0
  643. 329.08 s > Checking strsim v0.11.1
  644. 329.08 s > Checking clap_lex v1.1.0
  645. 329.08 s > Checking ppv-lite86 v0.2.21
  646. 329.08 s > Checking ahash v0.8.12
  647. 329.08 s > Checking signal-hook-registry v1.4.8
  648. 329.08 s > Checking indexmap v2.14.0
  649. 329.08 s > Checking vte v0.14.1
  650. 329.08 s > Checking same-file v1.0.6
  651. 329.08 s > Checking signal-hook v0.3.18
  652. 329.08 s > Checking half v2.7.1
  653. 329.08 s > Checking terminal_size v0.4.4
  654. 329.08 s > Checking walkdir v2.5.0
  655. 329.08 s > Checking block-buffer v0.10.4
  656. 329.08 s > Checking clap_builder v4.6.0
  657. 329.08 s > Checking crypto-common v0.1.7
  658. 329.08 s > Checking rand_chacha v0.9.0
  659. 329.08 s > Checking mio v1.2.0
  660. 329.08 s > Checking minimal-lexical v0.2.1
  661. 329.08 s > Checking ciborium-io v0.2.2
  662. 329.08 s > Checking digest v0.10.7
  663. 329.08 s > Checking ciborium-ll v0.2.2
  664. 329.08 s > Checking rand v0.9.4
  665. 329.08 s > Checking derive_more v2.1.1
  666. 329.08 s > Checking num-bigint v0.4.6
  667. 329.08 s > Checking console v0.16.3
  668. 329.08 s > Checking bstr v1.12.1
  669. 329.08 s > Checking signal-hook-mio v0.2.5
  670. 329.08 s > Checking nom v7.1.3
  671. 329.08 s > Checking linux-raw-sys v0.4.15
  672. 329.08 s > Checking cpufeatures v0.2.17
  673. 329.08 s > Checking winnow v0.7.15
  674. 329.08 s > Checking symjit v2.21.0
  675. 329.08 s > Checking rustix v0.38.44
  676. 329.08 s > Checking globset v0.4.18
  677. 329.08 s > Checking sha2 v0.10.9
  678. 329.08 s > Checking ciborium v0.2.2
  679. 329.08 s > Checking rand_core v0.6.4
  680. 329.08 s > Checking getrandom v0.4.2
  681. 329.08 s > Checking fnv v1.0.7
  682. 329.08 s > Checking plotters-backend v0.3.7
  683. 329.08 s > Checking fastrand v2.4.1
  684. 329.08 s > Checking crossterm v0.28.1
  685. 329.08 s > Checking tempfile v3.27.0
  686. 329.08 s > Checking plotters-svg v0.3.7
  687. 329.08 s > Checking rust-embed-utils v8.11.0
  688. 329.08 s > Checking serde_spanned v0.6.9
  689. 329.08 s > Checking toml_datetime v0.6.11
  690. 329.08 s > Checking itertools v0.10.5
  691. 329.08 s > Checking tap v1.0.1
  692. 329.08 s > Checking toml_write v0.1.2
  693. 329.08 s > Checking cast v0.3.0
  694. 329.08 s > Checking wyz v0.5.1
  695. 329.08 s > Checking ansitok v0.3.0
  696. 329.08 s > Checking plotters v0.3.7
  697. 329.08 s > Checking rand_chacha v0.3.1
  698. 329.08 s > Checking clap v4.6.1
  699. 329.08 s > Checking radium v0.7.0
  700. 329.08 s > Checking toml_edit v0.22.27
  701. 329.08 s > Compiling unicode_names2 v1.3.0
  702. 329.08 s > Checking typeid v1.0.3
  703. 329.08 s > Checking similar v2.7.0
  704. 329.08 s > Checking tinytemplate v1.2.1
  705. 329.08 s > Checking is-terminal v0.4.17
  706. 329.08 s > Checking anes v0.1.6
  707. 329.08 s > Checking bytecount v0.6.9
  708. 329.08 s > Checking ansi-str v0.9.0
  709. 329.08 s > Checking oorandom v11.1.5
  710. 329.08 s > Checking funty v2.0.0
  711. 329.08 s > Checking xprec v0.2.2
  712. 329.08 s > Checking testing_table v0.3.0
  713. 329.08 s > Checking rand v0.8.6
  714. 329.08 s > Checking ron v0.12.1
  715. 329.08 s > Checking papergrid v0.17.0
  716. 329.08 s > Checking toml_edit v0.25.11+spec-1.1.0
  717. 329.08 s > Checking uncased v0.9.10
  718. 329.08 s > Checking env_filter v1.0.1
  719. 329.08 s > Checking jiff v0.2.24
  720. 329.08 s > Checking bitvec v1.0.1
  721. 329.08 s > Checking ptr_meta v0.1.4
  722. 329.08 s > Checking criterion-plot v0.5.0
  723. 329.08 s > Checking simdutf8 v0.1.5
  724. 329.08 s > Checking ucd-trie v0.1.7
  725. 329.08 s > Checking pest v2.8.6
  726. 329.08 s > Checking criterion v0.5.1
  727. 329.08 s > Checking bytecheck v0.6.12
  728. 329.08 s > Checking ahash v0.7.8
  729. 329.08 s > Checking approx v0.4.0
  730. 329.08 s > Checking hashbrown v0.12.3
  731. 329.08 s > Checking tabled v0.20.0
  732. 329.08 s > Checking seahash v4.1.0
  733. 329.08 s > Checking cgmath v0.18.0
  734. 329.08 s > Checking num-rational v0.4.2
  735. 329.08 s > Checking insta v1.47.2
  736. 329.08 s > Checking toml v0.8.23
  737. 329.08 s > Checking num-iter v0.1.45
  738. 329.08 s > Checking ref-ops v0.2.5
  739. 329.08 s > Checking rend v0.4.2
  740. 329.08 s > Checking num v0.4.3
  741. 329.08 s > Checking rand_xoshiro v0.6.0
  742. 329.08 s > Checking features v0.10.0
  743. 329.08 s > Checking gat-lending-iterator v0.1.8
  744. 329.08 s > Checking figment v0.10.19
  745. 329.08 s > Checking constcat v0.5.1
  746. 329.08 s > Compiling pyo3-ffi v0.28.3
  747. 329.08 s > Compiling pyo3-macros-backend v0.28.3
  748. 329.08 s > Compiling pyo3 v0.28.3
  749. 329.08 s > Compiling numpy v0.28.0
  750. 329.08 s > Checking dot-parser v0.5.1
  751. 329.08 s > Checking colored v2.2.0
  752. 329.08 s > Checking constant_time_eq v0.4.2
  753. 329.08 s > Checking cpufeatures v0.3.0
  754. 329.08 s > Checking arrayref v0.3.9
  755. 329.08 s > Checking base64 v0.22.1
  756. 329.08 s > Checking joinery v2.1.0
  757. 329.08 s > Checking blake3 v1.8.5
  758. 329.08 s > Checking siphasher v1.0.2
  759. 329.08 s > Checking subprocess v0.2.15
  760. 329.08 s > Checking rust_lisp v0.18.0
  761. 329.08 s > Checking titlecase v2.2.1
  762. 329.08 s > Checking phf_shared v0.13.1
  763. 329.08 s > Compiling vakint v0.1.2 (/build/source/crates/vakint)
  764. 329.08 s > Checking version-compare v0.2.1
  765. 329.08 s > Checking xpct v0.5.1
  766. 329.08 s > Checking phf v0.13.1
  767. 329.08 s > Checking ryu v1.0.23
  768. 329.08 s > Checking castaway v0.2.4
  769. 329.08 s > Checking toml_datetime v0.7.5+spec-1.1.0
  770. 329.08 s > Checking strum v0.27.2
  771. 329.08 s > Checking unicode-truncate v2.0.1
  772. 329.08 s > Checking kasuari v0.4.12
  773. 329.08 s > Checking lru v0.16.4
  774. 329.08 s > Checking vte v0.15.0
  775. 329.08 s > Checking portable-atomic v1.13.1
  776. 329.08 s > Checking string-template-plus v0.4.3
  777. 329.08 s > Checking compact_str v0.9.0
  778. 329.08 s > Checking toml v0.9.12+spec-1.1.0
  779. 329.08 s > Checking unit-prefix v0.5.2
  780. 329.08 s > Checking rand_distr v0.4.3
  781. 329.08 s > Checking simba v0.6.0
  782. 329.08 s > Checking vt100 v0.16.2
  783. 329.08 s > Checking line-clipping v0.3.7
  784. 329.08 s > Compiling three-dimensional-reps v0.1.0 (/build/source/crates/three-dimensional-reps)
  785. 329.08 s > Compiling rustpython-parser-core v0.4.0
  786. 329.08 s > Checking adler2 v2.0.1
  787. 329.08 s > Checking gimli v0.32.3
  788. 329.08 s > Checking miniz_oxide v0.8.9
  789. 329.08 s > Checking thiserror v1.0.69
  790. 329.08 s > Checking derive_builder v0.11.2
  791. 329.08 s > Compiling rustpython-ast v0.4.0
  792. 329.08 s > Checking ratatui-core v0.1.0
  793. 329.08 s > Checking object v0.37.3
  794. 329.08 s > Checking crossterm v0.29.0
  795. 329.08 s > Checking owo-colors v4.3.0
  796. 329.08 s > Checking tracing-error v0.2.1
  797. 329.08 s > Checking env_logger v0.11.10
  798. 329.08 s > Checking indicatif v0.18.4
  799. 329.08 s > Checking typed-index-collections v3.5.0
  800. 329.08 s > Checking serde-big-array v0.5.1
  801. 329.08 s > Checking amd v0.2.2
  802. 329.08 s > Checking itertools v0.11.0
  803. 329.08 s > Compiling gammaloop-tracing-filter-macros v0.1.0 (/build/source/crates/gammaloop-tracing-filter-macros)
  804. 329.08 s > Checking option-ext v0.2.0
  805. 329.08 s > Checking rustc-demangle v0.1.27
  806. 329.08 s > Checking ref-cast v1.0.25
  807. 329.08 s > Checking dirs-sys v0.5.0
  808. 329.08 s > Checking nix v0.31.2
  809. 329.08 s > Checking integer-sqrt v0.1.5
  810. 329.08 s > Checking rkyv v0.7.46
  811. 329.08 s > Checking brotli-decompressor v4.0.3
  812. 329.08 s > Checking crossbeam-channel v0.5.15
  813. 329.08 s > Checking itertools v0.12.1
  814. 329.08 s > Checking symlink v0.1.0
  815. 329.08 s > Compiling gammalooprs v0.3.4 (/build/source/crates/gammalooprs)
  816. 329.08 s > Checking color-spantrace v0.3.0
  817. 329.08 s > Checking unsafe-libyaml v0.2.11
  818. 329.08 s > Checking tracing-appender v0.2.5
  819. 329.08 s > Checking ratatui-widgets v0.3.0
  820. 329.08 s > Checking ratatui-crossterm v0.1.0
  821. 329.08 s > Checking include_dir v0.7.4
  822. 329.08 s > Checking tracing-indicatif v0.3.14
  823. 329.08 s > Checking ctrlc v3.5.2
  824. 329.08 s > Checking clarabel v0.11.1
  825. 329.08 s > Checking pathfinding v4.15.0
  826. 329.08 s > Checking dirs v6.0.0
  827. 329.08 s > Checking schemars v1.2.1
  828. 329.08 s > Checking slotmap v1.1.1
  829. 329.08 s > Checking json5 v0.4.1
  830. 329.08 s > Checking brotli v7.0.0
  831. 329.08 s > Checking addr2line v0.25.1
  832. 329.08 s > Checking serde_yaml v0.9.34+deprecated
  833. 329.08 s > Checking vectorize v0.2.0
  834. 329.08 s > Checking base62 v2.2.4
  835. 329.08 s > Checking ringbuffer v0.16.0
  836. 329.08 s > Checking ratatui-macros v0.7.0
  837. 329.08 s > Checking rust-embed v8.11.0
  838. 329.08 s > Checking clap_complete v4.6.3
  839. 329.08 s > Checking ratatui v0.30.0
  840. 329.08 s > Checking fd-lock v4.0.4
  841. 329.08 s > Checking strip-ansi-escapes v0.2.1
  842. 329.08 s > Compiling gammaloop-api v0.1.0 (/build/source/crates/gammaloop-api)
  843. 329.08 s > Checking itertools v0.13.0
  844. 329.08 s > Checking strum v0.26.3
  845. 329.08 s > Checking sysinfo v0.33.1
  846. 329.08 s > Checking shlex v1.3.0
  847. 329.08 s > Checking futures-task v0.3.32
  848. 329.08 s > Checking futures-core v0.3.32
  849. 329.08 s > Checking slab v0.4.12
  850. 329.08 s > Checking clap_complete_nushell v4.6.0
  851. 329.08 s > Checking sdd v3.0.10
  852. 329.08 s > Compiling gammaloop-integration-tests v0.1.0 (/build/source/tests)
  853. 329.08 s > Compiling test-log-core v0.2.20
  854. 329.08 s > Checking futures-util v0.3.32
  855. 329.08 s > Compiling rustc_version v0.4.1
  856. 329.08 s > Checking scc v2.4.0
  857. 329.08 s > Checking which v8.0.2
  858. 329.08 s > Checking bincode v1.3.3
  859. 329.08 s > Compiling gungraun-runner v0.18.2
  860. 329.08 s > Checking nalgebra v0.29.0
  861. 329.08 s > Checking reedline v0.42.0
  862. 329.08 s > Checking proc-macro2 v1.0.106
  863. 329.08 s > Checking backtrace v0.3.76
  864. 329.08 s > Checking quote v1.0.45
  865. 329.08 s > Compiling gungraun-macros v0.8.0
  866. 329.08 s > Checking base64 v0.21.7
  867. 329.08 s > Checking maplit v1.0.2
  868. 329.08 s > Checking color-eyre v0.6.5
  869. 329.08 s > Compiling iai-callgrind-runner v0.14.2
  870. 329.08 s > Checking ron v0.8.1
  871. 329.08 s > Compiling numerica v2.2.0 (https://github.com/alphal00p/symbolica?rev=a277a8dadbaae5a8d6605f2f381991a601e1f345#a277a8da)
  872. 329.08 s > Checking futures-executor v0.3.32
  873. 329.08 s > Checking kurbo v0.13.0
  874. 329.08 s > Checking wait-timeout v0.2.1
  875. 329.08 s > Checking serial_test v3.4.0
  876. 329.08 s > Checking quick-error v1.2.3
  877. 329.08 s > Checking bit-vec v0.8.0
  878. 329.08 s > Compiling iai-callgrind v0.14.2
  879. 329.08 s > Checking rusty-fork v0.3.1
  880. 329.08 s > Checking bit-set v0.8.0
  881. 329.08 s > Checking syn v2.0.117
  882. 329.08 s > Compiling test-log-macros v0.2.20
  883. 329.08 s > Compiling iai-callgrind-macros v0.5.1
  884. 329.08 s > Checking rand_xorshift v0.4.0
  885. 329.08 s > Checking console v0.15.11
  886. 329.08 s > Checking pathdiff v0.2.3
  887. 329.08 s > Checking unarray v0.1.4
  888. 329.08 s > Checking proptest v1.11.0
  889. 329.08 s > Checking kurvst v0.1.0 (/build/source/crates/kurvst)
  890. 329.08 s > Checking similar-asserts v1.7.0
  891. 329.08 s > Checking clinnet v0.1.8 (/build/source/crates/clinnet)
  892. 329.08 s > Compiling graphica v2.1.0 (https://github.com/alphal00p/symbolica?rev=a277a8dadbaae5a8d6605f2f381991a601e1f345#a277a8da)
  893. 329.08 s > Checking test-log v0.2.20
  894. 329.08 s > Checking statrs v0.16.1
  895. 329.08 s > Checking momtrop v0.3.0
  896. 329.08 s > Checking gungraun v0.18.2
  897. 329.08 s > Compiling pyo3-stub-gen-derive v0.17.2
  898. 329.08 s > Compiling pyo3-macros v0.28.3
  899. 329.08 s > Checking pyo3-stub-gen v0.17.2
  900. 329.08 s > Checking symbolica-utils v0.1.0 (/build/source/crates/symbolica-utils)
  901. 329.08 s > Checking spenso-macros v0.3.2 (/build/source/crates/spenso-macros)
  902. 329.08 s > Compiling gammaloop-workspace-hack v0.1.0 (/build/source/crates/gammaloop-workspace-hack)
  903. 329.08 s > Checking linnet v0.17.0 (/build/source/crates/linnet)
  904. 329.08 s > Checking spenso v0.6.0 (/build/source/crates/spenso)
  905. 329.08 s > Checking linnet-py v0.1.0 (/build/source/crates/linnet-py)
  906. 329.08 s > Checking linnest v0.1.0 (/build/source/crates/linnest)
  907. 329.08 s > Checking idenso v0.3.0 (/build/source/crates/idenso)
  908. 329.08 s > Checking gammaloop-tracing-filter v0.1.0 (/build/source/crates/gammaloop-tracing-filter)
  909. 329.08 s > Checking spenso-hep-lib v0.1.7 (/build/source/crates/spenso-hep-lib)
  910. 329.08 s > Checking spynso3 v0.1.2 (/build/source/crates/spynso3)
  911. 329.08 s > error[E0560]: struct `CutInfo` has no field named `lmb_channel_id`
  912. 329.08 s > --> tests/tests/test_differential.rs:86:13
  913. 329.08 s > |
  914. 329.08 s > 86 | lmb_channel_id: None,
  915. 329.08 s > | ^^^^^^^^^^^^^^ `CutInfo` does not have this field
  916. 329.08 s > |
  917. 329.08 s > = note: available fields are: `sampling_channel_id`, `sampling_channel_edge_ids`
  918. 329.08 s >
  919. 329.08 s > error[E0560]: struct `CutInfo` has no field named `lmb_channel_edge_ids`
  920. 329.08 s > --> tests/tests/test_differential.rs:87:13
  921. 329.08 s > |
  922. 329.08 s > 87 | lmb_channel_edge_ids: None,
  923. 329.08 s > | ^^^^^^^^^^^^^^^^^^^^ `CutInfo` does not have this field
  924. 329.08 s > |
  925. 329.08 s > = note: available fields are: `sampling_channel_id`, `sampling_channel_edge_ids`
  926. 329.08 s >
  927. 329.08 s > error[E0063]: missing field `reference_moments` in initializer of `GraphEvaluationResult<_>`
  928. 329.08 s > --> tests/tests/test_differential.rs:532:19
  929. 329.08 s > |
  930. 329.08 s > 532 | let mut lhs = GraphEvaluationResult {
  931. 329.08 s > | ^^^^^^^^^^^^^^^^^^^^^ missing `reference_moments`
  932. 329.08 s >
  933. 329.08 s > error[E0063]: missing field `reference_moments` in initializer of `GraphEvaluationResult<_>`
  934. 329.08 s > --> tests/tests/test_differential.rs:539:15
  935. 329.08 s > |
  936. 329.08 s > 539 | let rhs = GraphEvaluationResult {
  937. 329.08 s > | ^^^^^^^^^^^^^^^^^^^^^ missing `reference_moments`
  938. 329.08 s >
  939. 329.08 s > Some errors have detailed explanations: E0063, E0560.
  940. 329.08 s > For more information about an error, try `rustc --explain E0063`.
  941. 329.08 s > error: could not compile `gammaloop-integration-tests` (test "test_differential") due to 4 previous errors
  942. 329.08 s > warning: build failed, waiting for other jobs to finish...
  943. 329.08 s > error[E0609]: no field `lmb_channel_id` on type `CutInfo`
  944. 329.08 s > --> tests/tests/test_runs/utils.rs:568:36
  945. 329.08 s > |
  946. 329.08 s > 568 | event.cut_info.lmb_channel_id,
  947. 329.08 s > | ^^^^^^^^^^^^^^ unknown field
  948. 329.08 s > |
  949. 329.08 s > = note: available fields are: `particle_pdgs`, `cut_id`, `graph_id`, `graph_group_id`, `orientation_id` ... and 2 others
  950. 329.08 s >
  951. 329.08 s > error[E0609]: no field `lmb_channel_id` on type `CutInfo`
  952. 329.08 s > --> tests/tests/test_runs/utils.rs:580:36
  953. 329.08 s > |
  954. 329.08 s > 580 | event.cut_info.lmb_channel_id,
  955. 329.08 s > | ^^^^^^^^^^^^^^ unknown field
  956. 329.08 s > |
  957. 329.08 s > = note: available fields are: `particle_pdgs`, `cut_id`, `graph_id`, `graph_group_id`, `orientation_id` ... and 2 others
  958. 329.08 s >
  959. 329.08 s > For more information about this error, try `rustc --explain E0609`.
  960. 329.08 s > error: could not compile `gammaloop-integration-tests` (test "test_runs") due to 2 previous errors
  961. 329.08 s For full logs, run:
  962. 329.08 s nix log /nix/store/gmbpv2azznl3dd48abbm33lq79pdf6qb-gammaloop-workspace-check-0.1.0.drv
  963. 329.11 s Build failed.