build packages.x86_64-linux.crate-test-binaries-gammaloop-integration-tests

Reproduce this run
Original Run
  1. 0.00 s $ /nix/store/9ypz3flqsrl5xl495mm8h645gadjsxi1-coreutils-9.11/bin/timeout --kill-after=15s 7200s /nix/store/23zk8sgzamrbmj1fday15szf7f2279s8-nix-2.34.7/bin/nix --extra-experimental-features nix-command --extra-experimental-features flakes --log-format internal-json build --no-link --print-out-paths git+https://github.com/alphal00p/gammaloop?ref=advanced_sampling&rev=3f9b1a28473f313d6242a556ada2e8dbcd6f6477&shallow=1#packages.x86_64-linux.crate-test-binaries-gammaloop-integration-tests --print-build-logs
  2. 0.21 s
  3. 0.62 s Building /nix/store/hi7l229gyfak4kgx0s39badq73ns4b5w-gammaloop-crate-test-binaries-gammaloop-integration-tests-b8cda0d438c96d4f-deps-0.1.0.drv
  4. 0.73 s [gammaloop-crate-test-binaries-gammaloop-integration-tests-b8cda0d438c96d4f-deps] Phase: unpackPhase
  5. 0.73 s [gammaloop-crate-test-binaries-gammaloop-integration-tests-b8cda0d438c96d4f-deps] unpacking source archive /nix/store/zip3xcgspngrl6brgh8zi2jq9frx1qav-source
  6. 0.82 s [gammaloop-crate-test-binaries-gammaloop-integration-tests-b8cda0d438c96d4f-deps] source root is source
  7. 0.84 s [gammaloop-crate-test-binaries-gammaloop-integration-tests-b8cda0d438c96d4f-deps] Phase: patchPhase
  8. 0.96 s [gammaloop-crate-test-binaries-gammaloop-integration-tests-b8cda0d438c96d4f-deps] Executing configureCargoCommonVars
  9. 0.97 s [gammaloop-crate-test-binaries-gammaloop-integration-tests-b8cda0d438c96d4f-deps] copying cargo artifacts from /nix/store/2y6pgnp23nhymhvncrkhdh5r8njnndw8-gammaloop-crate-test-binaries-gammaloop-integration-tests-b8cda0d438c96d4f-inputs/target to target
  10. 0.97 s [gammaloop-crate-test-binaries-gammaloop-integration-tests-b8cda0d438c96d4f-deps] will deep copy artifacts (instead of symlinking) as requested
  11. 2.95 s [gammaloop-crate-test-binaries-gammaloop-integration-tests-b8cda0d438c96d4f-deps] Phase: updateAutotoolsGnuConfigScriptsPhase
  12. 3.00 s [gammaloop-crate-test-binaries-gammaloop-integration-tests-b8cda0d438c96d4f-deps] Phase: configurePhase
  13. 3.01 s [gammaloop-crate-test-binaries-gammaloop-integration-tests-b8cda0d438c96d4f-deps] will append /build/source/.cargo-home/config.toml with contents of /nix/store/5drf77x6km4ky7gwlrzdx9bbd6fz09g3-vendor-cargo-deps/config.toml
  14. 3.01 s [gammaloop-crate-test-binaries-gammaloop-integration-tests-b8cda0d438c96d4f-deps] default configurePhase, nothing to do
  15. 3.02 s [gammaloop-crate-test-binaries-gammaloop-integration-tests-b8cda0d438c96d4f-deps] Phase: buildPhase
  16. 3.02 s [gammaloop-crate-test-binaries-gammaloop-integration-tests-b8cda0d438c96d4f-deps] +++ command cargo --version
  17. 3.03 s [gammaloop-crate-test-binaries-gammaloop-integration-tests-b8cda0d438c96d4f-deps] cargo 1.97.0 (c980f4866 2026-06-30)
  18. 3.03 s [gammaloop-crate-test-binaries-gammaloop-integration-tests-b8cda0d438c96d4f-deps] +++ command cargo test --profile ci-optim --no-run --offline -p gammaloop-integration-tests
  19. 3.80 s [gammaloop-crate-test-binaries-gammaloop-integration-tests-b8cda0d438c96d4f-deps] Compiling gammaloop-integration-tests v0.1.0 (/build/source/tests)
  20. 3.93 s [gammaloop-crate-test-binaries-gammaloop-integration-tests-b8cda0d438c96d4f-deps] error[E0560]: struct `CutInfo` has no field named `lmb_channel_id`
  21. 3.93 s [gammaloop-crate-test-binaries-gammaloop-integration-tests-b8cda0d438c96d4f-deps] --> tests/tests/test_differential.rs:86:13
  22. 3.93 s [gammaloop-crate-test-binaries-gammaloop-integration-tests-b8cda0d438c96d4f-deps] |
  23. 3.93 s [gammaloop-crate-test-binaries-gammaloop-integration-tests-b8cda0d438c96d4f-deps] 86 | lmb_channel_id: None,
  24. 3.93 s [gammaloop-crate-test-binaries-gammaloop-integration-tests-b8cda0d438c96d4f-deps] | ^^^^^^^^^^^^^^ `CutInfo` does not have this field
  25. 3.93 s [gammaloop-crate-test-binaries-gammaloop-integration-tests-b8cda0d438c96d4f-deps] |
  26. 3.93 s [gammaloop-crate-test-binaries-gammaloop-integration-tests-b8cda0d438c96d4f-deps] = note: available fields are: `sampling_channel_id`, `sampling_channel_edge_ids`
  27. 3.93 s [gammaloop-crate-test-binaries-gammaloop-integration-tests-b8cda0d438c96d4f-deps]
  28. 3.93 s [gammaloop-crate-test-binaries-gammaloop-integration-tests-b8cda0d438c96d4f-deps] error[E0560]: struct `CutInfo` has no field named `lmb_channel_edge_ids`
  29. 3.93 s [gammaloop-crate-test-binaries-gammaloop-integration-tests-b8cda0d438c96d4f-deps] --> tests/tests/test_differential.rs:87:13
  30. 3.93 s [gammaloop-crate-test-binaries-gammaloop-integration-tests-b8cda0d438c96d4f-deps] |
  31. 3.93 s [gammaloop-crate-test-binaries-gammaloop-integration-tests-b8cda0d438c96d4f-deps] 87 | lmb_channel_edge_ids: None,
  32. 3.93 s [gammaloop-crate-test-binaries-gammaloop-integration-tests-b8cda0d438c96d4f-deps] | ^^^^^^^^^^^^^^^^^^^^ `CutInfo` does not have this field
  33. 3.93 s [gammaloop-crate-test-binaries-gammaloop-integration-tests-b8cda0d438c96d4f-deps] |
  34. 3.93 s [gammaloop-crate-test-binaries-gammaloop-integration-tests-b8cda0d438c96d4f-deps] = note: available fields are: `sampling_channel_id`, `sampling_channel_edge_ids`
  35. 3.93 s [gammaloop-crate-test-binaries-gammaloop-integration-tests-b8cda0d438c96d4f-deps]
  36. 3.96 s [gammaloop-crate-test-binaries-gammaloop-integration-tests-b8cda0d438c96d4f-deps] error[E0063]: missing field `reference_moments` in initializer of `GraphEvaluationResult<_>`
  37. 3.96 s [gammaloop-crate-test-binaries-gammaloop-integration-tests-b8cda0d438c96d4f-deps] --> tests/tests/test_differential.rs:532:19
  38. 3.96 s [gammaloop-crate-test-binaries-gammaloop-integration-tests-b8cda0d438c96d4f-deps] |
  39. 3.96 s [gammaloop-crate-test-binaries-gammaloop-integration-tests-b8cda0d438c96d4f-deps] 532 | let mut lhs = GraphEvaluationResult {
  40. 3.96 s [gammaloop-crate-test-binaries-gammaloop-integration-tests-b8cda0d438c96d4f-deps] | ^^^^^^^^^^^^^^^^^^^^^ missing `reference_moments`
  41. 3.96 s [gammaloop-crate-test-binaries-gammaloop-integration-tests-b8cda0d438c96d4f-deps]
  42. 3.96 s [gammaloop-crate-test-binaries-gammaloop-integration-tests-b8cda0d438c96d4f-deps] error[E0063]: missing field `reference_moments` in initializer of `GraphEvaluationResult<_>`
  43. 3.96 s [gammaloop-crate-test-binaries-gammaloop-integration-tests-b8cda0d438c96d4f-deps] --> tests/tests/test_differential.rs:539:15
  44. 3.96 s [gammaloop-crate-test-binaries-gammaloop-integration-tests-b8cda0d438c96d4f-deps] |
  45. 3.96 s [gammaloop-crate-test-binaries-gammaloop-integration-tests-b8cda0d438c96d4f-deps] 539 | let rhs = GraphEvaluationResult {
  46. 3.96 s [gammaloop-crate-test-binaries-gammaloop-integration-tests-b8cda0d438c96d4f-deps] | ^^^^^^^^^^^^^^^^^^^^^ missing `reference_moments`
  47. 3.96 s [gammaloop-crate-test-binaries-gammaloop-integration-tests-b8cda0d438c96d4f-deps]
  48. 4.08 s [gammaloop-crate-test-binaries-gammaloop-integration-tests-b8cda0d438c96d4f-deps] Some errors have detailed explanations: E0063, E0560.
  49. 4.08 s [gammaloop-crate-test-binaries-gammaloop-integration-tests-b8cda0d438c96d4f-deps] For more information about an error, try `rustc --explain E0063`.
  50. 4.09 s [gammaloop-crate-test-binaries-gammaloop-integration-tests-b8cda0d438c96d4f-deps] error: could not compile `gammaloop-integration-tests` (test "test_differential") due to 4 previous errors
  51. 4.10 s [gammaloop-crate-test-binaries-gammaloop-integration-tests-b8cda0d438c96d4f-deps] warning: build failed, waiting for other jobs to finish...
  52. 5.77 s [gammaloop-crate-test-binaries-gammaloop-integration-tests-b8cda0d438c96d4f-deps] error[E0609]: no field `lmb_channel_id` on type `CutInfo`
  53. 5.77 s [gammaloop-crate-test-binaries-gammaloop-integration-tests-b8cda0d438c96d4f-deps] --> tests/tests/test_runs/utils.rs:568:36
  54. 5.77 s [gammaloop-crate-test-binaries-gammaloop-integration-tests-b8cda0d438c96d4f-deps] |
  55. 5.77 s [gammaloop-crate-test-binaries-gammaloop-integration-tests-b8cda0d438c96d4f-deps] 568 | event.cut_info.lmb_channel_id,
  56. 5.77 s [gammaloop-crate-test-binaries-gammaloop-integration-tests-b8cda0d438c96d4f-deps] | ^^^^^^^^^^^^^^ unknown field
  57. 5.77 s [gammaloop-crate-test-binaries-gammaloop-integration-tests-b8cda0d438c96d4f-deps] |
  58. 5.77 s [gammaloop-crate-test-binaries-gammaloop-integration-tests-b8cda0d438c96d4f-deps] = note: available fields are: `particle_pdgs`, `cut_id`, `graph_id`, `graph_group_id`, `orientation_id` ... and 2 others
  59. 5.77 s [gammaloop-crate-test-binaries-gammaloop-integration-tests-b8cda0d438c96d4f-deps]
  60. 5.77 s [gammaloop-crate-test-binaries-gammaloop-integration-tests-b8cda0d438c96d4f-deps] error[E0609]: no field `lmb_channel_id` on type `CutInfo`
  61. 5.77 s [gammaloop-crate-test-binaries-gammaloop-integration-tests-b8cda0d438c96d4f-deps] --> tests/tests/test_runs/utils.rs:580:36
  62. 5.77 s [gammaloop-crate-test-binaries-gammaloop-integration-tests-b8cda0d438c96d4f-deps] |
  63. 5.77 s [gammaloop-crate-test-binaries-gammaloop-integration-tests-b8cda0d438c96d4f-deps] 580 | event.cut_info.lmb_channel_id,
  64. 5.77 s [gammaloop-crate-test-binaries-gammaloop-integration-tests-b8cda0d438c96d4f-deps] | ^^^^^^^^^^^^^^ unknown field
  65. 5.77 s [gammaloop-crate-test-binaries-gammaloop-integration-tests-b8cda0d438c96d4f-deps] |
  66. 5.77 s [gammaloop-crate-test-binaries-gammaloop-integration-tests-b8cda0d438c96d4f-deps] = note: available fields are: `particle_pdgs`, `cut_id`, `graph_id`, `graph_group_id`, `orientation_id` ... and 2 others
  67. 5.77 s [gammaloop-crate-test-binaries-gammaloop-integration-tests-b8cda0d438c96d4f-deps]
  68. 7.09 s [gammaloop-crate-test-binaries-gammaloop-integration-tests-b8cda0d438c96d4f-deps] For more information about this error, try `rustc --explain E0609`.
  69. 7.13 s [gammaloop-crate-test-binaries-gammaloop-integration-tests-b8cda0d438c96d4f-deps] error: could not compile `gammaloop-integration-tests` (test "test_runs") due to 2 previous errors
  70. 87.30 s Progress: 0 of 2 built (1 failed)
  71. 87.30 s Failed to build gammaloop-crate-test-binaries-gammaloop-integration-tests-b8cda0d438c96d4f-deps after 1m26s
  72. 87.30 s error: Cannot build '/nix/store/hi7l229gyfak4kgx0s39badq73ns4b5w-gammaloop-crate-test-binaries-gammaloop-integration-tests-b8cda0d438c96d4f-deps-0.1.0.drv'.
  73. 87.30 s Reason: builder failed with exit code 101.
  74. 87.30 s Output paths:
  75. 87.30 s /nix/store/sabzak2d8m3v20w5d6shjq3rkjrgi97y-gammaloop-crate-test-binaries-gammaloop-integration-tests-b8cda0d438c96d4f-deps-0.1.0
  76. 87.30 s Last 66 log lines:
  77. 87.30 s > Running phase: unpackPhase
  78. 87.30 s > unpacking source archive /nix/store/zip3xcgspngrl6brgh8zi2jq9frx1qav-source
  79. 87.30 s > source root is source
  80. 87.30 s > Running phase: patchPhase
  81. 87.30 s > Executing configureCargoCommonVars
  82. 87.30 s > copying cargo artifacts from /nix/store/2y6pgnp23nhymhvncrkhdh5r8njnndw8-gammaloop-crate-test-binaries-gammaloop-integration-tests-b8cda0d438c96d4f-inputs/target to target
  83. 87.30 s > will deep copy artifacts (instead of symlinking) as requested
  84. 87.30 s > Running phase: updateAutotoolsGnuConfigScriptsPhase
  85. 87.30 s > Running phase: configurePhase
  86. 87.30 s > will append /build/source/.cargo-home/config.toml with contents of /nix/store/5drf77x6km4ky7gwlrzdx9bbd6fz09g3-vendor-cargo-deps/config.toml
  87. 87.30 s > default configurePhase, nothing to do
  88. 87.30 s > Running phase: buildPhase
  89. 87.30 s > +++ command cargo --version
  90. 87.30 s > cargo 1.97.0 (c980f4866 2026-06-30)
  91. 87.30 s > +++ command cargo test --profile ci-optim --no-run --offline -p gammaloop-integration-tests
  92. 87.30 s > Compiling gammaloop-integration-tests v0.1.0 (/build/source/tests)
  93. 87.30 s > error[E0560]: struct `CutInfo` has no field named `lmb_channel_id`
  94. 87.30 s > --> tests/tests/test_differential.rs:86:13
  95. 87.30 s > |
  96. 87.30 s > 86 | lmb_channel_id: None,
  97. 87.30 s > | ^^^^^^^^^^^^^^ `CutInfo` does not have this field
  98. 87.30 s > |
  99. 87.30 s > = note: available fields are: `sampling_channel_id`, `sampling_channel_edge_ids`
  100. 87.30 s >
  101. 87.30 s > error[E0560]: struct `CutInfo` has no field named `lmb_channel_edge_ids`
  102. 87.30 s > --> tests/tests/test_differential.rs:87:13
  103. 87.30 s > |
  104. 87.30 s > 87 | lmb_channel_edge_ids: None,
  105. 87.30 s > | ^^^^^^^^^^^^^^^^^^^^ `CutInfo` does not have this field
  106. 87.30 s > |
  107. 87.30 s > = note: available fields are: `sampling_channel_id`, `sampling_channel_edge_ids`
  108. 87.30 s >
  109. 87.30 s > error[E0063]: missing field `reference_moments` in initializer of `GraphEvaluationResult<_>`
  110. 87.30 s > --> tests/tests/test_differential.rs:532:19
  111. 87.30 s > |
  112. 87.30 s > 532 | let mut lhs = GraphEvaluationResult {
  113. 87.30 s > | ^^^^^^^^^^^^^^^^^^^^^ missing `reference_moments`
  114. 87.30 s >
  115. 87.30 s > error[E0063]: missing field `reference_moments` in initializer of `GraphEvaluationResult<_>`
  116. 87.30 s > --> tests/tests/test_differential.rs:539:15
  117. 87.30 s > |
  118. 87.30 s > 539 | let rhs = GraphEvaluationResult {
  119. 87.30 s > | ^^^^^^^^^^^^^^^^^^^^^ missing `reference_moments`
  120. 87.30 s >
  121. 87.30 s > Some errors have detailed explanations: E0063, E0560.
  122. 87.30 s > For more information about an error, try `rustc --explain E0063`.
  123. 87.30 s > error: could not compile `gammaloop-integration-tests` (test "test_differential") due to 4 previous errors
  124. 87.30 s > warning: build failed, waiting for other jobs to finish...
  125. 87.30 s > error[E0609]: no field `lmb_channel_id` on type `CutInfo`
  126. 87.30 s > --> tests/tests/test_runs/utils.rs:568:36
  127. 87.30 s > |
  128. 87.30 s > 568 | event.cut_info.lmb_channel_id,
  129. 87.30 s > | ^^^^^^^^^^^^^^ unknown field
  130. 87.30 s > |
  131. 87.30 s > = note: available fields are: `particle_pdgs`, `cut_id`, `graph_id`, `graph_group_id`, `orientation_id` ... and 2 others
  132. 87.30 s >
  133. 87.30 s > error[E0609]: no field `lmb_channel_id` on type `CutInfo`
  134. 87.30 s > --> tests/tests/test_runs/utils.rs:580:36
  135. 87.30 s > |
  136. 87.30 s > 580 | event.cut_info.lmb_channel_id,
  137. 87.30 s > | ^^^^^^^^^^^^^^ unknown field
  138. 87.30 s > |
  139. 87.30 s > = note: available fields are: `particle_pdgs`, `cut_id`, `graph_id`, `graph_group_id`, `orientation_id` ... and 2 others
  140. 87.30 s >
  141. 87.30 s > For more information about this error, try `rustc --explain E0609`.
  142. 87.30 s > error: could not compile `gammaloop-integration-tests` (test "test_runs") due to 2 previous errors
  143. 87.30 s For full logs, run:
  144. 87.30 s nix log /nix/store/hi7l229gyfak4kgx0s39badq73ns4b5w-gammaloop-crate-test-binaries-gammaloop-integration-tests-b8cda0d438c96d4f-deps-0.1.0.drv
  145. 87.30 s error: Cannot build '/nix/store/3i2bcj7z7ywlkydhm1y4qyv137fa6m23-nix-ci-artifact-barrier-crate-test-binaries-gammaloop-integration-tests.drv'.
  146. 87.30 s Reason: 1 dependency failed.
  147. 87.30 s Output paths:
  148. 87.30 s /nix/store/1yzc17a24lcmb35yrklpxvh6q8vv9zmj-nix-ci-artifact-barrier-crate-test-binaries-gammaloop-integration-tests
  149. 87.30 s Build failed due to failed dependency
  150. 87.32 s Build failed.