0.00 s
$ /nix/store/9ypz3flqsrl5xl495mm8h645gadjsxi1-coreutils-9.11/bin/timeout --kill-after=15s 7200s /nix/store/23zk8sgzamrbmj1fday15szf7f2279s8-nix-2.34.7/bin/nix --extra-experimental-features nix-command --extra-experimental-features flakes --log-format internal-json build --no-link --print-out-paths git+https://github.com/alphal00p/gammaloop?ref=advanced_sampling&rev=3f9b1a28473f313d6242a556ada2e8dbcd6f6477&shallow=1#packages.x86_64-linux.crate-test-binaries-gammaloop-integration-tests --print-build-logs
0.21 s
0.62 s
Building /nix/store/hi7l229gyfak4kgx0s39badq73ns4b5w-gammaloop-crate-test-binaries-gammaloop-integration-tests-b8cda0d438c96d4f-deps-0.1.0.drv
0.73 s
[gammaloop-crate-test-binaries-gammaloop-integration-tests-b8cda0d438c96d4f-deps] Phase: unpackPhase
0.73 s
[gammaloop-crate-test-binaries-gammaloop-integration-tests-b8cda0d438c96d4f-deps] unpacking source archive /nix/store/zip3xcgspngrl6brgh8zi2jq9frx1qav-source
0.82 s
[gammaloop-crate-test-binaries-gammaloop-integration-tests-b8cda0d438c96d4f-deps] source root is source
0.84 s
[gammaloop-crate-test-binaries-gammaloop-integration-tests-b8cda0d438c96d4f-deps] Phase: patchPhase
0.96 s
[gammaloop-crate-test-binaries-gammaloop-integration-tests-b8cda0d438c96d4f-deps] Executing configureCargoCommonVars
0.97 s
[gammaloop-crate-test-binaries-gammaloop-integration-tests-b8cda0d438c96d4f-deps] copying cargo artifacts from /nix/store/2y6pgnp23nhymhvncrkhdh5r8njnndw8-gammaloop-crate-test-binaries-gammaloop-integration-tests-b8cda0d438c96d4f-inputs/target to target
0.97 s
[gammaloop-crate-test-binaries-gammaloop-integration-tests-b8cda0d438c96d4f-deps] will deep copy artifacts (instead of symlinking) as requested
2.95 s
[gammaloop-crate-test-binaries-gammaloop-integration-tests-b8cda0d438c96d4f-deps] Phase: updateAutotoolsGnuConfigScriptsPhase
3.00 s
[gammaloop-crate-test-binaries-gammaloop-integration-tests-b8cda0d438c96d4f-deps] Phase: configurePhase
3.01 s
[gammaloop-crate-test-binaries-gammaloop-integration-tests-b8cda0d438c96d4f-deps] will append /build/source/.cargo-home/config.toml with contents of /nix/store/5drf77x6km4ky7gwlrzdx9bbd6fz09g3-vendor-cargo-deps/config.toml
3.01 s
[gammaloop-crate-test-binaries-gammaloop-integration-tests-b8cda0d438c96d4f-deps] default configurePhase, nothing to do
3.02 s
[gammaloop-crate-test-binaries-gammaloop-integration-tests-b8cda0d438c96d4f-deps] Phase: buildPhase
3.02 s
[gammaloop-crate-test-binaries-gammaloop-integration-tests-b8cda0d438c96d4f-deps] +++ command cargo --version
3.03 s
[gammaloop-crate-test-binaries-gammaloop-integration-tests-b8cda0d438c96d4f-deps] cargo 1.97.0 (c980f4866 2026-06-30)
3.03 s
[gammaloop-crate-test-binaries-gammaloop-integration-tests-b8cda0d438c96d4f-deps] +++ command cargo test --profile ci-optim --no-run --offline -p gammaloop-integration-tests
3.80 s
[gammaloop-crate-test-binaries-gammaloop-integration-tests-b8cda0d438c96d4f-deps] Compiling gammaloop-integration-tests v0.1.0 (/build/source/tests)
3.93 s
[gammaloop-crate-test-binaries-gammaloop-integration-tests-b8cda0d438c96d4f-deps] error[E0560] : struct `CutInfo` has no field named `lmb_channel_id`
3.93 s
[gammaloop-crate-test-binaries-gammaloop-integration-tests-b8cda0d438c96d4f-deps] --> tests/tests/test_differential.rs:86:13
3.93 s
[gammaloop-crate-test-binaries-gammaloop-integration-tests-b8cda0d438c96d4f-deps] |
3.93 s
[gammaloop-crate-test-binaries-gammaloop-integration-tests-b8cda0d438c96d4f-deps] 86 | lmb_channel_id: None,
3.93 s
[gammaloop-crate-test-binaries-gammaloop-integration-tests-b8cda0d438c96d4f-deps] | ^^^^^^^^^^^^^^ `CutInfo` does not have this field
3.93 s
[gammaloop-crate-test-binaries-gammaloop-integration-tests-b8cda0d438c96d4f-deps] |
3.93 s
[gammaloop-crate-test-binaries-gammaloop-integration-tests-b8cda0d438c96d4f-deps] = note : available fields are: `sampling_channel_id`, `sampling_channel_edge_ids`
3.93 s
[gammaloop-crate-test-binaries-gammaloop-integration-tests-b8cda0d438c96d4f-deps]
3.93 s
[gammaloop-crate-test-binaries-gammaloop-integration-tests-b8cda0d438c96d4f-deps] error[E0560] : struct `CutInfo` has no field named `lmb_channel_edge_ids`
3.93 s
[gammaloop-crate-test-binaries-gammaloop-integration-tests-b8cda0d438c96d4f-deps] --> tests/tests/test_differential.rs:87:13
3.93 s
[gammaloop-crate-test-binaries-gammaloop-integration-tests-b8cda0d438c96d4f-deps] |
3.93 s
[gammaloop-crate-test-binaries-gammaloop-integration-tests-b8cda0d438c96d4f-deps] 87 | lmb_channel_edge_ids: None,
3.93 s
[gammaloop-crate-test-binaries-gammaloop-integration-tests-b8cda0d438c96d4f-deps] | ^^^^^^^^^^^^^^^^^^^^ `CutInfo` does not have this field
3.93 s
[gammaloop-crate-test-binaries-gammaloop-integration-tests-b8cda0d438c96d4f-deps] |
3.93 s
[gammaloop-crate-test-binaries-gammaloop-integration-tests-b8cda0d438c96d4f-deps] = note : available fields are: `sampling_channel_id`, `sampling_channel_edge_ids`
3.93 s
[gammaloop-crate-test-binaries-gammaloop-integration-tests-b8cda0d438c96d4f-deps]
3.96 s
[gammaloop-crate-test-binaries-gammaloop-integration-tests-b8cda0d438c96d4f-deps] error[E0063] : missing field `reference_moments` in initializer of `GraphEvaluationResult<_>`
3.96 s
[gammaloop-crate-test-binaries-gammaloop-integration-tests-b8cda0d438c96d4f-deps] --> tests/tests/test_differential.rs:532:19
3.96 s
[gammaloop-crate-test-binaries-gammaloop-integration-tests-b8cda0d438c96d4f-deps] |
3.96 s
[gammaloop-crate-test-binaries-gammaloop-integration-tests-b8cda0d438c96d4f-deps] 532 | let mut lhs = GraphEvaluationResult {
3.96 s
[gammaloop-crate-test-binaries-gammaloop-integration-tests-b8cda0d438c96d4f-deps] | ^^^^^^^^^^^^^^^^^^^^^ missing `reference_moments`
3.96 s
[gammaloop-crate-test-binaries-gammaloop-integration-tests-b8cda0d438c96d4f-deps]
3.96 s
[gammaloop-crate-test-binaries-gammaloop-integration-tests-b8cda0d438c96d4f-deps] error[E0063] : missing field `reference_moments` in initializer of `GraphEvaluationResult<_>`
3.96 s
[gammaloop-crate-test-binaries-gammaloop-integration-tests-b8cda0d438c96d4f-deps] --> tests/tests/test_differential.rs:539:15
3.96 s
[gammaloop-crate-test-binaries-gammaloop-integration-tests-b8cda0d438c96d4f-deps] |
3.96 s
[gammaloop-crate-test-binaries-gammaloop-integration-tests-b8cda0d438c96d4f-deps] 539 | let rhs = GraphEvaluationResult {
3.96 s
[gammaloop-crate-test-binaries-gammaloop-integration-tests-b8cda0d438c96d4f-deps] | ^^^^^^^^^^^^^^^^^^^^^ missing `reference_moments`
3.96 s
[gammaloop-crate-test-binaries-gammaloop-integration-tests-b8cda0d438c96d4f-deps]
4.08 s
[gammaloop-crate-test-binaries-gammaloop-integration-tests-b8cda0d438c96d4f-deps] Some errors have detailed explanations: E0063, E0560.
4.08 s
[gammaloop-crate-test-binaries-gammaloop-integration-tests-b8cda0d438c96d4f-deps] For more information about an error, try `rustc --explain E0063`.
4.09 s
[gammaloop-crate-test-binaries-gammaloop-integration-tests-b8cda0d438c96d4f-deps] error : could not compile `gammaloop-integration-tests` (test "test_differential") due to 4 previous errors
4.10 s
[gammaloop-crate-test-binaries-gammaloop-integration-tests-b8cda0d438c96d4f-deps] warning : build failed, waiting for other jobs to finish...
5.77 s
[gammaloop-crate-test-binaries-gammaloop-integration-tests-b8cda0d438c96d4f-deps] error[E0609] : no field `lmb_channel_id` on type `CutInfo`
5.77 s
[gammaloop-crate-test-binaries-gammaloop-integration-tests-b8cda0d438c96d4f-deps] --> tests/tests/test_runs/utils.rs:568:36
5.77 s
[gammaloop-crate-test-binaries-gammaloop-integration-tests-b8cda0d438c96d4f-deps] |
5.77 s
[gammaloop-crate-test-binaries-gammaloop-integration-tests-b8cda0d438c96d4f-deps] 568 | event.cut_info.lmb_channel_id,
5.77 s
[gammaloop-crate-test-binaries-gammaloop-integration-tests-b8cda0d438c96d4f-deps] | ^^^^^^^^^^^^^^ unknown field
5.77 s
[gammaloop-crate-test-binaries-gammaloop-integration-tests-b8cda0d438c96d4f-deps] |
5.77 s
[gammaloop-crate-test-binaries-gammaloop-integration-tests-b8cda0d438c96d4f-deps] = note : available fields are: `particle_pdgs`, `cut_id`, `graph_id`, `graph_group_id`, `orientation_id` ... and 2 others
5.77 s
[gammaloop-crate-test-binaries-gammaloop-integration-tests-b8cda0d438c96d4f-deps]
5.77 s
[gammaloop-crate-test-binaries-gammaloop-integration-tests-b8cda0d438c96d4f-deps] error[E0609] : no field `lmb_channel_id` on type `CutInfo`
5.77 s
[gammaloop-crate-test-binaries-gammaloop-integration-tests-b8cda0d438c96d4f-deps] --> tests/tests/test_runs/utils.rs:580:36
5.77 s
[gammaloop-crate-test-binaries-gammaloop-integration-tests-b8cda0d438c96d4f-deps] |
5.77 s
[gammaloop-crate-test-binaries-gammaloop-integration-tests-b8cda0d438c96d4f-deps] 580 | event.cut_info.lmb_channel_id,
5.77 s
[gammaloop-crate-test-binaries-gammaloop-integration-tests-b8cda0d438c96d4f-deps] | ^^^^^^^^^^^^^^ unknown field
5.77 s
[gammaloop-crate-test-binaries-gammaloop-integration-tests-b8cda0d438c96d4f-deps] |
5.77 s
[gammaloop-crate-test-binaries-gammaloop-integration-tests-b8cda0d438c96d4f-deps] = note : available fields are: `particle_pdgs`, `cut_id`, `graph_id`, `graph_group_id`, `orientation_id` ... and 2 others
5.77 s
[gammaloop-crate-test-binaries-gammaloop-integration-tests-b8cda0d438c96d4f-deps]
7.09 s
[gammaloop-crate-test-binaries-gammaloop-integration-tests-b8cda0d438c96d4f-deps] For more information about this error, try `rustc --explain E0609`.
7.13 s
[gammaloop-crate-test-binaries-gammaloop-integration-tests-b8cda0d438c96d4f-deps] error : could not compile `gammaloop-integration-tests` (test "test_runs") due to 2 previous errors
87.30 s
Progress: 0 of 2 built (1 failed)
87.30 s
Failed to build gammaloop-crate-test-binaries-gammaloop-integration-tests-b8cda0d438c96d4f-deps after 1m26s
87.30 s
error: Cannot build '/nix/store/hi7l229gyfak4kgx0s39badq73ns4b5w-gammaloop-crate-test-binaries-gammaloop-integration-tests-b8cda0d438c96d4f-deps-0.1.0.drv '.
87.30 s
Reason: builder failed with exit code 101 .
87.30 s
Output paths:
87.30 s
/nix/store/sabzak2d8m3v20w5d6shjq3rkjrgi97y-gammaloop-crate-test-binaries-gammaloop-integration-tests-b8cda0d438c96d4f-deps-0.1.0
87.30 s
Last 66 log lines:
87.30 s
> Running phase: unpackPhase
87.30 s
> unpacking source archive /nix/store/zip3xcgspngrl6brgh8zi2jq9frx1qav-source
87.30 s
> source root is source
87.30 s
> Running phase: patchPhase
87.30 s
> Executing configureCargoCommonVars
87.30 s
> copying cargo artifacts from /nix/store/2y6pgnp23nhymhvncrkhdh5r8njnndw8-gammaloop-crate-test-binaries-gammaloop-integration-tests-b8cda0d438c96d4f-inputs/target to target
87.30 s
> will deep copy artifacts (instead of symlinking) as requested
87.30 s
> Running phase: updateAutotoolsGnuConfigScriptsPhase
87.30 s
> Running phase: configurePhase
87.30 s
> will append /build/source/.cargo-home/config.toml with contents of /nix/store/5drf77x6km4ky7gwlrzdx9bbd6fz09g3-vendor-cargo-deps/config.toml
87.30 s
> default configurePhase, nothing to do
87.30 s
> Running phase: buildPhase
87.30 s
> +++ command cargo --version
87.30 s
> cargo 1.97.0 (c980f4866 2026-06-30)
87.30 s
> +++ command cargo test --profile ci-optim --no-run --offline -p gammaloop-integration-tests
87.30 s
> Compiling gammaloop-integration-tests v0.1.0 (/build/source/tests)
87.30 s
> error[E0560] : struct `CutInfo` has no field named `lmb_channel_id`
87.30 s
> --> tests/tests/test_differential.rs:86:13
87.30 s
> |
87.30 s
> 86 | lmb_channel_id: None,
87.30 s
> | ^^^^^^^^^^^^^^ `CutInfo` does not have this field
87.30 s
> |
87.30 s
> = note : available fields are: `sampling_channel_id`, `sampling_channel_edge_ids`
87.30 s
>
87.30 s
> error[E0560] : struct `CutInfo` has no field named `lmb_channel_edge_ids`
87.30 s
> --> tests/tests/test_differential.rs:87:13
87.30 s
> |
87.30 s
> 87 | lmb_channel_edge_ids: None,
87.30 s
> | ^^^^^^^^^^^^^^^^^^^^ `CutInfo` does not have this field
87.30 s
> |
87.30 s
> = note : available fields are: `sampling_channel_id`, `sampling_channel_edge_ids`
87.30 s
>
87.30 s
> error[E0063] : missing field `reference_moments` in initializer of `GraphEvaluationResult<_>`
87.30 s
> --> tests/tests/test_differential.rs:532:19
87.30 s
> |
87.30 s
> 532 | let mut lhs = GraphEvaluationResult {
87.30 s
> | ^^^^^^^^^^^^^^^^^^^^^ missing `reference_moments`
87.30 s
>
87.30 s
> error[E0063] : missing field `reference_moments` in initializer of `GraphEvaluationResult<_>`
87.30 s
> --> tests/tests/test_differential.rs:539:15
87.30 s
> |
87.30 s
> 539 | let rhs = GraphEvaluationResult {
87.30 s
> | ^^^^^^^^^^^^^^^^^^^^^ missing `reference_moments`
87.30 s
>
87.30 s
> Some errors have detailed explanations: E0063, E0560.
87.30 s
> For more information about an error, try `rustc --explain E0063`.
87.30 s
> error : could not compile `gammaloop-integration-tests` (test "test_differential") due to 4 previous errors
87.30 s
> warning : build failed, waiting for other jobs to finish...
87.30 s
> error[E0609] : no field `lmb_channel_id` on type `CutInfo`
87.30 s
> --> tests/tests/test_runs/utils.rs:568:36
87.30 s
> |
87.30 s
> 568 | event.cut_info.lmb_channel_id,
87.30 s
> | ^^^^^^^^^^^^^^ unknown field
87.30 s
> |
87.30 s
> = note : available fields are: `particle_pdgs`, `cut_id`, `graph_id`, `graph_group_id`, `orientation_id` ... and 2 others
87.30 s
>
87.30 s
> error[E0609] : no field `lmb_channel_id` on type `CutInfo`
87.30 s
> --> tests/tests/test_runs/utils.rs:580:36
87.30 s
> |
87.30 s
> 580 | event.cut_info.lmb_channel_id,
87.30 s
> | ^^^^^^^^^^^^^^ unknown field
87.30 s
> |
87.30 s
> = note : available fields are: `particle_pdgs`, `cut_id`, `graph_id`, `graph_group_id`, `orientation_id` ... and 2 others
87.30 s
>
87.30 s
> For more information about this error, try `rustc --explain E0609`.
87.30 s
> error : could not compile `gammaloop-integration-tests` (test "test_runs") due to 2 previous errors
87.30 s
For full logs, run:
87.30 s
nix log /nix/store/hi7l229gyfak4kgx0s39badq73ns4b5w-gammaloop-crate-test-binaries-gammaloop-integration-tests-b8cda0d438c96d4f-deps-0.1.0.drv
87.30 s
error: Cannot build '/nix/store/3i2bcj7z7ywlkydhm1y4qyv137fa6m23-nix-ci-artifact-barrier-crate-test-binaries-gammaloop-integration-tests.drv '.
87.30 s
Reason: 1 dependency failed .
87.30 s
Output paths:
87.30 s
/nix/store/1yzc17a24lcmb35yrklpxvh6q8vv9zmj-nix-ci-artifact-barrier-crate-test-binaries-gammaloop-integration-tests
87.30 s
Build failed due to failed dependency
87.32 s
Build failed.