- 0.00 s
$ /nix/store/9ypz3flqsrl5xl495mm8h645gadjsxi1-coreutils-9.11/bin/timeout --kill-after=15s 7200s /nix/store/23zk8sgzamrbmj1fday15szf7f2279s8-nix-2.34.7/bin/nix --extra-experimental-features nix-command --extra-experimental-features flakes flake clone git+https://github.com/alphal00p/gammaloop --dest /tmp/nix-ci-worker/stable-pwd/repo/
- 0.07 s
Cloning into '/tmp/nix-ci-worker/stable-pwd/repo'...
- 0.77 s
remote: Enumerating objects: 93832, done.
- 0.88 s
remote: Counting objects: 0% (1/9068)
remote: Counting objects: 1% (91/9068)
remote: Counting objects: 2% (182/9068)
remote: Counting objects: 3% (273/9068)
remote: Counting objects: 4% (363/9068)
remote: Counting objects: 5% (454/9068)
remote: Counting objects: 6% (545/9068)
remote: Counting objects: 7% (635/9068)
remote: Counting objects: 8% (726/9068)
remote: Counting objects: 9% (817/9068)
remote: Counting objects: 10% (907/9068)
remote: Counting objects: 11% (998/9068)
remote: Counting objects: 12% (1089/9068)
remote: Counting objects: 13% (1179/9068)
remote: Counting objects: 14% (1270/9068)
remote: Counting objects: 15% (1361/9068)
remote: Counting objects: 16% (1451/9068)
remote: Counting objects: 17% (1542/9068)
remote: Counting objects: 18% (1633/9068)
remote: Counting objects: 19% (1723/9068)
remote: Counting objects: 20% (1814/9068)
remote: Counting objects: 21% (1905/9068)
remote: Counting objects: 22% (1995/9068)
remote: Counting objects: 23% (2086/9068)
remote: Counting objects: 24% (2177/9068)
remote: Counting objects: 25% (2267/9068)
remote: Counting objects: 26% (2358/9068)
remote: Counting objects: 27% (2449/9068)
remote: Counting objects: 28% (2540/9068)
remote: Counting objects: 29% (2630/9068)
remote: Counting objects: 30% (2721/9068)
remote: Counting objects: 31% (2812/9068)
remote: Counting objects: 32% (2902/9068)
remote: Counting objects: 33% (2993/9068)
remote: Counting objects: 34% (3084/9068)
remote: Counting objects: 35% (3174/9068)
remote: Counting objects: 36% (3265/9068)
remote: Counting objects: 37% (3356/9068)
remote: Counting objects: 38% (3446/9068)
remote: Counting objects: 39% (3537/9068)
remote: Counting objects: 40% (3628/9068)
remote: Counting objects: 41% (3718/9068)
remote: Counting objects: 42% (3809/9068)
remote: Counting objects: 43% (3900/9068)
remote: Counting objects: 44% (3990/9068)
remote: Counting objects: 45% (4081/9068)
remote: Counting objects: 46% (4172/9068)
remote: Counting objects: 47% (4262/9068)
remote: Counting objects: 48% (4353/9068)
remote: Counting objects: 49% (4444/9068)
remote: Counting objects: 50% (4534/9068)
remote: Counting objects: 51% (4625/9068)
remote: Counting objects: 52% (4716/9068)
remote: Counting objects: 53% (4807/9068)
remote: Counting objects: 54% (4897/9068)
remote: Counting objects: 55% (4988/9068)
remote: Counting objects: 56% (5079/9068)
remote: Counting objects: 57% (5169/9068)
remote: Counting objects: 58% (5260/9068)
remote: Counting objects: 59% (5351/9068)
remote: Counting objects: 60% (5441/9068)
remote: Counting objects: 61% (5532/9068)
remote: Counting objects: 62% (5623/9068)
remote: Counting objects: 63% (5713/9068)
remote: Counting objects: 64% (5804/9068)
remote: Counting objects: 65% (5895/9068)
remote: Counting objects: 66% (5985/9068)
remote: Counting objects: 67% (6076/9068)
remote: Counting objects: 68% (6167/9068)
remote: Counting objects: 69% (6257/9068)
remote: Counting objects: 70% (6348/9068)
remote: Counting objects: 71% (6439/9068)
remote: Counting objects: 72% (6529/9068)
remote: Counting objects: 73% (6620/9068)
remote: Counting objects: 74% (6711/9068)
remote: Counting objects: 75% (6801/9068)
remote: Counting objects: 76% (6892/9068)
remote: Counting objects: 77% (6983/9068)
remote: Counting objects: 78% (7074/9068)
remote: Counting objects: 79% (7164/9068)
remote: Counting objects: 80% (7255/9068)
remote: Counting objects: 81% (7346/9068)
remote: Counting objects: 82% (7436/9068)
remote: Counting objects: 83% (7527/9068)
remote: Counting objects: 84% (7618/9068)
remote: Counting objects: 85% (7708/9068)
remote: Counting objects: 86% (7799/9068)
remote: Counting objects: 87% (7890/9068)
remote: Counting objects: 88% (7980/9068)
remote: Counting objects: 89% (8071/9068)
remote: Counting objects: 90% (8162/9068)
remote: Counting objects: 91% (8252/9068)
remote: Counting objects: 92% (8343/9068)
remote: Counting objects: 93% (8434/9068)
remote: Counting objects: 94% (8524/9068)
remote: Counting objects: 95% (8615/9068)
remote: Counting objects: 96% (8706/9068)
remote: Counting objects: 97% (8796/9068)
remote: Counting objects: 98% (8887/9068)
remote: Counting objects: 99% (8978/9068)
remote: Counting objects: 100% (9068/9068)
remote: Counting objects: 100% (9068/9068), done.
- 2.94 s
remote: Compressing objects: 0% (1/1854)
remote: Compressing objects: 1% (19/1854)
remote: Compressing objects: 2% (38/1854)
remote: Compressing objects: 3% (56/1854)
remote: Compressing objects: 4% (75/1854)
remote: Compressing objects: 5% (93/1854)
remote: Compressing objects: 6% (112/1854)
remote: Compressing objects: 7% (130/1854)
remote: Compressing objects: 7% (147/1854)
remote: Compressing objects: 8% (149/1854)
remote: Compressing objects: 9% (167/1854)
remote: Compressing objects: 10% (186/1854)
remote: Compressing objects: 11% (204/1854)
remote: Compressing objects: 12% (223/1854)
remote: Compressing objects: 13% (242/1854)
remote: Compressing objects: 14% (260/1854)
remote: Compressing objects: 15% (279/1854)
remote: Compressing objects: 16% (297/1854)
remote: Compressing objects: 17% (316/1854)
remote: Compressing objects: 18% (334/1854)
remote: Compressing objects: 19% (353/1854)
remote: Compressing objects: 20% (371/1854)
remote: Compressing objects: 21% (390/1854)
remote: Compressing objects: 22% (408/1854)
remote: Compressing objects: 23% (427/1854)
remote: Compressing objects: 24% (445/1854)
remote: Compressing objects: 25% (464/1854)
remote: Compressing objects: 26% (483/1854)
remote: Compressing objects: 26% (489/1854)
remote: Compressing objects: 27% (501/1854)
remote: Compressing objects: 28% (520/1854)
remote: Compressing objects: 29% (538/1854)
remote: Compressing objects: 30% (557/1854)
remote: Compressing objects: 31% (575/1854)
remote: Compressing objects: 32% (594/1854)
remote: Compressing objects: 33% (612/1854)
remote: Compressing objects: 34% (631/1854)
remote: Compressing objects: 35% (649/1854)
remote: Compressing objects: 36% (668/1854)
remote: Compressing objects: 37% (686/1854)
remote: Compressing objects: 38% (705/1854)
remote: Compressing objects: 39% (724/1854)
remote: Compressing objects: 40% (742/1854)
remote: Compressing objects: 41% (761/1854)
remote: Compressing objects: 42% (779/1854)
remote: Compressing objects: 43% (798/1854)
remote: Compressing objects: 44% (816/1854)
remote: Compressing objects: 45% (835/1854)
remote: Compressing objects: 46% (853/1854)
remote: Compressing objects: 47% (872/1854)
remote: Compressing objects: 48% (890/1854)
remote: Compressing objects: 49% (909/1854)
remote: Compressing objects: 50% (927/1854)
remote: Compressing objects: 51% (946/1854)
remote: Compressing objects: 52% (965/1854)
remote: Compressing objects: 53% (983/1854)
remote: Compressing objects: 54% (1002/1854)
remote: Compressing objects: 55% (1020/1854)
remote: Compressing objects: 56% (1039/1854)
remote: Compressing objects: 57% (1057/1854)
remote: Compressing objects: 58% (1076/1854)
remote: Compressing objects: 59% (1094/1854)
remote: Compressing objects: 60% (1113/1854)
remote: Compressing objects: 61% (1131/1854)
remote: Compressing objects: 62% (1150/1854)
remote: Compressing objects: 63% (1169/1854)
remote: Compressing objects: 64% (1187/1854)
remote: Compressing objects: 65% (1206/1854)
remote: Compressing objects: 66% (1224/1854)
remote: Compressing objects: 67% (1243/1854)
remote: Compressing objects: 68% (1261/1854)
remote: Compressing objects: 69% (1280/1854)
remote: Compressing objects: 70% (1298/1854)
remote: Compressing objects: 71% (1317/1854)
remote: Compressing objects: 72% (1335/1854)
remote: Compressing objects: 73% (1354/1854)
remote: Compressing objects: 74% (1372/1854)
remote: Compressing objects: 75% (1391/1854)
remote: Compressing objects: 76% (1410/1854)
remote: Compressing objects: 77% (1428/1854)
remote: Compressing objects: 78% (1447/1854)
remote: Compressing objects: 79% (1465/1854)
remote: Compressing objects: 80% (1484/1854)
remote: Compressing objects: 81% (1502/1854)
remote: Compressing objects: 82% (1521/1854)
remote: Compressing objects: 83% (1539/1854)
remote: Compressing objects: 84% (1558/1854)
remote: Compressing objects: 85% (1576/1854)
remote: Compressing objects: 86% (1595/1854)
remote: Compressing objects: 87% (1613/1854)
remote: Compressing objects: 88% (1632/1854)
remote: Compressing objects: 89% (1651/1854)
remote: Compressing objects: 90% (1669/1854)
remote: Compressing objects: 91% (1688/1854)
remote: Compressing objects: 92% (1706/1854)
remote: Compressing objects: 93% (1725/1854)
remote: Compressing objects: 94% (1743/1854)
remote: Compressing objects: 95% (1762/1854)
remote: Compressing objects: 96% (1780/1854)
remote: Compressing objects: 97% (1799/1854)
remote: Compressing objects: 98% (1817/1854)
remote: Compressing objects: 99% (1836/1854)
remote: Compressing objects: 100% (1854/1854)
remote: Compressing objects: 100% (1854/1854), done.
- 11.85 s
Receiving objects: 0% (1/93832)
Receiving objects: 1% (939/93832)
Receiving objects: 2% (1877/93832)
Receiving objects: 3% (2815/93832)
Receiving objects: 4% (3754/93832)
Receiving objects: 5% (4692/93832)
Receiving objects: 6% (5630/93832)
Receiving objects: 7% (6569/93832)
Receiving objects: 8% (7507/93832), 16.61 MiB | 33.21 MiB/s
Receiving objects: 9% (8445/93832), 16.61 MiB | 33.21 MiB/s
Receiving objects: 10% (9384/93832), 16.61 MiB | 33.21 MiB/s
Receiving objects: 11% (10322/93832), 16.61 MiB | 33.21 MiB/s
Receiving objects: 12% (11260/93832), 16.61 MiB | 33.21 MiB/s
Receiving objects: 13% (12199/93832), 16.61 MiB | 33.21 MiB/s
Receiving objects: 14% (13137/93832), 16.61 MiB | 33.21 MiB/s
Receiving objects: 15% (14075/93832), 16.61 MiB | 33.21 MiB/s
Receiving objects: 16% (15014/93832), 16.61 MiB | 33.21 MiB/s
Receiving objects: 17% (15952/93832), 16.61 MiB | 33.21 MiB/s
Receiving objects: 18% (16890/93832), 16.61 MiB | 33.21 MiB/s
Receiving objects: 19% (17829/93832), 16.61 MiB | 33.21 MiB/s
Receiving objects: 20% (18767/93832), 16.61 MiB | 33.21 MiB/s
Receiving objects: 21% (19705/93832), 16.61 MiB | 33.21 MiB/s
Receiving objects: 22% (20644/93832), 16.61 MiB | 33.21 MiB/s
Receiving objects: 23% (21582/93832), 16.61 MiB | 33.21 MiB/s
Receiving objects: 24% (22520/93832), 16.61 MiB | 33.21 MiB/s
Receiving objects: 25% (23458/93832), 16.61 MiB | 33.21 MiB/s
Receiving objects: 26% (24397/93832), 16.61 MiB | 33.21 MiB/s
Receiving objects: 27% (25335/93832), 16.61 MiB | 33.21 MiB/s
Receiving objects: 28% (26273/93832), 16.61 MiB | 33.21 MiB/s
Receiving objects: 29% (27212/93832), 16.61 MiB | 33.21 MiB/s
Receiving objects: 30% (28150/93832), 16.61 MiB | 33.21 MiB/s
Receiving objects: 31% (29088/93832), 16.61 MiB | 33.21 MiB/s
Receiving objects: 32% (30027/93832), 16.61 MiB | 33.21 MiB/s
Receiving objects: 33% (30965/93832), 16.61 MiB | 33.21 MiB/s
Receiving objects: 34% (31903/93832), 16.61 MiB | 33.21 MiB/s
Receiving objects: 35% (32842/93832), 16.61 MiB | 33.21 MiB/s
Receiving objects: 36% (33780/93832), 16.61 MiB | 33.21 MiB/s
Receiving objects: 36% (34079/93832), 34.14 MiB | 34.13 MiB/s
Receiving objects: 37% (34718/93832), 34.14 MiB | 34.13 MiB/s
Receiving objects: 38% (35657/93832), 34.14 MiB | 34.13 MiB/s
Receiving objects: 39% (36595/93832), 34.14 MiB | 34.13 MiB/s
Receiving objects: 40% (37533/93832), 34.14 MiB | 34.13 MiB/s
Receiving objects: 41% (38472/93832), 34.14 MiB | 34.13 MiB/s
Receiving objects: 42% (39410/93832), 34.14 MiB | 34.13 MiB/s
Receiving objects: 43% (40348/93832), 34.14 MiB | 34.13 MiB/s
Receiving objects: 44% (41287/93832), 34.14 MiB | 34.13 MiB/s
Receiving objects: 45% (42225/93832), 34.14 MiB | 34.13 MiB/s
Receiving objects: 46% (43163/93832), 34.14 MiB | 34.13 MiB/s
Receiving objects: 47% (44102/93832), 34.14 MiB | 34.13 MiB/s
Receiving objects: 48% (45040/93832), 52.34 MiB | 34.57 MiB/s
Receiving objects: 49% (45978/93832), 52.34 MiB | 34.57 MiB/s
Receiving objects: 50% (46916/93832), 52.34 MiB | 34.57 MiB/s
Receiving objects: 51% (47855/93832), 52.34 MiB | 34.57 MiB/s
Receiving objects: 52% (48793/93832), 52.34 MiB | 34.57 MiB/s
Receiving objects: 52% (49646/93832), 52.34 MiB | 34.57 MiB/s
Receiving objects: 53% (49731/93832), 52.34 MiB | 34.57 MiB/s
Receiving objects: 54% (50670/93832), 69.93 MiB | 34.72 MiB/s
Receiving objects: 55% (51608/93832), 69.93 MiB | 34.72 MiB/s
Receiving objects: 56% (52546/93832), 69.93 MiB | 34.72 MiB/s
Receiving objects: 57% (53485/93832), 69.93 MiB | 34.72 MiB/s
Receiving objects: 58% (54423/93832), 69.93 MiB | 34.72 MiB/s
Receiving objects: 59% (55361/93832), 69.93 MiB | 34.72 MiB/s
Receiving objects: 60% (56300/93832), 69.93 MiB | 34.72 MiB/s
Receiving objects: 60% (57049/93832), 104.70 MiB | 34.74 MiB/s
Receiving objects: 60% (57174/93832), 139.46 MiB | 34.74 MiB/s
Receiving objects: 61% (57238/93832), 157.45 MiB | 34.88 MiB/s
Receiving objects: 61% (57628/93832), 174.55 MiB | 34.99 MiB/s
Receiving objects: 62% (58176/93832), 174.55 MiB | 34.99 MiB/s
Receiving objects: 63% (59115/93832), 174.55 MiB | 34.99 MiB/s
Receiving objects: 64% (60053/93832), 174.55 MiB | 34.99 MiB/s
Receiving objects: 65% (60991/93832), 174.55 MiB | 34.99 MiB/s
Receiving objects: 66% (61930/93832), 174.55 MiB | 34.99 MiB/s
Receiving objects: 67% (62868/93832), 192.27 MiB | 35.03 MiB/s
Receiving objects: 68% (63806/93832), 192.27 MiB | 35.03 MiB/s
Receiving objects: 69% (64745/93832), 192.27 MiB | 35.03 MiB/s
Receiving objects: 69% (64836/93832), 192.27 MiB | 35.03 MiB/s
Receiving objects: 70% (65683/93832), 209.68 MiB | 34.96 MiB/s
Receiving objects: 71% (66621/93832), 209.68 MiB | 34.96 MiB/s
Receiving objects: 72% (67560/93832), 209.68 MiB | 34.96 MiB/s
Receiving objects: 73% (68498/93832), 209.68 MiB | 34.96 MiB/s
Receiving objects: 74% (69436/93832), 209.68 MiB | 34.96 MiB/s
Receiving objects: 75% (70374/93832), 209.68 MiB | 34.96 MiB/s
Receiving objects: 76% (71313/93832), 209.68 MiB | 34.96 MiB/s
Receiving objects: 77% (72251/93832), 209.68 MiB | 34.96 MiB/s
Receiving objects: 78% (73189/93832), 209.68 MiB | 34.96 MiB/s
Receiving objects: 79% (74128/93832), 209.68 MiB | 34.96 MiB/s
Receiving objects: 80% (75066/93832), 209.68 MiB | 34.96 MiB/s
Receiving objects: 81% (76004/93832), 226.27 MiB | 34.74 MiB/s
Receiving objects: 81% (76937/93832), 226.27 MiB | 34.74 MiB/s
Receiving objects: 82% (76943/93832), 226.27 MiB | 34.74 MiB/s
Receiving objects: 83% (77881/93832), 244.63 MiB | 34.94 MiB/s
Receiving objects: 84% (78819/93832), 244.63 MiB | 34.94 MiB/s
Receiving objects: 85% (79758/93832), 244.63 MiB | 34.94 MiB/s
Receiving objects: 86% (80696/93832), 261.19 MiB | 34.74 MiB/s
Receiving objects: 87% (81634/93832), 261.19 MiB | 34.74 MiB/s
Receiving objects: 88% (82573/93832), 261.19 MiB | 34.74 MiB/s
Receiving objects: 89% (83511/93832), 261.19 MiB | 34.74 MiB/s
Receiving objects: 89% (84417/93832), 261.19 MiB | 34.74 MiB/s
Receiving objects: 90% (84449/93832), 261.19 MiB | 34.74 MiB/s
Receiving objects: 91% (85388/93832), 296.41 MiB | 34.84 MiB/s
Receiving objects: 92% (86326/93832), 296.41 MiB | 34.84 MiB/s
Receiving objects: 93% (87264/93832), 296.41 MiB | 34.84 MiB/s
Receiving objects: 94% (88203/93832), 296.41 MiB | 34.84 MiB/s
Receiving objects: 95% (89141/93832), 296.41 MiB | 34.84 MiB/s
Receiving objects: 96% (90079/93832), 296.41 MiB | 34.84 MiB/s
Receiving objects: 97% (91018/93832), 296.41 MiB | 34.84 MiB/s
Receiving objects: 98% (91956/93832), 296.41 MiB | 34.84 MiB/s
Receiving objects: 99% (92894/93832), 296.41 MiB | 34.84 MiB/s
remote: Total 93832 (delta 7906), reused 7233 (delta 7213), pack-reused 84764 (from 3)
- 11.85 s
Receiving objects: 100% (93832/93832), 296.41 MiB | 34.84 MiB/s
Receiving objects: 100% (93832/93832), 309.81 MiB | 34.81 MiB/s, done.
- 12.94 s
Resolving deltas: 0% (0/63131)
Resolving deltas: 1% (633/63131)
Resolving deltas: 2% (1263/63131)
Resolving deltas: 3% (1895/63131)
Resolving deltas: 4% (2526/63131)
Resolving deltas: 5% (3157/63131)
Resolving deltas: 6% (3788/63131)
Resolving deltas: 7% (4424/63131)
Resolving deltas: 8% (5051/63131)
Resolving deltas: 9% (5682/63131)
Resolving deltas: 10% (6314/63131)
Resolving deltas: 11% (6945/63131)
Resolving deltas: 12% (7576/63131)
Resolving deltas: 13% (8208/63131)
Resolving deltas: 14% (8839/63131)
Resolving deltas: 15% (9470/63131)
Resolving deltas: 16% (10101/63131)
Resolving deltas: 17% (10734/63131)
Resolving deltas: 18% (11364/63131)
Resolving deltas: 19% (11995/63131)
Resolving deltas: 20% (12627/63131)
Resolving deltas: 21% (13258/63131)
Resolving deltas: 22% (13889/63131)
Resolving deltas: 23% (14521/63131)
Resolving deltas: 24% (15152/63131)
Resolving deltas: 25% (15783/63131)
Resolving deltas: 26% (16415/63131)
Resolving deltas: 27% (17047/63131)
Resolving deltas: 28% (17677/63131)
Resolving deltas: 29% (18309/63131)
Resolving deltas: 30% (18940/63131)
Resolving deltas: 31% (19572/63131)
Resolving deltas: 32% (20202/63131)
Resolving deltas: 33% (20834/63131)
Resolving deltas: 34% (21465/63131)
Resolving deltas: 35% (22096/63131)
Resolving deltas: 36% (22728/63131)
Resolving deltas: 37% (23360/63131)
Resolving deltas: 38% (23990/63131)
Resolving deltas: 39% (24622/63131)
Resolving deltas: 40% (25253/63131)
Resolving deltas: 41% (25884/63131)
Resolving deltas: 42% (26516/63131)
Resolving deltas: 43% (27147/63131)
Resolving deltas: 44% (27778/63131)
Resolving deltas: 45% (28409/63131)
Resolving deltas: 46% (29041/63131)
Resolving deltas: 47% (29672/63131)
Resolving deltas: 48% (30303/63131)
Resolving deltas: 49% (30935/63131)
Resolving deltas: 50% (31566/63131)
Resolving deltas: 51% (32197/63131)
Resolving deltas: 52% (32829/63131)
Resolving deltas: 53% (33460/63131)
Resolving deltas: 54% (34091/63131)
Resolving deltas: 55% (34723/63131)
Resolving deltas: 56% (35354/63131)
Resolving deltas: 57% (35985/63131)
Resolving deltas: 58% (36617/63131)
Resolving deltas: 59% (37248/63131)
Resolving deltas: 60% (37879/63131)
Resolving deltas: 61% (38510/63131)
Resolving deltas: 62% (39142/63131)
Resolving deltas: 63% (39773/63131)
Resolving deltas: 64% (40404/63131)
Resolving deltas: 65% (41037/63131)
Resolving deltas: 66% (41667/63131)
Resolving deltas: 67% (42299/63131)
Resolving deltas: 68% (42930/63131)
Resolving deltas: 69% (43561/63131)
Resolving deltas: 70% (44192/63131)
Resolving deltas: 71% (44824/63131)
Resolving deltas: 72% (45455/63131)
Resolving deltas: 73% (46087/63131)
Resolving deltas: 74% (46717/63131)
Resolving deltas: 75% (47349/63131)
Resolving deltas: 76% (47980/63131)
Resolving deltas: 77% (48611/63131)
Resolving deltas: 78% (49243/63131)
Resolving deltas: 79% (49874/63131)
Resolving deltas: 80% (50505/63131)
Resolving deltas: 81% (51137/63131)
Resolving deltas: 82% (51770/63131)
Resolving deltas: 83% (52399/63131)
Resolving deltas: 84% (53031/63131)
Resolving deltas: 85% (53662/63131)
Resolving deltas: 86% (54293/63131)
Resolving deltas: 86% (54837/63131)
Resolving deltas: 87% (54925/63131)
Resolving deltas: 88% (55556/63131)
Resolving deltas: 89% (56187/63131)
Resolving deltas: 90% (56818/63131)
Resolving deltas: 91% (57450/63131)
Resolving deltas: 92% (58081/63131)
Resolving deltas: 93% (58712/63131)
Resolving deltas: 94% (59344/63131)
Resolving deltas: 95% (59975/63131)
Resolving deltas: 96% (60606/63131)
Resolving deltas: 97% (61239/63131)
Resolving deltas: 98% (61869/63131)
Resolving deltas: 99% (62500/63131)
Resolving deltas: 100% (63131/63131)
Resolving deltas: 100% (63131/63131), done.
- 13.43 s
Fetching commit 654d6aff73111149f97b220cbd7a9fe7bf7d23e4 for advanced_sampling ...
- 13.43 s
$ /nix/store/bcnisk3ydfgv26v2gw3zlky24g00yww2-git-2.54.0/bin/git fetch origin 654d6aff73111149f97b220cbd7a9fe7bf7d23e4
- 13.83 s
From https://github.com/alphal00p/gammaloop
- 13.83 s
* branch 654d6aff73111149f97b220cbd7a9fe7bf7d23e4 -> FETCH_HEAD
- 13.84 s
$ /nix/store/9ypz3flqsrl5xl495mm8h645gadjsxi1-coreutils-9.11/bin/timeout --kill-after=15s 7200s /nix/store/bcnisk3ydfgv26v2gw3zlky24g00yww2-git-2.54.0/bin/git -c advice.detachedHead=false checkout 654d6aff73111149f97b220cbd7a9fe7bf7d23e4
- 14.36 s
HEAD is now at 654d6aff7 allow final underflow rounding and stage GL638 validation pilots
- 14.37 s
$ /nix/store/9ypz3flqsrl5xl495mm8h645gadjsxi1-coreutils-9.11/bin/timeout --kill-after=15s 7200s /nix/store/23zk8sgzamrbmj1fday15szf7f2279s8-nix-2.34.7/bin/nix --extra-experimental-features nix-command --extra-experimental-features flakes --log-format internal-json run .#packages.x86_64-linux.nix-ci-check-gammaloop-nextest-python-api --print-build-logs
- 14.50 s
error (ignored): SQLite database '/var/cache/nix-ci-worker/eval-cache-v6/4330622c2b93ce2cfc8d9ae563257cfa215fede24c0a7af46d1ed469e8cc0bc3.sqlite' is busy
- 21.50 s
- 29.28 s
evaluating derivation 'g
copying '/nix/store/7nm0
evaluating derivation 'g
copying '/nix/store/7nm0
evaluating derivation 'g
copying '/nix/store/7nm0
evaluating derivation 'g
copying '/nix/store/7nm0
evaluating derivation 'g
copying '/nix/store/7nm0
evaluating derivation 'g
copying '/nix/store/7nm0
evaluating derivation 'g
copying '/nix/store/7nm0
evaluating derivation 'g
copying '/nix/store/7nm0
evaluating derivation 'g
copying '/nix/store/7nm0
evaluating derivation 'g
querying gammaloop-nexte
[0/7 built, 5/0/12 copiebuilder.pl> Running phase: patchPhase
- 29.29 s
[1/0/5 built, 2/5/12 copbuilder.pl> Running phase: updateAutotoolsGnuConfigScriptsPhase
- 29.29 s
builder.pl> Running phase: configurePhase
- 29.30 s
builder.pl> no configure script, doing nothing
- 29.30 s
builder.pl> Running phase: buildPhase
- 29.31 s
builder.pl> Running phase: checkPhase
- 29.31 s
builder.pl> Running phase: installPhase
- 29.32 s
builder.pl> no Makefile or custom installPhase, doing nothing
- 29.32 s
builder.pl> Running phase: fixupPhase
- 29.33 s
builder.pl> shrinking RPATHs of ELF executables and libraries in /nix/store/n17p4y03iknmyjpnfk30rj7i0klr448n-builder.pl
- 29.33 s
builder.pl> checking for references to /build/ in /nix/store/n17p4y03iknmyjpnfk30rj7i0klr448n-builder.pl...
- 29.34 s
builder.pl> patching script interpreter paths in /nix/store/n17p4y03iknmyjpnfk30rj7i0klr448n-builder.pl
- 29.37 s
builder.pl (post)> Uploading to the NixCI cache: /nix/store/n17p4y03iknmyjpnfk30rj7i0klr448n-builder.pl
- 29.41 s
builder.pl (post)> warning: 'warn-short-path-literals' is deprecated, use 'lint-short-path-literals = ignore' instead
- 29.45 s
builder.pl (post)> copying 0 paths...
- 29.50 s
builder.pl (post)> warning: 'warn-short-path-literals' is deprecated, use 'lint-short-path-literals = ignore' instead
- 29.54 s
builder.pl (post)> copying 0 paths...
- 30.56 s
[1/4 built, 2/7/12 copie
[1/4 built, 1/11/12 copi
[1/3 built, 12 copied (2python3> structuredAttrs is enabled
- 30.63 s
[1/1/3 built, 12 copied python3> created 227 symlinks in user environment
- 31.49 s
python3 (post)> Uploading to the NixCI cache: /nix/store/3gi2x25n327sf3xma8b08jd57aqv69x5-python3-3.13.14-env
- 31.53 s
python3 (post)> warning: 'warn-short-path-literals' is deprecated, use 'lint-short-path-literals = ignore' instead
- 31.74 s
python3 (post)> copying 0 paths...
- 31.79 s
python3 (post)> warning: 'warn-short-path-literals' is deprecated, use 'lint-short-path-literals = ignore' instead
- 31.84 s
python3 (post)> copying 0 paths...
- 32.13 s
[2/4 built, 12 copied (2
[1/2/3 built, 12 copied gammaloop-nextest-python-api> Extracting 1 binary, 1 build script output directory, and 3 linked paths to /build/nextest-archive-rsLJsz
- 32.19 s
gammaloop-nextest-python-api> Extracted 18 files to /build/nextest-archive-rsLJsz in 0.06s
- 32.20 s
gammaloop-nextest-python-api> ------------
- 32.20 s
gammaloop-nextest-python-api> Nextest run ID 1b80046f-e435-4e3a-a9bc-58cbcbf77210 with nextest profile: ci_gammaloop
- 32.20 s
gammaloop-nextest-python-api> Starting 5 tests across 1 binary
- 32.31 s
gammaloop-nextest-python-api> FAIL [ 0.110s] (1/5) gammaloop-integration-tests::test_python_api python_evaluate_sample_preserves_graph_grouping_and_incoming_pdgs
- 32.31 s
gammaloop-nextest-python-api> stdout ---
- 32.31 s
gammaloop-nextest-python-api>
- 32.31 s
gammaloop-nextest-python-api> running 1 test
- 32.31 s
gammaloop-nextest-python-api> test python_evaluate_sample_preserves_graph_grouping_and_incoming_pdgs ... FAILED
- 32.31 s
gammaloop-nextest-python-api>
- 32.31 s
gammaloop-nextest-python-api> failures:
- 32.31 s
gammaloop-nextest-python-api>
- 32.31 s
gammaloop-nextest-python-api> failures:
- 32.31 s
gammaloop-nextest-python-api> python_evaluate_sample_preserves_graph_grouping_and_incoming_pdgs
- 32.31 s
gammaloop-nextest-python-api>
- 32.31 s
gammaloop-nextest-python-api> test result: FAILED. 0 passed; 1 failed; 0 ignored; 0 measured; 4 filtered out; finished in 0.11s
- 32.31 s
gammaloop-nextest-python-api>
- 32.31 s
gammaloop-nextest-python-api> stderr ---
- 32.31 s
gammaloop-nextest-python-api> Error: Python API test subprocess failed.
- 32.31 s
gammaloop-nextest-python-api> stdout:
- 32.31 s
gammaloop-nextest-python-api> ┌────────────────────────────────────────────────────────┐
- 32.31 s
gammaloop-nextest-python-api> │ You are running a restricted Symbolica instance. │
- 32.31 s
gammaloop-nextest-python-api> │ │
- 32.31 s
gammaloop-nextest-python-api> │ This mode is only permitted for non-commercial use and │
- 32.31 s
gammaloop-nextest-python-api> │ is limited to one instance and core per machine. │
- 32.31 s
gammaloop-nextest-python-api> │ │
- 32.31 s
gammaloop-nextest-python-api> │ Hobbyists can easily acquire a free license key │
- 32.31 s
gammaloop-nextest-python-api> │ that unlocks all cores and removes this banner: │
- 32.31 s
gammaloop-nextest-python-api> │ │
- 32.31 s
gammaloop-nextest-python-api> │ from symbolica import * │
- 32.31 s
gammaloop-nextest-python-api> │ request_hobbyist_license('YOUR_NAME', 'YOUR_EMAIL') │
- 32.31 s
gammaloop-nextest-python-api> │ │
- 32.31 s
gammaloop-nextest-python-api> │ All other users can obtain a free 30-day trial key: │
- 32.31 s
gammaloop-nextest-python-api> │ │
- 32.31 s
gammaloop-nextest-python-api> │ from symbolica import * │
- 32.31 s
gammaloop-nextest-python-api> │ request_trial_license('NAME', 'EMAIL', 'EMPLOYER') │
- 32.31 s
gammaloop-nextest-python-api> │ │
- 32.31 s
gammaloop-nextest-python-api> │ See https://symbolica.io/docs/get_started.html#license │
- 32.31 s
gammaloop-nextest-python-api> └────────────────────────────────────────────────────────┘
- 32.31 s
gammaloop-nextest-python-api> ┌───────────────────────────────────────────────────────────────────────────────────────────────────────────┐
- 32.31 s
gammaloop-nextest-python-api> │ Cannot start new unlicensed Symbolica instance since there is already another one running on the machine. │
- 32.31 s
gammaloop-nextest-python-api> └───────────────────────────────────────────────────────────────────────────────────────────────────────────┘
- 32.31 s
gammaloop-nextest-python-api>
- 32.31 s
gammaloop-nextest-python-api> stderr:
- 32.31 s
gammaloop-nextest-python-api>
- 32.31 s
gammaloop-nextest-python-api> ┌───────────────────────────────────────────────────────────┐
- 32.31 s
gammaloop-nextest-python-api> │ Could not resolve the IP of the Symbolica license server. │
- 32.31 s
gammaloop-nextest-python-api> │ │
- 32.31 s
gammaloop-nextest-python-api> │ Please check your DNS configuration. │
- 32.31 s
gammaloop-nextest-python-api> └───────────────────────────────────────────────────────────┘
- 32.31 s
gammaloop-nextest-python-api> Error: failed to lookup address information: Temporary failure in name resolution
- 32.31 s
gammaloop-nextest-python-api>
- 32.31 s
gammaloop-nextest-python-api>
- 32.31 s
gammaloop-nextest-python-api> Location:
- 32.31 s
gammaloop-nextest-python-api> tests/tests/test_python_api.rs:156:20
- 32.31 s
gammaloop-nextest-python-api>
- 32.31 s
gammaloop-nextest-python-api> FAIL [ 0.110s] (2/5) gammaloop-integration-tests::test_python_api python_evaluate_samples_batch_and_momentum_space_have_expected_shape
- 32.31 s
gammaloop-nextest-python-api> stdout ---
- 32.31 s
gammaloop-nextest-python-api>
- 32.31 s
gammaloop-nextest-python-api> running 1 test
- 32.31 s
gammaloop-nextest-python-api> test python_evaluate_samples_batch_and_momentum_space_have_expected_shape ... FAILED
- 32.31 s
gammaloop-nextest-python-api>
- 32.31 s
gammaloop-nextest-python-api> failures:
- 32.31 s
gammaloop-nextest-python-api>
- 32.31 s
gammaloop-nextest-python-api> failures:
- 32.31 s
gammaloop-nextest-python-api> python_evaluate_samples_batch_and_momentum_space_have_expected_shape
- 32.31 s
gammaloop-nextest-python-api>
- 32.31 s
gammaloop-nextest-python-api> test result: FAILED. 0 passed; 1 failed; 0 ignored; 0 measured; 4 filtered out; finished in 0.11s
- 32.31 s
gammaloop-nextest-python-api>
- 32.31 s
gammaloop-nextest-python-api> stderr ---
- 32.31 s
gammaloop-nextest-python-api> Error: Python API test subprocess failed.
- 32.31 s
gammaloop-nextest-python-api> stdout:
- 32.31 s
gammaloop-nextest-python-api> ┌────────────────────────────────────────────────────────┐
- 32.31 s
gammaloop-nextest-python-api> │ You are running a restricted Symbolica instance. │
- 32.31 s
gammaloop-nextest-python-api> │ │
- 32.31 s
gammaloop-nextest-python-api> │ This mode is only permitted for non-commercial use and │
- 32.31 s
gammaloop-nextest-python-api> │ is limited to one instance and core per machine. │
- 32.31 s
gammaloop-nextest-python-api> │ │
- 32.31 s
gammaloop-nextest-python-api> │ Hobbyists can easily acquire a free license key │
- 32.31 s
gammaloop-nextest-python-api> │ that unlocks all cores and removes this banner: │
- 32.31 s
gammaloop-nextest-python-api> │ │
- 32.31 s
gammaloop-nextest-python-api> │ from symbolica import * │
- 32.31 s
gammaloop-nextest-python-api> │ request_hobbyist_license('YOUR_NAME', 'YOUR_EMAIL') │
- 32.31 s
gammaloop-nextest-python-api> │ │
- 32.31 s
gammaloop-nextest-python-api> │ All other users can obtain a free 30-day trial key: │
- 32.31 s
gammaloop-nextest-python-api> │ │
- 32.31 s
gammaloop-nextest-python-api> │ from symbolica import * │
- 32.31 s
gammaloop-nextest-python-api> │ request_trial_license('NAME', 'EMAIL', 'EMPLOYER') │
- 32.31 s
gammaloop-nextest-python-api> │ │
- 32.31 s
gammaloop-nextest-python-api> │ See https://symbolica.io/docs/get_started.html#license │
- 32.31 s
gammaloop-nextest-python-api> └────────────────────────────────────────────────────────┘
- 32.31 s
gammaloop-nextest-python-api> ┌───────────────────────────────────────────────────────────────────────────────────────────────────────────┐
- 32.31 s
gammaloop-nextest-python-api> │ Cannot start new unlicensed Symbolica instance since there is already another one running on the machine. │
- 32.31 s
gammaloop-nextest-python-api> └───────────────────────────────────────────────────────────────────────────────────────────────────────────┘
- 32.31 s
gammaloop-nextest-python-api>
- 32.31 s
gammaloop-nextest-python-api> stderr:
- 32.31 s
gammaloop-nextest-python-api>
- 32.31 s
gammaloop-nextest-python-api> ┌───────────────────────────────────────────────────────────┐
- 32.31 s
gammaloop-nextest-python-api> │ Could not resolve the IP of the Symbolica license server. │
- 32.31 s
gammaloop-nextest-python-api> │ │
- 32.31 s
gammaloop-nextest-python-api> │ Please check your DNS configuration. │
- 32.31 s
gammaloop-nextest-python-api> └───────────────────────────────────────────────────────────┘
- 32.31 s
gammaloop-nextest-python-api> Error: failed to lookup address information: Temporary failure in name resolution
- 32.31 s
gammaloop-nextest-python-api>
- 32.31 s
gammaloop-nextest-python-api>
- 32.32 s
gammaloop-nextest-python-api> Location:
- 32.32 s
gammaloop-nextest-python-api> tests/tests/test_python_api.rs:156:20
- 32.32 s
gammaloop-nextest-python-api>
- 32.32 s
gammaloop-nextest-python-api> FAIL [ 0.110s] (3/5) gammaloop-integration-tests::test_python_api python_evaluate_sample_honors_generate_events_and_observable_snapshots
- 32.32 s
gammaloop-nextest-python-api> stdout ---
- 32.32 s
gammaloop-nextest-python-api>
- 32.32 s
gammaloop-nextest-python-api> running 1 test
- 32.32 s
gammaloop-nextest-python-api> test python_evaluate_sample_honors_generate_events_and_observable_snapshots ... FAILED
- 32.32 s
gammaloop-nextest-python-api>
- 32.32 s
gammaloop-nextest-python-api> failures:
- 32.32 s
gammaloop-nextest-python-api>
- 32.32 s
gammaloop-nextest-python-api> failures:
- 32.32 s
gammaloop-nextest-python-api> python_evaluate_sample_honors_generate_events_and_observable_snapshots
- 32.32 s
gammaloop-nextest-python-api>
- 32.32 s
gammaloop-nextest-python-api> test result: FAILED. 0 passed; 1 failed; 0 ignored; 0 measured; 4 filtered out; finished in 0.11s
- 32.32 s
gammaloop-nextest-python-api>
- 32.32 s
gammaloop-nextest-python-api> stderr ---
- 32.32 s
gammaloop-nextest-python-api> Error: Python API test subprocess failed.
- 32.32 s
gammaloop-nextest-python-api> stdout:
- 32.32 s
gammaloop-nextest-python-api> ┌────────────────────────────────────────────────────────┐
- 32.32 s
gammaloop-nextest-python-api> │ You are running a restricted Symbolica instance. │
- 32.32 s
gammaloop-nextest-python-api> │ │
- 32.32 s
gammaloop-nextest-python-api> │ This mode is only permitted for non-commercial use and │
- 32.32 s
gammaloop-nextest-python-api> │ is limited to one instance and core per machine. │
- 32.32 s
gammaloop-nextest-python-api> │ │
- 32.32 s
gammaloop-nextest-python-api> │ Hobbyists can easily acquire a free license key │
- 32.32 s
gammaloop-nextest-python-api> │ that unlocks all cores and removes this banner: │
- 32.32 s
gammaloop-nextest-python-api> │ │
- 32.32 s
gammaloop-nextest-python-api> │ from symbolica import * │
- 32.32 s
gammaloop-nextest-python-api> │ request_hobbyist_license('YOUR_NAME', 'YOUR_EMAIL') │
- 32.32 s
gammaloop-nextest-python-api> │ │
- 32.32 s
gammaloop-nextest-python-api> │ All other users can obtain a free 30-day trial key: │
- 32.32 s
gammaloop-nextest-python-api> │ │
- 32.32 s
gammaloop-nextest-python-api> │ from symbolica import * │
- 32.32 s
gammaloop-nextest-python-api> │ request_trial_license('NAME', 'EMAIL', 'EMPLOYER') │
- 32.32 s
gammaloop-nextest-python-api> │ │
- 32.32 s
gammaloop-nextest-python-api> │ See https://symbolica.io/docs/get_started.html#license │
- 32.32 s
gammaloop-nextest-python-api> └────────────────────────────────────────────────────────┘
- 32.32 s
gammaloop-nextest-python-api> ┌───────────────────────────────────────────────────────────────────────────────────────────────────────────┐
- 32.32 s
gammaloop-nextest-python-api> │ Cannot start new unlicensed Symbolica instance since there is already another one running on the machine. │
- 32.32 s
gammaloop-nextest-python-api> └───────────────────────────────────────────────────────────────────────────────────────────────────────────┘
- 32.32 s
gammaloop-nextest-python-api>
- 32.32 s
gammaloop-nextest-python-api> stderr:
- 32.32 s
gammaloop-nextest-python-api>
- 32.32 s
gammaloop-nextest-python-api> ┌───────────────────────────────────────────────────────────┐
- 32.32 s
gammaloop-nextest-python-api> │ Could not resolve the IP of the Symbolica license server. │
- 32.32 s
gammaloop-nextest-python-api> │ │
- 32.32 s
gammaloop-nextest-python-api> │ Please check your DNS configuration. │
- 32.32 s
gammaloop-nextest-python-api> └───────────────────────────────────────────────────────────┘
- 32.32 s
gammaloop-nextest-python-api> Error: failed to lookup address information: Temporary failure in name resolution
- 32.32 s
gammaloop-nextest-python-api>
- 32.32 s
gammaloop-nextest-python-api>
- 32.32 s
gammaloop-nextest-python-api> Location:
- 32.32 s
gammaloop-nextest-python-api> tests/tests/test_python_api.rs:156:20
- 32.32 s
gammaloop-nextest-python-api>
- 32.32 s
gammaloop-nextest-python-api> FAIL [ 0.118s] (4/5) gammaloop-integration-tests::test_python_api python_session_getters_return_live_toml_and_command_blocks
- 32.32 s
gammaloop-nextest-python-api> stdout ---
- 32.32 s
gammaloop-nextest-python-api>
- 32.32 s
gammaloop-nextest-python-api> running 1 test
- 32.32 s
gammaloop-nextest-python-api> test python_session_getters_return_live_toml_and_command_blocks ... FAILED
- 32.32 s
gammaloop-nextest-python-api>
- 32.32 s
gammaloop-nextest-python-api> failures:
- 32.32 s
gammaloop-nextest-python-api>
- 32.32 s
gammaloop-nextest-python-api> failures:
- 32.32 s
gammaloop-nextest-python-api> python_session_getters_return_live_toml_and_command_blocks
- 32.32 s
gammaloop-nextest-python-api>
- 32.32 s
gammaloop-nextest-python-api> test result: FAILED. 0 passed; 1 failed; 0 ignored; 0 measured; 4 filtered out; finished in 0.11s
- 32.32 s
gammaloop-nextest-python-api>
- 32.32 s
gammaloop-nextest-python-api> stderr ---
- 32.32 s
gammaloop-nextest-python-api> Error: Python API test subprocess failed.
- 32.32 s
gammaloop-nextest-python-api> stdout:
- 32.32 s
gammaloop-nextest-python-api> ┌────────────────────────────────────────────────────────┐
- 32.32 s
gammaloop-nextest-python-api> │ You are running a restricted Symbolica instance. │
- 32.32 s
gammaloop-nextest-python-api> │ │
- 32.32 s
gammaloop-nextest-python-api> │ This mode is only permitted for non-commercial use and │
- 32.32 s
gammaloop-nextest-python-api> │ is limited to one instance and core per machine. │
- 32.32 s
gammaloop-nextest-python-api> │ │
- 32.32 s
gammaloop-nextest-python-api> │ Hobbyists can easily acquire a free license key │
- 32.32 s
gammaloop-nextest-python-api> │ that unlocks all cores and removes this banner: │
- 32.32 s
gammaloop-nextest-python-api> │ │
- 32.32 s
gammaloop-nextest-python-api> │ from symbolica import * │
- 32.32 s
gammaloop-nextest-python-api> │ request_hobbyist_license('YOUR_NAME', 'YOUR_EMAIL') │
- 32.32 s
gammaloop-nextest-python-api> │ │
- 32.32 s
gammaloop-nextest-python-api> │ All other users can obtain a free 30-day trial key: │
- 32.32 s
gammaloop-nextest-python-api> │ │
- 32.32 s
gammaloop-nextest-python-api> │ from symbolica import * │
- 32.32 s
gammaloop-nextest-python-api> │ request_trial_license('NAME', 'EMAIL', 'EMPLOYER') │
- 32.32 s
gammaloop-nextest-python-api> │ │
- 32.32 s
gammaloop-nextest-python-api> │ See https://symbolica.io/docs/get_started.html#license │
- 32.32 s
gammaloop-nextest-python-api> └────────────────────────────────────────────────────────┘
- 32.32 s
gammaloop-nextest-python-api> ┌───────────────────────────────────────────────────────────────────────────────────────────────────────────┐
- 32.32 s
gammaloop-nextest-python-api> │ Cannot start new unlicensed Symbolica instance since there is already another one running on the machine. │
- 32.32 s
gammaloop-nextest-python-api> └───────────────────────────────────────────────────────────────────────────────────────────────────────────┘
- 32.32 s
gammaloop-nextest-python-api>
- 32.32 s
gammaloop-nextest-python-api> stderr:
- 32.32 s
gammaloop-nextest-python-api>
- 32.32 s
gammaloop-nextest-python-api> ┌───────────────────────────────────────────────────────────┐
- 32.32 s
gammaloop-nextest-python-api> │ Could not resolve the IP of the Symbolica license server. │
- 32.32 s
gammaloop-nextest-python-api> │ │
- 32.32 s
gammaloop-nextest-python-api> │ Please check your DNS configuration. │
- 32.32 s
gammaloop-nextest-python-api> └───────────────────────────────────────────────────────────┘
- 32.32 s
gammaloop-nextest-python-api> Error: failed to lookup address information: Temporary failure in name resolution
- 32.32 s
gammaloop-nextest-python-api>
- 32.32 s
gammaloop-nextest-python-api>
- 32.32 s
gammaloop-nextest-python-api> Location:
- 32.32 s
gammaloop-nextest-python-api> tests/tests/test_python_api.rs:156:20
- 32.32 s
gammaloop-nextest-python-api>
- 32.48 s
gammaloop-nextest-python-api> ------------
- 32.48 s
gammaloop-nextest-python-api> Summary [ 0.274s] 5 tests run: 1 passed, 4 failed, 0 skipped
- 32.48 s
gammaloop-nextest-python-api> FAIL [ 0.110s] (1/5) gammaloop-integration-tests::test_python_api python_evaluate_sample_preserves_graph_grouping_and_incoming_pdgs
- 32.48 s
gammaloop-nextest-python-api> stdout ---
- 32.48 s
gammaloop-nextest-python-api>
- 32.48 s
gammaloop-nextest-python-api> running 1 test
- 32.48 s
gammaloop-nextest-python-api> test python_evaluate_sample_preserves_graph_grouping_and_incoming_pdgs ... FAILED
- 32.48 s
gammaloop-nextest-python-api>
- 32.48 s
gammaloop-nextest-python-api> failures:
- 32.48 s
gammaloop-nextest-python-api>
- 32.48 s
gammaloop-nextest-python-api> failures:
- 32.48 s
gammaloop-nextest-python-api> python_evaluate_sample_preserves_graph_grouping_and_incoming_pdgs
- 32.48 s
gammaloop-nextest-python-api>
- 32.48 s
gammaloop-nextest-python-api> test result: FAILED. 0 passed; 1 failed; 0 ignored; 0 measured; 4 filtered out; finished in 0.11s
- 32.48 s
gammaloop-nextest-python-api>
- 32.48 s
gammaloop-nextest-python-api> stderr ---
- 32.48 s
gammaloop-nextest-python-api> Error: Python API test subprocess failed.
- 32.48 s
gammaloop-nextest-python-api> stdout:
- 32.48 s
gammaloop-nextest-python-api> ┌────────────────────────────────────────────────────────┐
- 32.48 s
gammaloop-nextest-python-api> │ You are running a restricted Symbolica instance. │
- 32.48 s
gammaloop-nextest-python-api> │ │
- 32.48 s
gammaloop-nextest-python-api> │ This mode is only permitted for non-commercial use and │
- 32.48 s
gammaloop-nextest-python-api> │ is limited to one instance and core per machine. │
- 32.48 s
gammaloop-nextest-python-api> │ │
- 32.48 s
gammaloop-nextest-python-api> │ Hobbyists can easily acquire a free license key │
- 32.48 s
gammaloop-nextest-python-api> │ that unlocks all cores and removes this banner: │
- 32.48 s
gammaloop-nextest-python-api> │ │
- 32.48 s
gammaloop-nextest-python-api> │ from symbolica import * │
- 32.48 s
gammaloop-nextest-python-api> │ request_hobbyist_license('YOUR_NAME', 'YOUR_EMAIL') │
- 32.48 s
gammaloop-nextest-python-api> │ │
- 32.48 s
gammaloop-nextest-python-api> │ All other users can obtain a free 30-day trial key: │
- 32.48 s
gammaloop-nextest-python-api> │ │
- 32.48 s
gammaloop-nextest-python-api> │ from symbolica import * │
- 32.48 s
gammaloop-nextest-python-api> │ request_trial_license('NAME', 'EMAIL', 'EMPLOYER') │
- 32.48 s
gammaloop-nextest-python-api> │ │
- 32.48 s
gammaloop-nextest-python-api> │ See https://symbolica.io/docs/get_started.html#license │
- 32.48 s
gammaloop-nextest-python-api> └────────────────────────────────────────────────────────┘
- 32.48 s
gammaloop-nextest-python-api> ┌───────────────────────────────────────────────────────────────────────────────────────────────────────────┐
- 32.48 s
gammaloop-nextest-python-api> │ Cannot start new unlicensed Symbolica instance since there is already another one running on the machine. │
- 32.48 s
gammaloop-nextest-python-api> └───────────────────────────────────────────────────────────────────────────────────────────────────────────┘
- 32.48 s
gammaloop-nextest-python-api>
- 32.48 s
gammaloop-nextest-python-api> stderr:
- 32.48 s
gammaloop-nextest-python-api>
- 32.48 s
gammaloop-nextest-python-api> ┌───────────────────────────────────────────────────────────┐
- 32.48 s
gammaloop-nextest-python-api> │ Could not resolve the IP of the Symbolica license server. │
- 32.48 s
gammaloop-nextest-python-api> │ │
- 32.48 s
gammaloop-nextest-python-api> │ Please check your DNS configuration. │
- 32.48 s
gammaloop-nextest-python-api> └───────────────────────────────────────────────────────────┘
- 32.48 s
gammaloop-nextest-python-api> Error: failed to lookup address information: Temporary failure in name resolution
- 32.48 s
gammaloop-nextest-python-api>
- 32.48 s
gammaloop-nextest-python-api>
- 32.48 s
gammaloop-nextest-python-api> Location:
- 32.48 s
gammaloop-nextest-python-api> tests/tests/test_python_api.rs:156:20
- 32.48 s
gammaloop-nextest-python-api>
- 32.48 s
gammaloop-nextest-python-api> FAIL [ 0.110s] (2/5) gammaloop-integration-tests::test_python_api python_evaluate_samples_batch_and_momentum_space_have_expected_shape
- 32.48 s
gammaloop-nextest-python-api> stdout ---
- 32.48 s
gammaloop-nextest-python-api>
- 32.48 s
gammaloop-nextest-python-api> running 1 test
- 32.48 s
gammaloop-nextest-python-api> test python_evaluate_samples_batch_and_momentum_space_have_expected_shape ... FAILED
- 32.48 s
gammaloop-nextest-python-api>
- 32.48 s
gammaloop-nextest-python-api> failures:
- 32.48 s
gammaloop-nextest-python-api>
- 32.48 s
gammaloop-nextest-python-api> failures:
- 32.48 s
gammaloop-nextest-python-api> python_evaluate_samples_batch_and_momentum_space_have_expected_shape
- 32.48 s
gammaloop-nextest-python-api>
- 32.48 s
gammaloop-nextest-python-api> test result: FAILED. 0 passed; 1 failed; 0 ignored; 0 measured; 4 filtered out; finished in 0.11s
- 32.48 s
gammaloop-nextest-python-api>
- 32.48 s
gammaloop-nextest-python-api> stderr ---
- 32.48 s
gammaloop-nextest-python-api> Error: Python API test subprocess failed.
- 32.48 s
gammaloop-nextest-python-api> stdout:
- 32.48 s
gammaloop-nextest-python-api> ┌────────────────────────────────────────────────────────┐
- 32.48 s
gammaloop-nextest-python-api> │ You are running a restricted Symbolica instance. │
- 32.48 s
gammaloop-nextest-python-api> │ │
- 32.48 s
gammaloop-nextest-python-api> │ This mode is only permitted for non-commercial use and │
- 32.48 s
gammaloop-nextest-python-api> │ is limited to one instance and core per machine. │
- 32.48 s
gammaloop-nextest-python-api> │ │
- 32.48 s
gammaloop-nextest-python-api> │ Hobbyists can easily acquire a free license key │
- 32.48 s
gammaloop-nextest-python-api> │ that unlocks all cores and removes this banner: │
- 32.48 s
gammaloop-nextest-python-api> │ │
- 32.48 s
gammaloop-nextest-python-api> │ from symbolica import * │
- 32.48 s
gammaloop-nextest-python-api> │ request_hobbyist_license('YOUR_NAME', 'YOUR_EMAIL') │
- 32.48 s
gammaloop-nextest-python-api> │ │
- 32.48 s
gammaloop-nextest-python-api> │ All other users can obtain a free 30-day trial key: │
- 32.48 s
gammaloop-nextest-python-api> │ │
- 32.48 s
gammaloop-nextest-python-api> │ from symbolica import * │
- 32.48 s
gammaloop-nextest-python-api> │ request_trial_license('NAME', 'EMAIL', 'EMPLOYER') │
- 32.48 s
gammaloop-nextest-python-api> │ │
- 32.48 s
gammaloop-nextest-python-api> │ See https://symbolica.io/docs/get_started.html#license │
- 32.48 s
gammaloop-nextest-python-api> └────────────────────────────────────────────────────────┘
- 32.48 s
gammaloop-nextest-python-api> ┌───────────────────────────────────────────────────────────────────────────────────────────────────────────┐
- 32.48 s
gammaloop-nextest-python-api> │ Cannot start new unlicensed Symbolica instance since there is already another one running on the machine. │
- 32.48 s
gammaloop-nextest-python-api> └───────────────────────────────────────────────────────────────────────────────────────────────────────────┘
- 32.48 s
gammaloop-nextest-python-api>
- 32.48 s
gammaloop-nextest-python-api> stderr:
- 32.48 s
gammaloop-nextest-python-api>
- 32.48 s
gammaloop-nextest-python-api> ┌───────────────────────────────────────────────────────────┐
- 32.48 s
gammaloop-nextest-python-api> │ Could not resolve the IP of the Symbolica license server. │
- 32.48 s
gammaloop-nextest-python-api> │ │
- 32.48 s
gammaloop-nextest-python-api> │ Please check your DNS configuration. │
- 32.48 s
gammaloop-nextest-python-api> └───────────────────────────────────────────────────────────┘
- 32.48 s
gammaloop-nextest-python-api> Error: failed to lookup address information: Temporary failure in name resolution
- 32.48 s
gammaloop-nextest-python-api>
- 32.48 s
gammaloop-nextest-python-api>
- 32.48 s
gammaloop-nextest-python-api> Location:
- 32.48 s
gammaloop-nextest-python-api> tests/tests/test_python_api.rs:156:20
- 32.48 s
gammaloop-nextest-python-api>
- 32.48 s
gammaloop-nextest-python-api> FAIL [ 0.110s] (3/5) gammaloop-integration-tests::test_python_api python_evaluate_sample_honors_generate_events_and_observable_snapshots
- 32.48 s
gammaloop-nextest-python-api> stdout ---
- 32.48 s
gammaloop-nextest-python-api>
- 32.48 s
gammaloop-nextest-python-api> running 1 test
- 32.48 s
gammaloop-nextest-python-api> test python_evaluate_sample_honors_generate_events_and_observable_snapshots ... FAILED
- 32.48 s
gammaloop-nextest-python-api>
- 32.48 s
gammaloop-nextest-python-api> failures:
- 32.48 s
gammaloop-nextest-python-api>
- 32.48 s
gammaloop-nextest-python-api> failures:
- 32.48 s
gammaloop-nextest-python-api> python_evaluate_sample_honors_generate_events_and_observable_snapshots
- 32.48 s
gammaloop-nextest-python-api>
- 32.48 s
gammaloop-nextest-python-api> test result: FAILED. 0 passed; 1 failed; 0 ignored; 0 measured; 4 filtered out; finished in 0.11s
- 32.48 s
gammaloop-nextest-python-api>
- 32.48 s
gammaloop-nextest-python-api> stderr ---
- 32.48 s
gammaloop-nextest-python-api> Error: Python API test subprocess failed.
- 32.48 s
gammaloop-nextest-python-api> stdout:
- 32.48 s
gammaloop-nextest-python-api> ┌────────────────────────────────────────────────────────┐
- 32.48 s
gammaloop-nextest-python-api> │ You are running a restricted Symbolica instance. │
- 32.48 s
gammaloop-nextest-python-api> │ │
- 32.48 s
gammaloop-nextest-python-api> │ This mode is only permitted for non-commercial use and │
- 32.48 s
gammaloop-nextest-python-api> │ is limited to one instance and core per machine. │
- 32.48 s
gammaloop-nextest-python-api> │ │
- 32.48 s
gammaloop-nextest-python-api> │ Hobbyists can easily acquire a free license key │
- 32.48 s
gammaloop-nextest-python-api> │ that unlocks all cores and removes this banner: │
- 32.48 s
gammaloop-nextest-python-api> │ │
- 32.48 s
gammaloop-nextest-python-api> │ from symbolica import * │
- 32.48 s
gammaloop-nextest-python-api> │ request_hobbyist_license('YOUR_NAME', 'YOUR_EMAIL') │
- 32.48 s
gammaloop-nextest-python-api> │ │
- 32.48 s
gammaloop-nextest-python-api> │ All other users can obtain a free 30-day trial key: │
- 32.48 s
gammaloop-nextest-python-api> │ │
- 32.48 s
gammaloop-nextest-python-api> │ from symbolica import * │
- 32.48 s
gammaloop-nextest-python-api> │ request_trial_license('NAME', 'EMAIL', 'EMPLOYER') │
- 32.48 s
gammaloop-nextest-python-api> │ │
- 32.48 s
gammaloop-nextest-python-api> │ See https://symbolica.io/docs/get_started.html#license │
- 32.48 s
gammaloop-nextest-python-api> └────────────────────────────────────────────────────────┘
- 32.48 s
gammaloop-nextest-python-api> ┌───────────────────────────────────────────────────────────────────────────────────────────────────────────┐
- 32.48 s
gammaloop-nextest-python-api> │ Cannot start new unlicensed Symbolica instance since there is already another one running on the machine. │
- 32.48 s
gammaloop-nextest-python-api> └───────────────────────────────────────────────────────────────────────────────────────────────────────────┘
- 32.48 s
gammaloop-nextest-python-api>
- 32.48 s
gammaloop-nextest-python-api> stderr:
- 32.48 s
gammaloop-nextest-python-api>
- 32.48 s
gammaloop-nextest-python-api> ┌───────────────────────────────────────────────────────────┐
- 32.48 s
gammaloop-nextest-python-api> │ Could not resolve the IP of the Symbolica license server. │
- 32.48 s
gammaloop-nextest-python-api> │ │
- 32.48 s
gammaloop-nextest-python-api> │ Please check your DNS configuration. │
- 32.48 s
gammaloop-nextest-python-api> └───────────────────────────────────────────────────────────┘
- 32.48 s
gammaloop-nextest-python-api> Error: failed to lookup address information: Temporary failure in name resolution
- 32.48 s
gammaloop-nextest-python-api>
- 32.48 s
gammaloop-nextest-python-api>
- 32.48 s
gammaloop-nextest-python-api> Location:
- 32.48 s
gammaloop-nextest-python-api> tests/tests/test_python_api.rs:156:20
- 32.48 s
gammaloop-nextest-python-api>
- 32.48 s
gammaloop-nextest-python-api> FAIL [ 0.118s] (4/5) gammaloop-integration-tests::test_python_api python_session_getters_return_live_toml_and_command_blocks
- 32.48 s
gammaloop-nextest-python-api> stdout ---
- 32.48 s
gammaloop-nextest-python-api>
- 32.48 s
gammaloop-nextest-python-api> running 1 test
- 32.48 s
gammaloop-nextest-python-api> test python_session_getters_return_live_toml_and_command_blocks ... FAILED
- 32.48 s
gammaloop-nextest-python-api>
- 32.48 s
gammaloop-nextest-python-api> failures:
- 32.48 s
gammaloop-nextest-python-api>
- 32.48 s
gammaloop-nextest-python-api> failures:
- 32.48 s
gammaloop-nextest-python-api> python_session_getters_return_live_toml_and_command_blocks
- 32.48 s
gammaloop-nextest-python-api>
- 32.48 s
gammaloop-nextest-python-api> test result: FAILED. 0 passed; 1 failed; 0 ignored; 0 measured; 4 filtered out; finished in 0.11s
- 32.48 s
gammaloop-nextest-python-api>
- 32.48 s
gammaloop-nextest-python-api> stderr ---
- 32.48 s
gammaloop-nextest-python-api> Error: Python API test subprocess failed.
- 32.48 s
gammaloop-nextest-python-api> stdout:
- 32.48 s
gammaloop-nextest-python-api> ┌────────────────────────────────────────────────────────┐
- 32.48 s
gammaloop-nextest-python-api> │ You are running a restricted Symbolica instance. │
- 32.48 s
gammaloop-nextest-python-api> │ │
- 32.48 s
gammaloop-nextest-python-api> │ This mode is only permitted for non-commercial use and │
- 32.48 s
gammaloop-nextest-python-api> │ is limited to one instance and core per machine. │
- 32.48 s
gammaloop-nextest-python-api> │ │
- 32.48 s
gammaloop-nextest-python-api> │ Hobbyists can easily acquire a free license key │
- 32.48 s
gammaloop-nextest-python-api> │ that unlocks all cores and removes this banner: │
- 32.48 s
gammaloop-nextest-python-api> │ │
- 32.48 s
gammaloop-nextest-python-api> │ from symbolica import * │
- 32.48 s
gammaloop-nextest-python-api> │ request_hobbyist_license('YOUR_NAME', 'YOUR_EMAIL') │
- 32.48 s
gammaloop-nextest-python-api> │ │
- 32.48 s
gammaloop-nextest-python-api> │ All other users can obtain a free 30-day trial key: │
- 32.48 s
gammaloop-nextest-python-api> │ │
- 32.48 s
gammaloop-nextest-python-api> │ from symbolica import * │
- 32.48 s
gammaloop-nextest-python-api> │ request_trial_license('NAME', 'EMAIL', 'EMPLOYER') │
- 32.48 s
gammaloop-nextest-python-api> │ │
- 32.48 s
gammaloop-nextest-python-api> │ See https://symbolica.io/docs/get_started.html#license │
- 32.48 s
gammaloop-nextest-python-api> └────────────────────────────────────────────────────────┘
- 32.48 s
gammaloop-nextest-python-api> ┌───────────────────────────────────────────────────────────────────────────────────────────────────────────┐
- 32.48 s
gammaloop-nextest-python-api> │ Cannot start new unlicensed Symbolica instance since there is already another one running on the machine. │
- 32.48 s
gammaloop-nextest-python-api> └───────────────────────────────────────────────────────────────────────────────────────────────────────────┘
- 32.48 s
gammaloop-nextest-python-api>
- 32.48 s
gammaloop-nextest-python-api> stderr:
- 32.48 s
gammaloop-nextest-python-api>
- 32.48 s
gammaloop-nextest-python-api> ┌───────────────────────────────────────────────────────────┐
- 32.48 s
gammaloop-nextest-python-api> │ Could not resolve the IP of the Symbolica license server. │
- 32.48 s
gammaloop-nextest-python-api> │ │
- 32.48 s
gammaloop-nextest-python-api> │ Please check your DNS configuration. │
- 32.48 s
gammaloop-nextest-python-api> └───────────────────────────────────────────────────────────┘
- 32.48 s
gammaloop-nextest-python-api> Error: failed to lookup address information: Temporary failure in name resolution
- 32.48 s
gammaloop-nextest-python-api>
- 32.48 s
gammaloop-nextest-python-api>
- 32.48 s
gammaloop-nextest-python-api> Location:
- 32.48 s
gammaloop-nextest-python-api> tests/tests/test_python_api.rs:156:20
- 32.48 s
gammaloop-nextest-python-api>
- 32.49 s
gammaloop-nextest-python-api> error: test run failed
- 32.51 s
gammaloop-nextest-python-api>
- 32.51 s
gammaloop-nextest-python-api> ========== nextest test summary ==========
- 32.51 s
gammaloop-nextest-python-api> report: target/nextest/ci_gammaloop/junit.xml
- 32.51 s
gammaloop-nextest-python-api> tests: 5, failures: 4, errors: 0
- 32.51 s
gammaloop-nextest-python-api>
- 32.51 s
gammaloop-nextest-python-api> 1. gammaloop-integration-tests::test_python_api::python_evaluate_sample_preserves_graph_grouping_and_incoming_pdgs
- 32.51 s
gammaloop-nextest-python-api> failure: test failure with exit code 101
- 32.51 s
gammaloop-nextest-python-api> Error: Python API test subprocess failed.
- 32.51 s
gammaloop-nextest-python-api> stdout:
- 32.51 s
gammaloop-nextest-python-api> ┌────────────────────────────────────────────────────────┐
- 32.51 s
gammaloop-nextest-python-api> │ You are running a restricted Symbolica instance. │
- 32.51 s
gammaloop-nextest-python-api> │ │
- 32.51 s
gammaloop-nextest-python-api> │ This mode is only permitted for non-commercial use and │
- 32.51 s
gammaloop-nextest-python-api> │ is limited to one instance and core per machine. │
- 32.51 s
gammaloop-nextest-python-api> │ │
- 32.51 s
gammaloop-nextest-python-api> │ Hobbyists can easily acquire a free license key │
- 32.51 s
gammaloop-nextest-python-api> │ that unlocks all cores and removes this banner: │
- 32.51 s
gammaloop-nextest-python-api> │ │
- 32.51 s
gammaloop-nextest-python-api> │ from symbolica import * │
- 32.51 s
gammaloop-nextest-python-api> │ request_hobbyist_license('YOUR_NAME', 'YOUR_EMAIL') │
- 32.51 s
gammaloop-nextest-python-api> │ │
- 32.51 s
gammaloop-nextest-python-api> │ All other users can obtain a free 30-day trial key: │
- 32.51 s
gammaloop-nextest-python-api> │ │
- 32.51 s
gammaloop-nextest-python-api> │ from symbolica import * │
- 32.51 s
gammaloop-nextest-python-api> │ request_trial_license('NAME', 'EMAIL', 'EMPLOYER') │
- 32.51 s
gammaloop-nextest-python-api> │ │
- 32.51 s
gammaloop-nextest-python-api> │ See https://symbolica.io/docs/get_started.html#license │
- 32.51 s
gammaloop-nextest-python-api> └────────────────────────────────────────────────────────┘
- 32.51 s
gammaloop-nextest-python-api> ┌───────────────────────────────────────────────────────────────────────────────────────────────────────────┐
- 32.51 s
gammaloop-nextest-python-api> │ Cannot start new unlicensed Symbolica instance since there is already another one running on the machine. │
- 32.51 s
gammaloop-nextest-python-api> └───────────────────────────────────────────────────────────────────────────────────────────────────────────┘
- 32.51 s
gammaloop-nextest-python-api>
- 32.51 s
gammaloop-nextest-python-api> stderr:
- 32.51 s
gammaloop-nextest-python-api>
- 32.51 s
gammaloop-nextest-python-api> ┌───────────────────────────────────────────────────────────┐
- 32.51 s
gammaloop-nextest-python-api> │ Could not resolve the IP of the Symbolica license server. │
- 32.51 s
gammaloop-nextest-python-api> │ │
- 32.51 s
gammaloop-nextest-python-api> │ Please check your DNS configuration. │
- 32.51 s
gammaloop-nextest-python-api> └───────────────────────────────────────────────────────────┘
- 32.51 s
gammaloop-nextest-python-api> Error: failed to lookup address information: Temporary failure in name resolution
- 32.51 s
gammaloop-nextest-python-api>
- 32.51 s
gammaloop-nextest-python-api>
- 32.51 s
gammaloop-nextest-python-api> Location:
- 32.51 s
gammaloop-nextest-python-api> tests/tests/test_python_api.rs:156:20
- 32.51 s
gammaloop-nextest-python-api> system-out
- 32.51 s
gammaloop-nextest-python-api> running 1 test
- 32.51 s
gammaloop-nextest-python-api> test python_evaluate_sample_preserves_graph_grouping_and_incoming_pdgs ... FAILED
- 32.51 s
gammaloop-nextest-python-api>
- 32.51 s
gammaloop-nextest-python-api> failures:
- 32.51 s
gammaloop-nextest-python-api>
- 32.51 s
gammaloop-nextest-python-api> failures:
- 32.51 s
gammaloop-nextest-python-api> python_evaluate_sample_preserves_graph_grouping_and_incoming_pdgs
- 32.51 s
gammaloop-nextest-python-api>
- 32.51 s
gammaloop-nextest-python-api> test result: FAILED. 0 passed; 1 failed; 0 ignored; 0 measured; 4 filtered out; finished in 0.11s
- 32.51 s
gammaloop-nextest-python-api> system-err
- 32.51 s
gammaloop-nextest-python-api> Error: Python API test subprocess failed.
- 32.51 s
gammaloop-nextest-python-api> stdout:
- 32.51 s
gammaloop-nextest-python-api> ┌────────────────────────────────────────────────────────┐
- 32.51 s
gammaloop-nextest-python-api> │ You are running a restricted Symbolica instance. │
- 32.51 s
gammaloop-nextest-python-api> │ │
- 32.51 s
gammaloop-nextest-python-api> │ This mode is only permitted for non-commercial use and │
- 32.51 s
gammaloop-nextest-python-api> │ is limited to one instance and core per machine. │
- 32.51 s
gammaloop-nextest-python-api> │ │
- 32.51 s
gammaloop-nextest-python-api> │ Hobbyists can easily acquire a free license key │
- 32.51 s
gammaloop-nextest-python-api> │ that unlocks all cores and removes this banner: │
- 32.51 s
gammaloop-nextest-python-api> │ │
- 32.51 s
gammaloop-nextest-python-api> │ from symbolica import * │
- 32.51 s
gammaloop-nextest-python-api> │ request_hobbyist_license('YOUR_NAME', 'YOUR_EMAIL') │
- 32.51 s
gammaloop-nextest-python-api> │ │
- 32.51 s
gammaloop-nextest-python-api> │ All other users can obtain a free 30-day trial key: │
- 32.51 s
gammaloop-nextest-python-api> │ │
- 32.51 s
gammaloop-nextest-python-api> │ from symbolica import * │
- 32.51 s
gammaloop-nextest-python-api> │ request_trial_license('NAME', 'EMAIL', 'EMPLOYER') │
- 32.51 s
gammaloop-nextest-python-api> │ │
- 32.51 s
gammaloop-nextest-python-api> │ See https://symbolica.io/docs/get_started.html#license │
- 32.51 s
gammaloop-nextest-python-api> └────────────────────────────────────────────────────────┘
- 32.51 s
gammaloop-nextest-python-api> ┌───────────────────────────────────────────────────────────────────────────────────────────────────────────┐
- 32.51 s
gammaloop-nextest-python-api> │ Cannot start new unlicensed Symbolica instance since there is already another one running on the machine. │
- 32.51 s
gammaloop-nextest-python-api> └───────────────────────────────────────────────────────────────────────────────────────────────────────────┘
- 32.51 s
gammaloop-nextest-python-api>
- 32.51 s
gammaloop-nextest-python-api> stderr:
- 32.51 s
gammaloop-nextest-python-api>
- 32.51 s
gammaloop-nextest-python-api> ┌───────────────────────────────────────────────────────────┐
- 32.51 s
gammaloop-nextest-python-api> │ Could not resolve the IP of the Symbolica license server. │
- 32.51 s
gammaloop-nextest-python-api> │ │
- 32.51 s
gammaloop-nextest-python-api> │ Please check your DNS configuration. │
- 32.51 s
gammaloop-nextest-python-api> └───────────────────────────────────────────────────────────┘
- 32.51 s
gammaloop-nextest-python-api> Error: failed to lookup address information: Temporary failure in name resolution
- 32.51 s
gammaloop-nextest-python-api>
- 32.51 s
gammaloop-nextest-python-api>
- 32.51 s
gammaloop-nextest-python-api> Location:
- 32.51 s
gammaloop-nextest-python-api> tests/tests/test_python_api.rs:156:20
- 32.51 s
gammaloop-nextest-python-api>
- 32.51 s
gammaloop-nextest-python-api> 2. gammaloop-integration-tests::test_python_api::python_evaluate_samples_batch_and_momentum_space_have_expected_shape
- 32.51 s
gammaloop-nextest-python-api> failure: test failure with exit code 101
- 32.51 s
gammaloop-nextest-python-api> Error: Python API test subprocess failed.
- 32.51 s
gammaloop-nextest-python-api> stdout:
- 32.51 s
gammaloop-nextest-python-api> ┌────────────────────────────────────────────────────────┐
- 32.51 s
gammaloop-nextest-python-api> │ You are running a restricted Symbolica instance. │
- 32.51 s
gammaloop-nextest-python-api> │ │
- 32.51 s
gammaloop-nextest-python-api> │ This mode is only permitted for non-commercial use and │
- 32.51 s
gammaloop-nextest-python-api> │ is limited to one instance and core per machine. │
- 32.51 s
gammaloop-nextest-python-api> │ │
- 32.51 s
gammaloop-nextest-python-api> │ Hobbyists can easily acquire a free license key │
- 32.51 s
gammaloop-nextest-python-api> │ that unlocks all cores and removes this banner: │
- 32.51 s
gammaloop-nextest-python-api> │ │
- 32.51 s
gammaloop-nextest-python-api> │ from symbolica import * │
- 32.51 s
gammaloop-nextest-python-api> │ request_hobbyist_license('YOUR_NAME', 'YOUR_EMAIL') │
- 32.51 s
gammaloop-nextest-python-api> │ │
- 32.51 s
gammaloop-nextest-python-api> │ All other users can obtain a free 30-day trial key: │
- 32.51 s
gammaloop-nextest-python-api> │ │
- 32.51 s
gammaloop-nextest-python-api> │ from symbolica import * │
- 32.51 s
gammaloop-nextest-python-api> │ request_trial_license('NAME', 'EMAIL', 'EMPLOYER') │
- 32.51 s
gammaloop-nextest-python-api> │ │
- 32.51 s
gammaloop-nextest-python-api> │ See https://symbolica.io/docs/get_started.html#license │
- 32.51 s
gammaloop-nextest-python-api> └────────────────────────────────────────────────────────┘
- 32.51 s
gammaloop-nextest-python-api> ┌───────────────────────────────────────────────────────────────────────────────────────────────────────────┐
- 32.51 s
gammaloop-nextest-python-api> │ Cannot start new unlicensed Symbolica instance since there is already another one running on the machine. │
- 32.51 s
gammaloop-nextest-python-api> └───────────────────────────────────────────────────────────────────────────────────────────────────────────┘
- 32.51 s
gammaloop-nextest-python-api>
- 32.51 s
gammaloop-nextest-python-api> stderr:
- 32.51 s
gammaloop-nextest-python-api>
- 32.51 s
gammaloop-nextest-python-api> ┌───────────────────────────────────────────────────────────┐
- 32.51 s
gammaloop-nextest-python-api> │ Could not resolve the IP of the Symbolica license server. │
- 32.51 s
gammaloop-nextest-python-api> │ │
- 32.51 s
gammaloop-nextest-python-api> │ Please check your DNS configuration. │
- 32.51 s
gammaloop-nextest-python-api> └───────────────────────────────────────────────────────────┘
- 32.51 s
gammaloop-nextest-python-api> Error: failed to lookup address information: Temporary failure in name resolution
- 32.51 s
gammaloop-nextest-python-api>
- 32.51 s
gammaloop-nextest-python-api>
- 32.51 s
gammaloop-nextest-python-api> Location:
- 32.51 s
gammaloop-nextest-python-api> tests/tests/test_python_api.rs:156:20
- 32.51 s
gammaloop-nextest-python-api> system-out
- 32.51 s
gammaloop-nextest-python-api> running 1 test
- 32.51 s
gammaloop-nextest-python-api> test python_evaluate_samples_batch_and_momentum_space_have_expected_shape ... FAILED
- 32.51 s
gammaloop-nextest-python-api>
- 32.51 s
gammaloop-nextest-python-api> failures:
- 32.51 s
gammaloop-nextest-python-api>
- 32.51 s
gammaloop-nextest-python-api> failures:
- 32.51 s
gammaloop-nextest-python-api> python_evaluate_samples_batch_and_momentum_space_have_expected_shape
- 32.51 s
gammaloop-nextest-python-api>
- 32.51 s
gammaloop-nextest-python-api> test result: FAILED. 0 passed; 1 failed; 0 ignored; 0 measured; 4 filtered out; finished in 0.11s
- 32.51 s
gammaloop-nextest-python-api> system-err
- 32.51 s
gammaloop-nextest-python-api> Error: Python API test subprocess failed.
- 32.51 s
gammaloop-nextest-python-api> stdout:
- 32.51 s
gammaloop-nextest-python-api> ┌────────────────────────────────────────────────────────┐
- 32.51 s
gammaloop-nextest-python-api> │ You are running a restricted Symbolica instance. │
- 32.51 s
gammaloop-nextest-python-api> │ │
- 32.51 s
gammaloop-nextest-python-api> │ This mode is only permitted for non-commercial use and │
- 32.51 s
gammaloop-nextest-python-api> │ is limited to one instance and core per machine. │
- 32.51 s
gammaloop-nextest-python-api> │ │
- 32.51 s
gammaloop-nextest-python-api> │ Hobbyists can easily acquire a free license key │
- 32.51 s
gammaloop-nextest-python-api> │ that unlocks all cores and removes this banner: │
- 32.51 s
gammaloop-nextest-python-api> │ │
- 32.51 s
gammaloop-nextest-python-api> │ from symbolica import * │
- 32.51 s
gammaloop-nextest-python-api> │ request_hobbyist_license('YOUR_NAME', 'YOUR_EMAIL') │
- 32.51 s
gammaloop-nextest-python-api> │ │
- 32.51 s
gammaloop-nextest-python-api> │ All other users can obtain a free 30-day trial key: │
- 32.51 s
gammaloop-nextest-python-api> │ │
- 32.51 s
gammaloop-nextest-python-api> │ from symbolica import * │
- 32.51 s
gammaloop-nextest-python-api> │ request_trial_license('NAME', 'EMAIL', 'EMPLOYER') │
- 32.51 s
gammaloop-nextest-python-api> │ │
- 32.51 s
gammaloop-nextest-python-api> │ See https://symbolica.io/docs/get_started.html#license │
- 32.51 s
gammaloop-nextest-python-api> └────────────────────────────────────────────────────────┘
- 32.51 s
gammaloop-nextest-python-api> ┌───────────────────────────────────────────────────────────────────────────────────────────────────────────┐
- 32.51 s
gammaloop-nextest-python-api> │ Cannot start new unlicensed Symbolica instance since there is already another one running on the machine. │
- 32.51 s
gammaloop-nextest-python-api> └───────────────────────────────────────────────────────────────────────────────────────────────────────────┘
- 32.51 s
gammaloop-nextest-python-api>
- 32.51 s
gammaloop-nextest-python-api> stderr:
- 32.51 s
gammaloop-nextest-python-api>
- 32.51 s
gammaloop-nextest-python-api> ┌───────────────────────────────────────────────────────────┐
- 32.51 s
gammaloop-nextest-python-api> │ Could not resolve the IP of the Symbolica license server. │
- 32.51 s
gammaloop-nextest-python-api> │ │
- 32.51 s
gammaloop-nextest-python-api> │ Please check your DNS configuration. │
- 32.51 s
gammaloop-nextest-python-api> └───────────────────────────────────────────────────────────┘
- 32.51 s
gammaloop-nextest-python-api> Error: failed to lookup address information: Temporary failure in name resolution
- 32.51 s
gammaloop-nextest-python-api>
- 32.51 s
gammaloop-nextest-python-api>
- 32.51 s
gammaloop-nextest-python-api> Location:
- 32.51 s
gammaloop-nextest-python-api> tests/tests/test_python_api.rs:156:20
- 32.51 s
gammaloop-nextest-python-api>
- 32.51 s
gammaloop-nextest-python-api> 3. gammaloop-integration-tests::test_python_api::python_evaluate_sample_honors_generate_events_and_observable_snapshots
- 32.51 s
gammaloop-nextest-python-api> failure: test failure with exit code 101
- 32.51 s
gammaloop-nextest-python-api> Error: Python API test subprocess failed.
- 32.51 s
gammaloop-nextest-python-api> stdout:
- 32.51 s
gammaloop-nextest-python-api> ┌────────────────────────────────────────────────────────┐
- 32.51 s
gammaloop-nextest-python-api> │ You are running a restricted Symbolica instance. │
- 32.51 s
gammaloop-nextest-python-api> │ │
- 32.51 s
gammaloop-nextest-python-api> │ This mode is only permitted for non-commercial use and │
- 32.51 s
gammaloop-nextest-python-api> │ is limited to one instance and core per machine. │
- 32.51 s
gammaloop-nextest-python-api> │ │
- 32.51 s
gammaloop-nextest-python-api> │ Hobbyists can easily acquire a free license key │
- 32.51 s
gammaloop-nextest-python-api> │ that unlocks all cores and removes this banner: │
- 32.51 s
gammaloop-nextest-python-api> │ │
- 32.51 s
gammaloop-nextest-python-api> │ from symbolica import * │
- 32.51 s
gammaloop-nextest-python-api> │ request_hobbyist_license('YOUR_NAME', 'YOUR_EMAIL') │
- 32.51 s
gammaloop-nextest-python-api> │ │
- 32.51 s
gammaloop-nextest-python-api> │ All other users can obtain a free 30-day trial key: │
- 32.51 s
gammaloop-nextest-python-api> │ │
- 32.51 s
gammaloop-nextest-python-api> │ from symbolica import * │
- 32.51 s
gammaloop-nextest-python-api> │ request_trial_license('NAME', 'EMAIL', 'EMPLOYER') │
- 32.51 s
gammaloop-nextest-python-api> │ │
- 32.51 s
gammaloop-nextest-python-api> │ See https://symbolica.io/docs/get_started.html#license │
- 32.51 s
gammaloop-nextest-python-api> └────────────────────────────────────────────────────────┘
- 32.51 s
gammaloop-nextest-python-api> ┌───────────────────────────────────────────────────────────────────────────────────────────────────────────┐
- 32.51 s
gammaloop-nextest-python-api> │ Cannot start new unlicensed Symbolica instance since there is already another one running on the machine. │
- 32.51 s
gammaloop-nextest-python-api> └───────────────────────────────────────────────────────────────────────────────────────────────────────────┘
- 32.51 s
gammaloop-nextest-python-api>
- 32.51 s
gammaloop-nextest-python-api> stderr:
- 32.51 s
gammaloop-nextest-python-api>
- 32.51 s
gammaloop-nextest-python-api> ┌───────────────────────────────────────────────────────────┐
- 32.51 s
gammaloop-nextest-python-api> │ Could not resolve the IP of the Symbolica license server. │
- 32.51 s
gammaloop-nextest-python-api> │ │
- 32.51 s
gammaloop-nextest-python-api> │ Please check your DNS configuration. │
- 32.51 s
gammaloop-nextest-python-api> └───────────────────────────────────────────────────────────┘
- 32.51 s
gammaloop-nextest-python-api> Error: failed to lookup address information: Temporary failure in name resolution
- 32.51 s
gammaloop-nextest-python-api>
- 32.51 s
gammaloop-nextest-python-api>
- 32.51 s
gammaloop-nextest-python-api> Location:
- 32.51 s
gammaloop-nextest-python-api> tests/tests/test_python_api.rs:156:20
- 32.51 s
gammaloop-nextest-python-api> system-out
- 32.51 s
gammaloop-nextest-python-api> running 1 test
- 32.51 s
gammaloop-nextest-python-api> test python_evaluate_sample_honors_generate_events_and_observable_snapshots ... FAILED
- 32.51 s
gammaloop-nextest-python-api>
- 32.51 s
gammaloop-nextest-python-api> failures:
- 32.51 s
gammaloop-nextest-python-api>
- 32.51 s
gammaloop-nextest-python-api> failures:
- 32.51 s
gammaloop-nextest-python-api> python_evaluate_sample_honors_generate_events_and_observable_snapshots
- 32.51 s
gammaloop-nextest-python-api>
- 32.51 s
gammaloop-nextest-python-api> test result: FAILED. 0 passed; 1 failed; 0 ignored; 0 measured; 4 filtered out; finished in 0.11s
- 32.51 s
gammaloop-nextest-python-api> system-err
- 32.51 s
gammaloop-nextest-python-api> Error: Python API test subprocess failed.
- 32.51 s
gammaloop-nextest-python-api> stdout:
- 32.51 s
gammaloop-nextest-python-api> ┌────────────────────────────────────────────────────────┐
- 32.51 s
gammaloop-nextest-python-api> │ You are running a restricted Symbolica instance. │
- 32.51 s
gammaloop-nextest-python-api> │ │
- 32.51 s
gammaloop-nextest-python-api> │ This mode is only permitted for non-commercial use and │
- 32.51 s
gammaloop-nextest-python-api> │ is limited to one instance and core per machine. │
- 32.51 s
gammaloop-nextest-python-api> │ │
- 32.51 s
gammaloop-nextest-python-api> │ Hobbyists can easily acquire a free license key │
- 32.51 s
gammaloop-nextest-python-api> │ that unlocks all cores and removes this banner: │
- 32.51 s
gammaloop-nextest-python-api> │ │
- 32.51 s
gammaloop-nextest-python-api> │ from symbolica import * │
- 32.51 s
gammaloop-nextest-python-api> │ request_hobbyist_license('YOUR_NAME', 'YOUR_EMAIL') │
- 32.51 s
gammaloop-nextest-python-api> │ │
- 32.51 s
gammaloop-nextest-python-api> │ All other users can obtain a free 30-day trial key: │
- 32.51 s
gammaloop-nextest-python-api> │ │
- 32.51 s
gammaloop-nextest-python-api> │ from symbolica import * │
- 32.51 s
gammaloop-nextest-python-api> │ request_trial_license('NAME', 'EMAIL', 'EMPLOYER') │
- 32.51 s
gammaloop-nextest-python-api> │ │
- 32.51 s
gammaloop-nextest-python-api> │ See https://symbolica.io/docs/get_started.html#license │
- 32.51 s
gammaloop-nextest-python-api> └────────────────────────────────────────────────────────┘
- 32.51 s
gammaloop-nextest-python-api> ┌───────────────────────────────────────────────────────────────────────────────────────────────────────────┐
- 32.51 s
gammaloop-nextest-python-api> │ Cannot start new unlicensed Symbolica instance since there is already another one running on the machine. │
- 32.51 s
gammaloop-nextest-python-api> └───────────────────────────────────────────────────────────────────────────────────────────────────────────┘
- 32.51 s
gammaloop-nextest-python-api>
- 32.51 s
gammaloop-nextest-python-api> stderr:
- 32.51 s
gammaloop-nextest-python-api>
- 32.51 s
gammaloop-nextest-python-api> ┌───────────────────────────────────────────────────────────┐
- 32.51 s
gammaloop-nextest-python-api> │ Could not resolve the IP of the Symbolica license server. │
- 32.51 s
gammaloop-nextest-python-api> │ │
- 32.51 s
gammaloop-nextest-python-api> │ Please check your DNS configuration. │
- 32.51 s
gammaloop-nextest-python-api> └───────────────────────────────────────────────────────────┘
- 32.51 s
gammaloop-nextest-python-api> Error: failed to lookup address information: Temporary failure in name resolution
- 32.51 s
gammaloop-nextest-python-api>
- 32.51 s
gammaloop-nextest-python-api>
- 32.51 s
gammaloop-nextest-python-api> Location:
- 32.51 s
gammaloop-nextest-python-api> tests/tests/test_python_api.rs:156:20
- 32.51 s
gammaloop-nextest-python-api>
- 32.51 s
gammaloop-nextest-python-api> 4. gammaloop-integration-tests::test_python_api::python_session_getters_return_live_toml_and_command_blocks
- 32.51 s
gammaloop-nextest-python-api> failure: test failure with exit code 101
- 32.51 s
gammaloop-nextest-python-api> Error: Python API test subprocess failed.
- 32.51 s
gammaloop-nextest-python-api> stdout:
- 32.51 s
gammaloop-nextest-python-api> ┌────────────────────────────────────────────────────────┐
- 32.51 s
gammaloop-nextest-python-api> │ You are running a restricted Symbolica instance. │
- 32.51 s
gammaloop-nextest-python-api> │ │
- 32.51 s
gammaloop-nextest-python-api> │ This mode is only permitted for non-commercial use and │
- 32.51 s
gammaloop-nextest-python-api> │ is limited to one instance and core per machine. │
- 32.51 s
gammaloop-nextest-python-api> │ │
- 32.51 s
gammaloop-nextest-python-api> │ Hobbyists can easily acquire a free license key │
- 32.51 s
gammaloop-nextest-python-api> │ that unlocks all cores and removes this banner: │
- 32.51 s
gammaloop-nextest-python-api> │ │
- 32.51 s
gammaloop-nextest-python-api> │ from symbolica import * │
- 32.51 s
gammaloop-nextest-python-api> │ request_hobbyist_license('YOUR_NAME', 'YOUR_EMAIL') │
- 32.51 s
gammaloop-nextest-python-api> │ │
- 32.51 s
gammaloop-nextest-python-api> │ All other users can obtain a free 30-day trial key: │
- 32.51 s
gammaloop-nextest-python-api> │ │
- 32.51 s
gammaloop-nextest-python-api> │ from symbolica import * │
- 32.51 s
gammaloop-nextest-python-api> │ request_trial_license('NAME', 'EMAIL', 'EMPLOYER') │
- 32.51 s
gammaloop-nextest-python-api> │ │
- 32.51 s
gammaloop-nextest-python-api> │ See https://symbolica.io/docs/get_started.html#license │
- 32.51 s
gammaloop-nextest-python-api> └────────────────────────────────────────────────────────┘
- 32.51 s
gammaloop-nextest-python-api> ┌───────────────────────────────────────────────────────────────────────────────────────────────────────────┐
- 32.51 s
gammaloop-nextest-python-api> │ Cannot start new unlicensed Symbolica instance since there is already another one running on the machine. │
- 32.51 s
gammaloop-nextest-python-api> └───────────────────────────────────────────────────────────────────────────────────────────────────────────┘
- 32.51 s
gammaloop-nextest-python-api>
- 32.51 s
gammaloop-nextest-python-api> stderr:
- 32.51 s
gammaloop-nextest-python-api>
- 32.51 s
gammaloop-nextest-python-api> ┌───────────────────────────────────────────────────────────┐
- 32.51 s
gammaloop-nextest-python-api> │ Could not resolve the IP of the Symbolica license server. │
- 32.51 s
gammaloop-nextest-python-api> │ │
- 32.51 s
gammaloop-nextest-python-api> │ Please check your DNS configuration. │
- 32.51 s
gammaloop-nextest-python-api> └───────────────────────────────────────────────────────────┘
- 32.51 s
gammaloop-nextest-python-api> Error: failed to lookup address information: Temporary failure in name resolution
- 32.51 s
gammaloop-nextest-python-api>
- 32.51 s
gammaloop-nextest-python-api>
- 32.51 s
gammaloop-nextest-python-api> Location:
- 32.51 s
gammaloop-nextest-python-api> tests/tests/test_python_api.rs:156:20
- 32.51 s
gammaloop-nextest-python-api> system-out
- 32.51 s
gammaloop-nextest-python-api> running 1 test
- 32.51 s
gammaloop-nextest-python-api> test python_session_getters_return_live_toml_and_command_blocks ... FAILED
- 32.51 s
gammaloop-nextest-python-api>
- 32.51 s
gammaloop-nextest-python-api> failures:
- 32.51 s
gammaloop-nextest-python-api>
- 32.52 s
gammaloop-nextest-python-api> failures:
- 32.52 s
gammaloop-nextest-python-api> python_session_getters_return_live_toml_and_command_blocks
- 32.52 s
gammaloop-nextest-python-api>
- 32.52 s
gammaloop-nextest-python-api> test result: FAILED. 0 passed; 1 failed; 0 ignored; 0 measured; 4 filtered out; finished in 0.11s
- 32.52 s
gammaloop-nextest-python-api> system-err
- 32.52 s
gammaloop-nextest-python-api> Error: Python API test subprocess failed.
- 32.52 s
gammaloop-nextest-python-api> stdout:
- 32.52 s
gammaloop-nextest-python-api> ┌────────────────────────────────────────────────────────┐
- 32.52 s
gammaloop-nextest-python-api> │ You are running a restricted Symbolica instance. │
- 32.52 s
gammaloop-nextest-python-api> │ │
- 32.52 s
gammaloop-nextest-python-api> │ This mode is only permitted for non-commercial use and │
- 32.52 s
gammaloop-nextest-python-api> │ is limited to one instance and core per machine. │
- 32.52 s
gammaloop-nextest-python-api> │ │
- 32.52 s
gammaloop-nextest-python-api> │ Hobbyists can easily acquire a free license key │
- 32.52 s
gammaloop-nextest-python-api> │ that unlocks all cores and removes this banner: │
- 32.52 s
gammaloop-nextest-python-api> │ │
- 32.52 s
gammaloop-nextest-python-api> │ from symbolica import * │
- 32.52 s
gammaloop-nextest-python-api> │ request_hobbyist_license('YOUR_NAME', 'YOUR_EMAIL') │
- 32.52 s
gammaloop-nextest-python-api> │ │
- 32.52 s
gammaloop-nextest-python-api> │ All other users can obtain a free 30-day trial key: │
- 32.52 s
gammaloop-nextest-python-api> │ │
- 32.52 s
gammaloop-nextest-python-api> │ from symbolica import * │
- 32.52 s
gammaloop-nextest-python-api> │ request_trial_license('NAME', 'EMAIL', 'EMPLOYER') │
- 32.52 s
gammaloop-nextest-python-api> │ │
- 32.52 s
gammaloop-nextest-python-api> │ See https://symbolica.io/docs/get_started.html#license │
- 32.52 s
gammaloop-nextest-python-api> └────────────────────────────────────────────────────────┘
- 32.52 s
gammaloop-nextest-python-api> ┌───────────────────────────────────────────────────────────────────────────────────────────────────────────┐
- 32.52 s
gammaloop-nextest-python-api> │ Cannot start new unlicensed Symbolica instance since there is already another one running on the machine. │
- 32.52 s
gammaloop-nextest-python-api> └───────────────────────────────────────────────────────────────────────────────────────────────────────────┘
- 32.52 s
gammaloop-nextest-python-api>
- 32.52 s
gammaloop-nextest-python-api> stderr:
- 32.52 s
gammaloop-nextest-python-api>
- 32.52 s
gammaloop-nextest-python-api> ┌───────────────────────────────────────────────────────────┐
- 32.52 s
gammaloop-nextest-python-api> │ Could not resolve the IP of the Symbolica license server. │
- 32.52 s
gammaloop-nextest-python-api> │ │
- 32.52 s
gammaloop-nextest-python-api> │ Please check your DNS configuration. │
- 32.52 s
gammaloop-nextest-python-api> └───────────────────────────────────────────────────────────┘
- 32.52 s
gammaloop-nextest-python-api> Error: failed to lookup address information: Temporary failure in name resolution
- 32.52 s
gammaloop-nextest-python-api>
- 32.52 s
gammaloop-nextest-python-api>
- 32.52 s
gammaloop-nextest-python-api> Location:
- 32.52 s
gammaloop-nextest-python-api> tests/tests/test_python_api.rs:156:20
- 32.52 s
gammaloop-nextest-python-api> =========================================
- 32.55 s
[2 built (1 failed), 12 error: Cannot build '/nix/store/nmwgfm0zigizp5byy173df7l99i9kddz-gammaloop-nextest-python-api.drv'.
- 32.55 s
Reason: builder failed with exit code 100.
- 32.55 s
Output paths:
- 32.55 s
/nix/store/0wmifwk23rqakrfsxal3kaig8chq1a34-gammaloop-nextest-python-api
- 32.55 s
Last 781 log lines:
- 32.55 s
> Extracting 1 binary, 1 build script output directory, and 3 linked paths to /build/nextest-archive-rsLJsz
- 32.55 s
> Extracted 18 files to /build/nextest-archive-rsLJsz in 0.06s
- 32.55 s
> ------------
- 32.55 s
> Nextest run ID 1b80046f-e435-4e3a-a9bc-58cbcbf77210 with nextest profile: ci_gammaloop
- 32.55 s
> Starting 5 tests across 1 binary
- 32.55 s
> FAIL [ 0.110s] (1/5) gammaloop-integration-tests::test_python_api python_evaluate_sample_preserves_graph_grouping_and_incoming_pdgs
- 32.55 s
> stdout ---
- 32.55 s
>
- 32.55 s
> running 1 test
- 32.55 s
> test python_evaluate_sample_preserves_graph_grouping_and_incoming_pdgs ... FAILED
- 32.55 s
>
- 32.55 s
> failures:
- 32.55 s
>
- 32.55 s
> failures:
- 32.55 s
> python_evaluate_sample_preserves_graph_grouping_and_incoming_pdgs
- 32.55 s
>
- 32.55 s
> test result: FAILED. 0 passed; 1 failed; 0 ignored; 0 measured; 4 filtered out; finished in 0.11s
- 32.55 s
>
- 32.55 s
> stderr ---
- 32.55 s
> Error: Python API test subprocess failed.
- 32.55 s
> stdout:
- 32.55 s
> ┌────────────────────────────────────────────────────────┐
- 32.55 s
> │ You are running a restricted Symbolica instance. │
- 32.55 s
> │ │
- 32.55 s
> │ This mode is only permitted for non-commercial use and │
- 32.55 s
> │ is limited to one instance and core per machine. │
- 32.55 s
> │ │
- 32.55 s
> │ Hobbyists can easily acquire a free license key │
- 32.55 s
> │ that unlocks all cores and removes this banner: │
- 32.55 s
> │ │
- 32.55 s
> │ from symbolica import * │
- 32.55 s
> │ request_hobbyist_license('YOUR_NAME', 'YOUR_EMAIL') │
- 32.55 s
> │ │
- 32.55 s
> │ All other users can obtain a free 30-day trial key: │
- 32.55 s
> │ │
- 32.55 s
> │ from symbolica import * │
- 32.55 s
> │ request_trial_license('NAME', 'EMAIL', 'EMPLOYER') │
- 32.55 s
> │ │
- 32.55 s
> │ See https://symbolica.io/docs/get_started.html#license │
- 32.55 s
> └────────────────────────────────────────────────────────┘
- 32.55 s
> ┌───────────────────────────────────────────────────────────────────────────────────────────────────────────┐
- 32.55 s
> │ Cannot start new unlicensed Symbolica instance since there is already another one running on the machine. │
- 32.55 s
> └───────────────────────────────────────────────────────────────────────────────────────────────────────────┘
- 32.55 s
>
- 32.55 s
> stderr:
- 32.55 s
>
- 32.55 s
> ┌───────────────────────────────────────────────────────────┐
- 32.55 s
> │ Could not resolve the IP of the Symbolica license server. │
- 32.55 s
> │ │
- 32.55 s
> │ Please check your DNS configuration. │
- 32.55 s
> └───────────────────────────────────────────────────────────┘
- 32.55 s
> Error: failed to lookup address information: Temporary failure in name resolution
- 32.55 s
>
- 32.55 s
>
- 32.55 s
> Location:
- 32.55 s
> tests/tests/test_python_api.rs:156:20
- 32.55 s
>
- 32.56 s
> FAIL [ 0.110s] (2/5) gammaloop-integration-tests::test_python_api python_evaluate_samples_batch_and_momentum_space_have_expected_shape
- 32.56 s
> stdout ---
- 32.56 s
>
- 32.56 s
> running 1 test
- 32.56 s
> test python_evaluate_samples_batch_and_momentum_space_have_expected_shape ... FAILED
- 32.56 s
>
- 32.56 s
> failures:
- 32.56 s
>
- 32.56 s
> failures:
- 32.56 s
> python_evaluate_samples_batch_and_momentum_space_have_expected_shape
- 32.56 s
>
- 32.56 s
> test result: FAILED. 0 passed; 1 failed; 0 ignored; 0 measured; 4 filtered out; finished in 0.11s
- 32.56 s
>
- 32.56 s
> stderr ---
- 32.56 s
> Error: Python API test subprocess failed.
- 32.56 s
> stdout:
- 32.56 s
> ┌────────────────────────────────────────────────────────┐
- 32.56 s
> │ You are running a restricted Symbolica instance. │
- 32.56 s
> │ │
- 32.56 s
> │ This mode is only permitted for non-commercial use and │
- 32.56 s
> │ is limited to one instance and core per machine. │
- 32.56 s
> │ │
- 32.56 s
> │ Hobbyists can easily acquire a free license key │
- 32.56 s
> │ that unlocks all cores and removes this banner: │
- 32.56 s
> │ │
- 32.56 s
> │ from symbolica import * │
- 32.56 s
> │ request_hobbyist_license('YOUR_NAME', 'YOUR_EMAIL') │
- 32.56 s
> │ │
- 32.56 s
> │ All other users can obtain a free 30-day trial key: │
- 32.56 s
> │ │
- 32.56 s
> │ from symbolica import * │
- 32.56 s
> │ request_trial_license('NAME', 'EMAIL', 'EMPLOYER') │
- 32.56 s
> │ │
- 32.56 s
> │ See https://symbolica.io/docs/get_started.html#license │
- 32.56 s
> └────────────────────────────────────────────────────────┘
- 32.56 s
> ┌───────────────────────────────────────────────────────────────────────────────────────────────────────────┐
- 32.56 s
> │ Cannot start new unlicensed Symbolica instance since there is already another one running on the machine. │
- 32.56 s
> └───────────────────────────────────────────────────────────────────────────────────────────────────────────┘
- 32.56 s
>
- 32.56 s
> stderr:
- 32.56 s
>
- 32.56 s
> ┌───────────────────────────────────────────────────────────┐
- 32.56 s
> │ Could not resolve the IP of the Symbolica license server. │
- 32.56 s
> │ │
- 32.56 s
> │ Please check your DNS configuration. │
- 32.56 s
> └───────────────────────────────────────────────────────────┘
- 32.56 s
> Error: failed to lookup address information: Temporary failure in name resolution
- 32.56 s
>
- 32.56 s
>
- 32.56 s
> Location:
- 32.56 s
> tests/tests/test_python_api.rs:156:20
- 32.56 s
>
- 32.56 s
> FAIL [ 0.110s] (3/5) gammaloop-integration-tests::test_python_api python_evaluate_sample_honors_generate_events_and_observable_snapshots
- 32.56 s
> stdout ---
- 32.56 s
>
- 32.56 s
> running 1 test
- 32.56 s
> test python_evaluate_sample_honors_generate_events_and_observable_snapshots ... FAILED
- 32.56 s
>
- 32.56 s
> failures:
- 32.56 s
>
- 32.56 s
> failures:
- 32.56 s
> python_evaluate_sample_honors_generate_events_and_observable_snapshots
- 32.56 s
>
- 32.56 s
> test result: FAILED. 0 passed; 1 failed; 0 ignored; 0 measured; 4 filtered out; finished in 0.11s
- 32.56 s
>
- 32.56 s
> stderr ---
- 32.56 s
> Error: Python API test subprocess failed.
- 32.56 s
> stdout:
- 32.56 s
> ┌────────────────────────────────────────────────────────┐
- 32.56 s
> │ You are running a restricted Symbolica instance. │
- 32.56 s
> │ │
- 32.56 s
> │ This mode is only permitted for non-commercial use and │
- 32.56 s
> │ is limited to one instance and core per machine. │
- 32.56 s
> │ │
- 32.56 s
> │ Hobbyists can easily acquire a free license key │
- 32.56 s
> │ that unlocks all cores and removes this banner: │
- 32.56 s
> │ │
- 32.56 s
> │ from symbolica import * │
- 32.56 s
> │ request_hobbyist_license('YOUR_NAME', 'YOUR_EMAIL') │
- 32.56 s
> │ │
- 32.56 s
> │ All other users can obtain a free 30-day trial key: │
- 32.56 s
> │ │
- 32.56 s
> │ from symbolica import * │
- 32.56 s
> │ request_trial_license('NAME', 'EMAIL', 'EMPLOYER') │
- 32.56 s
> │ │
- 32.56 s
> │ See https://symbolica.io/docs/get_started.html#license │
- 32.56 s
> └────────────────────────────────────────────────────────┘
- 32.56 s
> ┌───────────────────────────────────────────────────────────────────────────────────────────────────────────┐
- 32.56 s
> │ Cannot start new unlicensed Symbolica instance since there is already another one running on the machine. │
- 32.56 s
> └───────────────────────────────────────────────────────────────────────────────────────────────────────────┘
- 32.56 s
>
- 32.56 s
> stderr:
- 32.56 s
>
- 32.56 s
> ┌───────────────────────────────────────────────────────────┐
- 32.56 s
> │ Could not resolve the IP of the Symbolica license server. │
- 32.56 s
> │ │
- 32.56 s
> │ Please check your DNS configuration. │
- 32.56 s
> └───────────────────────────────────────────────────────────┘
- 32.56 s
> Error: failed to lookup address information: Temporary failure in name resolution
- 32.56 s
>
- 32.56 s
>
- 32.56 s
> Location:
- 32.56 s
> tests/tests/test_python_api.rs:156:20
- 32.56 s
>
- 32.56 s
> FAIL [ 0.118s] (4/5) gammaloop-integration-tests::test_python_api python_session_getters_return_live_toml_and_command_blocks
- 32.56 s
> stdout ---
- 32.56 s
>
- 32.56 s
> running 1 test
- 32.56 s
> test python_session_getters_return_live_toml_and_command_blocks ... FAILED
- 32.56 s
>
- 32.56 s
> failures:
- 32.56 s
>
- 32.56 s
> failures:
- 32.56 s
> python_session_getters_return_live_toml_and_command_blocks
- 32.56 s
>
- 32.56 s
> test result: FAILED. 0 passed; 1 failed; 0 ignored; 0 measured; 4 filtered out; finished in 0.11s
- 32.56 s
>
- 32.56 s
> stderr ---
- 32.56 s
> Error: Python API test subprocess failed.
- 32.56 s
> stdout:
- 32.56 s
> ┌────────────────────────────────────────────────────────┐
- 32.56 s
> │ You are running a restricted Symbolica instance. │
- 32.56 s
> │ │
- 32.56 s
> │ This mode is only permitted for non-commercial use and │
- 32.56 s
> │ is limited to one instance and core per machine. │
- 32.56 s
> │ │
- 32.56 s
> │ Hobbyists can easily acquire a free license key │
- 32.56 s
> │ that unlocks all cores and removes this banner: │
- 32.56 s
> │ │
- 32.56 s
> │ from symbolica import * │
- 32.56 s
> │ request_hobbyist_license('YOUR_NAME', 'YOUR_EMAIL') │
- 32.56 s
> │ │
- 32.56 s
> │ All other users can obtain a free 30-day trial key: │
- 32.56 s
> │ │
- 32.56 s
> │ from symbolica import * │
- 32.56 s
> │ request_trial_license('NAME', 'EMAIL', 'EMPLOYER') │
- 32.56 s
> │ │
- 32.56 s
> │ See https://symbolica.io/docs/get_started.html#license │
- 32.56 s
> └────────────────────────────────────────────────────────┘
- 32.56 s
> ┌───────────────────────────────────────────────────────────────────────────────────────────────────────────┐
- 32.56 s
> │ Cannot start new unlicensed Symbolica instance since there is already another one running on the machine. │
- 32.56 s
> └───────────────────────────────────────────────────────────────────────────────────────────────────────────┘
- 32.56 s
>
- 32.56 s
> stderr:
- 32.56 s
>
- 32.56 s
> ┌───────────────────────────────────────────────────────────┐
- 32.56 s
> │ Could not resolve the IP of the Symbolica license server. │
- 32.56 s
> │ │
- 32.56 s
> │ Please check your DNS configuration. │
- 32.56 s
> └───────────────────────────────────────────────────────────┘
- 32.56 s
> Error: failed to lookup address information: Temporary failure in name resolution
- 32.56 s
>
- 32.56 s
>
- 32.56 s
> Location:
- 32.56 s
> tests/tests/test_python_api.rs:156:20
- 32.56 s
>
- 32.56 s
> ------------
- 32.56 s
> Summary [ 0.274s] 5 tests run: 1 passed, 4 failed, 0 skipped
- 32.56 s
> FAIL [ 0.110s] (1/5) gammaloop-integration-tests::test_python_api python_evaluate_sample_preserves_graph_grouping_and_incoming_pdgs
- 32.56 s
> stdout ---
- 32.56 s
>
- 32.56 s
> running 1 test
- 32.56 s
> test python_evaluate_sample_preserves_graph_grouping_and_incoming_pdgs ... FAILED
- 32.56 s
>
- 32.56 s
> failures:
- 32.56 s
>
- 32.56 s
> failures:
- 32.56 s
> python_evaluate_sample_preserves_graph_grouping_and_incoming_pdgs
- 32.56 s
>
- 32.56 s
> test result: FAILED. 0 passed; 1 failed; 0 ignored; 0 measured; 4 filtered out; finished in 0.11s
- 32.56 s
>
- 32.56 s
> stderr ---
- 32.56 s
> Error: Python API test subprocess failed.
- 32.56 s
> stdout:
- 32.56 s
> ┌────────────────────────────────────────────────────────┐
- 32.56 s
> │ You are running a restricted Symbolica instance. │
- 32.56 s
> │ │
- 32.56 s
> │ This mode is only permitted for non-commercial use and │
- 32.56 s
> │ is limited to one instance and core per machine. │
- 32.56 s
> │ │
- 32.56 s
> │ Hobbyists can easily acquire a free license key │
- 32.56 s
> │ that unlocks all cores and removes this banner: │
- 32.56 s
> │ │
- 32.56 s
> │ from symbolica import * │
- 32.56 s
> │ request_hobbyist_license('YOUR_NAME', 'YOUR_EMAIL') │
- 32.56 s
> │ │
- 32.56 s
> │ All other users can obtain a free 30-day trial key: │
- 32.56 s
> │ │
- 32.56 s
> │ from symbolica import * │
- 32.56 s
> │ request_trial_license('NAME', 'EMAIL', 'EMPLOYER') │
- 32.56 s
> │ │
- 32.56 s
> │ See https://symbolica.io/docs/get_started.html#license │
- 32.56 s
> └────────────────────────────────────────────────────────┘
- 32.56 s
> ┌───────────────────────────────────────────────────────────────────────────────────────────────────────────┐
- 32.56 s
> │ Cannot start new unlicensed Symbolica instance since there is already another one running on the machine. │
- 32.56 s
> └───────────────────────────────────────────────────────────────────────────────────────────────────────────┘
- 32.56 s
>
- 32.56 s
> stderr:
- 32.56 s
>
- 32.56 s
> ┌───────────────────────────────────────────────────────────┐
- 32.56 s
> │ Could not resolve the IP of the Symbolica license server. │
- 32.56 s
> │ │
- 32.56 s
> │ Please check your DNS configuration. │
- 32.56 s
> └───────────────────────────────────────────────────────────┘
- 32.56 s
> Error: failed to lookup address information: Temporary failure in name resolution
- 32.56 s
>
- 32.56 s
>
- 32.56 s
> Location:
- 32.56 s
> tests/tests/test_python_api.rs:156:20
- 32.56 s
>
- 32.56 s
> FAIL [ 0.110s] (2/5) gammaloop-integration-tests::test_python_api python_evaluate_samples_batch_and_momentum_space_have_expected_shape
- 32.56 s
> stdout ---
- 32.56 s
>
- 32.56 s
> running 1 test
- 32.56 s
> test python_evaluate_samples_batch_and_momentum_space_have_expected_shape ... FAILED
- 32.56 s
>
- 32.56 s
> failures:
- 32.56 s
>
- 32.56 s
> failures:
- 32.56 s
> python_evaluate_samples_batch_and_momentum_space_have_expected_shape
- 32.56 s
>
- 32.56 s
> test result: FAILED. 0 passed; 1 failed; 0 ignored; 0 measured; 4 filtered out; finished in 0.11s
- 32.56 s
>
- 32.56 s
> stderr ---
- 32.56 s
> Error: Python API test subprocess failed.
- 32.56 s
> stdout:
- 32.56 s
> ┌────────────────────────────────────────────────────────┐
- 32.56 s
> │ You are running a restricted Symbolica instance. │
- 32.56 s
> │ │
- 32.56 s
> │ This mode is only permitted for non-commercial use and │
- 32.56 s
> │ is limited to one instance and core per machine. │
- 32.56 s
> │ │
- 32.56 s
> │ Hobbyists can easily acquire a free license key │
- 32.56 s
> │ that unlocks all cores and removes this banner: │
- 32.56 s
> │ │
- 32.56 s
> │ from symbolica import * │
- 32.56 s
> │ request_hobbyist_license('YOUR_NAME', 'YOUR_EMAIL') │
- 32.56 s
> │ │
- 32.56 s
> │ All other users can obtain a free 30-day trial key: │
- 32.56 s
> │ │
- 32.56 s
> │ from symbolica import * │
- 32.56 s
> │ request_trial_license('NAME', 'EMAIL', 'EMPLOYER') │
- 32.56 s
> │ │
- 32.56 s
> │ See https://symbolica.io/docs/get_started.html#license │
- 32.56 s
> └────────────────────────────────────────────────────────┘
- 32.56 s
> ┌───────────────────────────────────────────────────────────────────────────────────────────────────────────┐
- 32.56 s
> │ Cannot start new unlicensed Symbolica instance since there is already another one running on the machine. │
- 32.56 s
> └───────────────────────────────────────────────────────────────────────────────────────────────────────────┘
- 32.56 s
>
- 32.56 s
> stderr:
- 32.56 s
>
- 32.56 s
> ┌───────────────────────────────────────────────────────────┐
- 32.56 s
> │ Could not resolve the IP of the Symbolica license server. │
- 32.56 s
> │ │
- 32.56 s
> │ Please check your DNS configuration. │
- 32.56 s
> └───────────────────────────────────────────────────────────┘
- 32.56 s
> Error: failed to lookup address information: Temporary failure in name resolution
- 32.56 s
>
- 32.56 s
>
- 32.56 s
> Location:
- 32.56 s
> tests/tests/test_python_api.rs:156:20
- 32.56 s
>
- 32.56 s
> FAIL [ 0.110s] (3/5) gammaloop-integration-tests::test_python_api python_evaluate_sample_honors_generate_events_and_observable_snapshots
- 32.56 s
> stdout ---
- 32.56 s
>
- 32.56 s
> running 1 test
- 32.56 s
> test python_evaluate_sample_honors_generate_events_and_observable_snapshots ... FAILED
- 32.56 s
>
- 32.56 s
> failures:
- 32.56 s
>
- 32.56 s
> failures:
- 32.56 s
> python_evaluate_sample_honors_generate_events_and_observable_snapshots
- 32.56 s
>
- 32.56 s
> test result: FAILED. 0 passed; 1 failed; 0 ignored; 0 measured; 4 filtered out; finished in 0.11s
- 32.56 s
>
- 32.56 s
> stderr ---
- 32.56 s
> Error: Python API test subprocess failed.
- 32.56 s
> stdout:
- 32.56 s
> ┌────────────────────────────────────────────────────────┐
- 32.56 s
> │ You are running a restricted Symbolica instance. │
- 32.56 s
> │ │
- 32.56 s
> │ This mode is only permitted for non-commercial use and │
- 32.56 s
> │ is limited to one instance and core per machine. │
- 32.56 s
> │ │
- 32.56 s
> │ Hobbyists can easily acquire a free license key │
- 32.56 s
> │ that unlocks all cores and removes this banner: │
- 32.56 s
> │ │
- 32.56 s
> │ from symbolica import * │
- 32.56 s
> │ request_hobbyist_license('YOUR_NAME', 'YOUR_EMAIL') │
- 32.56 s
> │ │
- 32.56 s
> │ All other users can obtain a free 30-day trial key: │
- 32.56 s
> │ │
- 32.56 s
> │ from symbolica import * │
- 32.56 s
> │ request_trial_license('NAME', 'EMAIL', 'EMPLOYER') │
- 32.56 s
> │ │
- 32.56 s
> │ See https://symbolica.io/docs/get_started.html#license │
- 32.56 s
> └────────────────────────────────────────────────────────┘
- 32.56 s
> ┌───────────────────────────────────────────────────────────────────────────────────────────────────────────┐
- 32.56 s
> │ Cannot start new unlicensed Symbolica instance since there is already another one running on the machine. │
- 32.56 s
> └───────────────────────────────────────────────────────────────────────────────────────────────────────────┘
- 32.56 s
>
- 32.56 s
> stderr:
- 32.56 s
>
- 32.56 s
> ┌───────────────────────────────────────────────────────────┐
- 32.56 s
> │ Could not resolve the IP of the Symbolica license server. │
- 32.56 s
> │ │
- 32.56 s
> │ Please check your DNS configuration. │
- 32.56 s
> └───────────────────────────────────────────────────────────┘
- 32.56 s
> Error: failed to lookup address information: Temporary failure in name resolution
- 32.56 s
>
- 32.56 s
>
- 32.56 s
> Location:
- 32.56 s
> tests/tests/test_python_api.rs:156:20
- 32.56 s
>
- 32.56 s
> FAIL [ 0.118s] (4/5) gammaloop-integration-tests::test_python_api python_session_getters_return_live_toml_and_command_blocks
- 32.56 s
> stdout ---
- 32.56 s
>
- 32.56 s
> running 1 test
- 32.56 s
> test python_session_getters_return_live_toml_and_command_blocks ... FAILED
- 32.56 s
>
- 32.56 s
> failures:
- 32.56 s
>
- 32.56 s
> failures:
- 32.56 s
> python_session_getters_return_live_toml_and_command_blocks
- 32.56 s
>
- 32.56 s
> test result: FAILED. 0 passed; 1 failed; 0 ignored; 0 measured; 4 filtered out; finished in 0.11s
- 32.56 s
>
- 32.56 s
> stderr ---
- 32.56 s
> Error: Python API test subprocess failed.
- 32.56 s
> stdout:
- 32.56 s
> ┌────────────────────────────────────────────────────────┐
- 32.56 s
> │ You are running a restricted Symbolica instance. │
- 32.56 s
> │ │
- 32.56 s
> │ This mode is only permitted for non-commercial use and │
- 32.56 s
> │ is limited to one instance and core per machine. │
- 32.56 s
> │ │
- 32.56 s
> │ Hobbyists can easily acquire a free license key │
- 32.56 s
> │ that unlocks all cores and removes this banner: │
- 32.56 s
> │ │
- 32.56 s
> │ from symbolica import * │
- 32.56 s
> │ request_hobbyist_license('YOUR_NAME', 'YOUR_EMAIL') │
- 32.56 s
> │ │
- 32.56 s
> │ All other users can obtain a free 30-day trial key: │
- 32.56 s
> │ │
- 32.56 s
> │ from symbolica import * │
- 32.56 s
> │ request_trial_license('NAME', 'EMAIL', 'EMPLOYER') │
- 32.56 s
> │ │
- 32.56 s
> │ See https://symbolica.io/docs/get_started.html#license │
- 32.56 s
> └────────────────────────────────────────────────────────┘
- 32.56 s
> ┌───────────────────────────────────────────────────────────────────────────────────────────────────────────┐
- 32.56 s
> │ Cannot start new unlicensed Symbolica instance since there is already another one running on the machine. │
- 32.56 s
> └───────────────────────────────────────────────────────────────────────────────────────────────────────────┘
- 32.56 s
>
- 32.56 s
> stderr:
- 32.56 s
>
- 32.56 s
> ┌───────────────────────────────────────────────────────────┐
- 32.56 s
> │ Could not resolve the IP of the Symbolica license server. │
- 32.56 s
> │ │
- 32.56 s
> │ Please check your DNS configuration. │
- 32.56 s
> └───────────────────────────────────────────────────────────┘
- 32.56 s
> Error: failed to lookup address information: Temporary failure in name resolution
- 32.56 s
>
- 32.56 s
>
- 32.56 s
> Location:
- 32.56 s
> tests/tests/test_python_api.rs:156:20
- 32.56 s
>
- 32.56 s
> error: test run failed
- 32.56 s
>
- 32.56 s
> ========== nextest test summary ==========
- 32.56 s
> report: target/nextest/ci_gammaloop/junit.xml
- 32.56 s
> tests: 5, failures: 4, errors: 0
- 32.56 s
>
- 32.56 s
> 1. gammaloop-integration-tests::test_python_api::python_evaluate_sample_preserves_graph_grouping_and_incoming_pdgs
- 32.56 s
> failure: test failure with exit code 101
- 32.56 s
> Error: Python API test subprocess failed.
- 32.56 s
> stdout:
- 32.56 s
> ┌────────────────────────────────────────────────────────┐
- 32.56 s
> │ You are running a restricted Symbolica instance. │
- 32.56 s
> │ │
- 32.56 s
> │ This mode is only permitted for non-commercial use and │
- 32.56 s
> │ is limited to one instance and core per machine. │
- 32.56 s
> │ │
- 32.56 s
> │ Hobbyists can easily acquire a free license key │
- 32.56 s
> │ that unlocks all cores and removes this banner: │
- 32.56 s
> │ │
- 32.56 s
> │ from symbolica import * │
- 32.56 s
> │ request_hobbyist_license('YOUR_NAME', 'YOUR_EMAIL') │
- 32.56 s
> │ │
- 32.56 s
> │ All other users can obtain a free 30-day trial key: │
- 32.56 s
> │ │
- 32.56 s
> │ from symbolica import * │
- 32.56 s
> │ request_trial_license('NAME', 'EMAIL', 'EMPLOYER') │
- 32.56 s
> │ │
- 32.56 s
> │ See https://symbolica.io/docs/get_started.html#license │
- 32.56 s
> └────────────────────────────────────────────────────────┘
- 32.56 s
> ┌───────────────────────────────────────────────────────────────────────────────────────────────────────────┐
- 32.56 s
> │ Cannot start new unlicensed Symbolica instance since there is already another one running on the machine. │
- 32.56 s
> └───────────────────────────────────────────────────────────────────────────────────────────────────────────┘
- 32.56 s
>
- 32.56 s
> stderr:
- 32.56 s
>
- 32.56 s
> ┌───────────────────────────────────────────────────────────┐
- 32.56 s
> │ Could not resolve the IP of the Symbolica license server. │
- 32.56 s
> │ │
- 32.56 s
> │ Please check your DNS configuration. │
- 32.56 s
> └───────────────────────────────────────────────────────────┘
- 32.56 s
> Error: failed to lookup address information: Temporary failure in name resolution
- 32.56 s
>
- 32.56 s
>
- 32.56 s
> Location:
- 32.56 s
> tests/tests/test_python_api.rs:156:20
- 32.56 s
> system-out
- 32.56 s
> running 1 test
- 32.56 s
> test python_evaluate_sample_preserves_graph_grouping_and_incoming_pdgs ... FAILED
- 32.56 s
>
- 32.56 s
> failures:
- 32.56 s
>
- 32.56 s
> failures:
- 32.56 s
> python_evaluate_sample_preserves_graph_grouping_and_incoming_pdgs
- 32.56 s
>
- 32.56 s
> test result: FAILED. 0 passed; 1 failed; 0 ignored; 0 measured; 4 filtered out; finished in 0.11s
- 32.56 s
> system-err
- 32.56 s
> Error: Python API test subprocess failed.
- 32.56 s
> stdout:
- 32.56 s
> ┌────────────────────────────────────────────────────────┐
- 32.56 s
> │ You are running a restricted Symbolica instance. │
- 32.56 s
> │ │
- 32.56 s
> │ This mode is only permitted for non-commercial use and │
- 32.56 s
> │ is limited to one instance and core per machine. │
- 32.56 s
> │ │
- 32.56 s
> │ Hobbyists can easily acquire a free license key │
- 32.56 s
> │ that unlocks all cores and removes this banner: │
- 32.56 s
> │ │
- 32.56 s
> │ from symbolica import * │
- 32.56 s
> │ request_hobbyist_license('YOUR_NAME', 'YOUR_EMAIL') │
- 32.56 s
> │ │
- 32.56 s
> │ All other users can obtain a free 30-day trial key: │
- 32.56 s
> │ │
- 32.56 s
> │ from symbolica import * │
- 32.56 s
> │ request_trial_license('NAME', 'EMAIL', 'EMPLOYER') │
- 32.56 s
> │ │
- 32.56 s
> │ See https://symbolica.io/docs/get_started.html#license │
- 32.56 s
> └────────────────────────────────────────────────────────┘
- 32.56 s
> ┌───────────────────────────────────────────────────────────────────────────────────────────────────────────┐
- 32.56 s
> │ Cannot start new unlicensed Symbolica instance since there is already another one running on the machine. │
- 32.56 s
> └───────────────────────────────────────────────────────────────────────────────────────────────────────────┘
- 32.56 s
>
- 32.56 s
> stderr:
- 32.56 s
>
- 32.56 s
> ┌───────────────────────────────────────────────────────────┐
- 32.56 s
> │ Could not resolve the IP of the Symbolica license server. │
- 32.56 s
> │ │
- 32.56 s
> │ Please check your DNS configuration. │
- 32.56 s
> └───────────────────────────────────────────────────────────┘
- 32.56 s
> Error: failed to lookup address information: Temporary failure in name resolution
- 32.56 s
>
- 32.56 s
>
- 32.56 s
> Location:
- 32.56 s
> tests/tests/test_python_api.rs:156:20
- 32.56 s
>
- 32.56 s
> 2. gammaloop-integration-tests::test_python_api::python_evaluate_samples_batch_and_momentum_space_have_expected_shape
- 32.56 s
> failure: test failure with exit code 101
- 32.56 s
> Error: Python API test subprocess failed.
- 32.56 s
> stdout:
- 32.56 s
> ┌────────────────────────────────────────────────────────┐
- 32.56 s
> │ You are running a restricted Symbolica instance. │
- 32.56 s
> │ │
- 32.56 s
> │ This mode is only permitted for non-commercial use and │
- 32.56 s
> │ is limited to one instance and core per machine. │
- 32.56 s
> │ │
- 32.56 s
> │ Hobbyists can easily acquire a free license key │
- 32.56 s
> │ that unlocks all cores and removes this banner: │
- 32.56 s
> │ │
- 32.56 s
> │ from symbolica import * │
- 32.56 s
> │ request_hobbyist_license('YOUR_NAME', 'YOUR_EMAIL') │
- 32.56 s
> │ │
- 32.56 s
> │ All other users can obtain a free 30-day trial key: │
- 32.56 s
> │ │
- 32.56 s
> │ from symbolica import * │
- 32.56 s
> │ request_trial_license('NAME', 'EMAIL', 'EMPLOYER') │
- 32.56 s
> │ │
- 32.56 s
> │ See https://symbolica.io/docs/get_started.html#license │
- 32.56 s
> └────────────────────────────────────────────────────────┘
- 32.56 s
> ┌───────────────────────────────────────────────────────────────────────────────────────────────────────────┐
- 32.56 s
> │ Cannot start new unlicensed Symbolica instance since there is already another one running on the machine. │
- 32.56 s
> └───────────────────────────────────────────────────────────────────────────────────────────────────────────┘
- 32.56 s
>
- 32.56 s
> stderr:
- 32.56 s
>
- 32.56 s
> ┌───────────────────────────────────────────────────────────┐
- 32.56 s
> │ Could not resolve the IP of the Symbolica license server. │
- 32.56 s
> │ │
- 32.56 s
> │ Please check your DNS configuration. │
- 32.56 s
> └───────────────────────────────────────────────────────────┘
- 32.56 s
> Error: failed to lookup address information: Temporary failure in name resolution
- 32.56 s
>
- 32.56 s
>
- 32.56 s
> Location:
- 32.56 s
> tests/tests/test_python_api.rs:156:20
- 32.56 s
> system-out
- 32.56 s
> running 1 test
- 32.56 s
> test python_evaluate_samples_batch_and_momentum_space_have_expected_shape ... FAILED
- 32.56 s
>
- 32.56 s
> failures:
- 32.56 s
>
- 32.56 s
> failures:
- 32.56 s
> python_evaluate_samples_batch_and_momentum_space_have_expected_shape
- 32.56 s
>
- 32.56 s
> test result: FAILED. 0 passed; 1 failed; 0 ignored; 0 measured; 4 filtered out; finished in 0.11s
- 32.56 s
> system-err
- 32.56 s
> Error: Python API test subprocess failed.
- 32.56 s
> stdout:
- 32.56 s
> ┌────────────────────────────────────────────────────────┐
- 32.56 s
> │ You are running a restricted Symbolica instance. │
- 32.56 s
> │ │
- 32.56 s
> │ This mode is only permitted for non-commercial use and │
- 32.56 s
> │ is limited to one instance and core per machine. │
- 32.56 s
> │ │
- 32.56 s
> │ Hobbyists can easily acquire a free license key │
- 32.56 s
> │ that unlocks all cores and removes this banner: │
- 32.56 s
> │ │
- 32.56 s
> │ from symbolica import * │
- 32.56 s
> │ request_hobbyist_license('YOUR_NAME', 'YOUR_EMAIL') │
- 32.56 s
> │ │
- 32.56 s
> │ All other users can obtain a free 30-day trial key: │
- 32.56 s
> │ │
- 32.56 s
> │ from symbolica import * │
- 32.56 s
> │ request_trial_license('NAME', 'EMAIL', 'EMPLOYER') │
- 32.56 s
> │ │
- 32.56 s
> │ See https://symbolica.io/docs/get_started.html#license │
- 32.56 s
> └────────────────────────────────────────────────────────┘
- 32.56 s
> ┌───────────────────────────────────────────────────────────────────────────────────────────────────────────┐
- 32.56 s
> │ Cannot start new unlicensed Symbolica instance since there is already another one running on the machine. │
- 32.56 s
> └───────────────────────────────────────────────────────────────────────────────────────────────────────────┘
- 32.56 s
>
- 32.56 s
> stderr:
- 32.56 s
>
- 32.56 s
> ┌───────────────────────────────────────────────────────────┐
- 32.56 s
> │ Could not resolve the IP of the Symbolica license server. │
- 32.56 s
> │ │
- 32.56 s
> │ Please check your DNS configuration. │
- 32.56 s
> └───────────────────────────────────────────────────────────┘
- 32.56 s
> Error: failed to lookup address information: Temporary failure in name resolution
- 32.56 s
>
- 32.56 s
>
- 32.56 s
> Location:
- 32.56 s
> tests/tests/test_python_api.rs:156:20
- 32.56 s
>
- 32.56 s
> 3. gammaloop-integration-tests::test_python_api::python_evaluate_sample_honors_generate_events_and_observable_snapshots
- 32.56 s
> failure: test failure with exit code 101
- 32.56 s
> Error: Python API test subprocess failed.
- 32.56 s
> stdout:
- 32.56 s
> ┌────────────────────────────────────────────────────────┐
- 32.56 s
> │ You are running a restricted Symbolica instance. │
- 32.56 s
> │ │
- 32.56 s
> │ This mode is only permitted for non-commercial use and │
- 32.56 s
> │ is limited to one instance and core per machine. │
- 32.56 s
> │ │
- 32.56 s
> │ Hobbyists can easily acquire a free license key │
- 32.56 s
> │ that unlocks all cores and removes this banner: │
- 32.56 s
> │ │
- 32.56 s
> │ from symbolica import * │
- 32.56 s
> │ request_hobbyist_license('YOUR_NAME', 'YOUR_EMAIL') │
- 32.56 s
> │ │
- 32.56 s
> │ All other users can obtain a free 30-day trial key: │
- 32.56 s
> │ │
- 32.56 s
> │ from symbolica import * │
- 32.56 s
> │ request_trial_license('NAME', 'EMAIL', 'EMPLOYER') │
- 32.56 s
> │ │
- 32.56 s
> │ See https://symbolica.io/docs/get_started.html#license │
- 32.56 s
> └────────────────────────────────────────────────────────┘
- 32.56 s
> ┌───────────────────────────────────────────────────────────────────────────────────────────────────────────┐
- 32.56 s
> │ Cannot start new unlicensed Symbolica instance since there is already another one running on the machine. │
- 32.56 s
> └───────────────────────────────────────────────────────────────────────────────────────────────────────────┘
- 32.56 s
>
- 32.56 s
> stderr:
- 32.56 s
>
- 32.56 s
> ┌───────────────────────────────────────────────────────────┐
- 32.56 s
> │ Could not resolve the IP of the Symbolica license server. │
- 32.56 s
> │ │
- 32.56 s
> │ Please check your DNS configuration. │
- 32.56 s
> └───────────────────────────────────────────────────────────┘
- 32.56 s
> Error: failed to lookup address information: Temporary failure in name resolution
- 32.56 s
>
- 32.56 s
>
- 32.56 s
> Location:
- 32.56 s
> tests/tests/test_python_api.rs:156:20
- 32.56 s
> system-out
- 32.56 s
> running 1 test
- 32.56 s
> test python_evaluate_sample_honors_generate_events_and_observable_snapshots ... FAILED
- 32.56 s
>
- 32.56 s
> failures:
- 32.56 s
>
- 32.56 s
> failures:
- 32.56 s
> python_evaluate_sample_honors_generate_events_and_observable_snapshots
- 32.56 s
>
- 32.56 s
> test result: FAILED. 0 passed; 1 failed; 0 ignored; 0 measured; 4 filtered out; finished in 0.11s
- 32.56 s
> system-err
- 32.56 s
> Error: Python API test subprocess failed.
- 32.56 s
> stdout:
- 32.56 s
> ┌────────────────────────────────────────────────────────┐
- 32.56 s
> │ You are running a restricted Symbolica instance. │
- 32.56 s
> │ │
- 32.56 s
> │ This mode is only permitted for non-commercial use and │
- 32.56 s
> │ is limited to one instance and core per machine. │
- 32.56 s
> │ │
- 32.56 s
> │ Hobbyists can easily acquire a free license key │
- 32.56 s
> │ that unlocks all cores and removes this banner: │
- 32.56 s
> │ │
- 32.56 s
> │ from symbolica import * │
- 32.56 s
> │ request_hobbyist_license('YOUR_NAME', 'YOUR_EMAIL') │
- 32.56 s
> │ │
- 32.56 s
> │ All other users can obtain a free 30-day trial key: │
- 32.56 s
> │ │
- 32.56 s
> │ from symbolica import * │
- 32.56 s
> │ request_trial_license('NAME', 'EMAIL', 'EMPLOYER') │
- 32.56 s
> │ │
- 32.56 s
> │ See https://symbolica.io/docs/get_started.html#license │
- 32.56 s
> └────────────────────────────────────────────────────────┘
- 32.56 s
> ┌───────────────────────────────────────────────────────────────────────────────────────────────────────────┐
- 32.56 s
> │ Cannot start new unlicensed Symbolica instance since there is already another one running on the machine. │
- 32.56 s
> └───────────────────────────────────────────────────────────────────────────────────────────────────────────┘
- 32.56 s
>
- 32.56 s
> stderr:
- 32.56 s
>
- 32.56 s
> ┌───────────────────────────────────────────────────────────┐
- 32.56 s
> │ Could not resolve the IP of the Symbolica license server. │
- 32.56 s
> │ │
- 32.56 s
> │ Please check your DNS configuration. │
- 32.56 s
> └───────────────────────────────────────────────────────────┘
- 32.56 s
> Error: failed to lookup address information: Temporary failure in name resolution
- 32.56 s
>
- 32.56 s
>
- 32.56 s
> Location:
- 32.56 s
> tests/tests/test_python_api.rs:156:20
- 32.56 s
>
- 32.56 s
> 4. gammaloop-integration-tests::test_python_api::python_session_getters_return_live_toml_and_command_blocks
- 32.56 s
> failure: test failure with exit code 101
- 32.56 s
> Error: Python API test subprocess failed.
- 32.56 s
> stdout:
- 32.56 s
> ┌────────────────────────────────────────────────────────┐
- 32.56 s
> │ You are running a restricted Symbolica instance. │
- 32.56 s
> │ │
- 32.56 s
> │ This mode is only permitted for non-commercial use and │
- 32.56 s
> │ is limited to one instance and core per machine. │
- 32.56 s
> │ │
- 32.56 s
> │ Hobbyists can easily acquire a free license key │
- 32.56 s
> │ that unlocks all cores and removes this banner: │
- 32.56 s
> │ │
- 32.56 s
> │ from symbolica import * │
- 32.56 s
> │ request_hobbyist_license('YOUR_NAME', 'YOUR_EMAIL') │
- 32.56 s
> │ │
- 32.56 s
> │ All other users can obtain a free 30-day trial key: │
- 32.56 s
> │ │
- 32.56 s
> │ from symbolica import * │
- 32.56 s
> │ request_trial_license('NAME', 'EMAIL', 'EMPLOYER') │
- 32.56 s
> │ │
- 32.56 s
> │ See https://symbolica.io/docs/get_started.html#license │
- 32.56 s
> └────────────────────────────────────────────────────────┘
- 32.56 s
> ┌───────────────────────────────────────────────────────────────────────────────────────────────────────────┐
- 32.56 s
> │ Cannot start new unlicensed Symbolica instance since there is already another one running on the machine. │
- 32.56 s
> └───────────────────────────────────────────────────────────────────────────────────────────────────────────┘
- 32.56 s
>
- 32.56 s
> stderr:
- 32.56 s
>
- 32.56 s
> ┌───────────────────────────────────────────────────────────┐
- 32.56 s
> │ Could not resolve the IP of the Symbolica license server. │
- 32.56 s
> │ │
- 32.56 s
> │ Please check your DNS configuration. │
- 32.56 s
> └───────────────────────────────────────────────────────────┘
- 32.56 s
> Error: failed to lookup address information: Temporary failure in name resolution
- 32.56 s
>
- 32.56 s
>
- 32.56 s
> Location:
- 32.56 s
> tests/tests/test_python_api.rs:156:20
- 32.56 s
> system-out
- 32.56 s
> running 1 test
- 32.56 s
> test python_session_getters_return_live_toml_and_command_blocks ... FAILED
- 32.56 s
>
- 32.56 s
> failures:
- 32.56 s
>
- 32.56 s
> failures:
- 32.56 s
> python_session_getters_return_live_toml_and_command_blocks
- 32.56 s
>
- 32.56 s
> test result: FAILED. 0 passed; 1 failed; 0 ignored; 0 measured; 4 filtered out; finished in 0.11s
- 32.56 s
> system-err
- 32.56 s
> Error: Python API test subprocess failed.
- 32.56 s
> stdout:
- 32.56 s
> ┌────────────────────────────────────────────────────────┐
- 32.56 s
> │ You are running a restricted Symbolica instance. │
- 32.56 s
> │ │
- 32.56 s
> │ This mode is only permitted for non-commercial use and │
- 32.56 s
> │ is limited to one instance and core per machine. │
- 32.56 s
> │ │
- 32.56 s
> │ Hobbyists can easily acquire a free license key │
- 32.56 s
> │ that unlocks all cores and removes this banner: │
- 32.56 s
> │ │
- 32.56 s
> │ from symbolica import * │
- 32.56 s
> │ request_hobbyist_license('YOUR_NAME', 'YOUR_EMAIL') │
- 32.56 s
> │ │
- 32.56 s
> │ All other users can obtain a free 30-day trial key: │
- 32.56 s
> │ │
- 32.56 s
> │ from symbolica import * │
- 32.56 s
> │ request_trial_license('NAME', 'EMAIL', 'EMPLOYER') │
- 32.56 s
> │ │
- 32.56 s
> │ See https://symbolica.io/docs/get_started.html#license │
- 32.56 s
> └────────────────────────────────────────────────────────┘
- 32.56 s
> ┌───────────────────────────────────────────────────────────────────────────────────────────────────────────┐
- 32.56 s
> │ Cannot start new unlicensed Symbolica instance since there is already another one running on the machine. │
- 32.56 s
> └───────────────────────────────────────────────────────────────────────────────────────────────────────────┘
- 32.56 s
>
- 32.56 s
> stderr:
- 32.56 s
>
- 32.56 s
> ┌───────────────────────────────────────────────────────────┐
- 32.56 s
> │ Could not resolve the IP of the Symbolica license server. │
- 32.56 s
> │ │
- 32.56 s
> │ Please check your DNS configuration. │
- 32.56 s
> └───────────────────────────────────────────────────────────┘
- 32.56 s
> Error: failed to lookup address information: Temporary failure in name resolution
- 32.56 s
>
- 32.56 s
>
- 32.56 s
> Location:
- 32.56 s
> tests/tests/test_python_api.rs:156:20
- 32.56 s
> =========================================
- 32.56 s
For full logs, run:
- 32.56 s
nix log /nix/store/nmwgfm0zigizp5byy173df7l99i9kddz-gammaloop-nextest-python-api.drv
- 32.73 s
Run failed.