test packages.x86_64-linux.nix-ci-check-gammaloop-nextest-python-api

Reproduce this run
Retry Run
  1. 0.00 s $ /nix/store/9ypz3flqsrl5xl495mm8h645gadjsxi1-coreutils-9.11/bin/timeout --kill-after=15s 7200s /nix/store/23zk8sgzamrbmj1fday15szf7f2279s8-nix-2.34.7/bin/nix --extra-experimental-features nix-command --extra-experimental-features flakes flake clone git+https://github.com/alphal00p/gammaloop --dest /tmp/nix-ci-worker/stable-pwd/repo/
  2. 0.07 s Cloning into '/tmp/nix-ci-worker/stable-pwd/repo'...
  3. 0.77 s remote: Enumerating objects: 93832, done.
  4. 0.88 s remote: Counting objects: 0% (1/9068) remote: Counting objects: 1% (91/9068) remote: Counting objects: 2% (182/9068) remote: Counting objects: 3% (273/9068) remote: Counting objects: 4% (363/9068) remote: Counting objects: 5% (454/9068) remote: Counting objects: 6% (545/9068) remote: Counting objects: 7% (635/9068) remote: Counting objects: 8% (726/9068) remote: Counting objects: 9% (817/9068) remote: Counting objects: 10% (907/9068) remote: Counting objects: 11% (998/9068) remote: Counting objects: 12% (1089/9068) remote: Counting objects: 13% (1179/9068) remote: Counting objects: 14% (1270/9068) remote: Counting objects: 15% (1361/9068) remote: Counting objects: 16% (1451/9068) remote: Counting objects: 17% (1542/9068) remote: Counting objects: 18% (1633/9068) remote: Counting objects: 19% (1723/9068) remote: Counting objects: 20% (1814/9068) remote: Counting objects: 21% (1905/9068) remote: Counting objects: 22% (1995/9068) remote: Counting objects: 23% (2086/9068) remote: Counting objects: 24% (2177/9068) remote: Counting objects: 25% (2267/9068) remote: Counting objects: 26% (2358/9068) remote: Counting objects: 27% (2449/9068) remote: Counting objects: 28% (2540/9068) remote: Counting objects: 29% (2630/9068) remote: Counting objects: 30% (2721/9068) remote: Counting objects: 31% (2812/9068) remote: Counting objects: 32% (2902/9068) remote: Counting objects: 33% (2993/9068) remote: Counting objects: 34% (3084/9068) remote: Counting objects: 35% (3174/9068) remote: Counting objects: 36% (3265/9068) remote: Counting objects: 37% (3356/9068) remote: Counting objects: 38% (3446/9068) remote: Counting objects: 39% (3537/9068) remote: Counting objects: 40% (3628/9068) remote: Counting objects: 41% (3718/9068) remote: Counting objects: 42% (3809/9068) remote: Counting objects: 43% (3900/9068) remote: Counting objects: 44% (3990/9068) remote: Counting objects: 45% (4081/9068) remote: Counting objects: 46% (4172/9068) remote: Counting objects: 47% (4262/9068) remote: Counting objects: 48% (4353/9068) remote: Counting objects: 49% (4444/9068) remote: Counting objects: 50% (4534/9068) remote: Counting objects: 51% (4625/9068) remote: Counting objects: 52% (4716/9068) remote: Counting objects: 53% (4807/9068) remote: Counting objects: 54% (4897/9068) remote: Counting objects: 55% (4988/9068) remote: Counting objects: 56% (5079/9068) remote: Counting objects: 57% (5169/9068) remote: Counting objects: 58% (5260/9068) remote: Counting objects: 59% (5351/9068) remote: Counting objects: 60% (5441/9068) remote: Counting objects: 61% (5532/9068) remote: Counting objects: 62% (5623/9068) remote: Counting objects: 63% (5713/9068) remote: Counting objects: 64% (5804/9068) remote: Counting objects: 65% (5895/9068) remote: Counting objects: 66% (5985/9068) remote: Counting objects: 67% (6076/9068) remote: Counting objects: 68% (6167/9068) remote: Counting objects: 69% (6257/9068) remote: Counting objects: 70% (6348/9068) remote: Counting objects: 71% (6439/9068) remote: Counting objects: 72% (6529/9068) remote: Counting objects: 73% (6620/9068) remote: Counting objects: 74% (6711/9068) remote: Counting objects: 75% (6801/9068) remote: Counting objects: 76% (6892/9068) remote: Counting objects: 77% (6983/9068) remote: Counting objects: 78% (7074/9068) remote: Counting objects: 79% (7164/9068) remote: Counting objects: 80% (7255/9068) remote: Counting objects: 81% (7346/9068) remote: Counting objects: 82% (7436/9068) remote: Counting objects: 83% (7527/9068) remote: Counting objects: 84% (7618/9068) remote: Counting objects: 85% (7708/9068) remote: Counting objects: 86% (7799/9068) remote: Counting objects: 87% (7890/9068) remote: Counting objects: 88% (7980/9068) remote: Counting objects: 89% (8071/9068) remote: Counting objects: 90% (8162/9068) remote: Counting objects: 91% (8252/9068) remote: Counting objects: 92% (8343/9068) remote: Counting objects: 93% (8434/9068) remote: Counting objects: 94% (8524/9068) remote: Counting objects: 95% (8615/9068) remote: Counting objects: 96% (8706/9068) remote: Counting objects: 97% (8796/9068) remote: Counting objects: 98% (8887/9068) remote: Counting objects: 99% (8978/9068) remote: Counting objects: 100% (9068/9068) remote: Counting objects: 100% (9068/9068), done.
  5. 2.94 s remote: Compressing objects: 0% (1/1854) remote: Compressing objects: 1% (19/1854) remote: Compressing objects: 2% (38/1854) remote: Compressing objects: 3% (56/1854) remote: Compressing objects: 4% (75/1854) remote: Compressing objects: 5% (93/1854) remote: Compressing objects: 6% (112/1854) remote: Compressing objects: 7% (130/1854) remote: Compressing objects: 7% (147/1854) remote: Compressing objects: 8% (149/1854) remote: Compressing objects: 9% (167/1854) remote: Compressing objects: 10% (186/1854) remote: Compressing objects: 11% (204/1854) remote: Compressing objects: 12% (223/1854) remote: Compressing objects: 13% (242/1854) remote: Compressing objects: 14% (260/1854) remote: Compressing objects: 15% (279/1854) remote: Compressing objects: 16% (297/1854) remote: Compressing objects: 17% (316/1854) remote: Compressing objects: 18% (334/1854) remote: Compressing objects: 19% (353/1854) remote: Compressing objects: 20% (371/1854) remote: Compressing objects: 21% (390/1854) remote: Compressing objects: 22% (408/1854) remote: Compressing objects: 23% (427/1854) remote: Compressing objects: 24% (445/1854) remote: Compressing objects: 25% (464/1854) remote: Compressing objects: 26% (483/1854) remote: Compressing objects: 26% (489/1854) remote: Compressing objects: 27% (501/1854) remote: Compressing objects: 28% (520/1854) remote: Compressing objects: 29% (538/1854) remote: Compressing objects: 30% (557/1854) remote: Compressing objects: 31% (575/1854) remote: Compressing objects: 32% (594/1854) remote: Compressing objects: 33% (612/1854) remote: Compressing objects: 34% (631/1854) remote: Compressing objects: 35% (649/1854) remote: Compressing objects: 36% (668/1854) remote: Compressing objects: 37% (686/1854) remote: Compressing objects: 38% (705/1854) remote: Compressing objects: 39% (724/1854) remote: Compressing objects: 40% (742/1854) remote: Compressing objects: 41% (761/1854) remote: Compressing objects: 42% (779/1854) remote: Compressing objects: 43% (798/1854) remote: Compressing objects: 44% (816/1854) remote: Compressing objects: 45% (835/1854) remote: Compressing objects: 46% (853/1854) remote: Compressing objects: 47% (872/1854) remote: Compressing objects: 48% (890/1854) remote: Compressing objects: 49% (909/1854) remote: Compressing objects: 50% (927/1854) remote: Compressing objects: 51% (946/1854) remote: Compressing objects: 52% (965/1854) remote: Compressing objects: 53% (983/1854) remote: Compressing objects: 54% (1002/1854) remote: Compressing objects: 55% (1020/1854) remote: Compressing objects: 56% (1039/1854) remote: Compressing objects: 57% (1057/1854) remote: Compressing objects: 58% (1076/1854) remote: Compressing objects: 59% (1094/1854) remote: Compressing objects: 60% (1113/1854) remote: Compressing objects: 61% (1131/1854) remote: Compressing objects: 62% (1150/1854) remote: Compressing objects: 63% (1169/1854) remote: Compressing objects: 64% (1187/1854) remote: Compressing objects: 65% (1206/1854) remote: Compressing objects: 66% (1224/1854) remote: Compressing objects: 67% (1243/1854) remote: Compressing objects: 68% (1261/1854) remote: Compressing objects: 69% (1280/1854) remote: Compressing objects: 70% (1298/1854) remote: Compressing objects: 71% (1317/1854) remote: Compressing objects: 72% (1335/1854) remote: Compressing objects: 73% (1354/1854) remote: Compressing objects: 74% (1372/1854) remote: Compressing objects: 75% (1391/1854) remote: Compressing objects: 76% (1410/1854) remote: Compressing objects: 77% (1428/1854) remote: Compressing objects: 78% (1447/1854) remote: Compressing objects: 79% (1465/1854) remote: Compressing objects: 80% (1484/1854) remote: Compressing objects: 81% (1502/1854) remote: Compressing objects: 82% (1521/1854) remote: Compressing objects: 83% (1539/1854) remote: Compressing objects: 84% (1558/1854) remote: Compressing objects: 85% (1576/1854) remote: Compressing objects: 86% (1595/1854) remote: Compressing objects: 87% (1613/1854) remote: Compressing objects: 88% (1632/1854) remote: Compressing objects: 89% (1651/1854) remote: Compressing objects: 90% (1669/1854) remote: Compressing objects: 91% (1688/1854) remote: Compressing objects: 92% (1706/1854) remote: Compressing objects: 93% (1725/1854) remote: Compressing objects: 94% (1743/1854) remote: Compressing objects: 95% (1762/1854) remote: Compressing objects: 96% (1780/1854) remote: Compressing objects: 97% (1799/1854) remote: Compressing objects: 98% (1817/1854) remote: Compressing objects: 99% (1836/1854) remote: Compressing objects: 100% (1854/1854) remote: Compressing objects: 100% (1854/1854), done.
  6. 11.85 s Receiving objects: 0% (1/93832) Receiving objects: 1% (939/93832) Receiving objects: 2% (1877/93832) Receiving objects: 3% (2815/93832) Receiving objects: 4% (3754/93832) Receiving objects: 5% (4692/93832) Receiving objects: 6% (5630/93832) Receiving objects: 7% (6569/93832) Receiving objects: 8% (7507/93832), 16.61 MiB | 33.21 MiB/s Receiving objects: 9% (8445/93832), 16.61 MiB | 33.21 MiB/s Receiving objects: 10% (9384/93832), 16.61 MiB | 33.21 MiB/s Receiving objects: 11% (10322/93832), 16.61 MiB | 33.21 MiB/s Receiving objects: 12% (11260/93832), 16.61 MiB | 33.21 MiB/s Receiving objects: 13% (12199/93832), 16.61 MiB | 33.21 MiB/s Receiving objects: 14% (13137/93832), 16.61 MiB | 33.21 MiB/s Receiving objects: 15% (14075/93832), 16.61 MiB | 33.21 MiB/s Receiving objects: 16% (15014/93832), 16.61 MiB | 33.21 MiB/s Receiving objects: 17% (15952/93832), 16.61 MiB | 33.21 MiB/s Receiving objects: 18% (16890/93832), 16.61 MiB | 33.21 MiB/s Receiving objects: 19% (17829/93832), 16.61 MiB | 33.21 MiB/s Receiving objects: 20% (18767/93832), 16.61 MiB | 33.21 MiB/s Receiving objects: 21% (19705/93832), 16.61 MiB | 33.21 MiB/s Receiving objects: 22% (20644/93832), 16.61 MiB | 33.21 MiB/s Receiving objects: 23% (21582/93832), 16.61 MiB | 33.21 MiB/s Receiving objects: 24% (22520/93832), 16.61 MiB | 33.21 MiB/s Receiving objects: 25% (23458/93832), 16.61 MiB | 33.21 MiB/s Receiving objects: 26% (24397/93832), 16.61 MiB | 33.21 MiB/s Receiving objects: 27% (25335/93832), 16.61 MiB | 33.21 MiB/s Receiving objects: 28% (26273/93832), 16.61 MiB | 33.21 MiB/s Receiving objects: 29% (27212/93832), 16.61 MiB | 33.21 MiB/s Receiving objects: 30% (28150/93832), 16.61 MiB | 33.21 MiB/s Receiving objects: 31% (29088/93832), 16.61 MiB | 33.21 MiB/s Receiving objects: 32% (30027/93832), 16.61 MiB | 33.21 MiB/s Receiving objects: 33% (30965/93832), 16.61 MiB | 33.21 MiB/s Receiving objects: 34% (31903/93832), 16.61 MiB | 33.21 MiB/s Receiving objects: 35% (32842/93832), 16.61 MiB | 33.21 MiB/s Receiving objects: 36% (33780/93832), 16.61 MiB | 33.21 MiB/s Receiving objects: 36% (34079/93832), 34.14 MiB | 34.13 MiB/s Receiving objects: 37% (34718/93832), 34.14 MiB | 34.13 MiB/s Receiving objects: 38% (35657/93832), 34.14 MiB | 34.13 MiB/s Receiving objects: 39% (36595/93832), 34.14 MiB | 34.13 MiB/s Receiving objects: 40% (37533/93832), 34.14 MiB | 34.13 MiB/s Receiving objects: 41% (38472/93832), 34.14 MiB | 34.13 MiB/s Receiving objects: 42% (39410/93832), 34.14 MiB | 34.13 MiB/s Receiving objects: 43% (40348/93832), 34.14 MiB | 34.13 MiB/s Receiving objects: 44% (41287/93832), 34.14 MiB | 34.13 MiB/s Receiving objects: 45% (42225/93832), 34.14 MiB | 34.13 MiB/s Receiving objects: 46% (43163/93832), 34.14 MiB | 34.13 MiB/s Receiving objects: 47% (44102/93832), 34.14 MiB | 34.13 MiB/s Receiving objects: 48% (45040/93832), 52.34 MiB | 34.57 MiB/s Receiving objects: 49% (45978/93832), 52.34 MiB | 34.57 MiB/s Receiving objects: 50% (46916/93832), 52.34 MiB | 34.57 MiB/s Receiving objects: 51% (47855/93832), 52.34 MiB | 34.57 MiB/s Receiving objects: 52% (48793/93832), 52.34 MiB | 34.57 MiB/s Receiving objects: 52% (49646/93832), 52.34 MiB | 34.57 MiB/s Receiving objects: 53% (49731/93832), 52.34 MiB | 34.57 MiB/s Receiving objects: 54% (50670/93832), 69.93 MiB | 34.72 MiB/s Receiving objects: 55% (51608/93832), 69.93 MiB | 34.72 MiB/s Receiving objects: 56% (52546/93832), 69.93 MiB | 34.72 MiB/s Receiving objects: 57% (53485/93832), 69.93 MiB | 34.72 MiB/s Receiving objects: 58% (54423/93832), 69.93 MiB | 34.72 MiB/s Receiving objects: 59% (55361/93832), 69.93 MiB | 34.72 MiB/s Receiving objects: 60% (56300/93832), 69.93 MiB | 34.72 MiB/s Receiving objects: 60% (57049/93832), 104.70 MiB | 34.74 MiB/s Receiving objects: 60% (57174/93832), 139.46 MiB | 34.74 MiB/s Receiving objects: 61% (57238/93832), 157.45 MiB | 34.88 MiB/s Receiving objects: 61% (57628/93832), 174.55 MiB | 34.99 MiB/s Receiving objects: 62% (58176/93832), 174.55 MiB | 34.99 MiB/s Receiving objects: 63% (59115/93832), 174.55 MiB | 34.99 MiB/s Receiving objects: 64% (60053/93832), 174.55 MiB | 34.99 MiB/s Receiving objects: 65% (60991/93832), 174.55 MiB | 34.99 MiB/s Receiving objects: 66% (61930/93832), 174.55 MiB | 34.99 MiB/s Receiving objects: 67% (62868/93832), 192.27 MiB | 35.03 MiB/s Receiving objects: 68% (63806/93832), 192.27 MiB | 35.03 MiB/s Receiving objects: 69% (64745/93832), 192.27 MiB | 35.03 MiB/s Receiving objects: 69% (64836/93832), 192.27 MiB | 35.03 MiB/s Receiving objects: 70% (65683/93832), 209.68 MiB | 34.96 MiB/s Receiving objects: 71% (66621/93832), 209.68 MiB | 34.96 MiB/s Receiving objects: 72% (67560/93832), 209.68 MiB | 34.96 MiB/s Receiving objects: 73% (68498/93832), 209.68 MiB | 34.96 MiB/s Receiving objects: 74% (69436/93832), 209.68 MiB | 34.96 MiB/s Receiving objects: 75% (70374/93832), 209.68 MiB | 34.96 MiB/s Receiving objects: 76% (71313/93832), 209.68 MiB | 34.96 MiB/s Receiving objects: 77% (72251/93832), 209.68 MiB | 34.96 MiB/s Receiving objects: 78% (73189/93832), 209.68 MiB | 34.96 MiB/s Receiving objects: 79% (74128/93832), 209.68 MiB | 34.96 MiB/s Receiving objects: 80% (75066/93832), 209.68 MiB | 34.96 MiB/s Receiving objects: 81% (76004/93832), 226.27 MiB | 34.74 MiB/s Receiving objects: 81% (76937/93832), 226.27 MiB | 34.74 MiB/s Receiving objects: 82% (76943/93832), 226.27 MiB | 34.74 MiB/s Receiving objects: 83% (77881/93832), 244.63 MiB | 34.94 MiB/s Receiving objects: 84% (78819/93832), 244.63 MiB | 34.94 MiB/s Receiving objects: 85% (79758/93832), 244.63 MiB | 34.94 MiB/s Receiving objects: 86% (80696/93832), 261.19 MiB | 34.74 MiB/s Receiving objects: 87% (81634/93832), 261.19 MiB | 34.74 MiB/s Receiving objects: 88% (82573/93832), 261.19 MiB | 34.74 MiB/s Receiving objects: 89% (83511/93832), 261.19 MiB | 34.74 MiB/s Receiving objects: 89% (84417/93832), 261.19 MiB | 34.74 MiB/s Receiving objects: 90% (84449/93832), 261.19 MiB | 34.74 MiB/s Receiving objects: 91% (85388/93832), 296.41 MiB | 34.84 MiB/s Receiving objects: 92% (86326/93832), 296.41 MiB | 34.84 MiB/s Receiving objects: 93% (87264/93832), 296.41 MiB | 34.84 MiB/s Receiving objects: 94% (88203/93832), 296.41 MiB | 34.84 MiB/s Receiving objects: 95% (89141/93832), 296.41 MiB | 34.84 MiB/s Receiving objects: 96% (90079/93832), 296.41 MiB | 34.84 MiB/s Receiving objects: 97% (91018/93832), 296.41 MiB | 34.84 MiB/s Receiving objects: 98% (91956/93832), 296.41 MiB | 34.84 MiB/s Receiving objects: 99% (92894/93832), 296.41 MiB | 34.84 MiB/s remote: Total 93832 (delta 7906), reused 7233 (delta 7213), pack-reused 84764 (from 3)
  7. 11.85 s Receiving objects: 100% (93832/93832), 296.41 MiB | 34.84 MiB/s Receiving objects: 100% (93832/93832), 309.81 MiB | 34.81 MiB/s, done.
  8. 12.94 s Resolving deltas: 0% (0/63131) Resolving deltas: 1% (633/63131) Resolving deltas: 2% (1263/63131) Resolving deltas: 3% (1895/63131) Resolving deltas: 4% (2526/63131) Resolving deltas: 5% (3157/63131) Resolving deltas: 6% (3788/63131) Resolving deltas: 7% (4424/63131) Resolving deltas: 8% (5051/63131) Resolving deltas: 9% (5682/63131) Resolving deltas: 10% (6314/63131) Resolving deltas: 11% (6945/63131) Resolving deltas: 12% (7576/63131) Resolving deltas: 13% (8208/63131) Resolving deltas: 14% (8839/63131) Resolving deltas: 15% (9470/63131) Resolving deltas: 16% (10101/63131) Resolving deltas: 17% (10734/63131) Resolving deltas: 18% (11364/63131) Resolving deltas: 19% (11995/63131) Resolving deltas: 20% (12627/63131) Resolving deltas: 21% (13258/63131) Resolving deltas: 22% (13889/63131) Resolving deltas: 23% (14521/63131) Resolving deltas: 24% (15152/63131) Resolving deltas: 25% (15783/63131) Resolving deltas: 26% (16415/63131) Resolving deltas: 27% (17047/63131) Resolving deltas: 28% (17677/63131) Resolving deltas: 29% (18309/63131) Resolving deltas: 30% (18940/63131) Resolving deltas: 31% (19572/63131) Resolving deltas: 32% (20202/63131) Resolving deltas: 33% (20834/63131) Resolving deltas: 34% (21465/63131) Resolving deltas: 35% (22096/63131) Resolving deltas: 36% (22728/63131) Resolving deltas: 37% (23360/63131) Resolving deltas: 38% (23990/63131) Resolving deltas: 39% (24622/63131) Resolving deltas: 40% (25253/63131) Resolving deltas: 41% (25884/63131) Resolving deltas: 42% (26516/63131) Resolving deltas: 43% (27147/63131) Resolving deltas: 44% (27778/63131) Resolving deltas: 45% (28409/63131) Resolving deltas: 46% (29041/63131) Resolving deltas: 47% (29672/63131) Resolving deltas: 48% (30303/63131) Resolving deltas: 49% (30935/63131) Resolving deltas: 50% (31566/63131) Resolving deltas: 51% (32197/63131) Resolving deltas: 52% (32829/63131) Resolving deltas: 53% (33460/63131) Resolving deltas: 54% (34091/63131) Resolving deltas: 55% (34723/63131) Resolving deltas: 56% (35354/63131) Resolving deltas: 57% (35985/63131) Resolving deltas: 58% (36617/63131) Resolving deltas: 59% (37248/63131) Resolving deltas: 60% (37879/63131) Resolving deltas: 61% (38510/63131) Resolving deltas: 62% (39142/63131) Resolving deltas: 63% (39773/63131) Resolving deltas: 64% (40404/63131) Resolving deltas: 65% (41037/63131) Resolving deltas: 66% (41667/63131) Resolving deltas: 67% (42299/63131) Resolving deltas: 68% (42930/63131) Resolving deltas: 69% (43561/63131) Resolving deltas: 70% (44192/63131) Resolving deltas: 71% (44824/63131) Resolving deltas: 72% (45455/63131) Resolving deltas: 73% (46087/63131) Resolving deltas: 74% (46717/63131) Resolving deltas: 75% (47349/63131) Resolving deltas: 76% (47980/63131) Resolving deltas: 77% (48611/63131) Resolving deltas: 78% (49243/63131) Resolving deltas: 79% (49874/63131) Resolving deltas: 80% (50505/63131) Resolving deltas: 81% (51137/63131) Resolving deltas: 82% (51770/63131) Resolving deltas: 83% (52399/63131) Resolving deltas: 84% (53031/63131) Resolving deltas: 85% (53662/63131) Resolving deltas: 86% (54293/63131) Resolving deltas: 86% (54837/63131) Resolving deltas: 87% (54925/63131) Resolving deltas: 88% (55556/63131) Resolving deltas: 89% (56187/63131) Resolving deltas: 90% (56818/63131) Resolving deltas: 91% (57450/63131) Resolving deltas: 92% (58081/63131) Resolving deltas: 93% (58712/63131) Resolving deltas: 94% (59344/63131) Resolving deltas: 95% (59975/63131) Resolving deltas: 96% (60606/63131) Resolving deltas: 97% (61239/63131) Resolving deltas: 98% (61869/63131) Resolving deltas: 99% (62500/63131) Resolving deltas: 100% (63131/63131) Resolving deltas: 100% (63131/63131), done.
  9. 13.43 s Fetching commit 654d6aff73111149f97b220cbd7a9fe7bf7d23e4 for advanced_sampling ...
  10. 13.43 s $ /nix/store/bcnisk3ydfgv26v2gw3zlky24g00yww2-git-2.54.0/bin/git fetch origin 654d6aff73111149f97b220cbd7a9fe7bf7d23e4
  11. 13.83 s From https://github.com/alphal00p/gammaloop
  12. 13.83 s * branch 654d6aff73111149f97b220cbd7a9fe7bf7d23e4 -> FETCH_HEAD
  13. 13.84 s $ /nix/store/9ypz3flqsrl5xl495mm8h645gadjsxi1-coreutils-9.11/bin/timeout --kill-after=15s 7200s /nix/store/bcnisk3ydfgv26v2gw3zlky24g00yww2-git-2.54.0/bin/git -c advice.detachedHead=false checkout 654d6aff73111149f97b220cbd7a9fe7bf7d23e4
  14. 14.36 s HEAD is now at 654d6aff7 allow final underflow rounding and stage GL638 validation pilots
  15. 14.37 s $ /nix/store/9ypz3flqsrl5xl495mm8h645gadjsxi1-coreutils-9.11/bin/timeout --kill-after=15s 7200s /nix/store/23zk8sgzamrbmj1fday15szf7f2279s8-nix-2.34.7/bin/nix --extra-experimental-features nix-command --extra-experimental-features flakes --log-format internal-json run .#packages.x86_64-linux.nix-ci-check-gammaloop-nextest-python-api --print-build-logs
  16. 14.50 s error (ignored): SQLite database '/var/cache/nix-ci-worker/eval-cache-v6/4330622c2b93ce2cfc8d9ae563257cfa215fede24c0a7af46d1ed469e8cc0bc3.sqlite' is busy
  17. 21.50 s
  18. 29.28 s evaluating derivation 'g copying '/nix/store/7nm0 evaluating derivation 'g copying '/nix/store/7nm0 evaluating derivation 'g copying '/nix/store/7nm0 evaluating derivation 'g copying '/nix/store/7nm0 evaluating derivation 'g copying '/nix/store/7nm0 evaluating derivation 'g copying '/nix/store/7nm0 evaluating derivation 'g copying '/nix/store/7nm0 evaluating derivation 'g copying '/nix/store/7nm0 evaluating derivation 'g copying '/nix/store/7nm0 evaluating derivation 'g querying gammaloop-nexte [0/7 built, 5/0/12 copiebuilder.pl> Running phase: patchPhase
  19. 29.29 s [1/0/5 built, 2/5/12 copbuilder.pl> Running phase: updateAutotoolsGnuConfigScriptsPhase
  20. 29.29 s builder.pl> Running phase: configurePhase
  21. 29.30 s builder.pl> no configure script, doing nothing
  22. 29.30 s builder.pl> Running phase: buildPhase
  23. 29.31 s builder.pl> Running phase: checkPhase
  24. 29.31 s builder.pl> Running phase: installPhase
  25. 29.32 s builder.pl> no Makefile or custom installPhase, doing nothing
  26. 29.32 s builder.pl> Running phase: fixupPhase
  27. 29.33 s builder.pl> shrinking RPATHs of ELF executables and libraries in /nix/store/n17p4y03iknmyjpnfk30rj7i0klr448n-builder.pl
  28. 29.33 s builder.pl> checking for references to /build/ in /nix/store/n17p4y03iknmyjpnfk30rj7i0klr448n-builder.pl...
  29. 29.34 s builder.pl> patching script interpreter paths in /nix/store/n17p4y03iknmyjpnfk30rj7i0klr448n-builder.pl
  30. 29.37 s builder.pl (post)> Uploading to the NixCI cache: /nix/store/n17p4y03iknmyjpnfk30rj7i0klr448n-builder.pl
  31. 29.41 s builder.pl (post)> warning: 'warn-short-path-literals' is deprecated, use 'lint-short-path-literals = ignore' instead
  32. 29.45 s builder.pl (post)> copying 0 paths...
  33. 29.50 s builder.pl (post)> warning: 'warn-short-path-literals' is deprecated, use 'lint-short-path-literals = ignore' instead
  34. 29.54 s builder.pl (post)> copying 0 paths...
  35. 30.56 s [1/4 built, 2/7/12 copie [1/4 built, 1/11/12 copi [1/3 built, 12 copied (2python3> structuredAttrs is enabled
  36. 30.63 s [1/1/3 built, 12 copied python3> created 227 symlinks in user environment
  37. 31.49 s python3 (post)> Uploading to the NixCI cache: /nix/store/3gi2x25n327sf3xma8b08jd57aqv69x5-python3-3.13.14-env
  38. 31.53 s python3 (post)> warning: 'warn-short-path-literals' is deprecated, use 'lint-short-path-literals = ignore' instead
  39. 31.74 s python3 (post)> copying 0 paths...
  40. 31.79 s python3 (post)> warning: 'warn-short-path-literals' is deprecated, use 'lint-short-path-literals = ignore' instead
  41. 31.84 s python3 (post)> copying 0 paths...
  42. 32.13 s [2/4 built, 12 copied (2 [1/2/3 built, 12 copied gammaloop-nextest-python-api> Extracting 1 binary, 1 build script output directory, and 3 linked paths to /build/nextest-archive-rsLJsz
  43. 32.19 s gammaloop-nextest-python-api> Extracted 18 files to /build/nextest-archive-rsLJsz in 0.06s
  44. 32.20 s gammaloop-nextest-python-api> ------------
  45. 32.20 s gammaloop-nextest-python-api> Nextest run ID 1b80046f-e435-4e3a-a9bc-58cbcbf77210 with nextest profile: ci_gammaloop
  46. 32.20 s gammaloop-nextest-python-api> Starting 5 tests across 1 binary
  47. 32.31 s gammaloop-nextest-python-api> FAIL [ 0.110s] (1/5) gammaloop-integration-tests::test_python_api python_evaluate_sample_preserves_graph_grouping_and_incoming_pdgs
  48. 32.31 s gammaloop-nextest-python-api> stdout ---
  49. 32.31 s gammaloop-nextest-python-api>
  50. 32.31 s gammaloop-nextest-python-api> running 1 test
  51. 32.31 s gammaloop-nextest-python-api> test python_evaluate_sample_preserves_graph_grouping_and_incoming_pdgs ... FAILED
  52. 32.31 s gammaloop-nextest-python-api>
  53. 32.31 s gammaloop-nextest-python-api> failures:
  54. 32.31 s gammaloop-nextest-python-api>
  55. 32.31 s gammaloop-nextest-python-api> failures:
  56. 32.31 s gammaloop-nextest-python-api> python_evaluate_sample_preserves_graph_grouping_and_incoming_pdgs
  57. 32.31 s gammaloop-nextest-python-api>
  58. 32.31 s gammaloop-nextest-python-api> test result: FAILED. 0 passed; 1 failed; 0 ignored; 0 measured; 4 filtered out; finished in 0.11s
  59. 32.31 s gammaloop-nextest-python-api>
  60. 32.31 s gammaloop-nextest-python-api> stderr ---
  61. 32.31 s gammaloop-nextest-python-api> Error: Python API test subprocess failed.
  62. 32.31 s gammaloop-nextest-python-api> stdout:
  63. 32.31 s gammaloop-nextest-python-api> ┌────────────────────────────────────────────────────────┐
  64. 32.31 s gammaloop-nextest-python-api> │ You are running a restricted Symbolica instance. │
  65. 32.31 s gammaloop-nextest-python-api> │ │
  66. 32.31 s gammaloop-nextest-python-api> │ This mode is only permitted for non-commercial use and │
  67. 32.31 s gammaloop-nextest-python-api> │ is limited to one instance and core per machine. │
  68. 32.31 s gammaloop-nextest-python-api> │ │
  69. 32.31 s gammaloop-nextest-python-api> │ Hobbyists can easily acquire a free license key │
  70. 32.31 s gammaloop-nextest-python-api> │ that unlocks all cores and removes this banner: │
  71. 32.31 s gammaloop-nextest-python-api> │ │
  72. 32.31 s gammaloop-nextest-python-api> │ from symbolica import * │
  73. 32.31 s gammaloop-nextest-python-api> │ request_hobbyist_license('YOUR_NAME', 'YOUR_EMAIL') │
  74. 32.31 s gammaloop-nextest-python-api> │ │
  75. 32.31 s gammaloop-nextest-python-api> │ All other users can obtain a free 30-day trial key: │
  76. 32.31 s gammaloop-nextest-python-api> │ │
  77. 32.31 s gammaloop-nextest-python-api> │ from symbolica import * │
  78. 32.31 s gammaloop-nextest-python-api> │ request_trial_license('NAME', 'EMAIL', 'EMPLOYER') │
  79. 32.31 s gammaloop-nextest-python-api> │ │
  80. 32.31 s gammaloop-nextest-python-api> │ See https://symbolica.io/docs/get_started.html#license │
  81. 32.31 s gammaloop-nextest-python-api> └────────────────────────────────────────────────────────┘
  82. 32.31 s gammaloop-nextest-python-api> ┌───────────────────────────────────────────────────────────────────────────────────────────────────────────┐
  83. 32.31 s gammaloop-nextest-python-api> │ Cannot start new unlicensed Symbolica instance since there is already another one running on the machine. │
  84. 32.31 s gammaloop-nextest-python-api> └───────────────────────────────────────────────────────────────────────────────────────────────────────────┘
  85. 32.31 s gammaloop-nextest-python-api>
  86. 32.31 s gammaloop-nextest-python-api> stderr:
  87. 32.31 s gammaloop-nextest-python-api>
  88. 32.31 s gammaloop-nextest-python-api> ┌───────────────────────────────────────────────────────────┐
  89. 32.31 s gammaloop-nextest-python-api> │ Could not resolve the IP of the Symbolica license server. │
  90. 32.31 s gammaloop-nextest-python-api> │ │
  91. 32.31 s gammaloop-nextest-python-api> │ Please check your DNS configuration. │
  92. 32.31 s gammaloop-nextest-python-api> └───────────────────────────────────────────────────────────┘
  93. 32.31 s gammaloop-nextest-python-api> Error: failed to lookup address information: Temporary failure in name resolution
  94. 32.31 s gammaloop-nextest-python-api>
  95. 32.31 s gammaloop-nextest-python-api>
  96. 32.31 s gammaloop-nextest-python-api> Location:
  97. 32.31 s gammaloop-nextest-python-api> tests/tests/test_python_api.rs:156:20
  98. 32.31 s gammaloop-nextest-python-api>
  99. 32.31 s gammaloop-nextest-python-api> FAIL [ 0.110s] (2/5) gammaloop-integration-tests::test_python_api python_evaluate_samples_batch_and_momentum_space_have_expected_shape
  100. 32.31 s gammaloop-nextest-python-api> stdout ---
  101. 32.31 s gammaloop-nextest-python-api>
  102. 32.31 s gammaloop-nextest-python-api> running 1 test
  103. 32.31 s gammaloop-nextest-python-api> test python_evaluate_samples_batch_and_momentum_space_have_expected_shape ... FAILED
  104. 32.31 s gammaloop-nextest-python-api>
  105. 32.31 s gammaloop-nextest-python-api> failures:
  106. 32.31 s gammaloop-nextest-python-api>
  107. 32.31 s gammaloop-nextest-python-api> failures:
  108. 32.31 s gammaloop-nextest-python-api> python_evaluate_samples_batch_and_momentum_space_have_expected_shape
  109. 32.31 s gammaloop-nextest-python-api>
  110. 32.31 s gammaloop-nextest-python-api> test result: FAILED. 0 passed; 1 failed; 0 ignored; 0 measured; 4 filtered out; finished in 0.11s
  111. 32.31 s gammaloop-nextest-python-api>
  112. 32.31 s gammaloop-nextest-python-api> stderr ---
  113. 32.31 s gammaloop-nextest-python-api> Error: Python API test subprocess failed.
  114. 32.31 s gammaloop-nextest-python-api> stdout:
  115. 32.31 s gammaloop-nextest-python-api> ┌────────────────────────────────────────────────────────┐
  116. 32.31 s gammaloop-nextest-python-api> │ You are running a restricted Symbolica instance. │
  117. 32.31 s gammaloop-nextest-python-api> │ │
  118. 32.31 s gammaloop-nextest-python-api> │ This mode is only permitted for non-commercial use and │
  119. 32.31 s gammaloop-nextest-python-api> │ is limited to one instance and core per machine. │
  120. 32.31 s gammaloop-nextest-python-api> │ │
  121. 32.31 s gammaloop-nextest-python-api> │ Hobbyists can easily acquire a free license key │
  122. 32.31 s gammaloop-nextest-python-api> │ that unlocks all cores and removes this banner: │
  123. 32.31 s gammaloop-nextest-python-api> │ │
  124. 32.31 s gammaloop-nextest-python-api> │ from symbolica import * │
  125. 32.31 s gammaloop-nextest-python-api> │ request_hobbyist_license('YOUR_NAME', 'YOUR_EMAIL') │
  126. 32.31 s gammaloop-nextest-python-api> │ │
  127. 32.31 s gammaloop-nextest-python-api> │ All other users can obtain a free 30-day trial key: │
  128. 32.31 s gammaloop-nextest-python-api> │ │
  129. 32.31 s gammaloop-nextest-python-api> │ from symbolica import * │
  130. 32.31 s gammaloop-nextest-python-api> │ request_trial_license('NAME', 'EMAIL', 'EMPLOYER') │
  131. 32.31 s gammaloop-nextest-python-api> │ │
  132. 32.31 s gammaloop-nextest-python-api> │ See https://symbolica.io/docs/get_started.html#license │
  133. 32.31 s gammaloop-nextest-python-api> └────────────────────────────────────────────────────────┘
  134. 32.31 s gammaloop-nextest-python-api> ┌───────────────────────────────────────────────────────────────────────────────────────────────────────────┐
  135. 32.31 s gammaloop-nextest-python-api> │ Cannot start new unlicensed Symbolica instance since there is already another one running on the machine. │
  136. 32.31 s gammaloop-nextest-python-api> └───────────────────────────────────────────────────────────────────────────────────────────────────────────┘
  137. 32.31 s gammaloop-nextest-python-api>
  138. 32.31 s gammaloop-nextest-python-api> stderr:
  139. 32.31 s gammaloop-nextest-python-api>
  140. 32.31 s gammaloop-nextest-python-api> ┌───────────────────────────────────────────────────────────┐
  141. 32.31 s gammaloop-nextest-python-api> │ Could not resolve the IP of the Symbolica license server. │
  142. 32.31 s gammaloop-nextest-python-api> │ │
  143. 32.31 s gammaloop-nextest-python-api> │ Please check your DNS configuration. │
  144. 32.31 s gammaloop-nextest-python-api> └───────────────────────────────────────────────────────────┘
  145. 32.31 s gammaloop-nextest-python-api> Error: failed to lookup address information: Temporary failure in name resolution
  146. 32.31 s gammaloop-nextest-python-api>
  147. 32.31 s gammaloop-nextest-python-api>
  148. 32.32 s gammaloop-nextest-python-api> Location:
  149. 32.32 s gammaloop-nextest-python-api> tests/tests/test_python_api.rs:156:20
  150. 32.32 s gammaloop-nextest-python-api>
  151. 32.32 s gammaloop-nextest-python-api> FAIL [ 0.110s] (3/5) gammaloop-integration-tests::test_python_api python_evaluate_sample_honors_generate_events_and_observable_snapshots
  152. 32.32 s gammaloop-nextest-python-api> stdout ---
  153. 32.32 s gammaloop-nextest-python-api>
  154. 32.32 s gammaloop-nextest-python-api> running 1 test
  155. 32.32 s gammaloop-nextest-python-api> test python_evaluate_sample_honors_generate_events_and_observable_snapshots ... FAILED
  156. 32.32 s gammaloop-nextest-python-api>
  157. 32.32 s gammaloop-nextest-python-api> failures:
  158. 32.32 s gammaloop-nextest-python-api>
  159. 32.32 s gammaloop-nextest-python-api> failures:
  160. 32.32 s gammaloop-nextest-python-api> python_evaluate_sample_honors_generate_events_and_observable_snapshots
  161. 32.32 s gammaloop-nextest-python-api>
  162. 32.32 s gammaloop-nextest-python-api> test result: FAILED. 0 passed; 1 failed; 0 ignored; 0 measured; 4 filtered out; finished in 0.11s
  163. 32.32 s gammaloop-nextest-python-api>
  164. 32.32 s gammaloop-nextest-python-api> stderr ---
  165. 32.32 s gammaloop-nextest-python-api> Error: Python API test subprocess failed.
  166. 32.32 s gammaloop-nextest-python-api> stdout:
  167. 32.32 s gammaloop-nextest-python-api> ┌────────────────────────────────────────────────────────┐
  168. 32.32 s gammaloop-nextest-python-api> │ You are running a restricted Symbolica instance. │
  169. 32.32 s gammaloop-nextest-python-api> │ │
  170. 32.32 s gammaloop-nextest-python-api> │ This mode is only permitted for non-commercial use and │
  171. 32.32 s gammaloop-nextest-python-api> │ is limited to one instance and core per machine. │
  172. 32.32 s gammaloop-nextest-python-api> │ │
  173. 32.32 s gammaloop-nextest-python-api> │ Hobbyists can easily acquire a free license key │
  174. 32.32 s gammaloop-nextest-python-api> │ that unlocks all cores and removes this banner: │
  175. 32.32 s gammaloop-nextest-python-api> │ │
  176. 32.32 s gammaloop-nextest-python-api> │ from symbolica import * │
  177. 32.32 s gammaloop-nextest-python-api> │ request_hobbyist_license('YOUR_NAME', 'YOUR_EMAIL') │
  178. 32.32 s gammaloop-nextest-python-api> │ │
  179. 32.32 s gammaloop-nextest-python-api> │ All other users can obtain a free 30-day trial key: │
  180. 32.32 s gammaloop-nextest-python-api> │ │
  181. 32.32 s gammaloop-nextest-python-api> │ from symbolica import * │
  182. 32.32 s gammaloop-nextest-python-api> │ request_trial_license('NAME', 'EMAIL', 'EMPLOYER') │
  183. 32.32 s gammaloop-nextest-python-api> │ │
  184. 32.32 s gammaloop-nextest-python-api> │ See https://symbolica.io/docs/get_started.html#license │
  185. 32.32 s gammaloop-nextest-python-api> └────────────────────────────────────────────────────────┘
  186. 32.32 s gammaloop-nextest-python-api> ┌───────────────────────────────────────────────────────────────────────────────────────────────────────────┐
  187. 32.32 s gammaloop-nextest-python-api> │ Cannot start new unlicensed Symbolica instance since there is already another one running on the machine. │
  188. 32.32 s gammaloop-nextest-python-api> └───────────────────────────────────────────────────────────────────────────────────────────────────────────┘
  189. 32.32 s gammaloop-nextest-python-api>
  190. 32.32 s gammaloop-nextest-python-api> stderr:
  191. 32.32 s gammaloop-nextest-python-api>
  192. 32.32 s gammaloop-nextest-python-api> ┌───────────────────────────────────────────────────────────┐
  193. 32.32 s gammaloop-nextest-python-api> │ Could not resolve the IP of the Symbolica license server. │
  194. 32.32 s gammaloop-nextest-python-api> │ │
  195. 32.32 s gammaloop-nextest-python-api> │ Please check your DNS configuration. │
  196. 32.32 s gammaloop-nextest-python-api> └───────────────────────────────────────────────────────────┘
  197. 32.32 s gammaloop-nextest-python-api> Error: failed to lookup address information: Temporary failure in name resolution
  198. 32.32 s gammaloop-nextest-python-api>
  199. 32.32 s gammaloop-nextest-python-api>
  200. 32.32 s gammaloop-nextest-python-api> Location:
  201. 32.32 s gammaloop-nextest-python-api> tests/tests/test_python_api.rs:156:20
  202. 32.32 s gammaloop-nextest-python-api>
  203. 32.32 s gammaloop-nextest-python-api> FAIL [ 0.118s] (4/5) gammaloop-integration-tests::test_python_api python_session_getters_return_live_toml_and_command_blocks
  204. 32.32 s gammaloop-nextest-python-api> stdout ---
  205. 32.32 s gammaloop-nextest-python-api>
  206. 32.32 s gammaloop-nextest-python-api> running 1 test
  207. 32.32 s gammaloop-nextest-python-api> test python_session_getters_return_live_toml_and_command_blocks ... FAILED
  208. 32.32 s gammaloop-nextest-python-api>
  209. 32.32 s gammaloop-nextest-python-api> failures:
  210. 32.32 s gammaloop-nextest-python-api>
  211. 32.32 s gammaloop-nextest-python-api> failures:
  212. 32.32 s gammaloop-nextest-python-api> python_session_getters_return_live_toml_and_command_blocks
  213. 32.32 s gammaloop-nextest-python-api>
  214. 32.32 s gammaloop-nextest-python-api> test result: FAILED. 0 passed; 1 failed; 0 ignored; 0 measured; 4 filtered out; finished in 0.11s
  215. 32.32 s gammaloop-nextest-python-api>
  216. 32.32 s gammaloop-nextest-python-api> stderr ---
  217. 32.32 s gammaloop-nextest-python-api> Error: Python API test subprocess failed.
  218. 32.32 s gammaloop-nextest-python-api> stdout:
  219. 32.32 s gammaloop-nextest-python-api> ┌────────────────────────────────────────────────────────┐
  220. 32.32 s gammaloop-nextest-python-api> │ You are running a restricted Symbolica instance. │
  221. 32.32 s gammaloop-nextest-python-api> │ │
  222. 32.32 s gammaloop-nextest-python-api> │ This mode is only permitted for non-commercial use and │
  223. 32.32 s gammaloop-nextest-python-api> │ is limited to one instance and core per machine. │
  224. 32.32 s gammaloop-nextest-python-api> │ │
  225. 32.32 s gammaloop-nextest-python-api> │ Hobbyists can easily acquire a free license key │
  226. 32.32 s gammaloop-nextest-python-api> │ that unlocks all cores and removes this banner: │
  227. 32.32 s gammaloop-nextest-python-api> │ │
  228. 32.32 s gammaloop-nextest-python-api> │ from symbolica import * │
  229. 32.32 s gammaloop-nextest-python-api> │ request_hobbyist_license('YOUR_NAME', 'YOUR_EMAIL') │
  230. 32.32 s gammaloop-nextest-python-api> │ │
  231. 32.32 s gammaloop-nextest-python-api> │ All other users can obtain a free 30-day trial key: │
  232. 32.32 s gammaloop-nextest-python-api> │ │
  233. 32.32 s gammaloop-nextest-python-api> │ from symbolica import * │
  234. 32.32 s gammaloop-nextest-python-api> │ request_trial_license('NAME', 'EMAIL', 'EMPLOYER') │
  235. 32.32 s gammaloop-nextest-python-api> │ │
  236. 32.32 s gammaloop-nextest-python-api> │ See https://symbolica.io/docs/get_started.html#license │
  237. 32.32 s gammaloop-nextest-python-api> └────────────────────────────────────────────────────────┘
  238. 32.32 s gammaloop-nextest-python-api> ┌───────────────────────────────────────────────────────────────────────────────────────────────────────────┐
  239. 32.32 s gammaloop-nextest-python-api> │ Cannot start new unlicensed Symbolica instance since there is already another one running on the machine. │
  240. 32.32 s gammaloop-nextest-python-api> └───────────────────────────────────────────────────────────────────────────────────────────────────────────┘
  241. 32.32 s gammaloop-nextest-python-api>
  242. 32.32 s gammaloop-nextest-python-api> stderr:
  243. 32.32 s gammaloop-nextest-python-api>
  244. 32.32 s gammaloop-nextest-python-api> ┌───────────────────────────────────────────────────────────┐
  245. 32.32 s gammaloop-nextest-python-api> │ Could not resolve the IP of the Symbolica license server. │
  246. 32.32 s gammaloop-nextest-python-api> │ │
  247. 32.32 s gammaloop-nextest-python-api> │ Please check your DNS configuration. │
  248. 32.32 s gammaloop-nextest-python-api> └───────────────────────────────────────────────────────────┘
  249. 32.32 s gammaloop-nextest-python-api> Error: failed to lookup address information: Temporary failure in name resolution
  250. 32.32 s gammaloop-nextest-python-api>
  251. 32.32 s gammaloop-nextest-python-api>
  252. 32.32 s gammaloop-nextest-python-api> Location:
  253. 32.32 s gammaloop-nextest-python-api> tests/tests/test_python_api.rs:156:20
  254. 32.32 s gammaloop-nextest-python-api>
  255. 32.48 s gammaloop-nextest-python-api> ------------
  256. 32.48 s gammaloop-nextest-python-api> Summary [ 0.274s] 5 tests run: 1 passed, 4 failed, 0 skipped
  257. 32.48 s gammaloop-nextest-python-api> FAIL [ 0.110s] (1/5) gammaloop-integration-tests::test_python_api python_evaluate_sample_preserves_graph_grouping_and_incoming_pdgs
  258. 32.48 s gammaloop-nextest-python-api> stdout ---
  259. 32.48 s gammaloop-nextest-python-api>
  260. 32.48 s gammaloop-nextest-python-api> running 1 test
  261. 32.48 s gammaloop-nextest-python-api> test python_evaluate_sample_preserves_graph_grouping_and_incoming_pdgs ... FAILED
  262. 32.48 s gammaloop-nextest-python-api>
  263. 32.48 s gammaloop-nextest-python-api> failures:
  264. 32.48 s gammaloop-nextest-python-api>
  265. 32.48 s gammaloop-nextest-python-api> failures:
  266. 32.48 s gammaloop-nextest-python-api> python_evaluate_sample_preserves_graph_grouping_and_incoming_pdgs
  267. 32.48 s gammaloop-nextest-python-api>
  268. 32.48 s gammaloop-nextest-python-api> test result: FAILED. 0 passed; 1 failed; 0 ignored; 0 measured; 4 filtered out; finished in 0.11s
  269. 32.48 s gammaloop-nextest-python-api>
  270. 32.48 s gammaloop-nextest-python-api> stderr ---
  271. 32.48 s gammaloop-nextest-python-api> Error: Python API test subprocess failed.
  272. 32.48 s gammaloop-nextest-python-api> stdout:
  273. 32.48 s gammaloop-nextest-python-api> ┌────────────────────────────────────────────────────────┐
  274. 32.48 s gammaloop-nextest-python-api> │ You are running a restricted Symbolica instance. │
  275. 32.48 s gammaloop-nextest-python-api> │ │
  276. 32.48 s gammaloop-nextest-python-api> │ This mode is only permitted for non-commercial use and │
  277. 32.48 s gammaloop-nextest-python-api> │ is limited to one instance and core per machine. │
  278. 32.48 s gammaloop-nextest-python-api> │ │
  279. 32.48 s gammaloop-nextest-python-api> │ Hobbyists can easily acquire a free license key │
  280. 32.48 s gammaloop-nextest-python-api> │ that unlocks all cores and removes this banner: │
  281. 32.48 s gammaloop-nextest-python-api> │ │
  282. 32.48 s gammaloop-nextest-python-api> │ from symbolica import * │
  283. 32.48 s gammaloop-nextest-python-api> │ request_hobbyist_license('YOUR_NAME', 'YOUR_EMAIL') │
  284. 32.48 s gammaloop-nextest-python-api> │ │
  285. 32.48 s gammaloop-nextest-python-api> │ All other users can obtain a free 30-day trial key: │
  286. 32.48 s gammaloop-nextest-python-api> │ │
  287. 32.48 s gammaloop-nextest-python-api> │ from symbolica import * │
  288. 32.48 s gammaloop-nextest-python-api> │ request_trial_license('NAME', 'EMAIL', 'EMPLOYER') │
  289. 32.48 s gammaloop-nextest-python-api> │ │
  290. 32.48 s gammaloop-nextest-python-api> │ See https://symbolica.io/docs/get_started.html#license │
  291. 32.48 s gammaloop-nextest-python-api> └────────────────────────────────────────────────────────┘
  292. 32.48 s gammaloop-nextest-python-api> ┌───────────────────────────────────────────────────────────────────────────────────────────────────────────┐
  293. 32.48 s gammaloop-nextest-python-api> │ Cannot start new unlicensed Symbolica instance since there is already another one running on the machine. │
  294. 32.48 s gammaloop-nextest-python-api> └───────────────────────────────────────────────────────────────────────────────────────────────────────────┘
  295. 32.48 s gammaloop-nextest-python-api>
  296. 32.48 s gammaloop-nextest-python-api> stderr:
  297. 32.48 s gammaloop-nextest-python-api>
  298. 32.48 s gammaloop-nextest-python-api> ┌───────────────────────────────────────────────────────────┐
  299. 32.48 s gammaloop-nextest-python-api> │ Could not resolve the IP of the Symbolica license server. │
  300. 32.48 s gammaloop-nextest-python-api> │ │
  301. 32.48 s gammaloop-nextest-python-api> │ Please check your DNS configuration. │
  302. 32.48 s gammaloop-nextest-python-api> └───────────────────────────────────────────────────────────┘
  303. 32.48 s gammaloop-nextest-python-api> Error: failed to lookup address information: Temporary failure in name resolution
  304. 32.48 s gammaloop-nextest-python-api>
  305. 32.48 s gammaloop-nextest-python-api>
  306. 32.48 s gammaloop-nextest-python-api> Location:
  307. 32.48 s gammaloop-nextest-python-api> tests/tests/test_python_api.rs:156:20
  308. 32.48 s gammaloop-nextest-python-api>
  309. 32.48 s gammaloop-nextest-python-api> FAIL [ 0.110s] (2/5) gammaloop-integration-tests::test_python_api python_evaluate_samples_batch_and_momentum_space_have_expected_shape
  310. 32.48 s gammaloop-nextest-python-api> stdout ---
  311. 32.48 s gammaloop-nextest-python-api>
  312. 32.48 s gammaloop-nextest-python-api> running 1 test
  313. 32.48 s gammaloop-nextest-python-api> test python_evaluate_samples_batch_and_momentum_space_have_expected_shape ... FAILED
  314. 32.48 s gammaloop-nextest-python-api>
  315. 32.48 s gammaloop-nextest-python-api> failures:
  316. 32.48 s gammaloop-nextest-python-api>
  317. 32.48 s gammaloop-nextest-python-api> failures:
  318. 32.48 s gammaloop-nextest-python-api> python_evaluate_samples_batch_and_momentum_space_have_expected_shape
  319. 32.48 s gammaloop-nextest-python-api>
  320. 32.48 s gammaloop-nextest-python-api> test result: FAILED. 0 passed; 1 failed; 0 ignored; 0 measured; 4 filtered out; finished in 0.11s
  321. 32.48 s gammaloop-nextest-python-api>
  322. 32.48 s gammaloop-nextest-python-api> stderr ---
  323. 32.48 s gammaloop-nextest-python-api> Error: Python API test subprocess failed.
  324. 32.48 s gammaloop-nextest-python-api> stdout:
  325. 32.48 s gammaloop-nextest-python-api> ┌────────────────────────────────────────────────────────┐
  326. 32.48 s gammaloop-nextest-python-api> │ You are running a restricted Symbolica instance. │
  327. 32.48 s gammaloop-nextest-python-api> │ │
  328. 32.48 s gammaloop-nextest-python-api> │ This mode is only permitted for non-commercial use and │
  329. 32.48 s gammaloop-nextest-python-api> │ is limited to one instance and core per machine. │
  330. 32.48 s gammaloop-nextest-python-api> │ │
  331. 32.48 s gammaloop-nextest-python-api> │ Hobbyists can easily acquire a free license key │
  332. 32.48 s gammaloop-nextest-python-api> │ that unlocks all cores and removes this banner: │
  333. 32.48 s gammaloop-nextest-python-api> │ │
  334. 32.48 s gammaloop-nextest-python-api> │ from symbolica import * │
  335. 32.48 s gammaloop-nextest-python-api> │ request_hobbyist_license('YOUR_NAME', 'YOUR_EMAIL') │
  336. 32.48 s gammaloop-nextest-python-api> │ │
  337. 32.48 s gammaloop-nextest-python-api> │ All other users can obtain a free 30-day trial key: │
  338. 32.48 s gammaloop-nextest-python-api> │ │
  339. 32.48 s gammaloop-nextest-python-api> │ from symbolica import * │
  340. 32.48 s gammaloop-nextest-python-api> │ request_trial_license('NAME', 'EMAIL', 'EMPLOYER') │
  341. 32.48 s gammaloop-nextest-python-api> │ │
  342. 32.48 s gammaloop-nextest-python-api> │ See https://symbolica.io/docs/get_started.html#license │
  343. 32.48 s gammaloop-nextest-python-api> └────────────────────────────────────────────────────────┘
  344. 32.48 s gammaloop-nextest-python-api> ┌───────────────────────────────────────────────────────────────────────────────────────────────────────────┐
  345. 32.48 s gammaloop-nextest-python-api> │ Cannot start new unlicensed Symbolica instance since there is already another one running on the machine. │
  346. 32.48 s gammaloop-nextest-python-api> └───────────────────────────────────────────────────────────────────────────────────────────────────────────┘
  347. 32.48 s gammaloop-nextest-python-api>
  348. 32.48 s gammaloop-nextest-python-api> stderr:
  349. 32.48 s gammaloop-nextest-python-api>
  350. 32.48 s gammaloop-nextest-python-api> ┌───────────────────────────────────────────────────────────┐
  351. 32.48 s gammaloop-nextest-python-api> │ Could not resolve the IP of the Symbolica license server. │
  352. 32.48 s gammaloop-nextest-python-api> │ │
  353. 32.48 s gammaloop-nextest-python-api> │ Please check your DNS configuration. │
  354. 32.48 s gammaloop-nextest-python-api> └───────────────────────────────────────────────────────────┘
  355. 32.48 s gammaloop-nextest-python-api> Error: failed to lookup address information: Temporary failure in name resolution
  356. 32.48 s gammaloop-nextest-python-api>
  357. 32.48 s gammaloop-nextest-python-api>
  358. 32.48 s gammaloop-nextest-python-api> Location:
  359. 32.48 s gammaloop-nextest-python-api> tests/tests/test_python_api.rs:156:20
  360. 32.48 s gammaloop-nextest-python-api>
  361. 32.48 s gammaloop-nextest-python-api> FAIL [ 0.110s] (3/5) gammaloop-integration-tests::test_python_api python_evaluate_sample_honors_generate_events_and_observable_snapshots
  362. 32.48 s gammaloop-nextest-python-api> stdout ---
  363. 32.48 s gammaloop-nextest-python-api>
  364. 32.48 s gammaloop-nextest-python-api> running 1 test
  365. 32.48 s gammaloop-nextest-python-api> test python_evaluate_sample_honors_generate_events_and_observable_snapshots ... FAILED
  366. 32.48 s gammaloop-nextest-python-api>
  367. 32.48 s gammaloop-nextest-python-api> failures:
  368. 32.48 s gammaloop-nextest-python-api>
  369. 32.48 s gammaloop-nextest-python-api> failures:
  370. 32.48 s gammaloop-nextest-python-api> python_evaluate_sample_honors_generate_events_and_observable_snapshots
  371. 32.48 s gammaloop-nextest-python-api>
  372. 32.48 s gammaloop-nextest-python-api> test result: FAILED. 0 passed; 1 failed; 0 ignored; 0 measured; 4 filtered out; finished in 0.11s
  373. 32.48 s gammaloop-nextest-python-api>
  374. 32.48 s gammaloop-nextest-python-api> stderr ---
  375. 32.48 s gammaloop-nextest-python-api> Error: Python API test subprocess failed.
  376. 32.48 s gammaloop-nextest-python-api> stdout:
  377. 32.48 s gammaloop-nextest-python-api> ┌────────────────────────────────────────────────────────┐
  378. 32.48 s gammaloop-nextest-python-api> │ You are running a restricted Symbolica instance. │
  379. 32.48 s gammaloop-nextest-python-api> │ │
  380. 32.48 s gammaloop-nextest-python-api> │ This mode is only permitted for non-commercial use and │
  381. 32.48 s gammaloop-nextest-python-api> │ is limited to one instance and core per machine. │
  382. 32.48 s gammaloop-nextest-python-api> │ │
  383. 32.48 s gammaloop-nextest-python-api> │ Hobbyists can easily acquire a free license key │
  384. 32.48 s gammaloop-nextest-python-api> │ that unlocks all cores and removes this banner: │
  385. 32.48 s gammaloop-nextest-python-api> │ │
  386. 32.48 s gammaloop-nextest-python-api> │ from symbolica import * │
  387. 32.48 s gammaloop-nextest-python-api> │ request_hobbyist_license('YOUR_NAME', 'YOUR_EMAIL') │
  388. 32.48 s gammaloop-nextest-python-api> │ │
  389. 32.48 s gammaloop-nextest-python-api> │ All other users can obtain a free 30-day trial key: │
  390. 32.48 s gammaloop-nextest-python-api> │ │
  391. 32.48 s gammaloop-nextest-python-api> │ from symbolica import * │
  392. 32.48 s gammaloop-nextest-python-api> │ request_trial_license('NAME', 'EMAIL', 'EMPLOYER') │
  393. 32.48 s gammaloop-nextest-python-api> │ │
  394. 32.48 s gammaloop-nextest-python-api> │ See https://symbolica.io/docs/get_started.html#license │
  395. 32.48 s gammaloop-nextest-python-api> └────────────────────────────────────────────────────────┘
  396. 32.48 s gammaloop-nextest-python-api> ┌───────────────────────────────────────────────────────────────────────────────────────────────────────────┐
  397. 32.48 s gammaloop-nextest-python-api> │ Cannot start new unlicensed Symbolica instance since there is already another one running on the machine. │
  398. 32.48 s gammaloop-nextest-python-api> └───────────────────────────────────────────────────────────────────────────────────────────────────────────┘
  399. 32.48 s gammaloop-nextest-python-api>
  400. 32.48 s gammaloop-nextest-python-api> stderr:
  401. 32.48 s gammaloop-nextest-python-api>
  402. 32.48 s gammaloop-nextest-python-api> ┌───────────────────────────────────────────────────────────┐
  403. 32.48 s gammaloop-nextest-python-api> │ Could not resolve the IP of the Symbolica license server. │
  404. 32.48 s gammaloop-nextest-python-api> │ │
  405. 32.48 s gammaloop-nextest-python-api> │ Please check your DNS configuration. │
  406. 32.48 s gammaloop-nextest-python-api> └───────────────────────────────────────────────────────────┘
  407. 32.48 s gammaloop-nextest-python-api> Error: failed to lookup address information: Temporary failure in name resolution
  408. 32.48 s gammaloop-nextest-python-api>
  409. 32.48 s gammaloop-nextest-python-api>
  410. 32.48 s gammaloop-nextest-python-api> Location:
  411. 32.48 s gammaloop-nextest-python-api> tests/tests/test_python_api.rs:156:20
  412. 32.48 s gammaloop-nextest-python-api>
  413. 32.48 s gammaloop-nextest-python-api> FAIL [ 0.118s] (4/5) gammaloop-integration-tests::test_python_api python_session_getters_return_live_toml_and_command_blocks
  414. 32.48 s gammaloop-nextest-python-api> stdout ---
  415. 32.48 s gammaloop-nextest-python-api>
  416. 32.48 s gammaloop-nextest-python-api> running 1 test
  417. 32.48 s gammaloop-nextest-python-api> test python_session_getters_return_live_toml_and_command_blocks ... FAILED
  418. 32.48 s gammaloop-nextest-python-api>
  419. 32.48 s gammaloop-nextest-python-api> failures:
  420. 32.48 s gammaloop-nextest-python-api>
  421. 32.48 s gammaloop-nextest-python-api> failures:
  422. 32.48 s gammaloop-nextest-python-api> python_session_getters_return_live_toml_and_command_blocks
  423. 32.48 s gammaloop-nextest-python-api>
  424. 32.48 s gammaloop-nextest-python-api> test result: FAILED. 0 passed; 1 failed; 0 ignored; 0 measured; 4 filtered out; finished in 0.11s
  425. 32.48 s gammaloop-nextest-python-api>
  426. 32.48 s gammaloop-nextest-python-api> stderr ---
  427. 32.48 s gammaloop-nextest-python-api> Error: Python API test subprocess failed.
  428. 32.48 s gammaloop-nextest-python-api> stdout:
  429. 32.48 s gammaloop-nextest-python-api> ┌────────────────────────────────────────────────────────┐
  430. 32.48 s gammaloop-nextest-python-api> │ You are running a restricted Symbolica instance. │
  431. 32.48 s gammaloop-nextest-python-api> │ │
  432. 32.48 s gammaloop-nextest-python-api> │ This mode is only permitted for non-commercial use and │
  433. 32.48 s gammaloop-nextest-python-api> │ is limited to one instance and core per machine. │
  434. 32.48 s gammaloop-nextest-python-api> │ │
  435. 32.48 s gammaloop-nextest-python-api> │ Hobbyists can easily acquire a free license key │
  436. 32.48 s gammaloop-nextest-python-api> │ that unlocks all cores and removes this banner: │
  437. 32.48 s gammaloop-nextest-python-api> │ │
  438. 32.48 s gammaloop-nextest-python-api> │ from symbolica import * │
  439. 32.48 s gammaloop-nextest-python-api> │ request_hobbyist_license('YOUR_NAME', 'YOUR_EMAIL') │
  440. 32.48 s gammaloop-nextest-python-api> │ │
  441. 32.48 s gammaloop-nextest-python-api> │ All other users can obtain a free 30-day trial key: │
  442. 32.48 s gammaloop-nextest-python-api> │ │
  443. 32.48 s gammaloop-nextest-python-api> │ from symbolica import * │
  444. 32.48 s gammaloop-nextest-python-api> │ request_trial_license('NAME', 'EMAIL', 'EMPLOYER') │
  445. 32.48 s gammaloop-nextest-python-api> │ │
  446. 32.48 s gammaloop-nextest-python-api> │ See https://symbolica.io/docs/get_started.html#license │
  447. 32.48 s gammaloop-nextest-python-api> └────────────────────────────────────────────────────────┘
  448. 32.48 s gammaloop-nextest-python-api> ┌───────────────────────────────────────────────────────────────────────────────────────────────────────────┐
  449. 32.48 s gammaloop-nextest-python-api> │ Cannot start new unlicensed Symbolica instance since there is already another one running on the machine. │
  450. 32.48 s gammaloop-nextest-python-api> └───────────────────────────────────────────────────────────────────────────────────────────────────────────┘
  451. 32.48 s gammaloop-nextest-python-api>
  452. 32.48 s gammaloop-nextest-python-api> stderr:
  453. 32.48 s gammaloop-nextest-python-api>
  454. 32.48 s gammaloop-nextest-python-api> ┌───────────────────────────────────────────────────────────┐
  455. 32.48 s gammaloop-nextest-python-api> │ Could not resolve the IP of the Symbolica license server. │
  456. 32.48 s gammaloop-nextest-python-api> │ │
  457. 32.48 s gammaloop-nextest-python-api> │ Please check your DNS configuration. │
  458. 32.48 s gammaloop-nextest-python-api> └───────────────────────────────────────────────────────────┘
  459. 32.48 s gammaloop-nextest-python-api> Error: failed to lookup address information: Temporary failure in name resolution
  460. 32.48 s gammaloop-nextest-python-api>
  461. 32.48 s gammaloop-nextest-python-api>
  462. 32.48 s gammaloop-nextest-python-api> Location:
  463. 32.48 s gammaloop-nextest-python-api> tests/tests/test_python_api.rs:156:20
  464. 32.48 s gammaloop-nextest-python-api>
  465. 32.49 s gammaloop-nextest-python-api> error: test run failed
  466. 32.51 s gammaloop-nextest-python-api>
  467. 32.51 s gammaloop-nextest-python-api> ========== nextest test summary ==========
  468. 32.51 s gammaloop-nextest-python-api> report: target/nextest/ci_gammaloop/junit.xml
  469. 32.51 s gammaloop-nextest-python-api> tests: 5, failures: 4, errors: 0
  470. 32.51 s gammaloop-nextest-python-api>
  471. 32.51 s gammaloop-nextest-python-api> 1. gammaloop-integration-tests::test_python_api::python_evaluate_sample_preserves_graph_grouping_and_incoming_pdgs
  472. 32.51 s gammaloop-nextest-python-api> failure: test failure with exit code 101
  473. 32.51 s gammaloop-nextest-python-api> Error: Python API test subprocess failed.
  474. 32.51 s gammaloop-nextest-python-api> stdout:
  475. 32.51 s gammaloop-nextest-python-api> ┌────────────────────────────────────────────────────────┐
  476. 32.51 s gammaloop-nextest-python-api> │ You are running a restricted Symbolica instance. │
  477. 32.51 s gammaloop-nextest-python-api> │ │
  478. 32.51 s gammaloop-nextest-python-api> │ This mode is only permitted for non-commercial use and │
  479. 32.51 s gammaloop-nextest-python-api> │ is limited to one instance and core per machine. │
  480. 32.51 s gammaloop-nextest-python-api> │ │
  481. 32.51 s gammaloop-nextest-python-api> │ Hobbyists can easily acquire a free license key │
  482. 32.51 s gammaloop-nextest-python-api> │ that unlocks all cores and removes this banner: │
  483. 32.51 s gammaloop-nextest-python-api> │ │
  484. 32.51 s gammaloop-nextest-python-api> │ from symbolica import * │
  485. 32.51 s gammaloop-nextest-python-api> │ request_hobbyist_license('YOUR_NAME', 'YOUR_EMAIL') │
  486. 32.51 s gammaloop-nextest-python-api> │ │
  487. 32.51 s gammaloop-nextest-python-api> │ All other users can obtain a free 30-day trial key: │
  488. 32.51 s gammaloop-nextest-python-api> │ │
  489. 32.51 s gammaloop-nextest-python-api> │ from symbolica import * │
  490. 32.51 s gammaloop-nextest-python-api> │ request_trial_license('NAME', 'EMAIL', 'EMPLOYER') │
  491. 32.51 s gammaloop-nextest-python-api> │ │
  492. 32.51 s gammaloop-nextest-python-api> │ See https://symbolica.io/docs/get_started.html#license │
  493. 32.51 s gammaloop-nextest-python-api> └────────────────────────────────────────────────────────┘
  494. 32.51 s gammaloop-nextest-python-api> ┌───────────────────────────────────────────────────────────────────────────────────────────────────────────┐
  495. 32.51 s gammaloop-nextest-python-api> │ Cannot start new unlicensed Symbolica instance since there is already another one running on the machine. │
  496. 32.51 s gammaloop-nextest-python-api> └───────────────────────────────────────────────────────────────────────────────────────────────────────────┘
  497. 32.51 s gammaloop-nextest-python-api>
  498. 32.51 s gammaloop-nextest-python-api> stderr:
  499. 32.51 s gammaloop-nextest-python-api>
  500. 32.51 s gammaloop-nextest-python-api> ┌───────────────────────────────────────────────────────────┐
  501. 32.51 s gammaloop-nextest-python-api> │ Could not resolve the IP of the Symbolica license server. │
  502. 32.51 s gammaloop-nextest-python-api> │ │
  503. 32.51 s gammaloop-nextest-python-api> │ Please check your DNS configuration. │
  504. 32.51 s gammaloop-nextest-python-api> └───────────────────────────────────────────────────────────┘
  505. 32.51 s gammaloop-nextest-python-api> Error: failed to lookup address information: Temporary failure in name resolution
  506. 32.51 s gammaloop-nextest-python-api>
  507. 32.51 s gammaloop-nextest-python-api>
  508. 32.51 s gammaloop-nextest-python-api> Location:
  509. 32.51 s gammaloop-nextest-python-api> tests/tests/test_python_api.rs:156:20
  510. 32.51 s gammaloop-nextest-python-api> system-out
  511. 32.51 s gammaloop-nextest-python-api> running 1 test
  512. 32.51 s gammaloop-nextest-python-api> test python_evaluate_sample_preserves_graph_grouping_and_incoming_pdgs ... FAILED
  513. 32.51 s gammaloop-nextest-python-api>
  514. 32.51 s gammaloop-nextest-python-api> failures:
  515. 32.51 s gammaloop-nextest-python-api>
  516. 32.51 s gammaloop-nextest-python-api> failures:
  517. 32.51 s gammaloop-nextest-python-api> python_evaluate_sample_preserves_graph_grouping_and_incoming_pdgs
  518. 32.51 s gammaloop-nextest-python-api>
  519. 32.51 s gammaloop-nextest-python-api> test result: FAILED. 0 passed; 1 failed; 0 ignored; 0 measured; 4 filtered out; finished in 0.11s
  520. 32.51 s gammaloop-nextest-python-api> system-err
  521. 32.51 s gammaloop-nextest-python-api> Error: Python API test subprocess failed.
  522. 32.51 s gammaloop-nextest-python-api> stdout:
  523. 32.51 s gammaloop-nextest-python-api> ┌────────────────────────────────────────────────────────┐
  524. 32.51 s gammaloop-nextest-python-api> │ You are running a restricted Symbolica instance. │
  525. 32.51 s gammaloop-nextest-python-api> │ │
  526. 32.51 s gammaloop-nextest-python-api> │ This mode is only permitted for non-commercial use and │
  527. 32.51 s gammaloop-nextest-python-api> │ is limited to one instance and core per machine. │
  528. 32.51 s gammaloop-nextest-python-api> │ │
  529. 32.51 s gammaloop-nextest-python-api> │ Hobbyists can easily acquire a free license key │
  530. 32.51 s gammaloop-nextest-python-api> │ that unlocks all cores and removes this banner: │
  531. 32.51 s gammaloop-nextest-python-api> │ │
  532. 32.51 s gammaloop-nextest-python-api> │ from symbolica import * │
  533. 32.51 s gammaloop-nextest-python-api> │ request_hobbyist_license('YOUR_NAME', 'YOUR_EMAIL') │
  534. 32.51 s gammaloop-nextest-python-api> │ │
  535. 32.51 s gammaloop-nextest-python-api> │ All other users can obtain a free 30-day trial key: │
  536. 32.51 s gammaloop-nextest-python-api> │ │
  537. 32.51 s gammaloop-nextest-python-api> │ from symbolica import * │
  538. 32.51 s gammaloop-nextest-python-api> │ request_trial_license('NAME', 'EMAIL', 'EMPLOYER') │
  539. 32.51 s gammaloop-nextest-python-api> │ │
  540. 32.51 s gammaloop-nextest-python-api> │ See https://symbolica.io/docs/get_started.html#license │
  541. 32.51 s gammaloop-nextest-python-api> └────────────────────────────────────────────────────────┘
  542. 32.51 s gammaloop-nextest-python-api> ┌───────────────────────────────────────────────────────────────────────────────────────────────────────────┐
  543. 32.51 s gammaloop-nextest-python-api> │ Cannot start new unlicensed Symbolica instance since there is already another one running on the machine. │
  544. 32.51 s gammaloop-nextest-python-api> └───────────────────────────────────────────────────────────────────────────────────────────────────────────┘
  545. 32.51 s gammaloop-nextest-python-api>
  546. 32.51 s gammaloop-nextest-python-api> stderr:
  547. 32.51 s gammaloop-nextest-python-api>
  548. 32.51 s gammaloop-nextest-python-api> ┌───────────────────────────────────────────────────────────┐
  549. 32.51 s gammaloop-nextest-python-api> │ Could not resolve the IP of the Symbolica license server. │
  550. 32.51 s gammaloop-nextest-python-api> │ │
  551. 32.51 s gammaloop-nextest-python-api> │ Please check your DNS configuration. │
  552. 32.51 s gammaloop-nextest-python-api> └───────────────────────────────────────────────────────────┘
  553. 32.51 s gammaloop-nextest-python-api> Error: failed to lookup address information: Temporary failure in name resolution
  554. 32.51 s gammaloop-nextest-python-api>
  555. 32.51 s gammaloop-nextest-python-api>
  556. 32.51 s gammaloop-nextest-python-api> Location:
  557. 32.51 s gammaloop-nextest-python-api> tests/tests/test_python_api.rs:156:20
  558. 32.51 s gammaloop-nextest-python-api>
  559. 32.51 s gammaloop-nextest-python-api> 2. gammaloop-integration-tests::test_python_api::python_evaluate_samples_batch_and_momentum_space_have_expected_shape
  560. 32.51 s gammaloop-nextest-python-api> failure: test failure with exit code 101
  561. 32.51 s gammaloop-nextest-python-api> Error: Python API test subprocess failed.
  562. 32.51 s gammaloop-nextest-python-api> stdout:
  563. 32.51 s gammaloop-nextest-python-api> ┌────────────────────────────────────────────────────────┐
  564. 32.51 s gammaloop-nextest-python-api> │ You are running a restricted Symbolica instance. │
  565. 32.51 s gammaloop-nextest-python-api> │ │
  566. 32.51 s gammaloop-nextest-python-api> │ This mode is only permitted for non-commercial use and │
  567. 32.51 s gammaloop-nextest-python-api> │ is limited to one instance and core per machine. │
  568. 32.51 s gammaloop-nextest-python-api> │ │
  569. 32.51 s gammaloop-nextest-python-api> │ Hobbyists can easily acquire a free license key │
  570. 32.51 s gammaloop-nextest-python-api> │ that unlocks all cores and removes this banner: │
  571. 32.51 s gammaloop-nextest-python-api> │ │
  572. 32.51 s gammaloop-nextest-python-api> │ from symbolica import * │
  573. 32.51 s gammaloop-nextest-python-api> │ request_hobbyist_license('YOUR_NAME', 'YOUR_EMAIL') │
  574. 32.51 s gammaloop-nextest-python-api> │ │
  575. 32.51 s gammaloop-nextest-python-api> │ All other users can obtain a free 30-day trial key: │
  576. 32.51 s gammaloop-nextest-python-api> │ │
  577. 32.51 s gammaloop-nextest-python-api> │ from symbolica import * │
  578. 32.51 s gammaloop-nextest-python-api> │ request_trial_license('NAME', 'EMAIL', 'EMPLOYER') │
  579. 32.51 s gammaloop-nextest-python-api> │ │
  580. 32.51 s gammaloop-nextest-python-api> │ See https://symbolica.io/docs/get_started.html#license │
  581. 32.51 s gammaloop-nextest-python-api> └────────────────────────────────────────────────────────┘
  582. 32.51 s gammaloop-nextest-python-api> ┌───────────────────────────────────────────────────────────────────────────────────────────────────────────┐
  583. 32.51 s gammaloop-nextest-python-api> │ Cannot start new unlicensed Symbolica instance since there is already another one running on the machine. │
  584. 32.51 s gammaloop-nextest-python-api> └───────────────────────────────────────────────────────────────────────────────────────────────────────────┘
  585. 32.51 s gammaloop-nextest-python-api>
  586. 32.51 s gammaloop-nextest-python-api> stderr:
  587. 32.51 s gammaloop-nextest-python-api>
  588. 32.51 s gammaloop-nextest-python-api> ┌───────────────────────────────────────────────────────────┐
  589. 32.51 s gammaloop-nextest-python-api> │ Could not resolve the IP of the Symbolica license server. │
  590. 32.51 s gammaloop-nextest-python-api> │ │
  591. 32.51 s gammaloop-nextest-python-api> │ Please check your DNS configuration. │
  592. 32.51 s gammaloop-nextest-python-api> └───────────────────────────────────────────────────────────┘
  593. 32.51 s gammaloop-nextest-python-api> Error: failed to lookup address information: Temporary failure in name resolution
  594. 32.51 s gammaloop-nextest-python-api>
  595. 32.51 s gammaloop-nextest-python-api>
  596. 32.51 s gammaloop-nextest-python-api> Location:
  597. 32.51 s gammaloop-nextest-python-api> tests/tests/test_python_api.rs:156:20
  598. 32.51 s gammaloop-nextest-python-api> system-out
  599. 32.51 s gammaloop-nextest-python-api> running 1 test
  600. 32.51 s gammaloop-nextest-python-api> test python_evaluate_samples_batch_and_momentum_space_have_expected_shape ... FAILED
  601. 32.51 s gammaloop-nextest-python-api>
  602. 32.51 s gammaloop-nextest-python-api> failures:
  603. 32.51 s gammaloop-nextest-python-api>
  604. 32.51 s gammaloop-nextest-python-api> failures:
  605. 32.51 s gammaloop-nextest-python-api> python_evaluate_samples_batch_and_momentum_space_have_expected_shape
  606. 32.51 s gammaloop-nextest-python-api>
  607. 32.51 s gammaloop-nextest-python-api> test result: FAILED. 0 passed; 1 failed; 0 ignored; 0 measured; 4 filtered out; finished in 0.11s
  608. 32.51 s gammaloop-nextest-python-api> system-err
  609. 32.51 s gammaloop-nextest-python-api> Error: Python API test subprocess failed.
  610. 32.51 s gammaloop-nextest-python-api> stdout:
  611. 32.51 s gammaloop-nextest-python-api> ┌────────────────────────────────────────────────────────┐
  612. 32.51 s gammaloop-nextest-python-api> │ You are running a restricted Symbolica instance. │
  613. 32.51 s gammaloop-nextest-python-api> │ │
  614. 32.51 s gammaloop-nextest-python-api> │ This mode is only permitted for non-commercial use and │
  615. 32.51 s gammaloop-nextest-python-api> │ is limited to one instance and core per machine. │
  616. 32.51 s gammaloop-nextest-python-api> │ │
  617. 32.51 s gammaloop-nextest-python-api> │ Hobbyists can easily acquire a free license key │
  618. 32.51 s gammaloop-nextest-python-api> │ that unlocks all cores and removes this banner: │
  619. 32.51 s gammaloop-nextest-python-api> │ │
  620. 32.51 s gammaloop-nextest-python-api> │ from symbolica import * │
  621. 32.51 s gammaloop-nextest-python-api> │ request_hobbyist_license('YOUR_NAME', 'YOUR_EMAIL') │
  622. 32.51 s gammaloop-nextest-python-api> │ │
  623. 32.51 s gammaloop-nextest-python-api> │ All other users can obtain a free 30-day trial key: │
  624. 32.51 s gammaloop-nextest-python-api> │ │
  625. 32.51 s gammaloop-nextest-python-api> │ from symbolica import * │
  626. 32.51 s gammaloop-nextest-python-api> │ request_trial_license('NAME', 'EMAIL', 'EMPLOYER') │
  627. 32.51 s gammaloop-nextest-python-api> │ │
  628. 32.51 s gammaloop-nextest-python-api> │ See https://symbolica.io/docs/get_started.html#license │
  629. 32.51 s gammaloop-nextest-python-api> └────────────────────────────────────────────────────────┘
  630. 32.51 s gammaloop-nextest-python-api> ┌───────────────────────────────────────────────────────────────────────────────────────────────────────────┐
  631. 32.51 s gammaloop-nextest-python-api> │ Cannot start new unlicensed Symbolica instance since there is already another one running on the machine. │
  632. 32.51 s gammaloop-nextest-python-api> └───────────────────────────────────────────────────────────────────────────────────────────────────────────┘
  633. 32.51 s gammaloop-nextest-python-api>
  634. 32.51 s gammaloop-nextest-python-api> stderr:
  635. 32.51 s gammaloop-nextest-python-api>
  636. 32.51 s gammaloop-nextest-python-api> ┌───────────────────────────────────────────────────────────┐
  637. 32.51 s gammaloop-nextest-python-api> │ Could not resolve the IP of the Symbolica license server. │
  638. 32.51 s gammaloop-nextest-python-api> │ │
  639. 32.51 s gammaloop-nextest-python-api> │ Please check your DNS configuration. │
  640. 32.51 s gammaloop-nextest-python-api> └───────────────────────────────────────────────────────────┘
  641. 32.51 s gammaloop-nextest-python-api> Error: failed to lookup address information: Temporary failure in name resolution
  642. 32.51 s gammaloop-nextest-python-api>
  643. 32.51 s gammaloop-nextest-python-api>
  644. 32.51 s gammaloop-nextest-python-api> Location:
  645. 32.51 s gammaloop-nextest-python-api> tests/tests/test_python_api.rs:156:20
  646. 32.51 s gammaloop-nextest-python-api>
  647. 32.51 s gammaloop-nextest-python-api> 3. gammaloop-integration-tests::test_python_api::python_evaluate_sample_honors_generate_events_and_observable_snapshots
  648. 32.51 s gammaloop-nextest-python-api> failure: test failure with exit code 101
  649. 32.51 s gammaloop-nextest-python-api> Error: Python API test subprocess failed.
  650. 32.51 s gammaloop-nextest-python-api> stdout:
  651. 32.51 s gammaloop-nextest-python-api> ┌────────────────────────────────────────────────────────┐
  652. 32.51 s gammaloop-nextest-python-api> │ You are running a restricted Symbolica instance. │
  653. 32.51 s gammaloop-nextest-python-api> │ │
  654. 32.51 s gammaloop-nextest-python-api> │ This mode is only permitted for non-commercial use and │
  655. 32.51 s gammaloop-nextest-python-api> │ is limited to one instance and core per machine. │
  656. 32.51 s gammaloop-nextest-python-api> │ │
  657. 32.51 s gammaloop-nextest-python-api> │ Hobbyists can easily acquire a free license key │
  658. 32.51 s gammaloop-nextest-python-api> │ that unlocks all cores and removes this banner: │
  659. 32.51 s gammaloop-nextest-python-api> │ │
  660. 32.51 s gammaloop-nextest-python-api> │ from symbolica import * │
  661. 32.51 s gammaloop-nextest-python-api> │ request_hobbyist_license('YOUR_NAME', 'YOUR_EMAIL') │
  662. 32.51 s gammaloop-nextest-python-api> │ │
  663. 32.51 s gammaloop-nextest-python-api> │ All other users can obtain a free 30-day trial key: │
  664. 32.51 s gammaloop-nextest-python-api> │ │
  665. 32.51 s gammaloop-nextest-python-api> │ from symbolica import * │
  666. 32.51 s gammaloop-nextest-python-api> │ request_trial_license('NAME', 'EMAIL', 'EMPLOYER') │
  667. 32.51 s gammaloop-nextest-python-api> │ │
  668. 32.51 s gammaloop-nextest-python-api> │ See https://symbolica.io/docs/get_started.html#license │
  669. 32.51 s gammaloop-nextest-python-api> └────────────────────────────────────────────────────────┘
  670. 32.51 s gammaloop-nextest-python-api> ┌───────────────────────────────────────────────────────────────────────────────────────────────────────────┐
  671. 32.51 s gammaloop-nextest-python-api> │ Cannot start new unlicensed Symbolica instance since there is already another one running on the machine. │
  672. 32.51 s gammaloop-nextest-python-api> └───────────────────────────────────────────────────────────────────────────────────────────────────────────┘
  673. 32.51 s gammaloop-nextest-python-api>
  674. 32.51 s gammaloop-nextest-python-api> stderr:
  675. 32.51 s gammaloop-nextest-python-api>
  676. 32.51 s gammaloop-nextest-python-api> ┌───────────────────────────────────────────────────────────┐
  677. 32.51 s gammaloop-nextest-python-api> │ Could not resolve the IP of the Symbolica license server. │
  678. 32.51 s gammaloop-nextest-python-api> │ │
  679. 32.51 s gammaloop-nextest-python-api> │ Please check your DNS configuration. │
  680. 32.51 s gammaloop-nextest-python-api> └───────────────────────────────────────────────────────────┘
  681. 32.51 s gammaloop-nextest-python-api> Error: failed to lookup address information: Temporary failure in name resolution
  682. 32.51 s gammaloop-nextest-python-api>
  683. 32.51 s gammaloop-nextest-python-api>
  684. 32.51 s gammaloop-nextest-python-api> Location:
  685. 32.51 s gammaloop-nextest-python-api> tests/tests/test_python_api.rs:156:20
  686. 32.51 s gammaloop-nextest-python-api> system-out
  687. 32.51 s gammaloop-nextest-python-api> running 1 test
  688. 32.51 s gammaloop-nextest-python-api> test python_evaluate_sample_honors_generate_events_and_observable_snapshots ... FAILED
  689. 32.51 s gammaloop-nextest-python-api>
  690. 32.51 s gammaloop-nextest-python-api> failures:
  691. 32.51 s gammaloop-nextest-python-api>
  692. 32.51 s gammaloop-nextest-python-api> failures:
  693. 32.51 s gammaloop-nextest-python-api> python_evaluate_sample_honors_generate_events_and_observable_snapshots
  694. 32.51 s gammaloop-nextest-python-api>
  695. 32.51 s gammaloop-nextest-python-api> test result: FAILED. 0 passed; 1 failed; 0 ignored; 0 measured; 4 filtered out; finished in 0.11s
  696. 32.51 s gammaloop-nextest-python-api> system-err
  697. 32.51 s gammaloop-nextest-python-api> Error: Python API test subprocess failed.
  698. 32.51 s gammaloop-nextest-python-api> stdout:
  699. 32.51 s gammaloop-nextest-python-api> ┌────────────────────────────────────────────────────────┐
  700. 32.51 s gammaloop-nextest-python-api> │ You are running a restricted Symbolica instance. │
  701. 32.51 s gammaloop-nextest-python-api> │ │
  702. 32.51 s gammaloop-nextest-python-api> │ This mode is only permitted for non-commercial use and │
  703. 32.51 s gammaloop-nextest-python-api> │ is limited to one instance and core per machine. │
  704. 32.51 s gammaloop-nextest-python-api> │ │
  705. 32.51 s gammaloop-nextest-python-api> │ Hobbyists can easily acquire a free license key │
  706. 32.51 s gammaloop-nextest-python-api> │ that unlocks all cores and removes this banner: │
  707. 32.51 s gammaloop-nextest-python-api> │ │
  708. 32.51 s gammaloop-nextest-python-api> │ from symbolica import * │
  709. 32.51 s gammaloop-nextest-python-api> │ request_hobbyist_license('YOUR_NAME', 'YOUR_EMAIL') │
  710. 32.51 s gammaloop-nextest-python-api> │ │
  711. 32.51 s gammaloop-nextest-python-api> │ All other users can obtain a free 30-day trial key: │
  712. 32.51 s gammaloop-nextest-python-api> │ │
  713. 32.51 s gammaloop-nextest-python-api> │ from symbolica import * │
  714. 32.51 s gammaloop-nextest-python-api> │ request_trial_license('NAME', 'EMAIL', 'EMPLOYER') │
  715. 32.51 s gammaloop-nextest-python-api> │ │
  716. 32.51 s gammaloop-nextest-python-api> │ See https://symbolica.io/docs/get_started.html#license │
  717. 32.51 s gammaloop-nextest-python-api> └────────────────────────────────────────────────────────┘
  718. 32.51 s gammaloop-nextest-python-api> ┌───────────────────────────────────────────────────────────────────────────────────────────────────────────┐
  719. 32.51 s gammaloop-nextest-python-api> │ Cannot start new unlicensed Symbolica instance since there is already another one running on the machine. │
  720. 32.51 s gammaloop-nextest-python-api> └───────────────────────────────────────────────────────────────────────────────────────────────────────────┘
  721. 32.51 s gammaloop-nextest-python-api>
  722. 32.51 s gammaloop-nextest-python-api> stderr:
  723. 32.51 s gammaloop-nextest-python-api>
  724. 32.51 s gammaloop-nextest-python-api> ┌───────────────────────────────────────────────────────────┐
  725. 32.51 s gammaloop-nextest-python-api> │ Could not resolve the IP of the Symbolica license server. │
  726. 32.51 s gammaloop-nextest-python-api> │ │
  727. 32.51 s gammaloop-nextest-python-api> │ Please check your DNS configuration. │
  728. 32.51 s gammaloop-nextest-python-api> └───────────────────────────────────────────────────────────┘
  729. 32.51 s gammaloop-nextest-python-api> Error: failed to lookup address information: Temporary failure in name resolution
  730. 32.51 s gammaloop-nextest-python-api>
  731. 32.51 s gammaloop-nextest-python-api>
  732. 32.51 s gammaloop-nextest-python-api> Location:
  733. 32.51 s gammaloop-nextest-python-api> tests/tests/test_python_api.rs:156:20
  734. 32.51 s gammaloop-nextest-python-api>
  735. 32.51 s gammaloop-nextest-python-api> 4. gammaloop-integration-tests::test_python_api::python_session_getters_return_live_toml_and_command_blocks
  736. 32.51 s gammaloop-nextest-python-api> failure: test failure with exit code 101
  737. 32.51 s gammaloop-nextest-python-api> Error: Python API test subprocess failed.
  738. 32.51 s gammaloop-nextest-python-api> stdout:
  739. 32.51 s gammaloop-nextest-python-api> ┌────────────────────────────────────────────────────────┐
  740. 32.51 s gammaloop-nextest-python-api> │ You are running a restricted Symbolica instance. │
  741. 32.51 s gammaloop-nextest-python-api> │ │
  742. 32.51 s gammaloop-nextest-python-api> │ This mode is only permitted for non-commercial use and │
  743. 32.51 s gammaloop-nextest-python-api> │ is limited to one instance and core per machine. │
  744. 32.51 s gammaloop-nextest-python-api> │ │
  745. 32.51 s gammaloop-nextest-python-api> │ Hobbyists can easily acquire a free license key │
  746. 32.51 s gammaloop-nextest-python-api> │ that unlocks all cores and removes this banner: │
  747. 32.51 s gammaloop-nextest-python-api> │ │
  748. 32.51 s gammaloop-nextest-python-api> │ from symbolica import * │
  749. 32.51 s gammaloop-nextest-python-api> │ request_hobbyist_license('YOUR_NAME', 'YOUR_EMAIL') │
  750. 32.51 s gammaloop-nextest-python-api> │ │
  751. 32.51 s gammaloop-nextest-python-api> │ All other users can obtain a free 30-day trial key: │
  752. 32.51 s gammaloop-nextest-python-api> │ │
  753. 32.51 s gammaloop-nextest-python-api> │ from symbolica import * │
  754. 32.51 s gammaloop-nextest-python-api> │ request_trial_license('NAME', 'EMAIL', 'EMPLOYER') │
  755. 32.51 s gammaloop-nextest-python-api> │ │
  756. 32.51 s gammaloop-nextest-python-api> │ See https://symbolica.io/docs/get_started.html#license │
  757. 32.51 s gammaloop-nextest-python-api> └────────────────────────────────────────────────────────┘
  758. 32.51 s gammaloop-nextest-python-api> ┌───────────────────────────────────────────────────────────────────────────────────────────────────────────┐
  759. 32.51 s gammaloop-nextest-python-api> │ Cannot start new unlicensed Symbolica instance since there is already another one running on the machine. │
  760. 32.51 s gammaloop-nextest-python-api> └───────────────────────────────────────────────────────────────────────────────────────────────────────────┘
  761. 32.51 s gammaloop-nextest-python-api>
  762. 32.51 s gammaloop-nextest-python-api> stderr:
  763. 32.51 s gammaloop-nextest-python-api>
  764. 32.51 s gammaloop-nextest-python-api> ┌───────────────────────────────────────────────────────────┐
  765. 32.51 s gammaloop-nextest-python-api> │ Could not resolve the IP of the Symbolica license server. │
  766. 32.51 s gammaloop-nextest-python-api> │ │
  767. 32.51 s gammaloop-nextest-python-api> │ Please check your DNS configuration. │
  768. 32.51 s gammaloop-nextest-python-api> └───────────────────────────────────────────────────────────┘
  769. 32.51 s gammaloop-nextest-python-api> Error: failed to lookup address information: Temporary failure in name resolution
  770. 32.51 s gammaloop-nextest-python-api>
  771. 32.51 s gammaloop-nextest-python-api>
  772. 32.51 s gammaloop-nextest-python-api> Location:
  773. 32.51 s gammaloop-nextest-python-api> tests/tests/test_python_api.rs:156:20
  774. 32.51 s gammaloop-nextest-python-api> system-out
  775. 32.51 s gammaloop-nextest-python-api> running 1 test
  776. 32.51 s gammaloop-nextest-python-api> test python_session_getters_return_live_toml_and_command_blocks ... FAILED
  777. 32.51 s gammaloop-nextest-python-api>
  778. 32.51 s gammaloop-nextest-python-api> failures:
  779. 32.51 s gammaloop-nextest-python-api>
  780. 32.52 s gammaloop-nextest-python-api> failures:
  781. 32.52 s gammaloop-nextest-python-api> python_session_getters_return_live_toml_and_command_blocks
  782. 32.52 s gammaloop-nextest-python-api>
  783. 32.52 s gammaloop-nextest-python-api> test result: FAILED. 0 passed; 1 failed; 0 ignored; 0 measured; 4 filtered out; finished in 0.11s
  784. 32.52 s gammaloop-nextest-python-api> system-err
  785. 32.52 s gammaloop-nextest-python-api> Error: Python API test subprocess failed.
  786. 32.52 s gammaloop-nextest-python-api> stdout:
  787. 32.52 s gammaloop-nextest-python-api> ┌────────────────────────────────────────────────────────┐
  788. 32.52 s gammaloop-nextest-python-api> │ You are running a restricted Symbolica instance. │
  789. 32.52 s gammaloop-nextest-python-api> │ │
  790. 32.52 s gammaloop-nextest-python-api> │ This mode is only permitted for non-commercial use and │
  791. 32.52 s gammaloop-nextest-python-api> │ is limited to one instance and core per machine. │
  792. 32.52 s gammaloop-nextest-python-api> │ │
  793. 32.52 s gammaloop-nextest-python-api> │ Hobbyists can easily acquire a free license key │
  794. 32.52 s gammaloop-nextest-python-api> │ that unlocks all cores and removes this banner: │
  795. 32.52 s gammaloop-nextest-python-api> │ │
  796. 32.52 s gammaloop-nextest-python-api> │ from symbolica import * │
  797. 32.52 s gammaloop-nextest-python-api> │ request_hobbyist_license('YOUR_NAME', 'YOUR_EMAIL') │
  798. 32.52 s gammaloop-nextest-python-api> │ │
  799. 32.52 s gammaloop-nextest-python-api> │ All other users can obtain a free 30-day trial key: │
  800. 32.52 s gammaloop-nextest-python-api> │ │
  801. 32.52 s gammaloop-nextest-python-api> │ from symbolica import * │
  802. 32.52 s gammaloop-nextest-python-api> │ request_trial_license('NAME', 'EMAIL', 'EMPLOYER') │
  803. 32.52 s gammaloop-nextest-python-api> │ │
  804. 32.52 s gammaloop-nextest-python-api> │ See https://symbolica.io/docs/get_started.html#license │
  805. 32.52 s gammaloop-nextest-python-api> └────────────────────────────────────────────────────────┘
  806. 32.52 s gammaloop-nextest-python-api> ┌───────────────────────────────────────────────────────────────────────────────────────────────────────────┐
  807. 32.52 s gammaloop-nextest-python-api> │ Cannot start new unlicensed Symbolica instance since there is already another one running on the machine. │
  808. 32.52 s gammaloop-nextest-python-api> └───────────────────────────────────────────────────────────────────────────────────────────────────────────┘
  809. 32.52 s gammaloop-nextest-python-api>
  810. 32.52 s gammaloop-nextest-python-api> stderr:
  811. 32.52 s gammaloop-nextest-python-api>
  812. 32.52 s gammaloop-nextest-python-api> ┌───────────────────────────────────────────────────────────┐
  813. 32.52 s gammaloop-nextest-python-api> │ Could not resolve the IP of the Symbolica license server. │
  814. 32.52 s gammaloop-nextest-python-api> │ │
  815. 32.52 s gammaloop-nextest-python-api> │ Please check your DNS configuration. │
  816. 32.52 s gammaloop-nextest-python-api> └───────────────────────────────────────────────────────────┘
  817. 32.52 s gammaloop-nextest-python-api> Error: failed to lookup address information: Temporary failure in name resolution
  818. 32.52 s gammaloop-nextest-python-api>
  819. 32.52 s gammaloop-nextest-python-api>
  820. 32.52 s gammaloop-nextest-python-api> Location:
  821. 32.52 s gammaloop-nextest-python-api> tests/tests/test_python_api.rs:156:20
  822. 32.52 s gammaloop-nextest-python-api> =========================================
  823. 32.55 s [2 built (1 failed), 12 error: Cannot build '/nix/store/nmwgfm0zigizp5byy173df7l99i9kddz-gammaloop-nextest-python-api.drv'.
  824. 32.55 s Reason: builder failed with exit code 100.
  825. 32.55 s Output paths:
  826. 32.55 s /nix/store/0wmifwk23rqakrfsxal3kaig8chq1a34-gammaloop-nextest-python-api
  827. 32.55 s Last 781 log lines:
  828. 32.55 s > Extracting 1 binary, 1 build script output directory, and 3 linked paths to /build/nextest-archive-rsLJsz
  829. 32.55 s > Extracted 18 files to /build/nextest-archive-rsLJsz in 0.06s
  830. 32.55 s > ------------
  831. 32.55 s > Nextest run ID 1b80046f-e435-4e3a-a9bc-58cbcbf77210 with nextest profile: ci_gammaloop
  832. 32.55 s > Starting 5 tests across 1 binary
  833. 32.55 s > FAIL [ 0.110s] (1/5) gammaloop-integration-tests::test_python_api python_evaluate_sample_preserves_graph_grouping_and_incoming_pdgs
  834. 32.55 s > stdout ---
  835. 32.55 s >
  836. 32.55 s > running 1 test
  837. 32.55 s > test python_evaluate_sample_preserves_graph_grouping_and_incoming_pdgs ... FAILED
  838. 32.55 s >
  839. 32.55 s > failures:
  840. 32.55 s >
  841. 32.55 s > failures:
  842. 32.55 s > python_evaluate_sample_preserves_graph_grouping_and_incoming_pdgs
  843. 32.55 s >
  844. 32.55 s > test result: FAILED. 0 passed; 1 failed; 0 ignored; 0 measured; 4 filtered out; finished in 0.11s
  845. 32.55 s >
  846. 32.55 s > stderr ---
  847. 32.55 s > Error: Python API test subprocess failed.
  848. 32.55 s > stdout:
  849. 32.55 s > ┌────────────────────────────────────────────────────────┐
  850. 32.55 s > │ You are running a restricted Symbolica instance. │
  851. 32.55 s > │ │
  852. 32.55 s > │ This mode is only permitted for non-commercial use and │
  853. 32.55 s > │ is limited to one instance and core per machine. │
  854. 32.55 s > │ │
  855. 32.55 s > │ Hobbyists can easily acquire a free license key │
  856. 32.55 s > │ that unlocks all cores and removes this banner: │
  857. 32.55 s > │ │
  858. 32.55 s > │ from symbolica import * │
  859. 32.55 s > │ request_hobbyist_license('YOUR_NAME', 'YOUR_EMAIL') │
  860. 32.55 s > │ │
  861. 32.55 s > │ All other users can obtain a free 30-day trial key: │
  862. 32.55 s > │ │
  863. 32.55 s > │ from symbolica import * │
  864. 32.55 s > │ request_trial_license('NAME', 'EMAIL', 'EMPLOYER') │
  865. 32.55 s > │ │
  866. 32.55 s > │ See https://symbolica.io/docs/get_started.html#license │
  867. 32.55 s > └────────────────────────────────────────────────────────┘
  868. 32.55 s > ┌───────────────────────────────────────────────────────────────────────────────────────────────────────────┐
  869. 32.55 s > │ Cannot start new unlicensed Symbolica instance since there is already another one running on the machine. │
  870. 32.55 s > └───────────────────────────────────────────────────────────────────────────────────────────────────────────┘
  871. 32.55 s >
  872. 32.55 s > stderr:
  873. 32.55 s >
  874. 32.55 s > ┌───────────────────────────────────────────────────────────┐
  875. 32.55 s > │ Could not resolve the IP of the Symbolica license server. │
  876. 32.55 s > │ │
  877. 32.55 s > │ Please check your DNS configuration. │
  878. 32.55 s > └───────────────────────────────────────────────────────────┘
  879. 32.55 s > Error: failed to lookup address information: Temporary failure in name resolution
  880. 32.55 s >
  881. 32.55 s >
  882. 32.55 s > Location:
  883. 32.55 s > tests/tests/test_python_api.rs:156:20
  884. 32.55 s >
  885. 32.56 s > FAIL [ 0.110s] (2/5) gammaloop-integration-tests::test_python_api python_evaluate_samples_batch_and_momentum_space_have_expected_shape
  886. 32.56 s > stdout ---
  887. 32.56 s >
  888. 32.56 s > running 1 test
  889. 32.56 s > test python_evaluate_samples_batch_and_momentum_space_have_expected_shape ... FAILED
  890. 32.56 s >
  891. 32.56 s > failures:
  892. 32.56 s >
  893. 32.56 s > failures:
  894. 32.56 s > python_evaluate_samples_batch_and_momentum_space_have_expected_shape
  895. 32.56 s >
  896. 32.56 s > test result: FAILED. 0 passed; 1 failed; 0 ignored; 0 measured; 4 filtered out; finished in 0.11s
  897. 32.56 s >
  898. 32.56 s > stderr ---
  899. 32.56 s > Error: Python API test subprocess failed.
  900. 32.56 s > stdout:
  901. 32.56 s > ┌────────────────────────────────────────────────────────┐
  902. 32.56 s > │ You are running a restricted Symbolica instance. │
  903. 32.56 s > │ │
  904. 32.56 s > │ This mode is only permitted for non-commercial use and │
  905. 32.56 s > │ is limited to one instance and core per machine. │
  906. 32.56 s > │ │
  907. 32.56 s > │ Hobbyists can easily acquire a free license key │
  908. 32.56 s > │ that unlocks all cores and removes this banner: │
  909. 32.56 s > │ │
  910. 32.56 s > │ from symbolica import * │
  911. 32.56 s > │ request_hobbyist_license('YOUR_NAME', 'YOUR_EMAIL') │
  912. 32.56 s > │ │
  913. 32.56 s > │ All other users can obtain a free 30-day trial key: │
  914. 32.56 s > │ │
  915. 32.56 s > │ from symbolica import * │
  916. 32.56 s > │ request_trial_license('NAME', 'EMAIL', 'EMPLOYER') │
  917. 32.56 s > │ │
  918. 32.56 s > │ See https://symbolica.io/docs/get_started.html#license │
  919. 32.56 s > └────────────────────────────────────────────────────────┘
  920. 32.56 s > ┌───────────────────────────────────────────────────────────────────────────────────────────────────────────┐
  921. 32.56 s > │ Cannot start new unlicensed Symbolica instance since there is already another one running on the machine. │
  922. 32.56 s > └───────────────────────────────────────────────────────────────────────────────────────────────────────────┘
  923. 32.56 s >
  924. 32.56 s > stderr:
  925. 32.56 s >
  926. 32.56 s > ┌───────────────────────────────────────────────────────────┐
  927. 32.56 s > │ Could not resolve the IP of the Symbolica license server. │
  928. 32.56 s > │ │
  929. 32.56 s > │ Please check your DNS configuration. │
  930. 32.56 s > └───────────────────────────────────────────────────────────┘
  931. 32.56 s > Error: failed to lookup address information: Temporary failure in name resolution
  932. 32.56 s >
  933. 32.56 s >
  934. 32.56 s > Location:
  935. 32.56 s > tests/tests/test_python_api.rs:156:20
  936. 32.56 s >
  937. 32.56 s > FAIL [ 0.110s] (3/5) gammaloop-integration-tests::test_python_api python_evaluate_sample_honors_generate_events_and_observable_snapshots
  938. 32.56 s > stdout ---
  939. 32.56 s >
  940. 32.56 s > running 1 test
  941. 32.56 s > test python_evaluate_sample_honors_generate_events_and_observable_snapshots ... FAILED
  942. 32.56 s >
  943. 32.56 s > failures:
  944. 32.56 s >
  945. 32.56 s > failures:
  946. 32.56 s > python_evaluate_sample_honors_generate_events_and_observable_snapshots
  947. 32.56 s >
  948. 32.56 s > test result: FAILED. 0 passed; 1 failed; 0 ignored; 0 measured; 4 filtered out; finished in 0.11s
  949. 32.56 s >
  950. 32.56 s > stderr ---
  951. 32.56 s > Error: Python API test subprocess failed.
  952. 32.56 s > stdout:
  953. 32.56 s > ┌────────────────────────────────────────────────────────┐
  954. 32.56 s > │ You are running a restricted Symbolica instance. │
  955. 32.56 s > │ │
  956. 32.56 s > │ This mode is only permitted for non-commercial use and │
  957. 32.56 s > │ is limited to one instance and core per machine. │
  958. 32.56 s > │ │
  959. 32.56 s > │ Hobbyists can easily acquire a free license key │
  960. 32.56 s > │ that unlocks all cores and removes this banner: │
  961. 32.56 s > │ │
  962. 32.56 s > │ from symbolica import * │
  963. 32.56 s > │ request_hobbyist_license('YOUR_NAME', 'YOUR_EMAIL') │
  964. 32.56 s > │ │
  965. 32.56 s > │ All other users can obtain a free 30-day trial key: │
  966. 32.56 s > │ │
  967. 32.56 s > │ from symbolica import * │
  968. 32.56 s > │ request_trial_license('NAME', 'EMAIL', 'EMPLOYER') │
  969. 32.56 s > │ │
  970. 32.56 s > │ See https://symbolica.io/docs/get_started.html#license │
  971. 32.56 s > └────────────────────────────────────────────────────────┘
  972. 32.56 s > ┌───────────────────────────────────────────────────────────────────────────────────────────────────────────┐
  973. 32.56 s > │ Cannot start new unlicensed Symbolica instance since there is already another one running on the machine. │
  974. 32.56 s > └───────────────────────────────────────────────────────────────────────────────────────────────────────────┘
  975. 32.56 s >
  976. 32.56 s > stderr:
  977. 32.56 s >
  978. 32.56 s > ┌───────────────────────────────────────────────────────────┐
  979. 32.56 s > │ Could not resolve the IP of the Symbolica license server. │
  980. 32.56 s > │ │
  981. 32.56 s > │ Please check your DNS configuration. │
  982. 32.56 s > └───────────────────────────────────────────────────────────┘
  983. 32.56 s > Error: failed to lookup address information: Temporary failure in name resolution
  984. 32.56 s >
  985. 32.56 s >
  986. 32.56 s > Location:
  987. 32.56 s > tests/tests/test_python_api.rs:156:20
  988. 32.56 s >
  989. 32.56 s > FAIL [ 0.118s] (4/5) gammaloop-integration-tests::test_python_api python_session_getters_return_live_toml_and_command_blocks
  990. 32.56 s > stdout ---
  991. 32.56 s >
  992. 32.56 s > running 1 test
  993. 32.56 s > test python_session_getters_return_live_toml_and_command_blocks ... FAILED
  994. 32.56 s >
  995. 32.56 s > failures:
  996. 32.56 s >
  997. 32.56 s > failures:
  998. 32.56 s > python_session_getters_return_live_toml_and_command_blocks
  999. 32.56 s >
  1000. 32.56 s > test result: FAILED. 0 passed; 1 failed; 0 ignored; 0 measured; 4 filtered out; finished in 0.11s
  1001. 32.56 s >
  1002. 32.56 s > stderr ---
  1003. 32.56 s > Error: Python API test subprocess failed.
  1004. 32.56 s > stdout:
  1005. 32.56 s > ┌────────────────────────────────────────────────────────┐
  1006. 32.56 s > │ You are running a restricted Symbolica instance. │
  1007. 32.56 s > │ │
  1008. 32.56 s > │ This mode is only permitted for non-commercial use and │
  1009. 32.56 s > │ is limited to one instance and core per machine. │
  1010. 32.56 s > │ │
  1011. 32.56 s > │ Hobbyists can easily acquire a free license key │
  1012. 32.56 s > │ that unlocks all cores and removes this banner: │
  1013. 32.56 s > │ │
  1014. 32.56 s > │ from symbolica import * │
  1015. 32.56 s > │ request_hobbyist_license('YOUR_NAME', 'YOUR_EMAIL') │
  1016. 32.56 s > │ │
  1017. 32.56 s > │ All other users can obtain a free 30-day trial key: │
  1018. 32.56 s > │ │
  1019. 32.56 s > │ from symbolica import * │
  1020. 32.56 s > │ request_trial_license('NAME', 'EMAIL', 'EMPLOYER') │
  1021. 32.56 s > │ │
  1022. 32.56 s > │ See https://symbolica.io/docs/get_started.html#license │
  1023. 32.56 s > └────────────────────────────────────────────────────────┘
  1024. 32.56 s > ┌───────────────────────────────────────────────────────────────────────────────────────────────────────────┐
  1025. 32.56 s > │ Cannot start new unlicensed Symbolica instance since there is already another one running on the machine. │
  1026. 32.56 s > └───────────────────────────────────────────────────────────────────────────────────────────────────────────┘
  1027. 32.56 s >
  1028. 32.56 s > stderr:
  1029. 32.56 s >
  1030. 32.56 s > ┌───────────────────────────────────────────────────────────┐
  1031. 32.56 s > │ Could not resolve the IP of the Symbolica license server. │
  1032. 32.56 s > │ │
  1033. 32.56 s > │ Please check your DNS configuration. │
  1034. 32.56 s > └───────────────────────────────────────────────────────────┘
  1035. 32.56 s > Error: failed to lookup address information: Temporary failure in name resolution
  1036. 32.56 s >
  1037. 32.56 s >
  1038. 32.56 s > Location:
  1039. 32.56 s > tests/tests/test_python_api.rs:156:20
  1040. 32.56 s >
  1041. 32.56 s > ------------
  1042. 32.56 s > Summary [ 0.274s] 5 tests run: 1 passed, 4 failed, 0 skipped
  1043. 32.56 s > FAIL [ 0.110s] (1/5) gammaloop-integration-tests::test_python_api python_evaluate_sample_preserves_graph_grouping_and_incoming_pdgs
  1044. 32.56 s > stdout ---
  1045. 32.56 s >
  1046. 32.56 s > running 1 test
  1047. 32.56 s > test python_evaluate_sample_preserves_graph_grouping_and_incoming_pdgs ... FAILED
  1048. 32.56 s >
  1049. 32.56 s > failures:
  1050. 32.56 s >
  1051. 32.56 s > failures:
  1052. 32.56 s > python_evaluate_sample_preserves_graph_grouping_and_incoming_pdgs
  1053. 32.56 s >
  1054. 32.56 s > test result: FAILED. 0 passed; 1 failed; 0 ignored; 0 measured; 4 filtered out; finished in 0.11s
  1055. 32.56 s >
  1056. 32.56 s > stderr ---
  1057. 32.56 s > Error: Python API test subprocess failed.
  1058. 32.56 s > stdout:
  1059. 32.56 s > ┌────────────────────────────────────────────────────────┐
  1060. 32.56 s > │ You are running a restricted Symbolica instance. │
  1061. 32.56 s > │ │
  1062. 32.56 s > │ This mode is only permitted for non-commercial use and │
  1063. 32.56 s > │ is limited to one instance and core per machine. │
  1064. 32.56 s > │ │
  1065. 32.56 s > │ Hobbyists can easily acquire a free license key │
  1066. 32.56 s > │ that unlocks all cores and removes this banner: │
  1067. 32.56 s > │ │
  1068. 32.56 s > │ from symbolica import * │
  1069. 32.56 s > │ request_hobbyist_license('YOUR_NAME', 'YOUR_EMAIL') │
  1070. 32.56 s > │ │
  1071. 32.56 s > │ All other users can obtain a free 30-day trial key: │
  1072. 32.56 s > │ │
  1073. 32.56 s > │ from symbolica import * │
  1074. 32.56 s > │ request_trial_license('NAME', 'EMAIL', 'EMPLOYER') │
  1075. 32.56 s > │ │
  1076. 32.56 s > │ See https://symbolica.io/docs/get_started.html#license │
  1077. 32.56 s > └────────────────────────────────────────────────────────┘
  1078. 32.56 s > ┌───────────────────────────────────────────────────────────────────────────────────────────────────────────┐
  1079. 32.56 s > │ Cannot start new unlicensed Symbolica instance since there is already another one running on the machine. │
  1080. 32.56 s > └───────────────────────────────────────────────────────────────────────────────────────────────────────────┘
  1081. 32.56 s >
  1082. 32.56 s > stderr:
  1083. 32.56 s >
  1084. 32.56 s > ┌───────────────────────────────────────────────────────────┐
  1085. 32.56 s > │ Could not resolve the IP of the Symbolica license server. │
  1086. 32.56 s > │ │
  1087. 32.56 s > │ Please check your DNS configuration. │
  1088. 32.56 s > └───────────────────────────────────────────────────────────┘
  1089. 32.56 s > Error: failed to lookup address information: Temporary failure in name resolution
  1090. 32.56 s >
  1091. 32.56 s >
  1092. 32.56 s > Location:
  1093. 32.56 s > tests/tests/test_python_api.rs:156:20
  1094. 32.56 s >
  1095. 32.56 s > FAIL [ 0.110s] (2/5) gammaloop-integration-tests::test_python_api python_evaluate_samples_batch_and_momentum_space_have_expected_shape
  1096. 32.56 s > stdout ---
  1097. 32.56 s >
  1098. 32.56 s > running 1 test
  1099. 32.56 s > test python_evaluate_samples_batch_and_momentum_space_have_expected_shape ... FAILED
  1100. 32.56 s >
  1101. 32.56 s > failures:
  1102. 32.56 s >
  1103. 32.56 s > failures:
  1104. 32.56 s > python_evaluate_samples_batch_and_momentum_space_have_expected_shape
  1105. 32.56 s >
  1106. 32.56 s > test result: FAILED. 0 passed; 1 failed; 0 ignored; 0 measured; 4 filtered out; finished in 0.11s
  1107. 32.56 s >
  1108. 32.56 s > stderr ---
  1109. 32.56 s > Error: Python API test subprocess failed.
  1110. 32.56 s > stdout:
  1111. 32.56 s > ┌────────────────────────────────────────────────────────┐
  1112. 32.56 s > │ You are running a restricted Symbolica instance. │
  1113. 32.56 s > │ │
  1114. 32.56 s > │ This mode is only permitted for non-commercial use and │
  1115. 32.56 s > │ is limited to one instance and core per machine. │
  1116. 32.56 s > │ │
  1117. 32.56 s > │ Hobbyists can easily acquire a free license key │
  1118. 32.56 s > │ that unlocks all cores and removes this banner: │
  1119. 32.56 s > │ │
  1120. 32.56 s > │ from symbolica import * │
  1121. 32.56 s > │ request_hobbyist_license('YOUR_NAME', 'YOUR_EMAIL') │
  1122. 32.56 s > │ │
  1123. 32.56 s > │ All other users can obtain a free 30-day trial key: │
  1124. 32.56 s > │ │
  1125. 32.56 s > │ from symbolica import * │
  1126. 32.56 s > │ request_trial_license('NAME', 'EMAIL', 'EMPLOYER') │
  1127. 32.56 s > │ │
  1128. 32.56 s > │ See https://symbolica.io/docs/get_started.html#license │
  1129. 32.56 s > └────────────────────────────────────────────────────────┘
  1130. 32.56 s > ┌───────────────────────────────────────────────────────────────────────────────────────────────────────────┐
  1131. 32.56 s > │ Cannot start new unlicensed Symbolica instance since there is already another one running on the machine. │
  1132. 32.56 s > └───────────────────────────────────────────────────────────────────────────────────────────────────────────┘
  1133. 32.56 s >
  1134. 32.56 s > stderr:
  1135. 32.56 s >
  1136. 32.56 s > ┌───────────────────────────────────────────────────────────┐
  1137. 32.56 s > │ Could not resolve the IP of the Symbolica license server. │
  1138. 32.56 s > │ │
  1139. 32.56 s > │ Please check your DNS configuration. │
  1140. 32.56 s > └───────────────────────────────────────────────────────────┘
  1141. 32.56 s > Error: failed to lookup address information: Temporary failure in name resolution
  1142. 32.56 s >
  1143. 32.56 s >
  1144. 32.56 s > Location:
  1145. 32.56 s > tests/tests/test_python_api.rs:156:20
  1146. 32.56 s >
  1147. 32.56 s > FAIL [ 0.110s] (3/5) gammaloop-integration-tests::test_python_api python_evaluate_sample_honors_generate_events_and_observable_snapshots
  1148. 32.56 s > stdout ---
  1149. 32.56 s >
  1150. 32.56 s > running 1 test
  1151. 32.56 s > test python_evaluate_sample_honors_generate_events_and_observable_snapshots ... FAILED
  1152. 32.56 s >
  1153. 32.56 s > failures:
  1154. 32.56 s >
  1155. 32.56 s > failures:
  1156. 32.56 s > python_evaluate_sample_honors_generate_events_and_observable_snapshots
  1157. 32.56 s >
  1158. 32.56 s > test result: FAILED. 0 passed; 1 failed; 0 ignored; 0 measured; 4 filtered out; finished in 0.11s
  1159. 32.56 s >
  1160. 32.56 s > stderr ---
  1161. 32.56 s > Error: Python API test subprocess failed.
  1162. 32.56 s > stdout:
  1163. 32.56 s > ┌────────────────────────────────────────────────────────┐
  1164. 32.56 s > │ You are running a restricted Symbolica instance. │
  1165. 32.56 s > │ │
  1166. 32.56 s > │ This mode is only permitted for non-commercial use and │
  1167. 32.56 s > │ is limited to one instance and core per machine. │
  1168. 32.56 s > │ │
  1169. 32.56 s > │ Hobbyists can easily acquire a free license key │
  1170. 32.56 s > │ that unlocks all cores and removes this banner: │
  1171. 32.56 s > │ │
  1172. 32.56 s > │ from symbolica import * │
  1173. 32.56 s > │ request_hobbyist_license('YOUR_NAME', 'YOUR_EMAIL') │
  1174. 32.56 s > │ │
  1175. 32.56 s > │ All other users can obtain a free 30-day trial key: │
  1176. 32.56 s > │ │
  1177. 32.56 s > │ from symbolica import * │
  1178. 32.56 s > │ request_trial_license('NAME', 'EMAIL', 'EMPLOYER') │
  1179. 32.56 s > │ │
  1180. 32.56 s > │ See https://symbolica.io/docs/get_started.html#license │
  1181. 32.56 s > └────────────────────────────────────────────────────────┘
  1182. 32.56 s > ┌───────────────────────────────────────────────────────────────────────────────────────────────────────────┐
  1183. 32.56 s > │ Cannot start new unlicensed Symbolica instance since there is already another one running on the machine. │
  1184. 32.56 s > └───────────────────────────────────────────────────────────────────────────────────────────────────────────┘
  1185. 32.56 s >
  1186. 32.56 s > stderr:
  1187. 32.56 s >
  1188. 32.56 s > ┌───────────────────────────────────────────────────────────┐
  1189. 32.56 s > │ Could not resolve the IP of the Symbolica license server. │
  1190. 32.56 s > │ │
  1191. 32.56 s > │ Please check your DNS configuration. │
  1192. 32.56 s > └───────────────────────────────────────────────────────────┘
  1193. 32.56 s > Error: failed to lookup address information: Temporary failure in name resolution
  1194. 32.56 s >
  1195. 32.56 s >
  1196. 32.56 s > Location:
  1197. 32.56 s > tests/tests/test_python_api.rs:156:20
  1198. 32.56 s >
  1199. 32.56 s > FAIL [ 0.118s] (4/5) gammaloop-integration-tests::test_python_api python_session_getters_return_live_toml_and_command_blocks
  1200. 32.56 s > stdout ---
  1201. 32.56 s >
  1202. 32.56 s > running 1 test
  1203. 32.56 s > test python_session_getters_return_live_toml_and_command_blocks ... FAILED
  1204. 32.56 s >
  1205. 32.56 s > failures:
  1206. 32.56 s >
  1207. 32.56 s > failures:
  1208. 32.56 s > python_session_getters_return_live_toml_and_command_blocks
  1209. 32.56 s >
  1210. 32.56 s > test result: FAILED. 0 passed; 1 failed; 0 ignored; 0 measured; 4 filtered out; finished in 0.11s
  1211. 32.56 s >
  1212. 32.56 s > stderr ---
  1213. 32.56 s > Error: Python API test subprocess failed.
  1214. 32.56 s > stdout:
  1215. 32.56 s > ┌────────────────────────────────────────────────────────┐
  1216. 32.56 s > │ You are running a restricted Symbolica instance. │
  1217. 32.56 s > │ │
  1218. 32.56 s > │ This mode is only permitted for non-commercial use and │
  1219. 32.56 s > │ is limited to one instance and core per machine. │
  1220. 32.56 s > │ │
  1221. 32.56 s > │ Hobbyists can easily acquire a free license key │
  1222. 32.56 s > │ that unlocks all cores and removes this banner: │
  1223. 32.56 s > │ │
  1224. 32.56 s > │ from symbolica import * │
  1225. 32.56 s > │ request_hobbyist_license('YOUR_NAME', 'YOUR_EMAIL') │
  1226. 32.56 s > │ │
  1227. 32.56 s > │ All other users can obtain a free 30-day trial key: │
  1228. 32.56 s > │ │
  1229. 32.56 s > │ from symbolica import * │
  1230. 32.56 s > │ request_trial_license('NAME', 'EMAIL', 'EMPLOYER') │
  1231. 32.56 s > │ │
  1232. 32.56 s > │ See https://symbolica.io/docs/get_started.html#license │
  1233. 32.56 s > └────────────────────────────────────────────────────────┘
  1234. 32.56 s > ┌───────────────────────────────────────────────────────────────────────────────────────────────────────────┐
  1235. 32.56 s > │ Cannot start new unlicensed Symbolica instance since there is already another one running on the machine. │
  1236. 32.56 s > └───────────────────────────────────────────────────────────────────────────────────────────────────────────┘
  1237. 32.56 s >
  1238. 32.56 s > stderr:
  1239. 32.56 s >
  1240. 32.56 s > ┌───────────────────────────────────────────────────────────┐
  1241. 32.56 s > │ Could not resolve the IP of the Symbolica license server. │
  1242. 32.56 s > │ │
  1243. 32.56 s > │ Please check your DNS configuration. │
  1244. 32.56 s > └───────────────────────────────────────────────────────────┘
  1245. 32.56 s > Error: failed to lookup address information: Temporary failure in name resolution
  1246. 32.56 s >
  1247. 32.56 s >
  1248. 32.56 s > Location:
  1249. 32.56 s > tests/tests/test_python_api.rs:156:20
  1250. 32.56 s >
  1251. 32.56 s > error: test run failed
  1252. 32.56 s >
  1253. 32.56 s > ========== nextest test summary ==========
  1254. 32.56 s > report: target/nextest/ci_gammaloop/junit.xml
  1255. 32.56 s > tests: 5, failures: 4, errors: 0
  1256. 32.56 s >
  1257. 32.56 s > 1. gammaloop-integration-tests::test_python_api::python_evaluate_sample_preserves_graph_grouping_and_incoming_pdgs
  1258. 32.56 s > failure: test failure with exit code 101
  1259. 32.56 s > Error: Python API test subprocess failed.
  1260. 32.56 s > stdout:
  1261. 32.56 s > ┌────────────────────────────────────────────────────────┐
  1262. 32.56 s > │ You are running a restricted Symbolica instance. │
  1263. 32.56 s > │ │
  1264. 32.56 s > │ This mode is only permitted for non-commercial use and │
  1265. 32.56 s > │ is limited to one instance and core per machine. │
  1266. 32.56 s > │ │
  1267. 32.56 s > │ Hobbyists can easily acquire a free license key │
  1268. 32.56 s > │ that unlocks all cores and removes this banner: │
  1269. 32.56 s > │ │
  1270. 32.56 s > │ from symbolica import * │
  1271. 32.56 s > │ request_hobbyist_license('YOUR_NAME', 'YOUR_EMAIL') │
  1272. 32.56 s > │ │
  1273. 32.56 s > │ All other users can obtain a free 30-day trial key: │
  1274. 32.56 s > │ │
  1275. 32.56 s > │ from symbolica import * │
  1276. 32.56 s > │ request_trial_license('NAME', 'EMAIL', 'EMPLOYER') │
  1277. 32.56 s > │ │
  1278. 32.56 s > │ See https://symbolica.io/docs/get_started.html#license │
  1279. 32.56 s > └────────────────────────────────────────────────────────┘
  1280. 32.56 s > ┌───────────────────────────────────────────────────────────────────────────────────────────────────────────┐
  1281. 32.56 s > │ Cannot start new unlicensed Symbolica instance since there is already another one running on the machine. │
  1282. 32.56 s > └───────────────────────────────────────────────────────────────────────────────────────────────────────────┘
  1283. 32.56 s >
  1284. 32.56 s > stderr:
  1285. 32.56 s >
  1286. 32.56 s > ┌───────────────────────────────────────────────────────────┐
  1287. 32.56 s > │ Could not resolve the IP of the Symbolica license server. │
  1288. 32.56 s > │ │
  1289. 32.56 s > │ Please check your DNS configuration. │
  1290. 32.56 s > └───────────────────────────────────────────────────────────┘
  1291. 32.56 s > Error: failed to lookup address information: Temporary failure in name resolution
  1292. 32.56 s >
  1293. 32.56 s >
  1294. 32.56 s > Location:
  1295. 32.56 s > tests/tests/test_python_api.rs:156:20
  1296. 32.56 s > system-out
  1297. 32.56 s > running 1 test
  1298. 32.56 s > test python_evaluate_sample_preserves_graph_grouping_and_incoming_pdgs ... FAILED
  1299. 32.56 s >
  1300. 32.56 s > failures:
  1301. 32.56 s >
  1302. 32.56 s > failures:
  1303. 32.56 s > python_evaluate_sample_preserves_graph_grouping_and_incoming_pdgs
  1304. 32.56 s >
  1305. 32.56 s > test result: FAILED. 0 passed; 1 failed; 0 ignored; 0 measured; 4 filtered out; finished in 0.11s
  1306. 32.56 s > system-err
  1307. 32.56 s > Error: Python API test subprocess failed.
  1308. 32.56 s > stdout:
  1309. 32.56 s > ┌────────────────────────────────────────────────────────┐
  1310. 32.56 s > │ You are running a restricted Symbolica instance. │
  1311. 32.56 s > │ │
  1312. 32.56 s > │ This mode is only permitted for non-commercial use and │
  1313. 32.56 s > │ is limited to one instance and core per machine. │
  1314. 32.56 s > │ │
  1315. 32.56 s > │ Hobbyists can easily acquire a free license key │
  1316. 32.56 s > │ that unlocks all cores and removes this banner: │
  1317. 32.56 s > │ │
  1318. 32.56 s > │ from symbolica import * │
  1319. 32.56 s > │ request_hobbyist_license('YOUR_NAME', 'YOUR_EMAIL') │
  1320. 32.56 s > │ │
  1321. 32.56 s > │ All other users can obtain a free 30-day trial key: │
  1322. 32.56 s > │ │
  1323. 32.56 s > │ from symbolica import * │
  1324. 32.56 s > │ request_trial_license('NAME', 'EMAIL', 'EMPLOYER') │
  1325. 32.56 s > │ │
  1326. 32.56 s > │ See https://symbolica.io/docs/get_started.html#license │
  1327. 32.56 s > └────────────────────────────────────────────────────────┘
  1328. 32.56 s > ┌───────────────────────────────────────────────────────────────────────────────────────────────────────────┐
  1329. 32.56 s > │ Cannot start new unlicensed Symbolica instance since there is already another one running on the machine. │
  1330. 32.56 s > └───────────────────────────────────────────────────────────────────────────────────────────────────────────┘
  1331. 32.56 s >
  1332. 32.56 s > stderr:
  1333. 32.56 s >
  1334. 32.56 s > ┌───────────────────────────────────────────────────────────┐
  1335. 32.56 s > │ Could not resolve the IP of the Symbolica license server. │
  1336. 32.56 s > │ │
  1337. 32.56 s > │ Please check your DNS configuration. │
  1338. 32.56 s > └───────────────────────────────────────────────────────────┘
  1339. 32.56 s > Error: failed to lookup address information: Temporary failure in name resolution
  1340. 32.56 s >
  1341. 32.56 s >
  1342. 32.56 s > Location:
  1343. 32.56 s > tests/tests/test_python_api.rs:156:20
  1344. 32.56 s >
  1345. 32.56 s > 2. gammaloop-integration-tests::test_python_api::python_evaluate_samples_batch_and_momentum_space_have_expected_shape
  1346. 32.56 s > failure: test failure with exit code 101
  1347. 32.56 s > Error: Python API test subprocess failed.
  1348. 32.56 s > stdout:
  1349. 32.56 s > ┌────────────────────────────────────────────────────────┐
  1350. 32.56 s > │ You are running a restricted Symbolica instance. │
  1351. 32.56 s > │ │
  1352. 32.56 s > │ This mode is only permitted for non-commercial use and │
  1353. 32.56 s > │ is limited to one instance and core per machine. │
  1354. 32.56 s > │ │
  1355. 32.56 s > │ Hobbyists can easily acquire a free license key │
  1356. 32.56 s > │ that unlocks all cores and removes this banner: │
  1357. 32.56 s > │ │
  1358. 32.56 s > │ from symbolica import * │
  1359. 32.56 s > │ request_hobbyist_license('YOUR_NAME', 'YOUR_EMAIL') │
  1360. 32.56 s > │ │
  1361. 32.56 s > │ All other users can obtain a free 30-day trial key: │
  1362. 32.56 s > │ │
  1363. 32.56 s > │ from symbolica import * │
  1364. 32.56 s > │ request_trial_license('NAME', 'EMAIL', 'EMPLOYER') │
  1365. 32.56 s > │ │
  1366. 32.56 s > │ See https://symbolica.io/docs/get_started.html#license │
  1367. 32.56 s > └────────────────────────────────────────────────────────┘
  1368. 32.56 s > ┌───────────────────────────────────────────────────────────────────────────────────────────────────────────┐
  1369. 32.56 s > │ Cannot start new unlicensed Symbolica instance since there is already another one running on the machine. │
  1370. 32.56 s > └───────────────────────────────────────────────────────────────────────────────────────────────────────────┘
  1371. 32.56 s >
  1372. 32.56 s > stderr:
  1373. 32.56 s >
  1374. 32.56 s > ┌───────────────────────────────────────────────────────────┐
  1375. 32.56 s > │ Could not resolve the IP of the Symbolica license server. │
  1376. 32.56 s > │ │
  1377. 32.56 s > │ Please check your DNS configuration. │
  1378. 32.56 s > └───────────────────────────────────────────────────────────┘
  1379. 32.56 s > Error: failed to lookup address information: Temporary failure in name resolution
  1380. 32.56 s >
  1381. 32.56 s >
  1382. 32.56 s > Location:
  1383. 32.56 s > tests/tests/test_python_api.rs:156:20
  1384. 32.56 s > system-out
  1385. 32.56 s > running 1 test
  1386. 32.56 s > test python_evaluate_samples_batch_and_momentum_space_have_expected_shape ... FAILED
  1387. 32.56 s >
  1388. 32.56 s > failures:
  1389. 32.56 s >
  1390. 32.56 s > failures:
  1391. 32.56 s > python_evaluate_samples_batch_and_momentum_space_have_expected_shape
  1392. 32.56 s >
  1393. 32.56 s > test result: FAILED. 0 passed; 1 failed; 0 ignored; 0 measured; 4 filtered out; finished in 0.11s
  1394. 32.56 s > system-err
  1395. 32.56 s > Error: Python API test subprocess failed.
  1396. 32.56 s > stdout:
  1397. 32.56 s > ┌────────────────────────────────────────────────────────┐
  1398. 32.56 s > │ You are running a restricted Symbolica instance. │
  1399. 32.56 s > │ │
  1400. 32.56 s > │ This mode is only permitted for non-commercial use and │
  1401. 32.56 s > │ is limited to one instance and core per machine. │
  1402. 32.56 s > │ │
  1403. 32.56 s > │ Hobbyists can easily acquire a free license key │
  1404. 32.56 s > │ that unlocks all cores and removes this banner: │
  1405. 32.56 s > │ │
  1406. 32.56 s > │ from symbolica import * │
  1407. 32.56 s > │ request_hobbyist_license('YOUR_NAME', 'YOUR_EMAIL') │
  1408. 32.56 s > │ │
  1409. 32.56 s > │ All other users can obtain a free 30-day trial key: │
  1410. 32.56 s > │ │
  1411. 32.56 s > │ from symbolica import * │
  1412. 32.56 s > │ request_trial_license('NAME', 'EMAIL', 'EMPLOYER') │
  1413. 32.56 s > │ │
  1414. 32.56 s > │ See https://symbolica.io/docs/get_started.html#license │
  1415. 32.56 s > └────────────────────────────────────────────────────────┘
  1416. 32.56 s > ┌───────────────────────────────────────────────────────────────────────────────────────────────────────────┐
  1417. 32.56 s > │ Cannot start new unlicensed Symbolica instance since there is already another one running on the machine. │
  1418. 32.56 s > └───────────────────────────────────────────────────────────────────────────────────────────────────────────┘
  1419. 32.56 s >
  1420. 32.56 s > stderr:
  1421. 32.56 s >
  1422. 32.56 s > ┌───────────────────────────────────────────────────────────┐
  1423. 32.56 s > │ Could not resolve the IP of the Symbolica license server. │
  1424. 32.56 s > │ │
  1425. 32.56 s > │ Please check your DNS configuration. │
  1426. 32.56 s > └───────────────────────────────────────────────────────────┘
  1427. 32.56 s > Error: failed to lookup address information: Temporary failure in name resolution
  1428. 32.56 s >
  1429. 32.56 s >
  1430. 32.56 s > Location:
  1431. 32.56 s > tests/tests/test_python_api.rs:156:20
  1432. 32.56 s >
  1433. 32.56 s > 3. gammaloop-integration-tests::test_python_api::python_evaluate_sample_honors_generate_events_and_observable_snapshots
  1434. 32.56 s > failure: test failure with exit code 101
  1435. 32.56 s > Error: Python API test subprocess failed.
  1436. 32.56 s > stdout:
  1437. 32.56 s > ┌────────────────────────────────────────────────────────┐
  1438. 32.56 s > │ You are running a restricted Symbolica instance. │
  1439. 32.56 s > │ │
  1440. 32.56 s > │ This mode is only permitted for non-commercial use and │
  1441. 32.56 s > │ is limited to one instance and core per machine. │
  1442. 32.56 s > │ │
  1443. 32.56 s > │ Hobbyists can easily acquire a free license key │
  1444. 32.56 s > │ that unlocks all cores and removes this banner: │
  1445. 32.56 s > │ │
  1446. 32.56 s > │ from symbolica import * │
  1447. 32.56 s > │ request_hobbyist_license('YOUR_NAME', 'YOUR_EMAIL') │
  1448. 32.56 s > │ │
  1449. 32.56 s > │ All other users can obtain a free 30-day trial key: │
  1450. 32.56 s > │ │
  1451. 32.56 s > │ from symbolica import * │
  1452. 32.56 s > │ request_trial_license('NAME', 'EMAIL', 'EMPLOYER') │
  1453. 32.56 s > │ │
  1454. 32.56 s > │ See https://symbolica.io/docs/get_started.html#license │
  1455. 32.56 s > └────────────────────────────────────────────────────────┘
  1456. 32.56 s > ┌───────────────────────────────────────────────────────────────────────────────────────────────────────────┐
  1457. 32.56 s > │ Cannot start new unlicensed Symbolica instance since there is already another one running on the machine. │
  1458. 32.56 s > └───────────────────────────────────────────────────────────────────────────────────────────────────────────┘
  1459. 32.56 s >
  1460. 32.56 s > stderr:
  1461. 32.56 s >
  1462. 32.56 s > ┌───────────────────────────────────────────────────────────┐
  1463. 32.56 s > │ Could not resolve the IP of the Symbolica license server. │
  1464. 32.56 s > │ │
  1465. 32.56 s > │ Please check your DNS configuration. │
  1466. 32.56 s > └───────────────────────────────────────────────────────────┘
  1467. 32.56 s > Error: failed to lookup address information: Temporary failure in name resolution
  1468. 32.56 s >
  1469. 32.56 s >
  1470. 32.56 s > Location:
  1471. 32.56 s > tests/tests/test_python_api.rs:156:20
  1472. 32.56 s > system-out
  1473. 32.56 s > running 1 test
  1474. 32.56 s > test python_evaluate_sample_honors_generate_events_and_observable_snapshots ... FAILED
  1475. 32.56 s >
  1476. 32.56 s > failures:
  1477. 32.56 s >
  1478. 32.56 s > failures:
  1479. 32.56 s > python_evaluate_sample_honors_generate_events_and_observable_snapshots
  1480. 32.56 s >
  1481. 32.56 s > test result: FAILED. 0 passed; 1 failed; 0 ignored; 0 measured; 4 filtered out; finished in 0.11s
  1482. 32.56 s > system-err
  1483. 32.56 s > Error: Python API test subprocess failed.
  1484. 32.56 s > stdout:
  1485. 32.56 s > ┌────────────────────────────────────────────────────────┐
  1486. 32.56 s > │ You are running a restricted Symbolica instance. │
  1487. 32.56 s > │ │
  1488. 32.56 s > │ This mode is only permitted for non-commercial use and │
  1489. 32.56 s > │ is limited to one instance and core per machine. │
  1490. 32.56 s > │ │
  1491. 32.56 s > │ Hobbyists can easily acquire a free license key │
  1492. 32.56 s > │ that unlocks all cores and removes this banner: │
  1493. 32.56 s > │ │
  1494. 32.56 s > │ from symbolica import * │
  1495. 32.56 s > │ request_hobbyist_license('YOUR_NAME', 'YOUR_EMAIL') │
  1496. 32.56 s > │ │
  1497. 32.56 s > │ All other users can obtain a free 30-day trial key: │
  1498. 32.56 s > │ │
  1499. 32.56 s > │ from symbolica import * │
  1500. 32.56 s > │ request_trial_license('NAME', 'EMAIL', 'EMPLOYER') │
  1501. 32.56 s > │ │
  1502. 32.56 s > │ See https://symbolica.io/docs/get_started.html#license │
  1503. 32.56 s > └────────────────────────────────────────────────────────┘
  1504. 32.56 s > ┌───────────────────────────────────────────────────────────────────────────────────────────────────────────┐
  1505. 32.56 s > │ Cannot start new unlicensed Symbolica instance since there is already another one running on the machine. │
  1506. 32.56 s > └───────────────────────────────────────────────────────────────────────────────────────────────────────────┘
  1507. 32.56 s >
  1508. 32.56 s > stderr:
  1509. 32.56 s >
  1510. 32.56 s > ┌───────────────────────────────────────────────────────────┐
  1511. 32.56 s > │ Could not resolve the IP of the Symbolica license server. │
  1512. 32.56 s > │ │
  1513. 32.56 s > │ Please check your DNS configuration. │
  1514. 32.56 s > └───────────────────────────────────────────────────────────┘
  1515. 32.56 s > Error: failed to lookup address information: Temporary failure in name resolution
  1516. 32.56 s >
  1517. 32.56 s >
  1518. 32.56 s > Location:
  1519. 32.56 s > tests/tests/test_python_api.rs:156:20
  1520. 32.56 s >
  1521. 32.56 s > 4. gammaloop-integration-tests::test_python_api::python_session_getters_return_live_toml_and_command_blocks
  1522. 32.56 s > failure: test failure with exit code 101
  1523. 32.56 s > Error: Python API test subprocess failed.
  1524. 32.56 s > stdout:
  1525. 32.56 s > ┌────────────────────────────────────────────────────────┐
  1526. 32.56 s > │ You are running a restricted Symbolica instance. │
  1527. 32.56 s > │ │
  1528. 32.56 s > │ This mode is only permitted for non-commercial use and │
  1529. 32.56 s > │ is limited to one instance and core per machine. │
  1530. 32.56 s > │ │
  1531. 32.56 s > │ Hobbyists can easily acquire a free license key │
  1532. 32.56 s > │ that unlocks all cores and removes this banner: │
  1533. 32.56 s > │ │
  1534. 32.56 s > │ from symbolica import * │
  1535. 32.56 s > │ request_hobbyist_license('YOUR_NAME', 'YOUR_EMAIL') │
  1536. 32.56 s > │ │
  1537. 32.56 s > │ All other users can obtain a free 30-day trial key: │
  1538. 32.56 s > │ │
  1539. 32.56 s > │ from symbolica import * │
  1540. 32.56 s > │ request_trial_license('NAME', 'EMAIL', 'EMPLOYER') │
  1541. 32.56 s > │ │
  1542. 32.56 s > │ See https://symbolica.io/docs/get_started.html#license │
  1543. 32.56 s > └────────────────────────────────────────────────────────┘
  1544. 32.56 s > ┌───────────────────────────────────────────────────────────────────────────────────────────────────────────┐
  1545. 32.56 s > │ Cannot start new unlicensed Symbolica instance since there is already another one running on the machine. │
  1546. 32.56 s > └───────────────────────────────────────────────────────────────────────────────────────────────────────────┘
  1547. 32.56 s >
  1548. 32.56 s > stderr:
  1549. 32.56 s >
  1550. 32.56 s > ┌───────────────────────────────────────────────────────────┐
  1551. 32.56 s > │ Could not resolve the IP of the Symbolica license server. │
  1552. 32.56 s > │ │
  1553. 32.56 s > │ Please check your DNS configuration. │
  1554. 32.56 s > └───────────────────────────────────────────────────────────┘
  1555. 32.56 s > Error: failed to lookup address information: Temporary failure in name resolution
  1556. 32.56 s >
  1557. 32.56 s >
  1558. 32.56 s > Location:
  1559. 32.56 s > tests/tests/test_python_api.rs:156:20
  1560. 32.56 s > system-out
  1561. 32.56 s > running 1 test
  1562. 32.56 s > test python_session_getters_return_live_toml_and_command_blocks ... FAILED
  1563. 32.56 s >
  1564. 32.56 s > failures:
  1565. 32.56 s >
  1566. 32.56 s > failures:
  1567. 32.56 s > python_session_getters_return_live_toml_and_command_blocks
  1568. 32.56 s >
  1569. 32.56 s > test result: FAILED. 0 passed; 1 failed; 0 ignored; 0 measured; 4 filtered out; finished in 0.11s
  1570. 32.56 s > system-err
  1571. 32.56 s > Error: Python API test subprocess failed.
  1572. 32.56 s > stdout:
  1573. 32.56 s > ┌────────────────────────────────────────────────────────┐
  1574. 32.56 s > │ You are running a restricted Symbolica instance. │
  1575. 32.56 s > │ │
  1576. 32.56 s > │ This mode is only permitted for non-commercial use and │
  1577. 32.56 s > │ is limited to one instance and core per machine. │
  1578. 32.56 s > │ │
  1579. 32.56 s > │ Hobbyists can easily acquire a free license key │
  1580. 32.56 s > │ that unlocks all cores and removes this banner: │
  1581. 32.56 s > │ │
  1582. 32.56 s > │ from symbolica import * │
  1583. 32.56 s > │ request_hobbyist_license('YOUR_NAME', 'YOUR_EMAIL') │
  1584. 32.56 s > │ │
  1585. 32.56 s > │ All other users can obtain a free 30-day trial key: │
  1586. 32.56 s > │ │
  1587. 32.56 s > │ from symbolica import * │
  1588. 32.56 s > │ request_trial_license('NAME', 'EMAIL', 'EMPLOYER') │
  1589. 32.56 s > │ │
  1590. 32.56 s > │ See https://symbolica.io/docs/get_started.html#license │
  1591. 32.56 s > └────────────────────────────────────────────────────────┘
  1592. 32.56 s > ┌───────────────────────────────────────────────────────────────────────────────────────────────────────────┐
  1593. 32.56 s > │ Cannot start new unlicensed Symbolica instance since there is already another one running on the machine. │
  1594. 32.56 s > └───────────────────────────────────────────────────────────────────────────────────────────────────────────┘
  1595. 32.56 s >
  1596. 32.56 s > stderr:
  1597. 32.56 s >
  1598. 32.56 s > ┌───────────────────────────────────────────────────────────┐
  1599. 32.56 s > │ Could not resolve the IP of the Symbolica license server. │
  1600. 32.56 s > │ │
  1601. 32.56 s > │ Please check your DNS configuration. │
  1602. 32.56 s > └───────────────────────────────────────────────────────────┘
  1603. 32.56 s > Error: failed to lookup address information: Temporary failure in name resolution
  1604. 32.56 s >
  1605. 32.56 s >
  1606. 32.56 s > Location:
  1607. 32.56 s > tests/tests/test_python_api.rs:156:20
  1608. 32.56 s > =========================================
  1609. 32.56 s For full logs, run:
  1610. 32.56 s nix log /nix/store/nmwgfm0zigizp5byy173df7l99i9kddz-gammaloop-nextest-python-api.drv
  1611. 32.73 s Run failed.