- 0.00 s
$ /nix/store/9ypz3flqsrl5xl495mm8h645gadjsxi1-coreutils-9.11/bin/timeout --kill-after=15s 7200s /nix/store/23zk8sgzamrbmj1fday15szf7f2279s8-nix-2.34.7/bin/nix --extra-experimental-features nix-command --extra-experimental-features flakes flake clone git+https://github.com/alphal00p/gammaloop --dest /tmp/nix-ci-worker/stable-pwd/repo/
- 0.07 s
Cloning into '/tmp/nix-ci-worker/stable-pwd/repo'...
- 1.45 s
remote: Enumerating objects: 93832, done.
- 1.57 s
remote: Counting objects: 0% (1/9038)
remote: Counting objects: 1% (91/9038)
remote: Counting objects: 2% (181/9038)
remote: Counting objects: 3% (272/9038)
remote: Counting objects: 4% (362/9038)
remote: Counting objects: 5% (452/9038)
remote: Counting objects: 6% (543/9038)
remote: Counting objects: 7% (633/9038)
remote: Counting objects: 8% (724/9038)
remote: Counting objects: 9% (814/9038)
remote: Counting objects: 10% (904/9038)
remote: Counting objects: 11% (995/9038)
remote: Counting objects: 12% (1085/9038)
remote: Counting objects: 13% (1175/9038)
remote: Counting objects: 14% (1266/9038)
remote: Counting objects: 15% (1356/9038)
remote: Counting objects: 16% (1447/9038)
remote: Counting objects: 17% (1537/9038)
remote: Counting objects: 18% (1627/9038)
remote: Counting objects: 19% (1718/9038)
remote: Counting objects: 20% (1808/9038)
remote: Counting objects: 21% (1898/9038)
remote: Counting objects: 22% (1989/9038)
remote: Counting objects: 23% (2079/9038)
remote: Counting objects: 24% (2170/9038)
remote: Counting objects: 25% (2260/9038)
remote: Counting objects: 26% (2350/9038)
remote: Counting objects: 27% (2441/9038)
remote: Counting objects: 28% (2531/9038)
remote: Counting objects: 29% (2622/9038)
remote: Counting objects: 30% (2712/9038)
remote: Counting objects: 31% (2802/9038)
remote: Counting objects: 32% (2893/9038)
remote: Counting objects: 33% (2983/9038)
remote: Counting objects: 34% (3073/9038)
remote: Counting objects: 35% (3164/9038)
remote: Counting objects: 36% (3254/9038)
remote: Counting objects: 37% (3345/9038)
remote: Counting objects: 38% (3435/9038)
remote: Counting objects: 39% (3525/9038)
remote: Counting objects: 40% (3616/9038)
remote: Counting objects: 41% (3706/9038)
remote: Counting objects: 42% (3796/9038)
remote: Counting objects: 43% (3887/9038)
remote: Counting objects: 44% (3977/9038)
remote: Counting objects: 45% (4068/9038)
remote: Counting objects: 46% (4158/9038)
remote: Counting objects: 47% (4248/9038)
remote: Counting objects: 48% (4339/9038)
remote: Counting objects: 49% (4429/9038)
remote: Counting objects: 50% (4519/9038)
remote: Counting objects: 51% (4610/9038)
remote: Counting objects: 52% (4700/9038)
remote: Counting objects: 53% (4791/9038)
remote: Counting objects: 54% (4881/9038)
remote: Counting objects: 55% (4971/9038)
remote: Counting objects: 56% (5062/9038)
remote: Counting objects: 57% (5152/9038)
remote: Counting objects: 58% (5243/9038)
remote: Counting objects: 59% (5333/9038)
remote: Counting objects: 60% (5423/9038)
remote: Counting objects: 61% (5514/9038)
remote: Counting objects: 62% (5604/9038)
remote: Counting objects: 63% (5694/9038)
remote: Counting objects: 64% (5785/9038)
remote: Counting objects: 65% (5875/9038)
remote: Counting objects: 66% (5966/9038)
remote: Counting objects: 67% (6056/9038)
remote: Counting objects: 68% (6146/9038)
remote: Counting objects: 69% (6237/9038)
remote: Counting objects: 70% (6327/9038)
remote: Counting objects: 71% (6417/9038)
remote: Counting objects: 72% (6508/9038)
remote: Counting objects: 73% (6598/9038)
remote: Counting objects: 74% (6689/9038)
remote: Counting objects: 75% (6779/9038)
remote: Counting objects: 76% (6869/9038)
remote: Counting objects: 77% (6960/9038)
remote: Counting objects: 78% (7050/9038)
remote: Counting objects: 79% (7141/9038)
remote: Counting objects: 80% (7231/9038)
remote: Counting objects: 81% (7321/9038)
remote: Counting objects: 82% (7412/9038)
remote: Counting objects: 83% (7502/9038)
remote: Counting objects: 84% (7592/9038)
remote: Counting objects: 85% (7683/9038)
remote: Counting objects: 86% (7773/9038)
remote: Counting objects: 87% (7864/9038)
remote: Counting objects: 88% (7954/9038)
remote: Counting objects: 89% (8044/9038)
remote: Counting objects: 90% (8135/9038)
remote: Counting objects: 91% (8225/9038)
remote: Counting objects: 92% (8315/9038)
remote: Counting objects: 93% (8406/9038)
remote: Counting objects: 94% (8496/9038)
remote: Counting objects: 95% (8587/9038)
remote: Counting objects: 96% (8677/9038)
remote: Counting objects: 97% (8767/9038)
remote: Counting objects: 98% (8858/9038)
remote: Counting objects: 99% (8948/9038)
remote: Counting objects: 100% (9038/9038)
remote: Counting objects: 100% (9038/9038), done.
- 4.03 s
remote: Compressing objects: 0% (1/1850)
remote: Compressing objects: 1% (19/1850)
remote: Compressing objects: 2% (37/1850)
remote: Compressing objects: 3% (56/1850)
remote: Compressing objects: 4% (74/1850)
remote: Compressing objects: 5% (93/1850)
remote: Compressing objects: 6% (111/1850)
remote: Compressing objects: 6% (123/1850)
remote: Compressing objects: 7% (130/1850)
remote: Compressing objects: 8% (148/1850)
remote: Compressing objects: 9% (167/1850)
remote: Compressing objects: 10% (185/1850)
remote: Compressing objects: 11% (204/1850)
remote: Compressing objects: 12% (222/1850)
remote: Compressing objects: 13% (241/1850)
remote: Compressing objects: 14% (259/1850)
remote: Compressing objects: 15% (278/1850)
remote: Compressing objects: 16% (296/1850)
remote: Compressing objects: 16% (299/1850)
remote: Compressing objects: 17% (315/1850)
remote: Compressing objects: 18% (333/1850)
remote: Compressing objects: 19% (352/1850)
remote: Compressing objects: 20% (370/1850)
remote: Compressing objects: 21% (389/1850)
remote: Compressing objects: 22% (407/1850)
remote: Compressing objects: 23% (426/1850)
remote: Compressing objects: 24% (444/1850)
remote: Compressing objects: 25% (463/1850)
remote: Compressing objects: 26% (481/1850)
remote: Compressing objects: 27% (500/1850)
remote: Compressing objects: 28% (518/1850)
remote: Compressing objects: 29% (537/1850)
remote: Compressing objects: 30% (555/1850)
remote: Compressing objects: 31% (574/1850)
remote: Compressing objects: 32% (592/1850)
remote: Compressing objects: 33% (611/1850)
remote: Compressing objects: 34% (629/1850)
remote: Compressing objects: 35% (648/1850)
remote: Compressing objects: 36% (666/1850)
remote: Compressing objects: 37% (685/1850)
remote: Compressing objects: 38% (703/1850)
remote: Compressing objects: 39% (722/1850)
remote: Compressing objects: 40% (740/1850)
remote: Compressing objects: 41% (759/1850)
remote: Compressing objects: 42% (777/1850)
remote: Compressing objects: 43% (796/1850)
remote: Compressing objects: 44% (814/1850)
remote: Compressing objects: 45% (833/1850)
remote: Compressing objects: 46% (851/1850)
remote: Compressing objects: 47% (870/1850)
remote: Compressing objects: 48% (888/1850)
remote: Compressing objects: 49% (907/1850)
remote: Compressing objects: 50% (925/1850)
remote: Compressing objects: 51% (944/1850)
remote: Compressing objects: 52% (962/1850)
remote: Compressing objects: 53% (981/1850)
remote: Compressing objects: 54% (999/1850)
remote: Compressing objects: 55% (1018/1850)
remote: Compressing objects: 56% (1036/1850)
remote: Compressing objects: 57% (1055/1850)
remote: Compressing objects: 58% (1073/1850)
remote: Compressing objects: 59% (1092/1850)
remote: Compressing objects: 60% (1110/1850)
remote: Compressing objects: 61% (1129/1850)
remote: Compressing objects: 62% (1147/1850)
remote: Compressing objects: 63% (1166/1850)
remote: Compressing objects: 64% (1184/1850)
remote: Compressing objects: 65% (1203/1850)
remote: Compressing objects: 66% (1221/1850)
remote: Compressing objects: 67% (1240/1850)
remote: Compressing objects: 68% (1258/1850)
remote: Compressing objects: 69% (1277/1850)
remote: Compressing objects: 70% (1295/1850)
remote: Compressing objects: 71% (1314/1850)
remote: Compressing objects: 72% (1332/1850)
remote: Compressing objects: 73% (1351/1850)
remote: Compressing objects: 74% (1369/1850)
remote: Compressing objects: 75% (1388/1850)
remote: Compressing objects: 76% (1406/1850)
remote: Compressing objects: 77% (1425/1850)
remote: Compressing objects: 78% (1443/1850)
remote: Compressing objects: 79% (1462/1850)
remote: Compressing objects: 80% (1480/1850)
remote: Compressing objects: 81% (1499/1850)
remote: Compressing objects: 82% (1517/1850)
remote: Compressing objects: 83% (1536/1850)
remote: Compressing objects: 84% (1554/1850)
remote: Compressing objects: 85% (1573/1850)
remote: Compressing objects: 86% (1591/1850)
remote: Compressing objects: 87% (1610/1850)
remote: Compressing objects: 88% (1628/1850)
remote: Compressing objects: 89% (1647/1850)
remote: Compressing objects: 90% (1665/1850)
remote: Compressing objects: 91% (1684/1850)
remote: Compressing objects: 92% (1702/1850)
remote: Compressing objects: 93% (1721/1850)
remote: Compressing objects: 94% (1739/1850)
remote: Compressing objects: 95% (1758/1850)
remote: Compressing objects: 96% (1776/1850)
remote: Compressing objects: 97% (1795/1850)
remote: Compressing objects: 98% (1813/1850)
remote: Compressing objects: 99% (1832/1850)
remote: Compressing objects: 100% (1850/1850)
remote: Compressing objects: 100% (1850/1850), done.
- 13.77 s
Receiving objects: 0% (1/93832)
Receiving objects: 1% (939/93832)
Receiving objects: 2% (1877/93832)
Receiving objects: 3% (2815/93832)
Receiving objects: 4% (3754/93832)
Receiving objects: 5% (4692/93832)
Receiving objects: 6% (5630/93832)
Receiving objects: 7% (6569/93832)
Receiving objects: 8% (7507/93832), 14.84 MiB | 29.66 MiB/s
Receiving objects: 9% (8445/93832), 14.84 MiB | 29.66 MiB/s
Receiving objects: 10% (9384/93832), 14.84 MiB | 29.66 MiB/s
Receiving objects: 11% (10322/93832), 14.84 MiB | 29.66 MiB/s
Receiving objects: 12% (11260/93832), 14.84 MiB | 29.66 MiB/s
Receiving objects: 13% (12199/93832), 14.84 MiB | 29.66 MiB/s
Receiving objects: 14% (13137/93832), 14.84 MiB | 29.66 MiB/s
Receiving objects: 15% (14075/93832), 14.84 MiB | 29.66 MiB/s
Receiving objects: 16% (15014/93832), 14.84 MiB | 29.66 MiB/s
Receiving objects: 17% (15952/93832), 14.84 MiB | 29.66 MiB/s
Receiving objects: 18% (16890/93832), 14.84 MiB | 29.66 MiB/s
Receiving objects: 19% (17829/93832), 14.84 MiB | 29.66 MiB/s
Receiving objects: 20% (18767/93832), 14.84 MiB | 29.66 MiB/s
Receiving objects: 21% (19705/93832), 14.84 MiB | 29.66 MiB/s
Receiving objects: 22% (20644/93832), 14.84 MiB | 29.66 MiB/s
Receiving objects: 23% (21582/93832), 14.84 MiB | 29.66 MiB/s
Receiving objects: 24% (22520/93832), 14.84 MiB | 29.66 MiB/s
Receiving objects: 25% (23458/93832), 14.84 MiB | 29.66 MiB/s
Receiving objects: 26% (24397/93832), 14.84 MiB | 29.66 MiB/s
Receiving objects: 27% (25335/93832), 14.84 MiB | 29.66 MiB/s
Receiving objects: 28% (26273/93832), 14.84 MiB | 29.66 MiB/s
Receiving objects: 29% (27212/93832), 14.84 MiB | 29.66 MiB/s
Receiving objects: 30% (28150/93832), 14.84 MiB | 29.66 MiB/s
Receiving objects: 31% (29088/93832), 14.84 MiB | 29.66 MiB/s
Receiving objects: 32% (30027/93832), 14.84 MiB | 29.66 MiB/s
Receiving objects: 33% (30965/93832), 14.84 MiB | 29.66 MiB/s
Receiving objects: 34% (31903/93832), 14.84 MiB | 29.66 MiB/s
Receiving objects: 35% (32842/93832), 14.84 MiB | 29.66 MiB/s
Receiving objects: 35% (33272/93832), 14.84 MiB | 29.66 MiB/s
Receiving objects: 36% (33780/93832), 31.12 MiB | 31.11 MiB/s
Receiving objects: 37% (34718/93832), 31.12 MiB | 31.11 MiB/s
Receiving objects: 38% (35657/93832), 31.12 MiB | 31.11 MiB/s
Receiving objects: 39% (36595/93832), 31.12 MiB | 31.11 MiB/s
Receiving objects: 40% (37533/93832), 31.12 MiB | 31.11 MiB/s
Receiving objects: 41% (38472/93832), 31.12 MiB | 31.11 MiB/s
Receiving objects: 42% (39410/93832), 31.12 MiB | 31.11 MiB/s
Receiving objects: 43% (40348/93832), 47.64 MiB | 31.76 MiB/s
Receiving objects: 44% (41287/93832), 47.64 MiB | 31.76 MiB/s
Receiving objects: 45% (42225/93832), 47.64 MiB | 31.76 MiB/s
Receiving objects: 46% (43163/93832), 47.64 MiB | 31.76 MiB/s
Receiving objects: 47% (44102/93832), 47.64 MiB | 31.76 MiB/s
Receiving objects: 48% (45040/93832), 47.64 MiB | 31.76 MiB/s
Receiving objects: 49% (45978/93832), 47.64 MiB | 31.76 MiB/s
Receiving objects: 50% (46916/93832), 47.64 MiB | 31.76 MiB/s
Receiving objects: 51% (47855/93832), 47.64 MiB | 31.76 MiB/s
Receiving objects: 51% (48754/93832), 63.85 MiB | 31.92 MiB/s
Receiving objects: 52% (48793/93832), 63.85 MiB | 31.92 MiB/s
Receiving objects: 53% (49731/93832), 63.85 MiB | 31.92 MiB/s
Receiving objects: 54% (50670/93832), 63.85 MiB | 31.92 MiB/s
Receiving objects: 55% (51608/93832), 63.85 MiB | 31.92 MiB/s
Receiving objects: 56% (52546/93832), 63.85 MiB | 31.92 MiB/s
Receiving objects: 57% (53485/93832), 63.85 MiB | 31.92 MiB/s
Receiving objects: 58% (54423/93832), 79.86 MiB | 31.91 MiB/s
Receiving objects: 59% (55361/93832), 79.86 MiB | 31.91 MiB/s
Receiving objects: 60% (56300/93832), 79.86 MiB | 31.91 MiB/s
Receiving objects: 61% (57238/93832), 79.86 MiB | 31.91 MiB/s
Receiving objects: 61% (57339/93832), 95.76 MiB | 31.90 MiB/s
Receiving objects: 61% (57496/93832), 127.71 MiB | 31.75 MiB/s
Receiving objects: 61% (57592/93832), 143.83 MiB | 31.80 MiB/s
Receiving objects: 61% (58032/93832), 175.71 MiB | 31.95 MiB/s
Receiving objects: 62% (58176/93832), 207.61 MiB | 31.74 MiB/s
Receiving objects: 63% (59115/93832), 207.61 MiB | 31.74 MiB/s
Receiving objects: 64% (60053/93832), 207.61 MiB | 31.74 MiB/s
Receiving objects: 65% (60991/93832), 207.61 MiB | 31.74 MiB/s
Receiving objects: 66% (61930/93832), 207.61 MiB | 31.74 MiB/s
Receiving objects: 67% (62868/93832), 207.61 MiB | 31.74 MiB/s
Receiving objects: 67% (63600/93832), 207.61 MiB | 31.74 MiB/s
Receiving objects: 68% (63806/93832), 207.61 MiB | 31.74 MiB/s
Receiving objects: 69% (64745/93832), 223.64 MiB | 31.76 MiB/s
Receiving objects: 70% (65683/93832), 223.64 MiB | 31.76 MiB/s
Receiving objects: 71% (66621/93832), 239.50 MiB | 31.75 MiB/s
Receiving objects: 72% (67560/93832), 239.50 MiB | 31.75 MiB/s
Receiving objects: 73% (68498/93832), 239.50 MiB | 31.75 MiB/s
Receiving objects: 74% (69436/93832), 239.50 MiB | 31.75 MiB/s
Receiving objects: 75% (70374/93832), 239.50 MiB | 31.75 MiB/s
Receiving objects: 76% (71313/93832), 239.50 MiB | 31.75 MiB/s
Receiving objects: 77% (72251/93832), 239.50 MiB | 31.75 MiB/s
Receiving objects: 78% (73189/93832), 239.50 MiB | 31.75 MiB/s
Receiving objects: 79% (74128/93832), 239.50 MiB | 31.75 MiB/s
Receiving objects: 80% (75066/93832), 239.50 MiB | 31.75 MiB/s
Receiving objects: 81% (76004/93832), 239.50 MiB | 31.75 MiB/s
Receiving objects: 81% (76250/93832), 239.50 MiB | 31.75 MiB/s
Receiving objects: 82% (76943/93832), 255.46 MiB | 31.74 MiB/s
Receiving objects: 83% (77881/93832), 271.28 MiB | 31.80 MiB/s
Receiving objects: 84% (78819/93832), 271.28 MiB | 31.80 MiB/s
Receiving objects: 85% (79758/93832), 271.28 MiB | 31.80 MiB/s
Receiving objects: 85% (80178/93832), 271.28 MiB | 31.80 MiB/s
Receiving objects: 86% (80696/93832), 287.20 MiB | 31.76 MiB/s
Receiving objects: 87% (81634/93832), 287.20 MiB | 31.76 MiB/s
Receiving objects: 88% (82573/93832), 287.20 MiB | 31.76 MiB/s
Receiving objects: 89% (83511/93832), 287.20 MiB | 31.76 MiB/s
Receiving objects: 90% (84449/93832), 287.20 MiB | 31.76 MiB/s
Receiving objects: 91% (85388/93832), 303.33 MiB | 31.83 MiB/s
Receiving objects: 92% (86326/93832), 303.33 MiB | 31.83 MiB/s
Receiving objects: 93% (87264/93832), 303.33 MiB | 31.83 MiB/s
Receiving objects: 94% (88203/93832), 303.33 MiB | 31.83 MiB/s
Receiving objects: 95% (89141/93832), 303.33 MiB | 31.83 MiB/s
Receiving objects: 96% (90079/93832), 303.33 MiB | 31.83 MiB/s
Receiving objects: 97% (91018/93832), 303.33 MiB | 31.83 MiB/s
Receiving objects: 98% (91956/93832), 303.33 MiB | 31.83 MiB/s
Receiving objects: 99% (92894/93832), 303.33 MiB | 31.83 MiB/s
remote: Total 93832 (delta 7875), reused 7207 (delta 7187), pack-reused 84794 (from 3)
- 13.77 s
Receiving objects: 100% (93832/93832), 303.33 MiB | 31.83 MiB/s
Receiving objects: 100% (93832/93832), 309.80 MiB | 31.83 MiB/s, done.
- 14.80 s
Resolving deltas: 0% (0/63130)
Resolving deltas: 1% (632/63130)
Resolving deltas: 2% (1263/63130)
Resolving deltas: 3% (1895/63130)
Resolving deltas: 4% (2526/63130)
Resolving deltas: 5% (3157/63130)
Resolving deltas: 6% (3788/63130)
Resolving deltas: 7% (4420/63130)
Resolving deltas: 8% (5051/63130)
Resolving deltas: 9% (5682/63130)
Resolving deltas: 10% (6313/63130)
Resolving deltas: 11% (6945/63130)
Resolving deltas: 12% (7577/63130)
Resolving deltas: 13% (8209/63130)
Resolving deltas: 14% (8839/63130)
Resolving deltas: 15% (9470/63130)
Resolving deltas: 16% (10101/63130)
Resolving deltas: 17% (10733/63130)
Resolving deltas: 18% (11364/63130)
Resolving deltas: 19% (11996/63130)
Resolving deltas: 20% (12626/63130)
Resolving deltas: 21% (13258/63130)
Resolving deltas: 22% (13889/63130)
Resolving deltas: 23% (14520/63130)
Resolving deltas: 24% (15152/63130)
Resolving deltas: 25% (15783/63130)
Resolving deltas: 26% (16417/63130)
Resolving deltas: 27% (17046/63130)
Resolving deltas: 28% (17677/63130)
Resolving deltas: 29% (18308/63130)
Resolving deltas: 30% (18939/63130)
Resolving deltas: 31% (19571/63130)
Resolving deltas: 32% (20202/63130)
Resolving deltas: 33% (20835/63130)
Resolving deltas: 34% (21468/63130)
Resolving deltas: 35% (22096/63130)
Resolving deltas: 36% (22728/63130)
Resolving deltas: 37% (23359/63130)
Resolving deltas: 38% (23991/63130)
Resolving deltas: 39% (24621/63130)
Resolving deltas: 40% (25252/63130)
Resolving deltas: 41% (25884/63130)
Resolving deltas: 42% (26515/63130)
Resolving deltas: 43% (27146/63130)
Resolving deltas: 44% (27778/63130)
Resolving deltas: 45% (28411/63130)
Resolving deltas: 46% (29040/63130)
Resolving deltas: 47% (29672/63130)
Resolving deltas: 48% (30303/63130)
Resolving deltas: 49% (30934/63130)
Resolving deltas: 50% (31565/63130)
Resolving deltas: 51% (32197/63130)
Resolving deltas: 52% (32830/63130)
Resolving deltas: 53% (33459/63130)
Resolving deltas: 54% (34092/63130)
Resolving deltas: 55% (34722/63130)
Resolving deltas: 56% (35353/63130)
Resolving deltas: 57% (35985/63130)
Resolving deltas: 58% (36616/63130)
Resolving deltas: 59% (37247/63130)
Resolving deltas: 60% (37878/63130)
Resolving deltas: 61% (38510/63130)
Resolving deltas: 62% (39141/63130)
Resolving deltas: 63% (39772/63130)
Resolving deltas: 64% (40405/63130)
Resolving deltas: 65% (41035/63130)
Resolving deltas: 66% (41667/63130)
Resolving deltas: 67% (42298/63130)
Resolving deltas: 68% (42931/63130)
Resolving deltas: 69% (43562/63130)
Resolving deltas: 70% (44191/63130)
Resolving deltas: 71% (44823/63130)
Resolving deltas: 72% (45454/63130)
Resolving deltas: 73% (46085/63130)
Resolving deltas: 74% (46717/63130)
Resolving deltas: 75% (47349/63130)
Resolving deltas: 76% (47979/63130)
Resolving deltas: 77% (48611/63130)
Resolving deltas: 78% (49242/63130)
Resolving deltas: 79% (49873/63130)
Resolving deltas: 80% (50504/63130)
Resolving deltas: 81% (51138/63130)
Resolving deltas: 82% (51769/63130)
Resolving deltas: 83% (52398/63130)
Resolving deltas: 84% (53031/63130)
Resolving deltas: 85% (53661/63130)
Resolving deltas: 86% (54292/63130)
Resolving deltas: 87% (54924/63130)
Resolving deltas: 88% (55555/63130)
Resolving deltas: 89% (56186/63130)
Resolving deltas: 90% (56817/63130)
Resolving deltas: 91% (57449/63130)
Resolving deltas: 92% (58081/63130)
Resolving deltas: 93% (58711/63130)
Resolving deltas: 94% (59344/63130)
Resolving deltas: 95% (59974/63130)
Resolving deltas: 96% (60605/63130)
Resolving deltas: 97% (61237/63130)
Resolving deltas: 98% (61868/63130)
Resolving deltas: 98% (61933/63130)
Resolving deltas: 99% (62499/63130)
Resolving deltas: 100% (63130/63130)
Resolving deltas: 100% (63130/63130), done.
- 15.30 s
Fetching commit 654d6aff73111149f97b220cbd7a9fe7bf7d23e4 for advanced_sampling ...
- 15.30 s
$ /nix/store/bcnisk3ydfgv26v2gw3zlky24g00yww2-git-2.54.0/bin/git fetch origin 654d6aff73111149f97b220cbd7a9fe7bf7d23e4
- 16.02 s
From https://github.com/alphal00p/gammaloop
- 16.02 s
* branch 654d6aff73111149f97b220cbd7a9fe7bf7d23e4 -> FETCH_HEAD
- 16.03 s
$ /nix/store/9ypz3flqsrl5xl495mm8h645gadjsxi1-coreutils-9.11/bin/timeout --kill-after=15s 7200s /nix/store/bcnisk3ydfgv26v2gw3zlky24g00yww2-git-2.54.0/bin/git -c advice.detachedHead=false checkout 654d6aff73111149f97b220cbd7a9fe7bf7d23e4
- 16.53 s
HEAD is now at 654d6aff7 allow final underflow rounding and stage GL638 validation pilots
- 16.53 s
$ /nix/store/9ypz3flqsrl5xl495mm8h645gadjsxi1-coreutils-9.11/bin/timeout --kill-after=15s 7200s /nix/store/23zk8sgzamrbmj1fday15szf7f2279s8-nix-2.34.7/bin/nix --extra-experimental-features nix-command --extra-experimental-features flakes --log-format internal-json run .#packages.x86_64-linux.nix-ci-check-gammaloop-nextest-python-api --print-build-logs
- 25.49 s
- 25.61 s
Downloading cached boehm-gc from https://cache.nix-ci.com
- 25.61 s
Downloading cached busybox from https://cache.nix-ci.com
- 25.61 s
Downloading cached aws-c-common from https://cache.nix-ci.com
- 25.61 s
Downloading cached brotli-1.2.0-lib from https://cache.nix-ci.com
- 25.61 s
Downloading cached libcpuid from https://cache.nix-ci.com
- 25.61 s
Downloading cached libseccomp-2.6.0-lib from https://cache.nix-ci.com
- 25.61 s
Downloading cached libsodium-1.0.22-unstable-2026-04 from https://cache.nix-ci.com
- 25.61 s
Downloading cached lowdown-3.0.1-lib from https://cache.nix-ci.com
- 25.61 s
Downloading cached publicsuffix-list-0-unstable-2026-05 from https://cache.nix-ci.com
- 25.61 s
Downloading cached icu4c from https://cache.nix-ci.com
- 25.61 s
Downloading cached libssh2 from https://cache.nix-ci.com
- 25.61 s
Downloading cached libxml2 from https://cache.nix-ci.com
- 25.61 s
Downloading cached nghttp2-1.69.0-lib from https://cache.nix-ci.com
- 25.61 s
Downloading cached nghttp3 from https://cache.nix-ci.com
- 25.61 s
Downloading cached s2n-tls from https://cache.nix-ci.com
- 25.61 s
Downloading cached ngtcp2 from https://cache.nix-ci.com
- 25.69 s
Downloaded cached publicsuffix-list-0-unstable-2026-05 (329 KiB) in 77ms
- 25.69 s
Progress: 0 of 1 built, 1 of 48 downloaded from cache (15 downloading)
- 25.69 s
Downloading cached hwloc-2.14.0-lib from https://cache.nix-ci.com
- 25.69 s
Downloaded cached hwloc-2.14.0-lib in 0ms
- 25.69 s
Progress: 0 of 1 built, 2 of 48 downloaded from cache (15 downloading)
- 25.69 s
Downloading cached keyutils-1.6.3-lib from https://cache.nix-ci.com
- 25.69 s
Downloaded cached keyutils-1.6.3-lib in 0ms
- 25.69 s
Progress: 0 of 1 built, 3 of 48 downloaded from cache (15 downloading)
- 25.69 s
Downloading cached libpsl from https://cache.nix-ci.com
- 25.69 s
Downloaded cached libpsl in 0ms
- 25.69 s
Progress: 0 of 1 built, 4 of 48 downloaded from cache (15 downloading)
- 25.69 s
Downloading cached krb5-1.22.2-lib from https://cache.nix-ci.com
- 25.71 s
Downloaded cached nghttp2-1.69.0-lib (225 KiB) in 103ms
- 25.71 s
Progress: 0 of 1 built, 5 of 48 downloaded from cache (15 downloading)
- 25.71 s
Downloading cached onetbb from https://cache.nix-ci.com
- 25.71 s
Downloaded cached onetbb in 0ms
- 25.71 s
Progress: 0 of 1 built, 6 of 48 downloaded from cache (15 downloading)
- 25.71 s
Downloading cached libblake3 from https://cache.nix-ci.com
- 25.71 s
Downloaded cached libseccomp-2.6.0-lib (193 KiB) in 106ms
- 25.71 s
Progress: 0 of 1 built, 7 of 48 downloaded from cache (15 downloading)
- 25.71 s
Downloaded cached libcpuid (326 KiB) in 106ms
- 25.72 s
Progress: 0 of 1 built, 8 of 48 downloaded from cache (14 downloading)
- 25.72 s
Downloaded cached nghttp3 (228 KiB) in 106ms
- 25.72 s
Progress: 0 of 1 built, 9 of 48 downloaded from cache (13 downloading)
- 25.73 s
Downloaded cached libssh2 (330 KiB) in 120ms
- 25.73 s
Progress: 0 of 1 built, 10 of 48 downloaded from cache (12 downloading)
- 25.73 s
Downloaded cached busybox (230 KiB) in 123ms
- 25.73 s
Progress: 0 of 1 built, 11 of 48 downloaded from cache (12 downloading)
- 25.73 s
Downloading cached libgit2-1.9.4-lib from https://cache.nix-ci.com
- 25.73 s
Downloaded cached libgit2-1.9.4-lib in 0ms
- 25.73 s
Progress: 0 of 1 built, 12 of 48 downloaded from cache (11 downloading)
- 25.73 s
Downloaded cached boehm-gc (312 KiB) in 123ms
- 25.73 s
Progress: 0 of 1 built, 13 of 48 downloaded from cache (10 downloading)
- 25.73 s
Downloaded cached lowdown-3.0.1-lib (341 KiB) in 121ms
- 25.73 s
Progress: 0 of 1 built, 14 of 48 downloaded from cache (9 downloading)
- 25.73 s
Downloaded cached ngtcp2 (515 KiB) in 121ms
- 25.73 s
Progress: 0 of 1 built, 15 of 48 downloaded from cache (8 downloading)
- 25.73 s
Downloaded cached aws-c-common (1.1 MiB) in 125ms
- 25.73 s
Progress: 0 of 1 built, 16 of 48 downloaded from cache (7 downloading)
- 25.73 s
Downloading cached aws-c-compression from https://cache.nix-ci.com
- 25.73 s
Downloading cached aws-c-cal from https://cache.nix-ci.com
- 25.73 s
Downloaded cached aws-c-compression in 0ms
- 25.73 s
Downloading cached aws-c-sdkutils from https://cache.nix-ci.com
- 25.73 s
Downloaded cached aws-c-cal in 0ms
- 25.73 s
Downloaded cached aws-c-sdkutils in 0ms
- 25.73 s
Downloading cached aws-checksums from https://cache.nix-ci.com
- 25.73 s
Progress: 0 of 1 built, 17 of 48 downloaded from cache (10 downloading)
- 25.73 s
Downloaded cached aws-checksums in 0ms
- 25.73 s
Progress: 0 of 1 built, 18 of 48 downloaded from cache (9 downloading)
- 25.73 s
Progress: 0 of 1 built, 19 of 48 downloaded from cache (8 downloading)
- 25.73 s
Progress: 0 of 1 built, 20 of 48 downloaded from cache (7 downloading)
- 25.73 s
Downloaded cached libsodium-1.0.22-unstable-2026-04 (666 KiB) in 126ms
- 25.73 s
Progress: 0 of 1 built, 21 of 48 downloaded from cache (6 downloading)
- 25.74 s
Downloaded cached s2n-tls (1.3 MiB) in 130ms
- 25.74 s
Progress: 0 of 1 built, 22 of 48 downloaded from cache (5 downloading)
- 25.74 s
Downloading cached aws-c-io from https://cache.nix-ci.com
- 25.74 s
Downloaded cached aws-c-io in 0ms
- 25.74 s
Progress: 0 of 1 built, 23 of 48 downloaded from cache (5 downloading)
- 25.74 s
Downloading cached aws-c-event-stream from https://cache.nix-ci.com
- 25.74 s
Downloading cached aws-c-http from https://cache.nix-ci.com
- 25.74 s
Downloaded cached brotli-1.2.0-lib (961 KiB) in 133ms
- 25.74 s
Progress: 0 of 1 built, 24 of 48 downloaded from cache (6 downloading)
- 25.75 s
Downloaded cached libxml2 (1.4 MiB) in 137ms
- 25.75 s
Progress: 0 of 1 built, 25 of 48 downloaded from cache (5 downloading)
- 25.75 s
Downloading cached libarchive-3.8.8-lib from https://cache.nix-ci.com
- 25.75 s
Downloaded cached libarchive-3.8.8-lib in 0ms
- 25.75 s
Progress: 0 of 1 built, 26 of 48 downloaded from cache (5 downloading)
- 25.76 s
Downloaded cached libblake3 (117 KiB) in 45ms
- 25.76 s
Progress: 0 of 1 built, 27 of 48 downloaded from cache (4 downloading)
- 25.76 s
Downloaded cached krb5-1.22.2-lib (2.7 MiB) in 71ms
- 25.76 s
Progress: 0 of 1 built, 28 of 48 downloaded from cache (3 downloading)
- 25.76 s
Downloading cached curl from https://cache.nix-ci.com
- 25.79 s
Downloaded cached curl (1.2 MiB) in 27ms
- 25.79 s
Progress: 0 of 1 built, 29 of 48 downloaded from cache (3 downloading)
- 25.79 s
Downloaded cached aws-c-event-stream (176 KiB) in 50ms
- 25.79 s
Progress: 0 of 1 built, 30 of 48 downloaded from cache (2 downloading)
- 25.80 s
Downloaded cached aws-c-http (641 KiB) in 58ms
- 25.80 s
Progress: 0 of 1 built, 31 of 48 downloaded from cache (1 downloading)
- 25.80 s
Downloading cached aws-c-auth from https://cache.nix-ci.com
- 25.80 s
Downloading cached aws-c-mqtt from https://cache.nix-ci.com
- 25.84 s
Downloaded cached aws-c-auth (387 KiB) in 39ms
- 25.84 s
Progress: 0 of 1 built, 32 of 48 downloaded from cache (2 downloading)
- 25.84 s
Downloading cached aws-c-s3 from https://cache.nix-ci.com
- 25.84 s
Downloaded cached aws-c-mqtt (557 KiB) in 44ms
- 25.84 s
Progress: 0 of 1 built, 33 of 48 downloaded from cache (2 downloading)
- 25.88 s
Downloaded cached aws-c-s3 (384 KiB) in 43ms
- 25.88 s
Progress: 0 of 1 built, 34 of 48 downloaded from cache (1 downloading)
- 25.88 s
Downloading cached aws-crt-cpp from https://cache.nix-ci.com
- 25.95 s
Downloaded cached aws-crt-cpp (979 KiB) in 65ms
- 25.95 s
Progress: 0 of 1 built, 35 of 48 downloaded from cache (1 downloading)
- 26.09 s
Downloaded cached icu4c (38.2 MiB) in 484ms
- 26.09 s
Progress: 0 of 1 built, 36 of 48 downloaded from cache
- 26.09 s
Downloading cached boost from https://cache.nix-ci.com
- 26.09 s
Downloaded cached boost in 0ms
- 26.09 s
Progress: 0 of 1 built, 37 of 48 downloaded from cache
- 26.09 s
Downloading cached nix-util from https://cache.nix-ci.com
- 26.09 s
Downloaded cached nix-util in 0ms
- 26.09 s
Progress: 0 of 1 built, 38 of 48 downloaded from cache
- 26.09 s
Downloading cached nix-nswrapper from https://cache.nix-ci.com
- 26.09 s
Downloaded cached nix-nswrapper in 0ms
- 26.09 s
Progress: 0 of 1 built, 39 of 48 downloaded from cache (1 downloading)
- 26.09 s
Downloading cached nix-store from https://cache.nix-ci.com
- 26.09 s
Downloaded cached nix-store in 0ms
- 26.09 s
Progress: 0 of 1 built, 40 of 48 downloaded from cache
- 26.09 s
Downloading cached nix-fetchers from https://cache.nix-ci.com
- 26.09 s
Downloaded cached nix-fetchers in 0ms
- 26.09 s
Progress: 0 of 1 built, 41 of 48 downloaded from cache (1 downloading)
- 26.09 s
Downloading cached nix-main from https://cache.nix-ci.com
- 26.09 s
Downloaded cached nix-main in 0ms
- 26.09 s
Progress: 0 of 1 built, 42 of 48 downloaded from cache (1 downloading)
- 26.09 s
Downloading cached nix-expr from https://cache.nix-ci.com
- 26.12 s
Downloaded cached nix-expr (3.3 MiB) in 29ms
- 26.12 s
Progress: 0 of 1 built, 43 of 48 downloaded from cache
- 26.12 s
Downloading cached nix-flake from https://cache.nix-ci.com
- 26.12 s
Downloaded cached nix-flake in 0ms
- 26.12 s
Progress: 0 of 1 built, 44 of 48 downloaded from cache
- 26.12 s
Downloading cached nix-cmd from https://cache.nix-ci.com
- 26.14 s
Downloaded cached nix-cmd (1 MiB) in 18ms
- 26.14 s
Progress: 0 of 1 built, 45 of 48 downloaded from cache
- 26.14 s
Downloading cached nix from https://cache.nix-ci.com
- 26.18 s
Downloaded cached nix (3.9 MiB) in 36ms
- 26.18 s
Progress: 0 of 1 built, 46 of 48 downloaded from cache
- 26.18 s
Downloading cached nix from https://cache.nix-ci.com
- 26.18 s
Downloaded cached nix in 0ms
- 26.18 s
Progress: 0 of 1 built, 47 of 48 downloaded from cache
- 26.18 s
Downloading cached nix-ci-check-gammaloop-nextest-python-api from https://cache.nix-ci.com
- 26.18 s
Downloaded cached nix-ci-check-gammaloop-nextest-python-api (1104 B) in 3ms
- 26.18 s
Progress: 0 of 1 built, 48 of 48 downloaded from cache
- 33.71 s
evaluating derivation 'g
copying '/nix/store/7nm0
evaluating derivation 'g
copying '/nix/store/7nm0
evaluating derivation 'g
copying '/nix/store/7nm0
evaluating derivation 'g
copying '/nix/store/7nm0
evaluating derivation 'g
copying '/nix/store/7nm0
evaluating derivation 'g
copying '/nix/store/7nm0
evaluating derivation 'g
copying '/nix/store/7nm0
evaluating derivation 'g
copying '/nix/store/7nm0
evaluating derivation 'g
copying '/nix/store/7nm0
evaluating derivation 'g
copying '/nix/store/7nm0
evaluating derivation 'g
querying gammaloop-nexte
[0/9 built, 0.0 KiB DL]
[0/1 built, 0.0 KiB DL]
[1/0/1 built, 0.0 KiB DLgammaloop-nextest-python-api> Extracting 1 binary, 1 build script output directory, and 3 linked paths to /build/nextest-archive-Hwt2Lj
- 33.77 s
gammaloop-nextest-python-api> Extracted 18 files to /build/nextest-archive-Hwt2Lj in 0.06s
- 33.78 s
gammaloop-nextest-python-api> ------------
- 33.78 s
gammaloop-nextest-python-api> Nextest run ID 71b70952-8308-4d0e-9e30-05a357df5f23 with nextest profile: ci_gammaloop
- 33.78 s
gammaloop-nextest-python-api> Starting 5 tests across 1 binary
- 33.90 s
gammaloop-nextest-python-api> FAIL [ 0.113s] (1/5) gammaloop-integration-tests::test_python_api python_evaluate_sample_honors_generate_events_and_observable_snapshots
- 33.90 s
gammaloop-nextest-python-api> stdout ---
- 33.90 s
gammaloop-nextest-python-api>
- 33.90 s
gammaloop-nextest-python-api> running 1 test
- 33.90 s
gammaloop-nextest-python-api> test python_evaluate_sample_honors_generate_events_and_observable_snapshots ... FAILED
- 33.90 s
gammaloop-nextest-python-api>
- 33.90 s
gammaloop-nextest-python-api> failures:
- 33.90 s
gammaloop-nextest-python-api>
- 33.90 s
gammaloop-nextest-python-api> failures:
- 33.90 s
gammaloop-nextest-python-api> python_evaluate_sample_honors_generate_events_and_observable_snapshots
- 33.90 s
gammaloop-nextest-python-api>
- 33.90 s
gammaloop-nextest-python-api> test result: FAILED. 0 passed; 1 failed; 0 ignored; 0 measured; 4 filtered out; finished in 0.11s
- 33.90 s
gammaloop-nextest-python-api>
- 33.90 s
gammaloop-nextest-python-api> stderr ---
- 33.90 s
gammaloop-nextest-python-api> Error: Python API test subprocess failed.
- 33.90 s
gammaloop-nextest-python-api> stdout:
- 33.90 s
gammaloop-nextest-python-api> ┌────────────────────────────────────────────────────────┐
- 33.90 s
gammaloop-nextest-python-api> │ You are running a restricted Symbolica instance. │
- 33.90 s
gammaloop-nextest-python-api> │ │
- 33.90 s
gammaloop-nextest-python-api> │ This mode is only permitted for non-commercial use and │
- 33.90 s
gammaloop-nextest-python-api> │ is limited to one instance and core per machine. │
- 33.90 s
gammaloop-nextest-python-api> │ │
- 33.90 s
gammaloop-nextest-python-api> │ Hobbyists can easily acquire a free license key │
- 33.90 s
gammaloop-nextest-python-api> │ that unlocks all cores and removes this banner: │
- 33.90 s
gammaloop-nextest-python-api> │ │
- 33.90 s
gammaloop-nextest-python-api> │ from symbolica import * │
- 33.90 s
gammaloop-nextest-python-api> │ request_hobbyist_license('YOUR_NAME', 'YOUR_EMAIL') │
- 33.90 s
gammaloop-nextest-python-api> │ │
- 33.90 s
gammaloop-nextest-python-api> │ All other users can obtain a free 30-day trial key: │
- 33.90 s
gammaloop-nextest-python-api> │ │
- 33.90 s
gammaloop-nextest-python-api> │ from symbolica import * │
- 33.90 s
gammaloop-nextest-python-api> │ request_trial_license('NAME', 'EMAIL', 'EMPLOYER') │
- 33.90 s
gammaloop-nextest-python-api> │ │
- 33.90 s
gammaloop-nextest-python-api> │ See https://symbolica.io/docs/get_started.html#license │
- 33.90 s
gammaloop-nextest-python-api> └────────────────────────────────────────────────────────┘
- 33.90 s
gammaloop-nextest-python-api> ┌───────────────────────────────────────────────────────────────────────────────────────────────────────────┐
- 33.90 s
gammaloop-nextest-python-api> │ Cannot start new unlicensed Symbolica instance since there is already another one running on the machine. │
- 33.90 s
gammaloop-nextest-python-api> └───────────────────────────────────────────────────────────────────────────────────────────────────────────┘
- 33.90 s
gammaloop-nextest-python-api>
- 33.90 s
gammaloop-nextest-python-api> stderr:
- 33.90 s
gammaloop-nextest-python-api>
- 33.90 s
gammaloop-nextest-python-api> ┌───────────────────────────────────────────────────────────┐
- 33.90 s
gammaloop-nextest-python-api> │ Could not resolve the IP of the Symbolica license server. │
- 33.90 s
gammaloop-nextest-python-api> │ │
- 33.90 s
gammaloop-nextest-python-api> │ Please check your DNS configuration. │
- 33.90 s
gammaloop-nextest-python-api> └───────────────────────────────────────────────────────────┘
- 33.90 s
gammaloop-nextest-python-api> Error: failed to lookup address information: Temporary failure in name resolution
- 33.90 s
gammaloop-nextest-python-api>
- 33.90 s
gammaloop-nextest-python-api>
- 33.90 s
gammaloop-nextest-python-api> Location:
- 33.90 s
gammaloop-nextest-python-api> tests/tests/test_python_api.rs:156:20
- 33.90 s
gammaloop-nextest-python-api>
- 33.90 s
gammaloop-nextest-python-api> FAIL [ 0.114s] (2/5) gammaloop-integration-tests::test_python_api python_evaluate_samples_batch_and_momentum_space_have_expected_shape
- 33.90 s
gammaloop-nextest-python-api> stdout ---
- 33.90 s
gammaloop-nextest-python-api>
- 33.90 s
gammaloop-nextest-python-api> running 1 test
- 33.90 s
gammaloop-nextest-python-api> test python_evaluate_samples_batch_and_momentum_space_have_expected_shape ... FAILED
- 33.90 s
gammaloop-nextest-python-api>
- 33.90 s
gammaloop-nextest-python-api> failures:
- 33.90 s
gammaloop-nextest-python-api>
- 33.90 s
gammaloop-nextest-python-api> failures:
- 33.90 s
gammaloop-nextest-python-api> python_evaluate_samples_batch_and_momentum_space_have_expected_shape
- 33.90 s
gammaloop-nextest-python-api>
- 33.90 s
gammaloop-nextest-python-api> test result: FAILED. 0 passed; 1 failed; 0 ignored; 0 measured; 4 filtered out; finished in 0.11s
- 33.90 s
gammaloop-nextest-python-api>
- 33.90 s
gammaloop-nextest-python-api> stderr ---
- 33.90 s
gammaloop-nextest-python-api> Error: Python API test subprocess failed.
- 33.90 s
gammaloop-nextest-python-api> stdout:
- 33.90 s
gammaloop-nextest-python-api> ┌────────────────────────────────────────────────────────┐
- 33.90 s
gammaloop-nextest-python-api> │ You are running a restricted Symbolica instance. │
- 33.90 s
gammaloop-nextest-python-api> │ │
- 33.90 s
gammaloop-nextest-python-api> │ This mode is only permitted for non-commercial use and │
- 33.90 s
gammaloop-nextest-python-api> │ is limited to one instance and core per machine. │
- 33.90 s
gammaloop-nextest-python-api> │ │
- 33.90 s
gammaloop-nextest-python-api> │ Hobbyists can easily acquire a free license key │
- 33.90 s
gammaloop-nextest-python-api> │ that unlocks all cores and removes this banner: │
- 33.90 s
gammaloop-nextest-python-api> │ │
- 33.90 s
gammaloop-nextest-python-api> │ from symbolica import * │
- 33.90 s
gammaloop-nextest-python-api> │ request_hobbyist_license('YOUR_NAME', 'YOUR_EMAIL') │
- 33.90 s
gammaloop-nextest-python-api> │ │
- 33.90 s
gammaloop-nextest-python-api> │ All other users can obtain a free 30-day trial key: │
- 33.90 s
gammaloop-nextest-python-api> │ │
- 33.90 s
gammaloop-nextest-python-api> │ from symbolica import * │
- 33.90 s
gammaloop-nextest-python-api> │ request_trial_license('NAME', 'EMAIL', 'EMPLOYER') │
- 33.90 s
gammaloop-nextest-python-api> │ │
- 33.90 s
gammaloop-nextest-python-api> │ See https://symbolica.io/docs/get_started.html#license │
- 33.90 s
gammaloop-nextest-python-api> └────────────────────────────────────────────────────────┘
- 33.90 s
gammaloop-nextest-python-api> ┌───────────────────────────────────────────────────────────────────────────────────────────────────────────┐
- 33.90 s
gammaloop-nextest-python-api> │ Cannot start new unlicensed Symbolica instance since there is already another one running on the machine. │
- 33.90 s
gammaloop-nextest-python-api> └───────────────────────────────────────────────────────────────────────────────────────────────────────────┘
- 33.90 s
gammaloop-nextest-python-api>
- 33.90 s
gammaloop-nextest-python-api> stderr:
- 33.90 s
gammaloop-nextest-python-api>
- 33.90 s
gammaloop-nextest-python-api> ┌───────────────────────────────────────────────────────────┐
- 33.90 s
gammaloop-nextest-python-api> │ Could not resolve the IP of the Symbolica license server. │
- 33.90 s
gammaloop-nextest-python-api> │ │
- 33.90 s
gammaloop-nextest-python-api> │ Please check your DNS configuration. │
- 33.90 s
gammaloop-nextest-python-api> └───────────────────────────────────────────────────────────┘
- 33.90 s
gammaloop-nextest-python-api> Error: failed to lookup address information: Temporary failure in name resolution
- 33.90 s
gammaloop-nextest-python-api>
- 33.90 s
gammaloop-nextest-python-api>
- 33.90 s
gammaloop-nextest-python-api> Location:
- 33.90 s
gammaloop-nextest-python-api> tests/tests/test_python_api.rs:156:20
- 33.90 s
gammaloop-nextest-python-api>
- 33.90 s
gammaloop-nextest-python-api> FAIL [ 0.118s] (3/5) gammaloop-integration-tests::test_python_api python_evaluate_sample_preserves_graph_grouping_and_incoming_pdgs
- 33.90 s
gammaloop-nextest-python-api> stdout ---
- 33.90 s
gammaloop-nextest-python-api>
- 33.90 s
gammaloop-nextest-python-api> running 1 test
- 33.90 s
gammaloop-nextest-python-api> test python_evaluate_sample_preserves_graph_grouping_and_incoming_pdgs ... FAILED
- 33.90 s
gammaloop-nextest-python-api>
- 33.90 s
gammaloop-nextest-python-api> failures:
- 33.90 s
gammaloop-nextest-python-api>
- 33.90 s
gammaloop-nextest-python-api> failures:
- 33.90 s
gammaloop-nextest-python-api> python_evaluate_sample_preserves_graph_grouping_and_incoming_pdgs
- 33.90 s
gammaloop-nextest-python-api>
- 33.90 s
gammaloop-nextest-python-api> test result: FAILED. 0 passed; 1 failed; 0 ignored; 0 measured; 4 filtered out; finished in 0.11s
- 33.90 s
gammaloop-nextest-python-api>
- 33.90 s
gammaloop-nextest-python-api> stderr ---
- 33.90 s
gammaloop-nextest-python-api> Error: Python API test subprocess failed.
- 33.90 s
gammaloop-nextest-python-api> stdout:
- 33.90 s
gammaloop-nextest-python-api> ┌────────────────────────────────────────────────────────┐
- 33.90 s
gammaloop-nextest-python-api> │ You are running a restricted Symbolica instance. │
- 33.90 s
gammaloop-nextest-python-api> │ │
- 33.90 s
gammaloop-nextest-python-api> │ This mode is only permitted for non-commercial use and │
- 33.90 s
gammaloop-nextest-python-api> │ is limited to one instance and core per machine. │
- 33.90 s
gammaloop-nextest-python-api> │ │
- 33.90 s
gammaloop-nextest-python-api> │ Hobbyists can easily acquire a free license key │
- 33.90 s
gammaloop-nextest-python-api> │ that unlocks all cores and removes this banner: │
- 33.90 s
gammaloop-nextest-python-api> │ │
- 33.90 s
gammaloop-nextest-python-api> │ from symbolica import * │
- 33.90 s
gammaloop-nextest-python-api> │ request_hobbyist_license('YOUR_NAME', 'YOUR_EMAIL') │
- 33.90 s
gammaloop-nextest-python-api> │ │
- 33.90 s
gammaloop-nextest-python-api> │ All other users can obtain a free 30-day trial key: │
- 33.90 s
gammaloop-nextest-python-api> │ │
- 33.90 s
gammaloop-nextest-python-api> │ from symbolica import * │
- 33.90 s
gammaloop-nextest-python-api> │ request_trial_license('NAME', 'EMAIL', 'EMPLOYER') │
- 33.90 s
gammaloop-nextest-python-api> │ │
- 33.90 s
gammaloop-nextest-python-api> │ See https://symbolica.io/docs/get_started.html#license │
- 33.90 s
gammaloop-nextest-python-api> └────────────────────────────────────────────────────────┘
- 33.90 s
gammaloop-nextest-python-api> ┌───────────────────────────────────────────────────────────────────────────────────────────────────────────┐
- 33.90 s
gammaloop-nextest-python-api> │ Cannot start new unlicensed Symbolica instance since there is already another one running on the machine. │
- 33.90 s
gammaloop-nextest-python-api> └───────────────────────────────────────────────────────────────────────────────────────────────────────────┘
- 33.90 s
gammaloop-nextest-python-api>
- 33.90 s
gammaloop-nextest-python-api> stderr:
- 33.90 s
gammaloop-nextest-python-api>
- 33.90 s
gammaloop-nextest-python-api> ┌───────────────────────────────────────────────────────────┐
- 33.90 s
gammaloop-nextest-python-api> │ Could not resolve the IP of the Symbolica license server. │
- 33.90 s
gammaloop-nextest-python-api> │ │
- 33.90 s
gammaloop-nextest-python-api> │ Please check your DNS configuration. │
- 33.90 s
gammaloop-nextest-python-api> └───────────────────────────────────────────────────────────┘
- 33.90 s
gammaloop-nextest-python-api> Error: failed to lookup address information: Temporary failure in name resolution
- 33.90 s
gammaloop-nextest-python-api>
- 33.90 s
gammaloop-nextest-python-api>
- 33.90 s
gammaloop-nextest-python-api> Location:
- 33.90 s
gammaloop-nextest-python-api> tests/tests/test_python_api.rs:156:20
- 33.90 s
gammaloop-nextest-python-api>
- 33.90 s
gammaloop-nextest-python-api> FAIL [ 0.118s] (4/5) gammaloop-integration-tests::test_python_api python_session_getters_return_live_toml_and_command_blocks
- 33.90 s
gammaloop-nextest-python-api> stdout ---
- 33.90 s
gammaloop-nextest-python-api>
- 33.90 s
gammaloop-nextest-python-api> running 1 test
- 33.90 s
gammaloop-nextest-python-api> test python_session_getters_return_live_toml_and_command_blocks ... FAILED
- 33.90 s
gammaloop-nextest-python-api>
- 33.90 s
gammaloop-nextest-python-api> failures:
- 33.90 s
gammaloop-nextest-python-api>
- 33.90 s
gammaloop-nextest-python-api> failures:
- 33.90 s
gammaloop-nextest-python-api> python_session_getters_return_live_toml_and_command_blocks
- 33.90 s
gammaloop-nextest-python-api>
- 33.90 s
gammaloop-nextest-python-api> test result: FAILED. 0 passed; 1 failed; 0 ignored; 0 measured; 4 filtered out; finished in 0.11s
- 33.90 s
gammaloop-nextest-python-api>
- 33.90 s
gammaloop-nextest-python-api> stderr ---
- 33.90 s
gammaloop-nextest-python-api> Error: Python API test subprocess failed.
- 33.90 s
gammaloop-nextest-python-api> stdout:
- 33.90 s
gammaloop-nextest-python-api> ┌────────────────────────────────────────────────────────┐
- 33.90 s
gammaloop-nextest-python-api> │ You are running a restricted Symbolica instance. │
- 33.90 s
gammaloop-nextest-python-api> │ │
- 33.90 s
gammaloop-nextest-python-api> │ This mode is only permitted for non-commercial use and │
- 33.90 s
gammaloop-nextest-python-api> │ is limited to one instance and core per machine. │
- 33.90 s
gammaloop-nextest-python-api> │ │
- 33.90 s
gammaloop-nextest-python-api> │ Hobbyists can easily acquire a free license key │
- 33.90 s
gammaloop-nextest-python-api> │ that unlocks all cores and removes this banner: │
- 33.90 s
gammaloop-nextest-python-api> │ │
- 33.90 s
gammaloop-nextest-python-api> │ from symbolica import * │
- 33.90 s
gammaloop-nextest-python-api> │ request_hobbyist_license('YOUR_NAME', 'YOUR_EMAIL') │
- 33.90 s
gammaloop-nextest-python-api> │ │
- 33.90 s
gammaloop-nextest-python-api> │ All other users can obtain a free 30-day trial key: │
- 33.90 s
gammaloop-nextest-python-api> │ │
- 33.90 s
gammaloop-nextest-python-api> │ from symbolica import * │
- 33.90 s
gammaloop-nextest-python-api> │ request_trial_license('NAME', 'EMAIL', 'EMPLOYER') │
- 33.90 s
gammaloop-nextest-python-api> │ │
- 33.90 s
gammaloop-nextest-python-api> │ See https://symbolica.io/docs/get_started.html#license │
- 33.90 s
gammaloop-nextest-python-api> └────────────────────────────────────────────────────────┘
- 33.90 s
gammaloop-nextest-python-api> ┌───────────────────────────────────────────────────────────────────────────────────────────────────────────┐
- 33.90 s
gammaloop-nextest-python-api> │ Cannot start new unlicensed Symbolica instance since there is already another one running on the machine. │
- 33.90 s
gammaloop-nextest-python-api> └───────────────────────────────────────────────────────────────────────────────────────────────────────────┘
- 33.90 s
gammaloop-nextest-python-api>
- 33.90 s
gammaloop-nextest-python-api> stderr:
- 33.90 s
gammaloop-nextest-python-api>
- 33.90 s
gammaloop-nextest-python-api> ┌───────────────────────────────────────────────────────────┐
- 33.90 s
gammaloop-nextest-python-api> │ Could not resolve the IP of the Symbolica license server. │
- 33.90 s
gammaloop-nextest-python-api> │ │
- 33.90 s
gammaloop-nextest-python-api> │ Please check your DNS configuration. │
- 33.90 s
gammaloop-nextest-python-api> └───────────────────────────────────────────────────────────┘
- 33.90 s
gammaloop-nextest-python-api> Error: failed to lookup address information: Temporary failure in name resolution
- 33.90 s
gammaloop-nextest-python-api>
- 33.90 s
gammaloop-nextest-python-api>
- 33.90 s
gammaloop-nextest-python-api> Location:
- 33.90 s
gammaloop-nextest-python-api> tests/tests/test_python_api.rs:156:20
- 33.90 s
gammaloop-nextest-python-api>
- 34.07 s
gammaloop-nextest-python-api> ------------
- 34.07 s
gammaloop-nextest-python-api> Summary [ 0.286s] 5 tests run: 1 passed, 4 failed, 0 skipped
- 34.07 s
gammaloop-nextest-python-api> FAIL [ 0.113s] (1/5) gammaloop-integration-tests::test_python_api python_evaluate_sample_honors_generate_events_and_observable_snapshots
- 34.07 s
gammaloop-nextest-python-api> stdout ---
- 34.07 s
gammaloop-nextest-python-api>
- 34.07 s
gammaloop-nextest-python-api> running 1 test
- 34.07 s
gammaloop-nextest-python-api> test python_evaluate_sample_honors_generate_events_and_observable_snapshots ... FAILED
- 34.07 s
gammaloop-nextest-python-api>
- 34.07 s
gammaloop-nextest-python-api> failures:
- 34.07 s
gammaloop-nextest-python-api>
- 34.07 s
gammaloop-nextest-python-api> failures:
- 34.07 s
gammaloop-nextest-python-api> python_evaluate_sample_honors_generate_events_and_observable_snapshots
- 34.07 s
gammaloop-nextest-python-api>
- 34.07 s
gammaloop-nextest-python-api> test result: FAILED. 0 passed; 1 failed; 0 ignored; 0 measured; 4 filtered out; finished in 0.11s
- 34.07 s
gammaloop-nextest-python-api>
- 34.07 s
gammaloop-nextest-python-api> stderr ---
- 34.07 s
gammaloop-nextest-python-api> Error: Python API test subprocess failed.
- 34.07 s
gammaloop-nextest-python-api> stdout:
- 34.07 s
gammaloop-nextest-python-api> ┌────────────────────────────────────────────────────────┐
- 34.07 s
gammaloop-nextest-python-api> │ You are running a restricted Symbolica instance. │
- 34.07 s
gammaloop-nextest-python-api> │ │
- 34.07 s
gammaloop-nextest-python-api> │ This mode is only permitted for non-commercial use and │
- 34.07 s
gammaloop-nextest-python-api> │ is limited to one instance and core per machine. │
- 34.07 s
gammaloop-nextest-python-api> │ │
- 34.07 s
gammaloop-nextest-python-api> │ Hobbyists can easily acquire a free license key │
- 34.07 s
gammaloop-nextest-python-api> │ that unlocks all cores and removes this banner: │
- 34.07 s
gammaloop-nextest-python-api> │ │
- 34.07 s
gammaloop-nextest-python-api> │ from symbolica import * │
- 34.07 s
gammaloop-nextest-python-api> │ request_hobbyist_license('YOUR_NAME', 'YOUR_EMAIL') │
- 34.07 s
gammaloop-nextest-python-api> │ │
- 34.07 s
gammaloop-nextest-python-api> │ All other users can obtain a free 30-day trial key: │
- 34.07 s
gammaloop-nextest-python-api> │ │
- 34.07 s
gammaloop-nextest-python-api> │ from symbolica import * │
- 34.07 s
gammaloop-nextest-python-api> │ request_trial_license('NAME', 'EMAIL', 'EMPLOYER') │
- 34.07 s
gammaloop-nextest-python-api> │ │
- 34.07 s
gammaloop-nextest-python-api> │ See https://symbolica.io/docs/get_started.html#license │
- 34.07 s
gammaloop-nextest-python-api> └────────────────────────────────────────────────────────┘
- 34.07 s
gammaloop-nextest-python-api> ┌───────────────────────────────────────────────────────────────────────────────────────────────────────────┐
- 34.07 s
gammaloop-nextest-python-api> │ Cannot start new unlicensed Symbolica instance since there is already another one running on the machine. │
- 34.07 s
gammaloop-nextest-python-api> └───────────────────────────────────────────────────────────────────────────────────────────────────────────┘
- 34.07 s
gammaloop-nextest-python-api>
- 34.07 s
gammaloop-nextest-python-api> stderr:
- 34.07 s
gammaloop-nextest-python-api>
- 34.07 s
gammaloop-nextest-python-api> ┌───────────────────────────────────────────────────────────┐
- 34.07 s
gammaloop-nextest-python-api> │ Could not resolve the IP of the Symbolica license server. │
- 34.07 s
gammaloop-nextest-python-api> │ │
- 34.07 s
gammaloop-nextest-python-api> │ Please check your DNS configuration. │
- 34.07 s
gammaloop-nextest-python-api> └───────────────────────────────────────────────────────────┘
- 34.07 s
gammaloop-nextest-python-api> Error: failed to lookup address information: Temporary failure in name resolution
- 34.07 s
gammaloop-nextest-python-api>
- 34.07 s
gammaloop-nextest-python-api>
- 34.07 s
gammaloop-nextest-python-api> Location:
- 34.07 s
gammaloop-nextest-python-api> tests/tests/test_python_api.rs:156:20
- 34.07 s
gammaloop-nextest-python-api>
- 34.07 s
gammaloop-nextest-python-api> FAIL [ 0.114s] (2/5) gammaloop-integration-tests::test_python_api python_evaluate_samples_batch_and_momentum_space_have_expected_shape
- 34.07 s
gammaloop-nextest-python-api> stdout ---
- 34.07 s
gammaloop-nextest-python-api>
- 34.07 s
gammaloop-nextest-python-api> running 1 test
- 34.07 s
gammaloop-nextest-python-api> test python_evaluate_samples_batch_and_momentum_space_have_expected_shape ... FAILED
- 34.07 s
gammaloop-nextest-python-api>
- 34.07 s
gammaloop-nextest-python-api> failures:
- 34.07 s
gammaloop-nextest-python-api>
- 34.07 s
gammaloop-nextest-python-api> failures:
- 34.07 s
gammaloop-nextest-python-api> python_evaluate_samples_batch_and_momentum_space_have_expected_shape
- 34.07 s
gammaloop-nextest-python-api>
- 34.07 s
gammaloop-nextest-python-api> test result: FAILED. 0 passed; 1 failed; 0 ignored; 0 measured; 4 filtered out; finished in 0.11s
- 34.07 s
gammaloop-nextest-python-api>
- 34.07 s
gammaloop-nextest-python-api> stderr ---
- 34.07 s
gammaloop-nextest-python-api> Error: Python API test subprocess failed.
- 34.07 s
gammaloop-nextest-python-api> stdout:
- 34.07 s
gammaloop-nextest-python-api> ┌────────────────────────────────────────────────────────┐
- 34.07 s
gammaloop-nextest-python-api> │ You are running a restricted Symbolica instance. │
- 34.07 s
gammaloop-nextest-python-api> │ │
- 34.07 s
gammaloop-nextest-python-api> │ This mode is only permitted for non-commercial use and │
- 34.07 s
gammaloop-nextest-python-api> │ is limited to one instance and core per machine. │
- 34.07 s
gammaloop-nextest-python-api> │ │
- 34.07 s
gammaloop-nextest-python-api> │ Hobbyists can easily acquire a free license key │
- 34.07 s
gammaloop-nextest-python-api> │ that unlocks all cores and removes this banner: │
- 34.07 s
gammaloop-nextest-python-api> │ │
- 34.07 s
gammaloop-nextest-python-api> │ from symbolica import * │
- 34.07 s
gammaloop-nextest-python-api> │ request_hobbyist_license('YOUR_NAME', 'YOUR_EMAIL') │
- 34.07 s
gammaloop-nextest-python-api> │ │
- 34.07 s
gammaloop-nextest-python-api> │ All other users can obtain a free 30-day trial key: │
- 34.07 s
gammaloop-nextest-python-api> │ │
- 34.07 s
gammaloop-nextest-python-api> │ from symbolica import * │
- 34.07 s
gammaloop-nextest-python-api> │ request_trial_license('NAME', 'EMAIL', 'EMPLOYER') │
- 34.07 s
gammaloop-nextest-python-api> │ │
- 34.07 s
gammaloop-nextest-python-api> │ See https://symbolica.io/docs/get_started.html#license │
- 34.07 s
gammaloop-nextest-python-api> └────────────────────────────────────────────────────────┘
- 34.07 s
gammaloop-nextest-python-api> ┌───────────────────────────────────────────────────────────────────────────────────────────────────────────┐
- 34.07 s
gammaloop-nextest-python-api> │ Cannot start new unlicensed Symbolica instance since there is already another one running on the machine. │
- 34.07 s
gammaloop-nextest-python-api> └───────────────────────────────────────────────────────────────────────────────────────────────────────────┘
- 34.07 s
gammaloop-nextest-python-api>
- 34.07 s
gammaloop-nextest-python-api> stderr:
- 34.07 s
gammaloop-nextest-python-api>
- 34.07 s
gammaloop-nextest-python-api> ┌───────────────────────────────────────────────────────────┐
- 34.07 s
gammaloop-nextest-python-api> │ Could not resolve the IP of the Symbolica license server. │
- 34.07 s
gammaloop-nextest-python-api> │ │
- 34.07 s
gammaloop-nextest-python-api> │ Please check your DNS configuration. │
- 34.07 s
gammaloop-nextest-python-api> └───────────────────────────────────────────────────────────┘
- 34.07 s
gammaloop-nextest-python-api> Error: failed to lookup address information: Temporary failure in name resolution
- 34.07 s
gammaloop-nextest-python-api>
- 34.07 s
gammaloop-nextest-python-api>
- 34.07 s
gammaloop-nextest-python-api> Location:
- 34.07 s
gammaloop-nextest-python-api> tests/tests/test_python_api.rs:156:20
- 34.07 s
gammaloop-nextest-python-api>
- 34.07 s
gammaloop-nextest-python-api> FAIL [ 0.118s] (3/5) gammaloop-integration-tests::test_python_api python_evaluate_sample_preserves_graph_grouping_and_incoming_pdgs
- 34.07 s
gammaloop-nextest-python-api> stdout ---
- 34.07 s
gammaloop-nextest-python-api>
- 34.07 s
gammaloop-nextest-python-api> running 1 test
- 34.07 s
gammaloop-nextest-python-api> test python_evaluate_sample_preserves_graph_grouping_and_incoming_pdgs ... FAILED
- 34.07 s
gammaloop-nextest-python-api>
- 34.07 s
gammaloop-nextest-python-api> failures:
- 34.07 s
gammaloop-nextest-python-api>
- 34.07 s
gammaloop-nextest-python-api> failures:
- 34.07 s
gammaloop-nextest-python-api> python_evaluate_sample_preserves_graph_grouping_and_incoming_pdgs
- 34.07 s
gammaloop-nextest-python-api>
- 34.07 s
gammaloop-nextest-python-api> test result: FAILED. 0 passed; 1 failed; 0 ignored; 0 measured; 4 filtered out; finished in 0.11s
- 34.07 s
gammaloop-nextest-python-api>
- 34.07 s
gammaloop-nextest-python-api> stderr ---
- 34.07 s
gammaloop-nextest-python-api> Error: Python API test subprocess failed.
- 34.07 s
gammaloop-nextest-python-api> stdout:
- 34.07 s
gammaloop-nextest-python-api> ┌────────────────────────────────────────────────────────┐
- 34.07 s
gammaloop-nextest-python-api> │ You are running a restricted Symbolica instance. │
- 34.07 s
gammaloop-nextest-python-api> │ │
- 34.07 s
gammaloop-nextest-python-api> │ This mode is only permitted for non-commercial use and │
- 34.07 s
gammaloop-nextest-python-api> │ is limited to one instance and core per machine. │
- 34.07 s
gammaloop-nextest-python-api> │ │
- 34.07 s
gammaloop-nextest-python-api> │ Hobbyists can easily acquire a free license key │
- 34.07 s
gammaloop-nextest-python-api> │ that unlocks all cores and removes this banner: │
- 34.07 s
gammaloop-nextest-python-api> │ │
- 34.07 s
gammaloop-nextest-python-api> │ from symbolica import * │
- 34.07 s
gammaloop-nextest-python-api> │ request_hobbyist_license('YOUR_NAME', 'YOUR_EMAIL') │
- 34.07 s
gammaloop-nextest-python-api> │ │
- 34.07 s
gammaloop-nextest-python-api> │ All other users can obtain a free 30-day trial key: │
- 34.07 s
gammaloop-nextest-python-api> │ │
- 34.07 s
gammaloop-nextest-python-api> │ from symbolica import * │
- 34.07 s
gammaloop-nextest-python-api> │ request_trial_license('NAME', 'EMAIL', 'EMPLOYER') │
- 34.07 s
gammaloop-nextest-python-api> │ │
- 34.07 s
gammaloop-nextest-python-api> │ See https://symbolica.io/docs/get_started.html#license │
- 34.07 s
gammaloop-nextest-python-api> └────────────────────────────────────────────────────────┘
- 34.07 s
gammaloop-nextest-python-api> ┌───────────────────────────────────────────────────────────────────────────────────────────────────────────┐
- 34.07 s
gammaloop-nextest-python-api> │ Cannot start new unlicensed Symbolica instance since there is already another one running on the machine. │
- 34.07 s
gammaloop-nextest-python-api> └───────────────────────────────────────────────────────────────────────────────────────────────────────────┘
- 34.07 s
gammaloop-nextest-python-api>
- 34.07 s
gammaloop-nextest-python-api> stderr:
- 34.07 s
gammaloop-nextest-python-api>
- 34.07 s
gammaloop-nextest-python-api> ┌───────────────────────────────────────────────────────────┐
- 34.07 s
gammaloop-nextest-python-api> │ Could not resolve the IP of the Symbolica license server. │
- 34.07 s
gammaloop-nextest-python-api> │ │
- 34.07 s
gammaloop-nextest-python-api> │ Please check your DNS configuration. │
- 34.07 s
gammaloop-nextest-python-api> └───────────────────────────────────────────────────────────┘
- 34.07 s
gammaloop-nextest-python-api> Error: failed to lookup address information: Temporary failure in name resolution
- 34.07 s
gammaloop-nextest-python-api>
- 34.07 s
gammaloop-nextest-python-api>
- 34.07 s
gammaloop-nextest-python-api> Location:
- 34.07 s
gammaloop-nextest-python-api> tests/tests/test_python_api.rs:156:20
- 34.07 s
gammaloop-nextest-python-api>
- 34.07 s
gammaloop-nextest-python-api> FAIL [ 0.118s] (4/5) gammaloop-integration-tests::test_python_api python_session_getters_return_live_toml_and_command_blocks
- 34.07 s
gammaloop-nextest-python-api> stdout ---
- 34.07 s
gammaloop-nextest-python-api>
- 34.07 s
gammaloop-nextest-python-api> running 1 test
- 34.07 s
gammaloop-nextest-python-api> test python_session_getters_return_live_toml_and_command_blocks ... FAILED
- 34.07 s
gammaloop-nextest-python-api>
- 34.07 s
gammaloop-nextest-python-api> failures:
- 34.07 s
gammaloop-nextest-python-api>
- 34.07 s
gammaloop-nextest-python-api> failures:
- 34.07 s
gammaloop-nextest-python-api> python_session_getters_return_live_toml_and_command_blocks
- 34.07 s
gammaloop-nextest-python-api>
- 34.07 s
gammaloop-nextest-python-api> test result: FAILED. 0 passed; 1 failed; 0 ignored; 0 measured; 4 filtered out; finished in 0.11s
- 34.07 s
gammaloop-nextest-python-api>
- 34.07 s
gammaloop-nextest-python-api> stderr ---
- 34.07 s
gammaloop-nextest-python-api> Error: Python API test subprocess failed.
- 34.07 s
gammaloop-nextest-python-api> stdout:
- 34.07 s
gammaloop-nextest-python-api> ┌────────────────────────────────────────────────────────┐
- 34.07 s
gammaloop-nextest-python-api> │ You are running a restricted Symbolica instance. │
- 34.07 s
gammaloop-nextest-python-api> │ │
- 34.07 s
gammaloop-nextest-python-api> │ This mode is only permitted for non-commercial use and │
- 34.07 s
gammaloop-nextest-python-api> │ is limited to one instance and core per machine. │
- 34.07 s
gammaloop-nextest-python-api> │ │
- 34.07 s
gammaloop-nextest-python-api> │ Hobbyists can easily acquire a free license key │
- 34.07 s
gammaloop-nextest-python-api> │ that unlocks all cores and removes this banner: │
- 34.07 s
gammaloop-nextest-python-api> │ │
- 34.07 s
gammaloop-nextest-python-api> │ from symbolica import * │
- 34.07 s
gammaloop-nextest-python-api> │ request_hobbyist_license('YOUR_NAME', 'YOUR_EMAIL') │
- 34.07 s
gammaloop-nextest-python-api> │ │
- 34.07 s
gammaloop-nextest-python-api> │ All other users can obtain a free 30-day trial key: │
- 34.07 s
gammaloop-nextest-python-api> │ │
- 34.07 s
gammaloop-nextest-python-api> │ from symbolica import * │
- 34.07 s
gammaloop-nextest-python-api> │ request_trial_license('NAME', 'EMAIL', 'EMPLOYER') │
- 34.07 s
gammaloop-nextest-python-api> │ │
- 34.07 s
gammaloop-nextest-python-api> │ See https://symbolica.io/docs/get_started.html#license │
- 34.07 s
gammaloop-nextest-python-api> └────────────────────────────────────────────────────────┘
- 34.07 s
gammaloop-nextest-python-api> ┌───────────────────────────────────────────────────────────────────────────────────────────────────────────┐
- 34.07 s
gammaloop-nextest-python-api> │ Cannot start new unlicensed Symbolica instance since there is already another one running on the machine. │
- 34.07 s
gammaloop-nextest-python-api> └───────────────────────────────────────────────────────────────────────────────────────────────────────────┘
- 34.07 s
gammaloop-nextest-python-api>
- 34.07 s
gammaloop-nextest-python-api> stderr:
- 34.07 s
gammaloop-nextest-python-api>
- 34.07 s
gammaloop-nextest-python-api> ┌───────────────────────────────────────────────────────────┐
- 34.07 s
gammaloop-nextest-python-api> │ Could not resolve the IP of the Symbolica license server. │
- 34.07 s
gammaloop-nextest-python-api> │ │
- 34.07 s
gammaloop-nextest-python-api> │ Please check your DNS configuration. │
- 34.07 s
gammaloop-nextest-python-api> └───────────────────────────────────────────────────────────┘
- 34.07 s
gammaloop-nextest-python-api> Error: failed to lookup address information: Temporary failure in name resolution
- 34.07 s
gammaloop-nextest-python-api>
- 34.07 s
gammaloop-nextest-python-api>
- 34.07 s
gammaloop-nextest-python-api> Location:
- 34.07 s
gammaloop-nextest-python-api> tests/tests/test_python_api.rs:156:20
- 34.07 s
gammaloop-nextest-python-api>
- 34.08 s
gammaloop-nextest-python-api> error: test run failed
- 34.10 s
gammaloop-nextest-python-api>
- 34.10 s
gammaloop-nextest-python-api> ========== nextest test summary ==========
- 34.10 s
gammaloop-nextest-python-api> report: target/nextest/ci_gammaloop/junit.xml
- 34.10 s
gammaloop-nextest-python-api> tests: 5, failures: 4, errors: 0
- 34.10 s
gammaloop-nextest-python-api>
- 34.10 s
gammaloop-nextest-python-api> 1. gammaloop-integration-tests::test_python_api::python_evaluate_sample_honors_generate_events_and_observable_snapshots
- 34.10 s
gammaloop-nextest-python-api> failure: test failure with exit code 101
- 34.10 s
gammaloop-nextest-python-api> Error: Python API test subprocess failed.
- 34.10 s
gammaloop-nextest-python-api> stdout:
- 34.10 s
gammaloop-nextest-python-api> ┌────────────────────────────────────────────────────────┐
- 34.10 s
gammaloop-nextest-python-api> │ You are running a restricted Symbolica instance. │
- 34.10 s
gammaloop-nextest-python-api> │ │
- 34.10 s
gammaloop-nextest-python-api> │ This mode is only permitted for non-commercial use and │
- 34.10 s
gammaloop-nextest-python-api> │ is limited to one instance and core per machine. │
- 34.10 s
gammaloop-nextest-python-api> │ │
- 34.10 s
gammaloop-nextest-python-api> │ Hobbyists can easily acquire a free license key │
- 34.10 s
gammaloop-nextest-python-api> │ that unlocks all cores and removes this banner: │
- 34.10 s
gammaloop-nextest-python-api> │ │
- 34.10 s
gammaloop-nextest-python-api> │ from symbolica import * │
- 34.10 s
gammaloop-nextest-python-api> │ request_hobbyist_license('YOUR_NAME', 'YOUR_EMAIL') │
- 34.10 s
gammaloop-nextest-python-api> │ │
- 34.10 s
gammaloop-nextest-python-api> │ All other users can obtain a free 30-day trial key: │
- 34.10 s
gammaloop-nextest-python-api> │ │
- 34.10 s
gammaloop-nextest-python-api> │ from symbolica import * │
- 34.10 s
gammaloop-nextest-python-api> │ request_trial_license('NAME', 'EMAIL', 'EMPLOYER') │
- 34.10 s
gammaloop-nextest-python-api> │ │
- 34.10 s
gammaloop-nextest-python-api> │ See https://symbolica.io/docs/get_started.html#license │
- 34.10 s
gammaloop-nextest-python-api> └────────────────────────────────────────────────────────┘
- 34.10 s
gammaloop-nextest-python-api> ┌───────────────────────────────────────────────────────────────────────────────────────────────────────────┐
- 34.10 s
gammaloop-nextest-python-api> │ Cannot start new unlicensed Symbolica instance since there is already another one running on the machine. │
- 34.10 s
gammaloop-nextest-python-api> └───────────────────────────────────────────────────────────────────────────────────────────────────────────┘
- 34.10 s
gammaloop-nextest-python-api>
- 34.10 s
gammaloop-nextest-python-api> stderr:
- 34.10 s
gammaloop-nextest-python-api>
- 34.10 s
gammaloop-nextest-python-api> ┌───────────────────────────────────────────────────────────┐
- 34.10 s
gammaloop-nextest-python-api> │ Could not resolve the IP of the Symbolica license server. │
- 34.10 s
gammaloop-nextest-python-api> │ │
- 34.10 s
gammaloop-nextest-python-api> │ Please check your DNS configuration. │
- 34.10 s
gammaloop-nextest-python-api> └───────────────────────────────────────────────────────────┘
- 34.10 s
gammaloop-nextest-python-api> Error: failed to lookup address information: Temporary failure in name resolution
- 34.10 s
gammaloop-nextest-python-api>
- 34.10 s
gammaloop-nextest-python-api>
- 34.10 s
gammaloop-nextest-python-api> Location:
- 34.10 s
gammaloop-nextest-python-api> tests/tests/test_python_api.rs:156:20
- 34.10 s
gammaloop-nextest-python-api> system-out
- 34.10 s
gammaloop-nextest-python-api> running 1 test
- 34.10 s
gammaloop-nextest-python-api> test python_evaluate_sample_honors_generate_events_and_observable_snapshots ... FAILED
- 34.10 s
gammaloop-nextest-python-api>
- 34.10 s
gammaloop-nextest-python-api> failures:
- 34.10 s
gammaloop-nextest-python-api>
- 34.10 s
gammaloop-nextest-python-api> failures:
- 34.10 s
gammaloop-nextest-python-api> python_evaluate_sample_honors_generate_events_and_observable_snapshots
- 34.10 s
gammaloop-nextest-python-api>
- 34.10 s
gammaloop-nextest-python-api> test result: FAILED. 0 passed; 1 failed; 0 ignored; 0 measured; 4 filtered out; finished in 0.11s
- 34.10 s
gammaloop-nextest-python-api> system-err
- 34.10 s
gammaloop-nextest-python-api> Error: Python API test subprocess failed.
- 34.10 s
gammaloop-nextest-python-api> stdout:
- 34.10 s
gammaloop-nextest-python-api> ┌────────────────────────────────────────────────────────┐
- 34.10 s
gammaloop-nextest-python-api> │ You are running a restricted Symbolica instance. │
- 34.10 s
gammaloop-nextest-python-api> │ │
- 34.10 s
gammaloop-nextest-python-api> │ This mode is only permitted for non-commercial use and │
- 34.10 s
gammaloop-nextest-python-api> │ is limited to one instance and core per machine. │
- 34.10 s
gammaloop-nextest-python-api> │ │
- 34.10 s
gammaloop-nextest-python-api> │ Hobbyists can easily acquire a free license key │
- 34.10 s
gammaloop-nextest-python-api> │ that unlocks all cores and removes this banner: │
- 34.10 s
gammaloop-nextest-python-api> │ │
- 34.10 s
gammaloop-nextest-python-api> │ from symbolica import * │
- 34.10 s
gammaloop-nextest-python-api> │ request_hobbyist_license('YOUR_NAME', 'YOUR_EMAIL') │
- 34.10 s
gammaloop-nextest-python-api> │ │
- 34.10 s
gammaloop-nextest-python-api> │ All other users can obtain a free 30-day trial key: │
- 34.10 s
gammaloop-nextest-python-api> │ │
- 34.10 s
gammaloop-nextest-python-api> │ from symbolica import * │
- 34.10 s
gammaloop-nextest-python-api> │ request_trial_license('NAME', 'EMAIL', 'EMPLOYER') │
- 34.10 s
gammaloop-nextest-python-api> │ │
- 34.10 s
gammaloop-nextest-python-api> │ See https://symbolica.io/docs/get_started.html#license │
- 34.10 s
gammaloop-nextest-python-api> └────────────────────────────────────────────────────────┘
- 34.10 s
gammaloop-nextest-python-api> ┌───────────────────────────────────────────────────────────────────────────────────────────────────────────┐
- 34.10 s
gammaloop-nextest-python-api> │ Cannot start new unlicensed Symbolica instance since there is already another one running on the machine. │
- 34.10 s
gammaloop-nextest-python-api> └───────────────────────────────────────────────────────────────────────────────────────────────────────────┘
- 34.10 s
gammaloop-nextest-python-api>
- 34.10 s
gammaloop-nextest-python-api> stderr:
- 34.10 s
gammaloop-nextest-python-api>
- 34.10 s
gammaloop-nextest-python-api> ┌───────────────────────────────────────────────────────────┐
- 34.10 s
gammaloop-nextest-python-api> │ Could not resolve the IP of the Symbolica license server. │
- 34.10 s
gammaloop-nextest-python-api> │ │
- 34.10 s
gammaloop-nextest-python-api> │ Please check your DNS configuration. │
- 34.10 s
gammaloop-nextest-python-api> └───────────────────────────────────────────────────────────┘
- 34.10 s
gammaloop-nextest-python-api> Error: failed to lookup address information: Temporary failure in name resolution
- 34.10 s
gammaloop-nextest-python-api>
- 34.10 s
gammaloop-nextest-python-api>
- 34.10 s
gammaloop-nextest-python-api> Location:
- 34.10 s
gammaloop-nextest-python-api> tests/tests/test_python_api.rs:156:20
- 34.10 s
gammaloop-nextest-python-api>
- 34.10 s
gammaloop-nextest-python-api> 2. gammaloop-integration-tests::test_python_api::python_evaluate_samples_batch_and_momentum_space_have_expected_shape
- 34.10 s
gammaloop-nextest-python-api> failure: test failure with exit code 101
- 34.10 s
gammaloop-nextest-python-api> Error: Python API test subprocess failed.
- 34.10 s
gammaloop-nextest-python-api> stdout:
- 34.10 s
gammaloop-nextest-python-api> ┌────────────────────────────────────────────────────────┐
- 34.10 s
gammaloop-nextest-python-api> │ You are running a restricted Symbolica instance. │
- 34.10 s
gammaloop-nextest-python-api> │ │
- 34.10 s
gammaloop-nextest-python-api> │ This mode is only permitted for non-commercial use and │
- 34.10 s
gammaloop-nextest-python-api> │ is limited to one instance and core per machine. │
- 34.10 s
gammaloop-nextest-python-api> │ │
- 34.10 s
gammaloop-nextest-python-api> │ Hobbyists can easily acquire a free license key │
- 34.10 s
gammaloop-nextest-python-api> │ that unlocks all cores and removes this banner: │
- 34.10 s
gammaloop-nextest-python-api> │ │
- 34.10 s
gammaloop-nextest-python-api> │ from symbolica import * │
- 34.10 s
gammaloop-nextest-python-api> │ request_hobbyist_license('YOUR_NAME', 'YOUR_EMAIL') │
- 34.10 s
gammaloop-nextest-python-api> │ │
- 34.10 s
gammaloop-nextest-python-api> │ All other users can obtain a free 30-day trial key: │
- 34.10 s
gammaloop-nextest-python-api> │ │
- 34.10 s
gammaloop-nextest-python-api> │ from symbolica import * │
- 34.10 s
gammaloop-nextest-python-api> │ request_trial_license('NAME', 'EMAIL', 'EMPLOYER') │
- 34.10 s
gammaloop-nextest-python-api> │ │
- 34.10 s
gammaloop-nextest-python-api> │ See https://symbolica.io/docs/get_started.html#license │
- 34.10 s
gammaloop-nextest-python-api> └────────────────────────────────────────────────────────┘
- 34.10 s
gammaloop-nextest-python-api> ┌───────────────────────────────────────────────────────────────────────────────────────────────────────────┐
- 34.10 s
gammaloop-nextest-python-api> │ Cannot start new unlicensed Symbolica instance since there is already another one running on the machine. │
- 34.10 s
gammaloop-nextest-python-api> └───────────────────────────────────────────────────────────────────────────────────────────────────────────┘
- 34.10 s
gammaloop-nextest-python-api>
- 34.10 s
gammaloop-nextest-python-api> stderr:
- 34.10 s
gammaloop-nextest-python-api>
- 34.10 s
gammaloop-nextest-python-api> ┌───────────────────────────────────────────────────────────┐
- 34.10 s
gammaloop-nextest-python-api> │ Could not resolve the IP of the Symbolica license server. │
- 34.10 s
gammaloop-nextest-python-api> │ │
- 34.10 s
gammaloop-nextest-python-api> │ Please check your DNS configuration. │
- 34.10 s
gammaloop-nextest-python-api> └───────────────────────────────────────────────────────────┘
- 34.10 s
gammaloop-nextest-python-api> Error: failed to lookup address information: Temporary failure in name resolution
- 34.10 s
gammaloop-nextest-python-api>
- 34.10 s
gammaloop-nextest-python-api>
- 34.10 s
gammaloop-nextest-python-api> Location:
- 34.10 s
gammaloop-nextest-python-api> tests/tests/test_python_api.rs:156:20
- 34.10 s
gammaloop-nextest-python-api> system-out
- 34.10 s
gammaloop-nextest-python-api> running 1 test
- 34.10 s
gammaloop-nextest-python-api> test python_evaluate_samples_batch_and_momentum_space_have_expected_shape ... FAILED
- 34.10 s
gammaloop-nextest-python-api>
- 34.10 s
gammaloop-nextest-python-api> failures:
- 34.10 s
gammaloop-nextest-python-api>
- 34.10 s
gammaloop-nextest-python-api> failures:
- 34.10 s
gammaloop-nextest-python-api> python_evaluate_samples_batch_and_momentum_space_have_expected_shape
- 34.10 s
gammaloop-nextest-python-api>
- 34.10 s
gammaloop-nextest-python-api> test result: FAILED. 0 passed; 1 failed; 0 ignored; 0 measured; 4 filtered out; finished in 0.11s
- 34.10 s
gammaloop-nextest-python-api> system-err
- 34.10 s
gammaloop-nextest-python-api> Error: Python API test subprocess failed.
- 34.10 s
gammaloop-nextest-python-api> stdout:
- 34.10 s
gammaloop-nextest-python-api> ┌────────────────────────────────────────────────────────┐
- 34.10 s
gammaloop-nextest-python-api> │ You are running a restricted Symbolica instance. │
- 34.10 s
gammaloop-nextest-python-api> │ │
- 34.10 s
gammaloop-nextest-python-api> │ This mode is only permitted for non-commercial use and │
- 34.10 s
gammaloop-nextest-python-api> │ is limited to one instance and core per machine. │
- 34.10 s
gammaloop-nextest-python-api> │ │
- 34.10 s
gammaloop-nextest-python-api> │ Hobbyists can easily acquire a free license key │
- 34.10 s
gammaloop-nextest-python-api> │ that unlocks all cores and removes this banner: │
- 34.10 s
gammaloop-nextest-python-api> │ │
- 34.10 s
gammaloop-nextest-python-api> │ from symbolica import * │
- 34.10 s
gammaloop-nextest-python-api> │ request_hobbyist_license('YOUR_NAME', 'YOUR_EMAIL') │
- 34.10 s
gammaloop-nextest-python-api> │ │
- 34.10 s
gammaloop-nextest-python-api> │ All other users can obtain a free 30-day trial key: │
- 34.10 s
gammaloop-nextest-python-api> │ │
- 34.10 s
gammaloop-nextest-python-api> │ from symbolica import * │
- 34.10 s
gammaloop-nextest-python-api> │ request_trial_license('NAME', 'EMAIL', 'EMPLOYER') │
- 34.10 s
gammaloop-nextest-python-api> │ │
- 34.10 s
gammaloop-nextest-python-api> │ See https://symbolica.io/docs/get_started.html#license │
- 34.10 s
gammaloop-nextest-python-api> └────────────────────────────────────────────────────────┘
- 34.10 s
gammaloop-nextest-python-api> ┌───────────────────────────────────────────────────────────────────────────────────────────────────────────┐
- 34.10 s
gammaloop-nextest-python-api> │ Cannot start new unlicensed Symbolica instance since there is already another one running on the machine. │
- 34.10 s
gammaloop-nextest-python-api> └───────────────────────────────────────────────────────────────────────────────────────────────────────────┘
- 34.10 s
gammaloop-nextest-python-api>
- 34.10 s
gammaloop-nextest-python-api> stderr:
- 34.10 s
gammaloop-nextest-python-api>
- 34.10 s
gammaloop-nextest-python-api> ┌───────────────────────────────────────────────────────────┐
- 34.10 s
gammaloop-nextest-python-api> │ Could not resolve the IP of the Symbolica license server. │
- 34.10 s
gammaloop-nextest-python-api> │ │
- 34.10 s
gammaloop-nextest-python-api> │ Please check your DNS configuration. │
- 34.10 s
gammaloop-nextest-python-api> └───────────────────────────────────────────────────────────┘
- 34.10 s
gammaloop-nextest-python-api> Error: failed to lookup address information: Temporary failure in name resolution
- 34.10 s
gammaloop-nextest-python-api>
- 34.10 s
gammaloop-nextest-python-api>
- 34.10 s
gammaloop-nextest-python-api> Location:
- 34.10 s
gammaloop-nextest-python-api> tests/tests/test_python_api.rs:156:20
- 34.10 s
gammaloop-nextest-python-api>
- 34.10 s
gammaloop-nextest-python-api> 3. gammaloop-integration-tests::test_python_api::python_evaluate_sample_preserves_graph_grouping_and_incoming_pdgs
- 34.10 s
gammaloop-nextest-python-api> failure: test failure with exit code 101
- 34.10 s
gammaloop-nextest-python-api> Error: Python API test subprocess failed.
- 34.10 s
gammaloop-nextest-python-api> stdout:
- 34.10 s
gammaloop-nextest-python-api> ┌────────────────────────────────────────────────────────┐
- 34.10 s
gammaloop-nextest-python-api> │ You are running a restricted Symbolica instance. │
- 34.10 s
gammaloop-nextest-python-api> │ │
- 34.10 s
gammaloop-nextest-python-api> │ This mode is only permitted for non-commercial use and │
- 34.10 s
gammaloop-nextest-python-api> │ is limited to one instance and core per machine. │
- 34.10 s
gammaloop-nextest-python-api> │ │
- 34.10 s
gammaloop-nextest-python-api> │ Hobbyists can easily acquire a free license key │
- 34.10 s
gammaloop-nextest-python-api> │ that unlocks all cores and removes this banner: │
- 34.10 s
gammaloop-nextest-python-api> │ │
- 34.10 s
gammaloop-nextest-python-api> │ from symbolica import * │
- 34.10 s
gammaloop-nextest-python-api> │ request_hobbyist_license('YOUR_NAME', 'YOUR_EMAIL') │
- 34.10 s
gammaloop-nextest-python-api> │ │
- 34.10 s
gammaloop-nextest-python-api> │ All other users can obtain a free 30-day trial key: │
- 34.10 s
gammaloop-nextest-python-api> │ │
- 34.10 s
gammaloop-nextest-python-api> │ from symbolica import * │
- 34.10 s
gammaloop-nextest-python-api> │ request_trial_license('NAME', 'EMAIL', 'EMPLOYER') │
- 34.10 s
gammaloop-nextest-python-api> │ │
- 34.10 s
gammaloop-nextest-python-api> │ See https://symbolica.io/docs/get_started.html#license │
- 34.10 s
gammaloop-nextest-python-api> └────────────────────────────────────────────────────────┘
- 34.10 s
gammaloop-nextest-python-api> ┌───────────────────────────────────────────────────────────────────────────────────────────────────────────┐
- 34.10 s
gammaloop-nextest-python-api> │ Cannot start new unlicensed Symbolica instance since there is already another one running on the machine. │
- 34.11 s
gammaloop-nextest-python-api> └───────────────────────────────────────────────────────────────────────────────────────────────────────────┘
- 34.11 s
gammaloop-nextest-python-api>
- 34.11 s
gammaloop-nextest-python-api> stderr:
- 34.11 s
gammaloop-nextest-python-api>
- 34.11 s
gammaloop-nextest-python-api> ┌───────────────────────────────────────────────────────────┐
- 34.11 s
gammaloop-nextest-python-api> │ Could not resolve the IP of the Symbolica license server. │
- 34.11 s
gammaloop-nextest-python-api> │ │
- 34.11 s
gammaloop-nextest-python-api> │ Please check your DNS configuration. │
- 34.11 s
gammaloop-nextest-python-api> └───────────────────────────────────────────────────────────┘
- 34.11 s
gammaloop-nextest-python-api> Error: failed to lookup address information: Temporary failure in name resolution
- 34.11 s
gammaloop-nextest-python-api>
- 34.11 s
gammaloop-nextest-python-api>
- 34.11 s
gammaloop-nextest-python-api> Location:
- 34.11 s
gammaloop-nextest-python-api> tests/tests/test_python_api.rs:156:20
- 34.11 s
gammaloop-nextest-python-api> system-out
- 34.11 s
gammaloop-nextest-python-api> running 1 test
- 34.11 s
gammaloop-nextest-python-api> test python_evaluate_sample_preserves_graph_grouping_and_incoming_pdgs ... FAILED
- 34.11 s
gammaloop-nextest-python-api>
- 34.11 s
gammaloop-nextest-python-api> failures:
- 34.11 s
gammaloop-nextest-python-api>
- 34.11 s
gammaloop-nextest-python-api> failures:
- 34.11 s
gammaloop-nextest-python-api> python_evaluate_sample_preserves_graph_grouping_and_incoming_pdgs
- 34.11 s
gammaloop-nextest-python-api>
- 34.11 s
gammaloop-nextest-python-api> test result: FAILED. 0 passed; 1 failed; 0 ignored; 0 measured; 4 filtered out; finished in 0.11s
- 34.11 s
gammaloop-nextest-python-api> system-err
- 34.11 s
gammaloop-nextest-python-api> Error: Python API test subprocess failed.
- 34.11 s
gammaloop-nextest-python-api> stdout:
- 34.11 s
gammaloop-nextest-python-api> ┌────────────────────────────────────────────────────────┐
- 34.11 s
gammaloop-nextest-python-api> │ You are running a restricted Symbolica instance. │
- 34.11 s
gammaloop-nextest-python-api> │ │
- 34.11 s
gammaloop-nextest-python-api> │ This mode is only permitted for non-commercial use and │
- 34.11 s
gammaloop-nextest-python-api> │ is limited to one instance and core per machine. │
- 34.11 s
gammaloop-nextest-python-api> │ │
- 34.11 s
gammaloop-nextest-python-api> │ Hobbyists can easily acquire a free license key │
- 34.11 s
gammaloop-nextest-python-api> │ that unlocks all cores and removes this banner: │
- 34.11 s
gammaloop-nextest-python-api> │ │
- 34.11 s
gammaloop-nextest-python-api> │ from symbolica import * │
- 34.11 s
gammaloop-nextest-python-api> │ request_hobbyist_license('YOUR_NAME', 'YOUR_EMAIL') │
- 34.11 s
gammaloop-nextest-python-api> │ │
- 34.11 s
gammaloop-nextest-python-api> │ All other users can obtain a free 30-day trial key: │
- 34.11 s
gammaloop-nextest-python-api> │ │
- 34.11 s
gammaloop-nextest-python-api> │ from symbolica import * │
- 34.11 s
gammaloop-nextest-python-api> │ request_trial_license('NAME', 'EMAIL', 'EMPLOYER') │
- 34.11 s
gammaloop-nextest-python-api> │ │
- 34.11 s
gammaloop-nextest-python-api> │ See https://symbolica.io/docs/get_started.html#license │
- 34.11 s
gammaloop-nextest-python-api> └────────────────────────────────────────────────────────┘
- 34.11 s
gammaloop-nextest-python-api> ┌───────────────────────────────────────────────────────────────────────────────────────────────────────────┐
- 34.11 s
gammaloop-nextest-python-api> │ Cannot start new unlicensed Symbolica instance since there is already another one running on the machine. │
- 34.11 s
gammaloop-nextest-python-api> └───────────────────────────────────────────────────────────────────────────────────────────────────────────┘
- 34.11 s
gammaloop-nextest-python-api>
- 34.11 s
gammaloop-nextest-python-api> stderr:
- 34.11 s
gammaloop-nextest-python-api>
- 34.11 s
gammaloop-nextest-python-api> ┌───────────────────────────────────────────────────────────┐
- 34.11 s
gammaloop-nextest-python-api> │ Could not resolve the IP of the Symbolica license server. │
- 34.11 s
gammaloop-nextest-python-api> │ │
- 34.11 s
gammaloop-nextest-python-api> │ Please check your DNS configuration. │
- 34.11 s
gammaloop-nextest-python-api> └───────────────────────────────────────────────────────────┘
- 34.11 s
gammaloop-nextest-python-api> Error: failed to lookup address information: Temporary failure in name resolution
- 34.11 s
gammaloop-nextest-python-api>
- 34.11 s
gammaloop-nextest-python-api>
- 34.11 s
gammaloop-nextest-python-api> Location:
- 34.11 s
gammaloop-nextest-python-api> tests/tests/test_python_api.rs:156:20
- 34.11 s
gammaloop-nextest-python-api>
- 34.11 s
gammaloop-nextest-python-api> 4. gammaloop-integration-tests::test_python_api::python_session_getters_return_live_toml_and_command_blocks
- 34.11 s
gammaloop-nextest-python-api> failure: test failure with exit code 101
- 34.11 s
gammaloop-nextest-python-api> Error: Python API test subprocess failed.
- 34.11 s
gammaloop-nextest-python-api> stdout:
- 34.11 s
gammaloop-nextest-python-api> ┌────────────────────────────────────────────────────────┐
- 34.11 s
gammaloop-nextest-python-api> │ You are running a restricted Symbolica instance. │
- 34.11 s
gammaloop-nextest-python-api> │ │
- 34.11 s
gammaloop-nextest-python-api> │ This mode is only permitted for non-commercial use and │
- 34.11 s
gammaloop-nextest-python-api> │ is limited to one instance and core per machine. │
- 34.11 s
gammaloop-nextest-python-api> │ │
- 34.11 s
gammaloop-nextest-python-api> │ Hobbyists can easily acquire a free license key │
- 34.11 s
gammaloop-nextest-python-api> │ that unlocks all cores and removes this banner: │
- 34.11 s
gammaloop-nextest-python-api> │ │
- 34.11 s
gammaloop-nextest-python-api> │ from symbolica import * │
- 34.11 s
gammaloop-nextest-python-api> │ request_hobbyist_license('YOUR_NAME', 'YOUR_EMAIL') │
- 34.11 s
gammaloop-nextest-python-api> │ │
- 34.11 s
gammaloop-nextest-python-api> │ All other users can obtain a free 30-day trial key: │
- 34.11 s
gammaloop-nextest-python-api> │ │
- 34.11 s
gammaloop-nextest-python-api> │ from symbolica import * │
- 34.11 s
gammaloop-nextest-python-api> │ request_trial_license('NAME', 'EMAIL', 'EMPLOYER') │
- 34.11 s
gammaloop-nextest-python-api> │ │
- 34.11 s
gammaloop-nextest-python-api> │ See https://symbolica.io/docs/get_started.html#license │
- 34.11 s
gammaloop-nextest-python-api> └────────────────────────────────────────────────────────┘
- 34.11 s
gammaloop-nextest-python-api> ┌───────────────────────────────────────────────────────────────────────────────────────────────────────────┐
- 34.11 s
gammaloop-nextest-python-api> │ Cannot start new unlicensed Symbolica instance since there is already another one running on the machine. │
- 34.11 s
gammaloop-nextest-python-api> └───────────────────────────────────────────────────────────────────────────────────────────────────────────┘
- 34.11 s
gammaloop-nextest-python-api>
- 34.11 s
gammaloop-nextest-python-api> stderr:
- 34.11 s
gammaloop-nextest-python-api>
- 34.11 s
gammaloop-nextest-python-api> ┌───────────────────────────────────────────────────────────┐
- 34.11 s
gammaloop-nextest-python-api> │ Could not resolve the IP of the Symbolica license server. │
- 34.11 s
gammaloop-nextest-python-api> │ │
- 34.11 s
gammaloop-nextest-python-api> │ Please check your DNS configuration. │
- 34.11 s
gammaloop-nextest-python-api> └───────────────────────────────────────────────────────────┘
- 34.11 s
gammaloop-nextest-python-api> Error: failed to lookup address information: Temporary failure in name resolution
- 34.11 s
gammaloop-nextest-python-api>
- 34.11 s
gammaloop-nextest-python-api>
- 34.11 s
gammaloop-nextest-python-api> Location:
- 34.11 s
gammaloop-nextest-python-api> tests/tests/test_python_api.rs:156:20
- 34.11 s
gammaloop-nextest-python-api> system-out
- 34.11 s
gammaloop-nextest-python-api> running 1 test
- 34.11 s
gammaloop-nextest-python-api> test python_session_getters_return_live_toml_and_command_blocks ... FAILED
- 34.11 s
gammaloop-nextest-python-api>
- 34.11 s
gammaloop-nextest-python-api> failures:
- 34.11 s
gammaloop-nextest-python-api>
- 34.11 s
gammaloop-nextest-python-api> failures:
- 34.11 s
gammaloop-nextest-python-api> python_session_getters_return_live_toml_and_command_blocks
- 34.11 s
gammaloop-nextest-python-api>
- 34.11 s
gammaloop-nextest-python-api> test result: FAILED. 0 passed; 1 failed; 0 ignored; 0 measured; 4 filtered out; finished in 0.11s
- 34.11 s
gammaloop-nextest-python-api> system-err
- 34.11 s
gammaloop-nextest-python-api> Error: Python API test subprocess failed.
- 34.11 s
gammaloop-nextest-python-api> stdout:
- 34.11 s
gammaloop-nextest-python-api> ┌────────────────────────────────────────────────────────┐
- 34.11 s
gammaloop-nextest-python-api> │ You are running a restricted Symbolica instance. │
- 34.11 s
gammaloop-nextest-python-api> │ │
- 34.11 s
gammaloop-nextest-python-api> │ This mode is only permitted for non-commercial use and │
- 34.11 s
gammaloop-nextest-python-api> │ is limited to one instance and core per machine. │
- 34.11 s
gammaloop-nextest-python-api> │ │
- 34.11 s
gammaloop-nextest-python-api> │ Hobbyists can easily acquire a free license key │
- 34.11 s
gammaloop-nextest-python-api> │ that unlocks all cores and removes this banner: │
- 34.11 s
gammaloop-nextest-python-api> │ │
- 34.11 s
gammaloop-nextest-python-api> │ from symbolica import * │
- 34.11 s
gammaloop-nextest-python-api> │ request_hobbyist_license('YOUR_NAME', 'YOUR_EMAIL') │
- 34.11 s
gammaloop-nextest-python-api> │ │
- 34.11 s
gammaloop-nextest-python-api> │ All other users can obtain a free 30-day trial key: │
- 34.11 s
gammaloop-nextest-python-api> │ │
- 34.11 s
gammaloop-nextest-python-api> │ from symbolica import * │
- 34.11 s
gammaloop-nextest-python-api> │ request_trial_license('NAME', 'EMAIL', 'EMPLOYER') │
- 34.11 s
gammaloop-nextest-python-api> │ │
- 34.11 s
gammaloop-nextest-python-api> │ See https://symbolica.io/docs/get_started.html#license │
- 34.11 s
gammaloop-nextest-python-api> └────────────────────────────────────────────────────────┘
- 34.11 s
gammaloop-nextest-python-api> ┌───────────────────────────────────────────────────────────────────────────────────────────────────────────┐
- 34.11 s
gammaloop-nextest-python-api> │ Cannot start new unlicensed Symbolica instance since there is already another one running on the machine. │
- 34.11 s
gammaloop-nextest-python-api> └───────────────────────────────────────────────────────────────────────────────────────────────────────────┘
- 34.11 s
gammaloop-nextest-python-api>
- 34.11 s
gammaloop-nextest-python-api> stderr:
- 34.11 s
gammaloop-nextest-python-api>
- 34.11 s
gammaloop-nextest-python-api> ┌───────────────────────────────────────────────────────────┐
- 34.11 s
gammaloop-nextest-python-api> │ Could not resolve the IP of the Symbolica license server. │
- 34.11 s
gammaloop-nextest-python-api> │ │
- 34.11 s
gammaloop-nextest-python-api> │ Please check your DNS configuration. │
- 34.11 s
gammaloop-nextest-python-api> └───────────────────────────────────────────────────────────┘
- 34.11 s
gammaloop-nextest-python-api> Error: failed to lookup address information: Temporary failure in name resolution
- 34.11 s
gammaloop-nextest-python-api>
- 34.11 s
gammaloop-nextest-python-api>
- 34.11 s
gammaloop-nextest-python-api> Location:
- 34.11 s
gammaloop-nextest-python-api> tests/tests/test_python_api.rs:156:20
- 34.11 s
gammaloop-nextest-python-api> =========================================
- 34.15 s
error: Cannot build '/nix/store/nmwgfm0zigizp5byy173df7l99i9kddz-gammaloop-nextest-python-api.drv'.
- 34.15 s
Reason: builder failed with exit code 100.
- 34.15 s
Output paths:
- 34.15 s
/nix/store/0wmifwk23rqakrfsxal3kaig8chq1a34-gammaloop-nextest-python-api
- 34.15 s
Last 781 log lines:
- 34.15 s
> Extracting 1 binary, 1 build script output directory, and 3 linked paths to /build/nextest-archive-Hwt2Lj
- 34.15 s
> Extracted 18 files to /build/nextest-archive-Hwt2Lj in 0.06s
- 34.15 s
> ------------
- 34.15 s
> Nextest run ID 71b70952-8308-4d0e-9e30-05a357df5f23 with nextest profile: ci_gammaloop
- 34.15 s
> Starting 5 tests across 1 binary
- 34.15 s
> FAIL [ 0.113s] (1/5) gammaloop-integration-tests::test_python_api python_evaluate_sample_honors_generate_events_and_observable_snapshots
- 34.15 s
> stdout ---
- 34.15 s
>
- 34.15 s
> running 1 test
- 34.15 s
> test python_evaluate_sample_honors_generate_events_and_observable_snapshots ... FAILED
- 34.15 s
>
- 34.15 s
> failures:
- 34.15 s
>
- 34.15 s
> failures:
- 34.15 s
> python_evaluate_sample_honors_generate_events_and_observable_snapshots
- 34.15 s
>
- 34.15 s
> test result: FAILED. 0 passed; 1 failed; 0 ignored; 0 measured; 4 filtered out; finished in 0.11s
- 34.15 s
>
- 34.15 s
> stderr ---
- 34.15 s
> Error: Python API test subprocess failed.
- 34.15 s
> stdout:
- 34.15 s
> ┌────────────────────────────────────────────────────────┐
- 34.15 s
> │ You are running a restricted Symbolica instance. │
- 34.15 s
> │ │
- 34.15 s
> │ This mode is only permitted for non-commercial use and │
- 34.15 s
> │ is limited to one instance and core per machine. │
- 34.15 s
> │ │
- 34.15 s
> │ Hobbyists can easily acquire a free license key │
- 34.15 s
> │ that unlocks all cores and removes this banner: │
- 34.15 s
> │ │
- 34.15 s
> │ from symbolica import * │
- 34.15 s
> │ request_hobbyist_license('YOUR_NAME', 'YOUR_EMAIL') │
- 34.15 s
> │ │
- 34.15 s
> │ All other users can obtain a free 30-day trial key: │
- 34.15 s
> │ │
- 34.15 s
> │ from symbolica import * │
- 34.15 s
> │ request_trial_license('NAME', 'EMAIL', 'EMPLOYER') │
- 34.15 s
> │ │
- 34.15 s
> │ See https://symbolica.io/docs/get_started.html#license │
- 34.15 s
> └────────────────────────────────────────────────────────┘
- 34.15 s
> ┌───────────────────────────────────────────────────────────────────────────────────────────────────────────┐
- 34.15 s
> │ Cannot start new unlicensed Symbolica instance since there is already another one running on the machine. │
- 34.15 s
> └───────────────────────────────────────────────────────────────────────────────────────────────────────────┘
- 34.15 s
>
- 34.15 s
> stderr:
- 34.15 s
>
- 34.15 s
> ┌───────────────────────────────────────────────────────────┐
- 34.15 s
> │ Could not resolve the IP of the Symbolica license server. │
- 34.15 s
> │ │
- 34.15 s
> │ Please check your DNS configuration. │
- 34.15 s
> └───────────────────────────────────────────────────────────┘
- 34.15 s
> Error: failed to lookup address information: Temporary failure in name resolution
- 34.15 s
>
- 34.15 s
>
- 34.15 s
> Location:
- 34.15 s
> tests/tests/test_python_api.rs:156:20
- 34.15 s
>
- 34.15 s
> FAIL [ 0.114s] (2/5) gammaloop-integration-tests::test_python_api python_evaluate_samples_batch_and_momentum_space_have_expected_shape
- 34.15 s
> stdout ---
- 34.15 s
>
- 34.15 s
> running 1 test
- 34.15 s
> test python_evaluate_samples_batch_and_momentum_space_have_expected_shape ... FAILED
- 34.15 s
>
- 34.15 s
> failures:
- 34.15 s
>
- 34.15 s
> failures:
- 34.15 s
> python_evaluate_samples_batch_and_momentum_space_have_expected_shape
- 34.15 s
>
- 34.15 s
> test result: FAILED. 0 passed; 1 failed; 0 ignored; 0 measured; 4 filtered out; finished in 0.11s
- 34.15 s
>
- 34.15 s
> stderr ---
- 34.15 s
> Error: Python API test subprocess failed.
- 34.15 s
> stdout:
- 34.15 s
> ┌────────────────────────────────────────────────────────┐
- 34.15 s
> │ You are running a restricted Symbolica instance. │
- 34.15 s
> │ │
- 34.15 s
> │ This mode is only permitted for non-commercial use and │
- 34.15 s
> │ is limited to one instance and core per machine. │
- 34.15 s
> │ │
- 34.15 s
> │ Hobbyists can easily acquire a free license key │
- 34.15 s
> │ that unlocks all cores and removes this banner: │
- 34.15 s
> │ │
- 34.15 s
> │ from symbolica import * │
- 34.15 s
> │ request_hobbyist_license('YOUR_NAME', 'YOUR_EMAIL') │
- 34.15 s
> │ │
- 34.15 s
> │ All other users can obtain a free 30-day trial key: │
- 34.15 s
> │ │
- 34.15 s
> │ from symbolica import * │
- 34.15 s
> │ request_trial_license('NAME', 'EMAIL', 'EMPLOYER') │
- 34.15 s
> │ │
- 34.15 s
> │ See https://symbolica.io/docs/get_started.html#license │
- 34.15 s
> └────────────────────────────────────────────────────────┘
- 34.15 s
> ┌───────────────────────────────────────────────────────────────────────────────────────────────────────────┐
- 34.15 s
> │ Cannot start new unlicensed Symbolica instance since there is already another one running on the machine. │
- 34.15 s
> └───────────────────────────────────────────────────────────────────────────────────────────────────────────┘
- 34.15 s
>
- 34.15 s
> stderr:
- 34.15 s
>
- 34.15 s
> ┌───────────────────────────────────────────────────────────┐
- 34.15 s
> │ Could not resolve the IP of the Symbolica license server. │
- 34.15 s
> │ │
- 34.15 s
> │ Please check your DNS configuration. │
- 34.15 s
> └───────────────────────────────────────────────────────────┘
- 34.15 s
> Error: failed to lookup address information: Temporary failure in name resolution
- 34.15 s
>
- 34.15 s
>
- 34.15 s
> Location:
- 34.15 s
> tests/tests/test_python_api.rs:156:20
- 34.15 s
>
- 34.15 s
> FAIL [ 0.118s] (3/5) gammaloop-integration-tests::test_python_api python_evaluate_sample_preserves_graph_grouping_and_incoming_pdgs
- 34.15 s
> stdout ---
- 34.15 s
>
- 34.15 s
> running 1 test
- 34.15 s
> test python_evaluate_sample_preserves_graph_grouping_and_incoming_pdgs ... FAILED
- 34.15 s
>
- 34.15 s
> failures:
- 34.15 s
>
- 34.15 s
> failures:
- 34.15 s
> python_evaluate_sample_preserves_graph_grouping_and_incoming_pdgs
- 34.15 s
>
- 34.15 s
> test result: FAILED. 0 passed; 1 failed; 0 ignored; 0 measured; 4 filtered out; finished in 0.11s
- 34.15 s
>
- 34.15 s
> stderr ---
- 34.15 s
> Error: Python API test subprocess failed.
- 34.15 s
> stdout:
- 34.15 s
> ┌────────────────────────────────────────────────────────┐
- 34.15 s
> │ You are running a restricted Symbolica instance. │
- 34.15 s
> │ │
- 34.15 s
> │ This mode is only permitted for non-commercial use and │
- 34.15 s
> │ is limited to one instance and core per machine. │
- 34.15 s
> │ │
- 34.15 s
> │ Hobbyists can easily acquire a free license key │
- 34.15 s
> │ that unlocks all cores and removes this banner: │
- 34.15 s
> │ │
- 34.15 s
> │ from symbolica import * │
- 34.15 s
> │ request_hobbyist_license('YOUR_NAME', 'YOUR_EMAIL') │
- 34.15 s
> │ │
- 34.15 s
> │ All other users can obtain a free 30-day trial key: │
- 34.15 s
> │ │
- 34.15 s
> │ from symbolica import * │
- 34.15 s
> │ request_trial_license('NAME', 'EMAIL', 'EMPLOYER') │
- 34.15 s
> │ │
- 34.15 s
> │ See https://symbolica.io/docs/get_started.html#license │
- 34.15 s
> └────────────────────────────────────────────────────────┘
- 34.15 s
> ┌───────────────────────────────────────────────────────────────────────────────────────────────────────────┐
- 34.15 s
> │ Cannot start new unlicensed Symbolica instance since there is already another one running on the machine. │
- 34.15 s
> └───────────────────────────────────────────────────────────────────────────────────────────────────────────┘
- 34.15 s
>
- 34.15 s
> stderr:
- 34.15 s
>
- 34.15 s
> ┌───────────────────────────────────────────────────────────┐
- 34.15 s
> │ Could not resolve the IP of the Symbolica license server. │
- 34.15 s
> │ │
- 34.15 s
> │ Please check your DNS configuration. │
- 34.15 s
> └───────────────────────────────────────────────────────────┘
- 34.15 s
> Error: failed to lookup address information: Temporary failure in name resolution
- 34.15 s
>
- 34.15 s
>
- 34.15 s
> Location:
- 34.15 s
> tests/tests/test_python_api.rs:156:20
- 34.15 s
>
- 34.15 s
> FAIL [ 0.118s] (4/5) gammaloop-integration-tests::test_python_api python_session_getters_return_live_toml_and_command_blocks
- 34.15 s
> stdout ---
- 34.15 s
>
- 34.15 s
> running 1 test
- 34.15 s
> test python_session_getters_return_live_toml_and_command_blocks ... FAILED
- 34.15 s
>
- 34.15 s
> failures:
- 34.15 s
>
- 34.15 s
> failures:
- 34.15 s
> python_session_getters_return_live_toml_and_command_blocks
- 34.15 s
>
- 34.15 s
> test result: FAILED. 0 passed; 1 failed; 0 ignored; 0 measured; 4 filtered out; finished in 0.11s
- 34.15 s
>
- 34.15 s
> stderr ---
- 34.15 s
> Error: Python API test subprocess failed.
- 34.15 s
> stdout:
- 34.15 s
> ┌────────────────────────────────────────────────────────┐
- 34.15 s
> │ You are running a restricted Symbolica instance. │
- 34.15 s
> │ │
- 34.15 s
> │ This mode is only permitted for non-commercial use and │
- 34.15 s
> │ is limited to one instance and core per machine. │
- 34.15 s
> │ │
- 34.15 s
> │ Hobbyists can easily acquire a free license key │
- 34.15 s
> │ that unlocks all cores and removes this banner: │
- 34.15 s
> │ │
- 34.15 s
> │ from symbolica import * │
- 34.15 s
> │ request_hobbyist_license('YOUR_NAME', 'YOUR_EMAIL') │
- 34.15 s
> │ │
- 34.15 s
> │ All other users can obtain a free 30-day trial key: │
- 34.15 s
> │ │
- 34.15 s
> │ from symbolica import * │
- 34.15 s
> │ request_trial_license('NAME', 'EMAIL', 'EMPLOYER') │
- 34.15 s
> │ │
- 34.15 s
> │ See https://symbolica.io/docs/get_started.html#license │
- 34.15 s
> └────────────────────────────────────────────────────────┘
- 34.15 s
> ┌───────────────────────────────────────────────────────────────────────────────────────────────────────────┐
- 34.15 s
> │ Cannot start new unlicensed Symbolica instance since there is already another one running on the machine. │
- 34.15 s
> └───────────────────────────────────────────────────────────────────────────────────────────────────────────┘
- 34.15 s
>
- 34.15 s
> stderr:
- 34.15 s
>
- 34.15 s
> ┌───────────────────────────────────────────────────────────┐
- 34.15 s
> │ Could not resolve the IP of the Symbolica license server. │
- 34.15 s
> │ │
- 34.15 s
> │ Please check your DNS configuration. │
- 34.15 s
> └───────────────────────────────────────────────────────────┘
- 34.15 s
> Error: failed to lookup address information: Temporary failure in name resolution
- 34.15 s
>
- 34.15 s
>
- 34.15 s
> Location:
- 34.15 s
> tests/tests/test_python_api.rs:156:20
- 34.15 s
>
- 34.15 s
> ------------
- 34.15 s
> Summary [ 0.286s] 5 tests run: 1 passed, 4 failed, 0 skipped
- 34.15 s
> FAIL [ 0.113s] (1/5) gammaloop-integration-tests::test_python_api python_evaluate_sample_honors_generate_events_and_observable_snapshots
- 34.15 s
> stdout ---
- 34.15 s
>
- 34.15 s
> running 1 test
- 34.15 s
> test python_evaluate_sample_honors_generate_events_and_observable_snapshots ... FAILED
- 34.15 s
>
- 34.15 s
> failures:
- 34.15 s
>
- 34.15 s
> failures:
- 34.15 s
> python_evaluate_sample_honors_generate_events_and_observable_snapshots
- 34.15 s
>
- 34.15 s
> test result: FAILED. 0 passed; 1 failed; 0 ignored; 0 measured; 4 filtered out; finished in 0.11s
- 34.15 s
>
- 34.15 s
> stderr ---
- 34.15 s
> Error: Python API test subprocess failed.
- 34.15 s
> stdout:
- 34.15 s
> ┌────────────────────────────────────────────────────────┐
- 34.15 s
> │ You are running a restricted Symbolica instance. │
- 34.15 s
> │ │
- 34.15 s
> │ This mode is only permitted for non-commercial use and │
- 34.15 s
> │ is limited to one instance and core per machine. │
- 34.15 s
> │ │
- 34.15 s
> │ Hobbyists can easily acquire a free license key │
- 34.15 s
> │ that unlocks all cores and removes this banner: │
- 34.15 s
> │ │
- 34.15 s
> │ from symbolica import * │
- 34.15 s
> │ request_hobbyist_license('YOUR_NAME', 'YOUR_EMAIL') │
- 34.15 s
> │ │
- 34.15 s
> │ All other users can obtain a free 30-day trial key: │
- 34.15 s
> │ │
- 34.15 s
> │ from symbolica import * │
- 34.15 s
> │ request_trial_license('NAME', 'EMAIL', 'EMPLOYER') │
- 34.15 s
> │ │
- 34.15 s
> │ See https://symbolica.io/docs/get_started.html#license │
- 34.15 s
> └────────────────────────────────────────────────────────┘
- 34.15 s
> ┌───────────────────────────────────────────────────────────────────────────────────────────────────────────┐
- 34.15 s
> │ Cannot start new unlicensed Symbolica instance since there is already another one running on the machine. │
- 34.15 s
> └───────────────────────────────────────────────────────────────────────────────────────────────────────────┘
- 34.15 s
>
- 34.15 s
> stderr:
- 34.15 s
>
- 34.15 s
> ┌───────────────────────────────────────────────────────────┐
- 34.15 s
> │ Could not resolve the IP of the Symbolica license server. │
- 34.15 s
> │ │
- 34.15 s
> │ Please check your DNS configuration. │
- 34.15 s
> └───────────────────────────────────────────────────────────┘
- 34.15 s
> Error: failed to lookup address information: Temporary failure in name resolution
- 34.15 s
>
- 34.15 s
>
- 34.15 s
> Location:
- 34.15 s
> tests/tests/test_python_api.rs:156:20
- 34.15 s
>
- 34.15 s
> FAIL [ 0.114s] (2/5) gammaloop-integration-tests::test_python_api python_evaluate_samples_batch_and_momentum_space_have_expected_shape
- 34.15 s
> stdout ---
- 34.15 s
>
- 34.15 s
> running 1 test
- 34.15 s
> test python_evaluate_samples_batch_and_momentum_space_have_expected_shape ... FAILED
- 34.15 s
>
- 34.15 s
> failures:
- 34.15 s
>
- 34.15 s
> failures:
- 34.15 s
> python_evaluate_samples_batch_and_momentum_space_have_expected_shape
- 34.15 s
>
- 34.15 s
> test result: FAILED. 0 passed; 1 failed; 0 ignored; 0 measured; 4 filtered out; finished in 0.11s
- 34.15 s
>
- 34.15 s
> stderr ---
- 34.15 s
> Error: Python API test subprocess failed.
- 34.15 s
> stdout:
- 34.15 s
> ┌────────────────────────────────────────────────────────┐
- 34.15 s
> │ You are running a restricted Symbolica instance. │
- 34.15 s
> │ │
- 34.15 s
> │ This mode is only permitted for non-commercial use and │
- 34.15 s
> │ is limited to one instance and core per machine. │
- 34.15 s
> │ │
- 34.15 s
> │ Hobbyists can easily acquire a free license key │
- 34.15 s
> │ that unlocks all cores and removes this banner: │
- 34.15 s
> │ │
- 34.15 s
> │ from symbolica import * │
- 34.15 s
> │ request_hobbyist_license('YOUR_NAME', 'YOUR_EMAIL') │
- 34.15 s
> │ │
- 34.15 s
> │ All other users can obtain a free 30-day trial key: │
- 34.15 s
> │ │
- 34.15 s
> │ from symbolica import * │
- 34.15 s
> │ request_trial_license('NAME', 'EMAIL', 'EMPLOYER') │
- 34.15 s
> │ │
- 34.15 s
> │ See https://symbolica.io/docs/get_started.html#license │
- 34.15 s
> └────────────────────────────────────────────────────────┘
- 34.15 s
> ┌───────────────────────────────────────────────────────────────────────────────────────────────────────────┐
- 34.15 s
> │ Cannot start new unlicensed Symbolica instance since there is already another one running on the machine. │
- 34.15 s
> └───────────────────────────────────────────────────────────────────────────────────────────────────────────┘
- 34.15 s
>
- 34.15 s
> stderr:
- 34.15 s
>
- 34.15 s
> ┌───────────────────────────────────────────────────────────┐
- 34.15 s
> │ Could not resolve the IP of the Symbolica license server. │
- 34.15 s
> │ │
- 34.15 s
> │ Please check your DNS configuration. │
- 34.15 s
> └───────────────────────────────────────────────────────────┘
- 34.15 s
> Error: failed to lookup address information: Temporary failure in name resolution
- 34.15 s
>
- 34.15 s
>
- 34.15 s
> Location:
- 34.15 s
> tests/tests/test_python_api.rs:156:20
- 34.15 s
>
- 34.15 s
> FAIL [ 0.118s] (3/5) gammaloop-integration-tests::test_python_api python_evaluate_sample_preserves_graph_grouping_and_incoming_pdgs
- 34.15 s
> stdout ---
- 34.15 s
>
- 34.15 s
> running 1 test
- 34.15 s
> test python_evaluate_sample_preserves_graph_grouping_and_incoming_pdgs ... FAILED
- 34.15 s
>
- 34.15 s
> failures:
- 34.15 s
>
- 34.15 s
> failures:
- 34.15 s
> python_evaluate_sample_preserves_graph_grouping_and_incoming_pdgs
- 34.15 s
>
- 34.15 s
> test result: FAILED. 0 passed; 1 failed; 0 ignored; 0 measured; 4 filtered out; finished in 0.11s
- 34.15 s
>
- 34.15 s
> stderr ---
- 34.15 s
> Error: Python API test subprocess failed.
- 34.15 s
> stdout:
- 34.15 s
> ┌────────────────────────────────────────────────────────┐
- 34.15 s
> │ You are running a restricted Symbolica instance. │
- 34.15 s
> │ │
- 34.15 s
> │ This mode is only permitted for non-commercial use and │
- 34.15 s
> │ is limited to one instance and core per machine. │
- 34.15 s
> │ │
- 34.15 s
> │ Hobbyists can easily acquire a free license key │
- 34.15 s
> │ that unlocks all cores and removes this banner: │
- 34.15 s
> │ │
- 34.15 s
> │ from symbolica import * │
- 34.15 s
> │ request_hobbyist_license('YOUR_NAME', 'YOUR_EMAIL') │
- 34.15 s
> │ │
- 34.15 s
> │ All other users can obtain a free 30-day trial key: │
- 34.15 s
> │ │
- 34.15 s
> │ from symbolica import * │
- 34.15 s
> │ request_trial_license('NAME', 'EMAIL', 'EMPLOYER') │
- 34.15 s
> │ │
- 34.15 s
> │ See https://symbolica.io/docs/get_started.html#license │
- 34.15 s
> └────────────────────────────────────────────────────────┘
- 34.15 s
> ┌───────────────────────────────────────────────────────────────────────────────────────────────────────────┐
- 34.15 s
> │ Cannot start new unlicensed Symbolica instance since there is already another one running on the machine. │
- 34.15 s
> └───────────────────────────────────────────────────────────────────────────────────────────────────────────┘
- 34.15 s
>
- 34.15 s
> stderr:
- 34.15 s
>
- 34.15 s
> ┌───────────────────────────────────────────────────────────┐
- 34.15 s
> │ Could not resolve the IP of the Symbolica license server. │
- 34.15 s
> │ │
- 34.15 s
> │ Please check your DNS configuration. │
- 34.15 s
> └───────────────────────────────────────────────────────────┘
- 34.15 s
> Error: failed to lookup address information: Temporary failure in name resolution
- 34.15 s
>
- 34.15 s
>
- 34.15 s
> Location:
- 34.15 s
> tests/tests/test_python_api.rs:156:20
- 34.15 s
>
- 34.15 s
> FAIL [ 0.118s] (4/5) gammaloop-integration-tests::test_python_api python_session_getters_return_live_toml_and_command_blocks
- 34.15 s
> stdout ---
- 34.15 s
>
- 34.15 s
> running 1 test
- 34.15 s
> test python_session_getters_return_live_toml_and_command_blocks ... FAILED
- 34.15 s
>
- 34.15 s
> failures:
- 34.15 s
>
- 34.15 s
> failures:
- 34.15 s
> python_session_getters_return_live_toml_and_command_blocks
- 34.15 s
>
- 34.15 s
> test result: FAILED. 0 passed; 1 failed; 0 ignored; 0 measured; 4 filtered out; finished in 0.11s
- 34.15 s
>
- 34.15 s
> stderr ---
- 34.15 s
> Error: Python API test subprocess failed.
- 34.15 s
> stdout:
- 34.15 s
> ┌────────────────────────────────────────────────────────┐
- 34.15 s
> │ You are running a restricted Symbolica instance. │
- 34.15 s
> │ │
- 34.15 s
> │ This mode is only permitted for non-commercial use and │
- 34.15 s
> │ is limited to one instance and core per machine. │
- 34.15 s
> │ │
- 34.15 s
> │ Hobbyists can easily acquire a free license key │
- 34.15 s
> │ that unlocks all cores and removes this banner: │
- 34.15 s
> │ │
- 34.15 s
> │ from symbolica import * │
- 34.15 s
> │ request_hobbyist_license('YOUR_NAME', 'YOUR_EMAIL') │
- 34.15 s
> │ │
- 34.15 s
> │ All other users can obtain a free 30-day trial key: │
- 34.15 s
> │ │
- 34.15 s
> │ from symbolica import * │
- 34.15 s
> │ request_trial_license('NAME', 'EMAIL', 'EMPLOYER') │
- 34.15 s
> │ │
- 34.15 s
> │ See https://symbolica.io/docs/get_started.html#license │
- 34.15 s
> └────────────────────────────────────────────────────────┘
- 34.15 s
> ┌───────────────────────────────────────────────────────────────────────────────────────────────────────────┐
- 34.15 s
> │ Cannot start new unlicensed Symbolica instance since there is already another one running on the machine. │
- 34.15 s
> └───────────────────────────────────────────────────────────────────────────────────────────────────────────┘
- 34.15 s
>
- 34.15 s
> stderr:
- 34.15 s
>
- 34.15 s
> ┌───────────────────────────────────────────────────────────┐
- 34.15 s
> │ Could not resolve the IP of the Symbolica license server. │
- 34.15 s
> │ │
- 34.15 s
> │ Please check your DNS configuration. │
- 34.15 s
> └───────────────────────────────────────────────────────────┘
- 34.15 s
> Error: failed to lookup address information: Temporary failure in name resolution
- 34.15 s
>
- 34.15 s
>
- 34.15 s
> Location:
- 34.15 s
> tests/tests/test_python_api.rs:156:20
- 34.15 s
>
- 34.15 s
> error: test run failed
- 34.15 s
>
- 34.15 s
> ========== nextest test summary ==========
- 34.15 s
> report: target/nextest/ci_gammaloop/junit.xml
- 34.15 s
> tests: 5, failures: 4, errors: 0
- 34.15 s
>
- 34.15 s
> 1. gammaloop-integration-tests::test_python_api::python_evaluate_sample_honors_generate_events_and_observable_snapshots
- 34.15 s
> failure: test failure with exit code 101
- 34.15 s
> Error: Python API test subprocess failed.
- 34.15 s
> stdout:
- 34.15 s
> ┌────────────────────────────────────────────────────────┐
- 34.15 s
> │ You are running a restricted Symbolica instance. │
- 34.15 s
> │ │
- 34.15 s
> │ This mode is only permitted for non-commercial use and │
- 34.15 s
> │ is limited to one instance and core per machine. │
- 34.15 s
> │ │
- 34.15 s
> │ Hobbyists can easily acquire a free license key │
- 34.15 s
> │ that unlocks all cores and removes this banner: │
- 34.15 s
> │ │
- 34.15 s
> │ from symbolica import * │
- 34.15 s
> │ request_hobbyist_license('YOUR_NAME', 'YOUR_EMAIL') │
- 34.15 s
> │ │
- 34.15 s
> │ All other users can obtain a free 30-day trial key: │
- 34.15 s
> │ │
- 34.15 s
> │ from symbolica import * │
- 34.15 s
> │ request_trial_license('NAME', 'EMAIL', 'EMPLOYER') │
- 34.15 s
> │ │
- 34.15 s
> │ See https://symbolica.io/docs/get_started.html#license │
- 34.15 s
> └────────────────────────────────────────────────────────┘
- 34.15 s
> ┌───────────────────────────────────────────────────────────────────────────────────────────────────────────┐
- 34.15 s
> │ Cannot start new unlicensed Symbolica instance since there is already another one running on the machine. │
- 34.15 s
> └───────────────────────────────────────────────────────────────────────────────────────────────────────────┘
- 34.15 s
>
- 34.15 s
> stderr:
- 34.15 s
>
- 34.15 s
> ┌───────────────────────────────────────────────────────────┐
- 34.15 s
> │ Could not resolve the IP of the Symbolica license server. │
- 34.15 s
> │ │
- 34.15 s
> │ Please check your DNS configuration. │
- 34.15 s
> └───────────────────────────────────────────────────────────┘
- 34.15 s
> Error: failed to lookup address information: Temporary failure in name resolution
- 34.15 s
>
- 34.15 s
>
- 34.15 s
> Location:
- 34.15 s
> tests/tests/test_python_api.rs:156:20
- 34.15 s
> system-out
- 34.15 s
> running 1 test
- 34.15 s
> test python_evaluate_sample_honors_generate_events_and_observable_snapshots ... FAILED
- 34.15 s
>
- 34.15 s
> failures:
- 34.15 s
>
- 34.15 s
> failures:
- 34.15 s
> python_evaluate_sample_honors_generate_events_and_observable_snapshots
- 34.15 s
>
- 34.15 s
> test result: FAILED. 0 passed; 1 failed; 0 ignored; 0 measured; 4 filtered out; finished in 0.11s
- 34.15 s
> system-err
- 34.15 s
> Error: Python API test subprocess failed.
- 34.15 s
> stdout:
- 34.15 s
> ┌────────────────────────────────────────────────────────┐
- 34.15 s
> │ You are running a restricted Symbolica instance. │
- 34.15 s
> │ │
- 34.15 s
> │ This mode is only permitted for non-commercial use and │
- 34.15 s
> │ is limited to one instance and core per machine. │
- 34.15 s
> │ │
- 34.15 s
> │ Hobbyists can easily acquire a free license key │
- 34.15 s
> │ that unlocks all cores and removes this banner: │
- 34.15 s
> │ │
- 34.15 s
> │ from symbolica import * │
- 34.15 s
> │ request_hobbyist_license('YOUR_NAME', 'YOUR_EMAIL') │
- 34.15 s
> │ │
- 34.15 s
> │ All other users can obtain a free 30-day trial key: │
- 34.15 s
> │ │
- 34.15 s
> │ from symbolica import * │
- 34.15 s
> │ request_trial_license('NAME', 'EMAIL', 'EMPLOYER') │
- 34.15 s
> │ │
- 34.15 s
> │ See https://symbolica.io/docs/get_started.html#license │
- 34.15 s
> └────────────────────────────────────────────────────────┘
- 34.15 s
> ┌───────────────────────────────────────────────────────────────────────────────────────────────────────────┐
- 34.15 s
> │ Cannot start new unlicensed Symbolica instance since there is already another one running on the machine. │
- 34.15 s
> └───────────────────────────────────────────────────────────────────────────────────────────────────────────┘
- 34.15 s
>
- 34.15 s
> stderr:
- 34.15 s
>
- 34.15 s
> ┌───────────────────────────────────────────────────────────┐
- 34.15 s
> │ Could not resolve the IP of the Symbolica license server. │
- 34.15 s
> │ │
- 34.15 s
> │ Please check your DNS configuration. │
- 34.15 s
> └───────────────────────────────────────────────────────────┘
- 34.15 s
> Error: failed to lookup address information: Temporary failure in name resolution
- 34.15 s
>
- 34.15 s
>
- 34.15 s
> Location:
- 34.15 s
> tests/tests/test_python_api.rs:156:20
- 34.15 s
>
- 34.15 s
> 2. gammaloop-integration-tests::test_python_api::python_evaluate_samples_batch_and_momentum_space_have_expected_shape
- 34.15 s
> failure: test failure with exit code 101
- 34.15 s
> Error: Python API test subprocess failed.
- 34.15 s
> stdout:
- 34.15 s
> ┌────────────────────────────────────────────────────────┐
- 34.15 s
> │ You are running a restricted Symbolica instance. │
- 34.15 s
> │ │
- 34.15 s
> │ This mode is only permitted for non-commercial use and │
- 34.15 s
> │ is limited to one instance and core per machine. │
- 34.15 s
> │ │
- 34.15 s
> │ Hobbyists can easily acquire a free license key │
- 34.15 s
> │ that unlocks all cores and removes this banner: │
- 34.15 s
> │ │
- 34.15 s
> │ from symbolica import * │
- 34.15 s
> │ request_hobbyist_license('YOUR_NAME', 'YOUR_EMAIL') │
- 34.15 s
> │ │
- 34.15 s
> │ All other users can obtain a free 30-day trial key: │
- 34.15 s
> │ │
- 34.15 s
> │ from symbolica import * │
- 34.15 s
> │ request_trial_license('NAME', 'EMAIL', 'EMPLOYER') │
- 34.15 s
> │ │
- 34.15 s
> │ See https://symbolica.io/docs/get_started.html#license │
- 34.15 s
> └────────────────────────────────────────────────────────┘
- 34.15 s
> ┌───────────────────────────────────────────────────────────────────────────────────────────────────────────┐
- 34.15 s
> │ Cannot start new unlicensed Symbolica instance since there is already another one running on the machine. │
- 34.15 s
> └───────────────────────────────────────────────────────────────────────────────────────────────────────────┘
- 34.15 s
>
- 34.15 s
> stderr:
- 34.15 s
>
- 34.15 s
> ┌───────────────────────────────────────────────────────────┐
- 34.15 s
> │ Could not resolve the IP of the Symbolica license server. │
- 34.15 s
> │ │
- 34.15 s
> │ Please check your DNS configuration. │
- 34.15 s
> └───────────────────────────────────────────────────────────┘
- 34.15 s
> Error: failed to lookup address information: Temporary failure in name resolution
- 34.15 s
>
- 34.15 s
>
- 34.15 s
> Location:
- 34.15 s
> tests/tests/test_python_api.rs:156:20
- 34.15 s
> system-out
- 34.15 s
> running 1 test
- 34.15 s
> test python_evaluate_samples_batch_and_momentum_space_have_expected_shape ... FAILED
- 34.15 s
>
- 34.15 s
> failures:
- 34.15 s
>
- 34.15 s
> failures:
- 34.15 s
> python_evaluate_samples_batch_and_momentum_space_have_expected_shape
- 34.15 s
>
- 34.15 s
> test result: FAILED. 0 passed; 1 failed; 0 ignored; 0 measured; 4 filtered out; finished in 0.11s
- 34.15 s
> system-err
- 34.15 s
> Error: Python API test subprocess failed.
- 34.15 s
> stdout:
- 34.15 s
> ┌────────────────────────────────────────────────────────┐
- 34.15 s
> │ You are running a restricted Symbolica instance. │
- 34.15 s
> │ │
- 34.15 s
> │ This mode is only permitted for non-commercial use and │
- 34.15 s
> │ is limited to one instance and core per machine. │
- 34.15 s
> │ │
- 34.15 s
> │ Hobbyists can easily acquire a free license key │
- 34.15 s
> │ that unlocks all cores and removes this banner: │
- 34.15 s
> │ │
- 34.15 s
> │ from symbolica import * │
- 34.15 s
> │ request_hobbyist_license('YOUR_NAME', 'YOUR_EMAIL') │
- 34.15 s
> │ │
- 34.15 s
> │ All other users can obtain a free 30-day trial key: │
- 34.15 s
> │ │
- 34.15 s
> │ from symbolica import * │
- 34.15 s
> │ request_trial_license('NAME', 'EMAIL', 'EMPLOYER') │
- 34.15 s
> │ │
- 34.15 s
> │ See https://symbolica.io/docs/get_started.html#license │
- 34.15 s
> └────────────────────────────────────────────────────────┘
- 34.15 s
> ┌───────────────────────────────────────────────────────────────────────────────────────────────────────────┐
- 34.15 s
> │ Cannot start new unlicensed Symbolica instance since there is already another one running on the machine. │
- 34.15 s
> └───────────────────────────────────────────────────────────────────────────────────────────────────────────┘
- 34.15 s
>
- 34.15 s
> stderr:
- 34.15 s
>
- 34.15 s
> ┌───────────────────────────────────────────────────────────┐
- 34.15 s
> │ Could not resolve the IP of the Symbolica license server. │
- 34.15 s
> │ │
- 34.15 s
> │ Please check your DNS configuration. │
- 34.15 s
> └───────────────────────────────────────────────────────────┘
- 34.15 s
> Error: failed to lookup address information: Temporary failure in name resolution
- 34.15 s
>
- 34.15 s
>
- 34.15 s
> Location:
- 34.15 s
> tests/tests/test_python_api.rs:156:20
- 34.15 s
>
- 34.15 s
> 3. gammaloop-integration-tests::test_python_api::python_evaluate_sample_preserves_graph_grouping_and_incoming_pdgs
- 34.15 s
> failure: test failure with exit code 101
- 34.15 s
> Error: Python API test subprocess failed.
- 34.15 s
> stdout:
- 34.15 s
> ┌────────────────────────────────────────────────────────┐
- 34.15 s
> │ You are running a restricted Symbolica instance. │
- 34.15 s
> │ │
- 34.15 s
> │ This mode is only permitted for non-commercial use and │
- 34.15 s
> │ is limited to one instance and core per machine. │
- 34.15 s
> │ │
- 34.15 s
> │ Hobbyists can easily acquire a free license key │
- 34.15 s
> │ that unlocks all cores and removes this banner: │
- 34.15 s
> │ │
- 34.15 s
> │ from symbolica import * │
- 34.15 s
> │ request_hobbyist_license('YOUR_NAME', 'YOUR_EMAIL') │
- 34.15 s
> │ │
- 34.15 s
> │ All other users can obtain a free 30-day trial key: │
- 34.15 s
> │ │
- 34.15 s
> │ from symbolica import * │
- 34.15 s
> │ request_trial_license('NAME', 'EMAIL', 'EMPLOYER') │
- 34.15 s
> │ │
- 34.15 s
> │ See https://symbolica.io/docs/get_started.html#license │
- 34.15 s
> └────────────────────────────────────────────────────────┘
- 34.15 s
> ┌───────────────────────────────────────────────────────────────────────────────────────────────────────────┐
- 34.15 s
> │ Cannot start new unlicensed Symbolica instance since there is already another one running on the machine. │
- 34.15 s
> └───────────────────────────────────────────────────────────────────────────────────────────────────────────┘
- 34.15 s
>
- 34.15 s
> stderr:
- 34.15 s
>
- 34.15 s
> ┌───────────────────────────────────────────────────────────┐
- 34.15 s
> │ Could not resolve the IP of the Symbolica license server. │
- 34.15 s
> │ │
- 34.15 s
> │ Please check your DNS configuration. │
- 34.15 s
> └───────────────────────────────────────────────────────────┘
- 34.15 s
> Error: failed to lookup address information: Temporary failure in name resolution
- 34.15 s
>
- 34.15 s
>
- 34.15 s
> Location:
- 34.15 s
> tests/tests/test_python_api.rs:156:20
- 34.15 s
> system-out
- 34.15 s
> running 1 test
- 34.15 s
> test python_evaluate_sample_preserves_graph_grouping_and_incoming_pdgs ... FAILED
- 34.15 s
>
- 34.15 s
> failures:
- 34.15 s
>
- 34.15 s
> failures:
- 34.15 s
> python_evaluate_sample_preserves_graph_grouping_and_incoming_pdgs
- 34.15 s
>
- 34.15 s
> test result: FAILED. 0 passed; 1 failed; 0 ignored; 0 measured; 4 filtered out; finished in 0.11s
- 34.15 s
> system-err
- 34.15 s
> Error: Python API test subprocess failed.
- 34.15 s
> stdout:
- 34.15 s
> ┌────────────────────────────────────────────────────────┐
- 34.15 s
> │ You are running a restricted Symbolica instance. │
- 34.15 s
> │ │
- 34.15 s
> │ This mode is only permitted for non-commercial use and │
- 34.15 s
> │ is limited to one instance and core per machine. │
- 34.15 s
> │ │
- 34.15 s
> │ Hobbyists can easily acquire a free license key │
- 34.15 s
> │ that unlocks all cores and removes this banner: │
- 34.15 s
> │ │
- 34.15 s
> │ from symbolica import * │
- 34.15 s
> │ request_hobbyist_license('YOUR_NAME', 'YOUR_EMAIL') │
- 34.15 s
> │ │
- 34.15 s
> │ All other users can obtain a free 30-day trial key: │
- 34.15 s
> │ │
- 34.15 s
> │ from symbolica import * │
- 34.15 s
> │ request_trial_license('NAME', 'EMAIL', 'EMPLOYER') │
- 34.15 s
> │ │
- 34.15 s
> │ See https://symbolica.io/docs/get_started.html#license │
- 34.15 s
> └────────────────────────────────────────────────────────┘
- 34.15 s
> ┌───────────────────────────────────────────────────────────────────────────────────────────────────────────┐
- 34.15 s
> │ Cannot start new unlicensed Symbolica instance since there is already another one running on the machine. │
- 34.15 s
> └───────────────────────────────────────────────────────────────────────────────────────────────────────────┘
- 34.15 s
>
- 34.15 s
> stderr:
- 34.15 s
>
- 34.15 s
> ┌───────────────────────────────────────────────────────────┐
- 34.15 s
> │ Could not resolve the IP of the Symbolica license server. │
- 34.15 s
> │ │
- 34.15 s
> │ Please check your DNS configuration. │
- 34.15 s
> └───────────────────────────────────────────────────────────┘
- 34.15 s
> Error: failed to lookup address information: Temporary failure in name resolution
- 34.15 s
>
- 34.15 s
>
- 34.15 s
> Location:
- 34.15 s
> tests/tests/test_python_api.rs:156:20
- 34.15 s
>
- 34.15 s
> 4. gammaloop-integration-tests::test_python_api::python_session_getters_return_live_toml_and_command_blocks
- 34.15 s
> failure: test failure with exit code 101
- 34.15 s
> Error: Python API test subprocess failed.
- 34.15 s
> stdout:
- 34.15 s
> ┌────────────────────────────────────────────────────────┐
- 34.15 s
> │ You are running a restricted Symbolica instance. │
- 34.15 s
> │ │
- 34.15 s
> │ This mode is only permitted for non-commercial use and │
- 34.15 s
> │ is limited to one instance and core per machine. │
- 34.15 s
> │ │
- 34.15 s
> │ Hobbyists can easily acquire a free license key │
- 34.15 s
> │ that unlocks all cores and removes this banner: │
- 34.15 s
> │ │
- 34.15 s
> │ from symbolica import * │
- 34.15 s
> │ request_hobbyist_license('YOUR_NAME', 'YOUR_EMAIL') │
- 34.15 s
> │ │
- 34.15 s
> │ All other users can obtain a free 30-day trial key: │
- 34.15 s
> │ │
- 34.15 s
> │ from symbolica import * │
- 34.15 s
> │ request_trial_license('NAME', 'EMAIL', 'EMPLOYER') │
- 34.15 s
> │ │
- 34.15 s
> │ See https://symbolica.io/docs/get_started.html#license │
- 34.15 s
> └────────────────────────────────────────────────────────┘
- 34.15 s
> ┌───────────────────────────────────────────────────────────────────────────────────────────────────────────┐
- 34.15 s
> │ Cannot start new unlicensed Symbolica instance since there is already another one running on the machine. │
- 34.15 s
> └───────────────────────────────────────────────────────────────────────────────────────────────────────────┘
- 34.15 s
>
- 34.15 s
> stderr:
- 34.15 s
>
- 34.15 s
> ┌───────────────────────────────────────────────────────────┐
- 34.15 s
> │ Could not resolve the IP of the Symbolica license server. │
- 34.15 s
> │ │
- 34.15 s
> │ Please check your DNS configuration. │
- 34.15 s
> └───────────────────────────────────────────────────────────┘
- 34.15 s
> Error: failed to lookup address information: Temporary failure in name resolution
- 34.15 s
>
- 34.15 s
>
- 34.15 s
> Location:
- 34.15 s
> tests/tests/test_python_api.rs:156:20
- 34.15 s
> system-out
- 34.15 s
> running 1 test
- 34.15 s
> test python_session_getters_return_live_toml_and_command_blocks ... FAILED
- 34.15 s
>
- 34.15 s
> failures:
- 34.15 s
>
- 34.15 s
> failures:
- 34.15 s
> python_session_getters_return_live_toml_and_command_blocks
- 34.15 s
>
- 34.15 s
> test result: FAILED. 0 passed; 1 failed; 0 ignored; 0 measured; 4 filtered out; finished in 0.11s
- 34.15 s
> system-err
- 34.15 s
> Error: Python API test subprocess failed.
- 34.15 s
> stdout:
- 34.15 s
> ┌────────────────────────────────────────────────────────┐
- 34.15 s
> │ You are running a restricted Symbolica instance. │
- 34.15 s
> │ │
- 34.15 s
> │ This mode is only permitted for non-commercial use and │
- 34.15 s
> │ is limited to one instance and core per machine. │
- 34.15 s
> │ │
- 34.15 s
> │ Hobbyists can easily acquire a free license key │
- 34.15 s
> │ that unlocks all cores and removes this banner: │
- 34.15 s
> │ │
- 34.15 s
> │ from symbolica import * │
- 34.15 s
> │ request_hobbyist_license('YOUR_NAME', 'YOUR_EMAIL') │
- 34.15 s
> │ │
- 34.15 s
> │ All other users can obtain a free 30-day trial key: │
- 34.15 s
> │ │
- 34.15 s
> │ from symbolica import * │
- 34.15 s
> │ request_trial_license('NAME', 'EMAIL', 'EMPLOYER') │
- 34.15 s
> │ │
- 34.15 s
> │ See https://symbolica.io/docs/get_started.html#license │
- 34.15 s
> └────────────────────────────────────────────────────────┘
- 34.15 s
> ┌───────────────────────────────────────────────────────────────────────────────────────────────────────────┐
- 34.15 s
> │ Cannot start new unlicensed Symbolica instance since there is already another one running on the machine. │
- 34.15 s
> └───────────────────────────────────────────────────────────────────────────────────────────────────────────┘
- 34.15 s
>
- 34.15 s
> stderr:
- 34.15 s
>
- 34.15 s
> ┌───────────────────────────────────────────────────────────┐
- 34.15 s
> │ Could not resolve the IP of the Symbolica license server. │
- 34.15 s
> │ │
- 34.15 s
> │ Please check your DNS configuration. │
- 34.15 s
> └───────────────────────────────────────────────────────────┘
- 34.15 s
> Error: failed to lookup address information: Temporary failure in name resolution
- 34.15 s
>
- 34.15 s
>
- 34.15 s
> Location:
- 34.15 s
> tests/tests/test_python_api.rs:156:20
- 34.15 s
> =========================================
- 34.15 s
For full logs, run:
- 34.15 s
nix log /nix/store/nmwgfm0zigizp5byy173df7l99i9kddz-gammaloop-nextest-python-api.drv
- 34.33 s
[0 built (1 failed), 0.0Run failed.