test packages.x86_64-linux.nix-ci-check-gammaloop-nextest-python-api

Reproduce this run
Original Run
  1. 0.00 s $ /nix/store/9ypz3flqsrl5xl495mm8h645gadjsxi1-coreutils-9.11/bin/timeout --kill-after=15s 7200s /nix/store/23zk8sgzamrbmj1fday15szf7f2279s8-nix-2.34.7/bin/nix --extra-experimental-features nix-command --extra-experimental-features flakes flake clone git+https://github.com/alphal00p/gammaloop --dest /tmp/nix-ci-worker/stable-pwd/repo/
  2. 0.07 s Cloning into '/tmp/nix-ci-worker/stable-pwd/repo'...
  3. 1.45 s remote: Enumerating objects: 93832, done.
  4. 1.57 s remote: Counting objects: 0% (1/9038) remote: Counting objects: 1% (91/9038) remote: Counting objects: 2% (181/9038) remote: Counting objects: 3% (272/9038) remote: Counting objects: 4% (362/9038) remote: Counting objects: 5% (452/9038) remote: Counting objects: 6% (543/9038) remote: Counting objects: 7% (633/9038) remote: Counting objects: 8% (724/9038) remote: Counting objects: 9% (814/9038) remote: Counting objects: 10% (904/9038) remote: Counting objects: 11% (995/9038) remote: Counting objects: 12% (1085/9038) remote: Counting objects: 13% (1175/9038) remote: Counting objects: 14% (1266/9038) remote: Counting objects: 15% (1356/9038) remote: Counting objects: 16% (1447/9038) remote: Counting objects: 17% (1537/9038) remote: Counting objects: 18% (1627/9038) remote: Counting objects: 19% (1718/9038) remote: Counting objects: 20% (1808/9038) remote: Counting objects: 21% (1898/9038) remote: Counting objects: 22% (1989/9038) remote: Counting objects: 23% (2079/9038) remote: Counting objects: 24% (2170/9038) remote: Counting objects: 25% (2260/9038) remote: Counting objects: 26% (2350/9038) remote: Counting objects: 27% (2441/9038) remote: Counting objects: 28% (2531/9038) remote: Counting objects: 29% (2622/9038) remote: Counting objects: 30% (2712/9038) remote: Counting objects: 31% (2802/9038) remote: Counting objects: 32% (2893/9038) remote: Counting objects: 33% (2983/9038) remote: Counting objects: 34% (3073/9038) remote: Counting objects: 35% (3164/9038) remote: Counting objects: 36% (3254/9038) remote: Counting objects: 37% (3345/9038) remote: Counting objects: 38% (3435/9038) remote: Counting objects: 39% (3525/9038) remote: Counting objects: 40% (3616/9038) remote: Counting objects: 41% (3706/9038) remote: Counting objects: 42% (3796/9038) remote: Counting objects: 43% (3887/9038) remote: Counting objects: 44% (3977/9038) remote: Counting objects: 45% (4068/9038) remote: Counting objects: 46% (4158/9038) remote: Counting objects: 47% (4248/9038) remote: Counting objects: 48% (4339/9038) remote: Counting objects: 49% (4429/9038) remote: Counting objects: 50% (4519/9038) remote: Counting objects: 51% (4610/9038) remote: Counting objects: 52% (4700/9038) remote: Counting objects: 53% (4791/9038) remote: Counting objects: 54% (4881/9038) remote: Counting objects: 55% (4971/9038) remote: Counting objects: 56% (5062/9038) remote: Counting objects: 57% (5152/9038) remote: Counting objects: 58% (5243/9038) remote: Counting objects: 59% (5333/9038) remote: Counting objects: 60% (5423/9038) remote: Counting objects: 61% (5514/9038) remote: Counting objects: 62% (5604/9038) remote: Counting objects: 63% (5694/9038) remote: Counting objects: 64% (5785/9038) remote: Counting objects: 65% (5875/9038) remote: Counting objects: 66% (5966/9038) remote: Counting objects: 67% (6056/9038) remote: Counting objects: 68% (6146/9038) remote: Counting objects: 69% (6237/9038) remote: Counting objects: 70% (6327/9038) remote: Counting objects: 71% (6417/9038) remote: Counting objects: 72% (6508/9038) remote: Counting objects: 73% (6598/9038) remote: Counting objects: 74% (6689/9038) remote: Counting objects: 75% (6779/9038) remote: Counting objects: 76% (6869/9038) remote: Counting objects: 77% (6960/9038) remote: Counting objects: 78% (7050/9038) remote: Counting objects: 79% (7141/9038) remote: Counting objects: 80% (7231/9038) remote: Counting objects: 81% (7321/9038) remote: Counting objects: 82% (7412/9038) remote: Counting objects: 83% (7502/9038) remote: Counting objects: 84% (7592/9038) remote: Counting objects: 85% (7683/9038) remote: Counting objects: 86% (7773/9038) remote: Counting objects: 87% (7864/9038) remote: Counting objects: 88% (7954/9038) remote: Counting objects: 89% (8044/9038) remote: Counting objects: 90% (8135/9038) remote: Counting objects: 91% (8225/9038) remote: Counting objects: 92% (8315/9038) remote: Counting objects: 93% (8406/9038) remote: Counting objects: 94% (8496/9038) remote: Counting objects: 95% (8587/9038) remote: Counting objects: 96% (8677/9038) remote: Counting objects: 97% (8767/9038) remote: Counting objects: 98% (8858/9038) remote: Counting objects: 99% (8948/9038) remote: Counting objects: 100% (9038/9038) remote: Counting objects: 100% (9038/9038), done.
  5. 4.03 s remote: Compressing objects: 0% (1/1850) remote: Compressing objects: 1% (19/1850) remote: Compressing objects: 2% (37/1850) remote: Compressing objects: 3% (56/1850) remote: Compressing objects: 4% (74/1850) remote: Compressing objects: 5% (93/1850) remote: Compressing objects: 6% (111/1850) remote: Compressing objects: 6% (123/1850) remote: Compressing objects: 7% (130/1850) remote: Compressing objects: 8% (148/1850) remote: Compressing objects: 9% (167/1850) remote: Compressing objects: 10% (185/1850) remote: Compressing objects: 11% (204/1850) remote: Compressing objects: 12% (222/1850) remote: Compressing objects: 13% (241/1850) remote: Compressing objects: 14% (259/1850) remote: Compressing objects: 15% (278/1850) remote: Compressing objects: 16% (296/1850) remote: Compressing objects: 16% (299/1850) remote: Compressing objects: 17% (315/1850) remote: Compressing objects: 18% (333/1850) remote: Compressing objects: 19% (352/1850) remote: Compressing objects: 20% (370/1850) remote: Compressing objects: 21% (389/1850) remote: Compressing objects: 22% (407/1850) remote: Compressing objects: 23% (426/1850) remote: Compressing objects: 24% (444/1850) remote: Compressing objects: 25% (463/1850) remote: Compressing objects: 26% (481/1850) remote: Compressing objects: 27% (500/1850) remote: Compressing objects: 28% (518/1850) remote: Compressing objects: 29% (537/1850) remote: Compressing objects: 30% (555/1850) remote: Compressing objects: 31% (574/1850) remote: Compressing objects: 32% (592/1850) remote: Compressing objects: 33% (611/1850) remote: Compressing objects: 34% (629/1850) remote: Compressing objects: 35% (648/1850) remote: Compressing objects: 36% (666/1850) remote: Compressing objects: 37% (685/1850) remote: Compressing objects: 38% (703/1850) remote: Compressing objects: 39% (722/1850) remote: Compressing objects: 40% (740/1850) remote: Compressing objects: 41% (759/1850) remote: Compressing objects: 42% (777/1850) remote: Compressing objects: 43% (796/1850) remote: Compressing objects: 44% (814/1850) remote: Compressing objects: 45% (833/1850) remote: Compressing objects: 46% (851/1850) remote: Compressing objects: 47% (870/1850) remote: Compressing objects: 48% (888/1850) remote: Compressing objects: 49% (907/1850) remote: Compressing objects: 50% (925/1850) remote: Compressing objects: 51% (944/1850) remote: Compressing objects: 52% (962/1850) remote: Compressing objects: 53% (981/1850) remote: Compressing objects: 54% (999/1850) remote: Compressing objects: 55% (1018/1850) remote: Compressing objects: 56% (1036/1850) remote: Compressing objects: 57% (1055/1850) remote: Compressing objects: 58% (1073/1850) remote: Compressing objects: 59% (1092/1850) remote: Compressing objects: 60% (1110/1850) remote: Compressing objects: 61% (1129/1850) remote: Compressing objects: 62% (1147/1850) remote: Compressing objects: 63% (1166/1850) remote: Compressing objects: 64% (1184/1850) remote: Compressing objects: 65% (1203/1850) remote: Compressing objects: 66% (1221/1850) remote: Compressing objects: 67% (1240/1850) remote: Compressing objects: 68% (1258/1850) remote: Compressing objects: 69% (1277/1850) remote: Compressing objects: 70% (1295/1850) remote: Compressing objects: 71% (1314/1850) remote: Compressing objects: 72% (1332/1850) remote: Compressing objects: 73% (1351/1850) remote: Compressing objects: 74% (1369/1850) remote: Compressing objects: 75% (1388/1850) remote: Compressing objects: 76% (1406/1850) remote: Compressing objects: 77% (1425/1850) remote: Compressing objects: 78% (1443/1850) remote: Compressing objects: 79% (1462/1850) remote: Compressing objects: 80% (1480/1850) remote: Compressing objects: 81% (1499/1850) remote: Compressing objects: 82% (1517/1850) remote: Compressing objects: 83% (1536/1850) remote: Compressing objects: 84% (1554/1850) remote: Compressing objects: 85% (1573/1850) remote: Compressing objects: 86% (1591/1850) remote: Compressing objects: 87% (1610/1850) remote: Compressing objects: 88% (1628/1850) remote: Compressing objects: 89% (1647/1850) remote: Compressing objects: 90% (1665/1850) remote: Compressing objects: 91% (1684/1850) remote: Compressing objects: 92% (1702/1850) remote: Compressing objects: 93% (1721/1850) remote: Compressing objects: 94% (1739/1850) remote: Compressing objects: 95% (1758/1850) remote: Compressing objects: 96% (1776/1850) remote: Compressing objects: 97% (1795/1850) remote: Compressing objects: 98% (1813/1850) remote: Compressing objects: 99% (1832/1850) remote: Compressing objects: 100% (1850/1850) remote: Compressing objects: 100% (1850/1850), done.
  6. 13.77 s Receiving objects: 0% (1/93832) Receiving objects: 1% (939/93832) Receiving objects: 2% (1877/93832) Receiving objects: 3% (2815/93832) Receiving objects: 4% (3754/93832) Receiving objects: 5% (4692/93832) Receiving objects: 6% (5630/93832) Receiving objects: 7% (6569/93832) Receiving objects: 8% (7507/93832), 14.84 MiB | 29.66 MiB/s Receiving objects: 9% (8445/93832), 14.84 MiB | 29.66 MiB/s Receiving objects: 10% (9384/93832), 14.84 MiB | 29.66 MiB/s Receiving objects: 11% (10322/93832), 14.84 MiB | 29.66 MiB/s Receiving objects: 12% (11260/93832), 14.84 MiB | 29.66 MiB/s Receiving objects: 13% (12199/93832), 14.84 MiB | 29.66 MiB/s Receiving objects: 14% (13137/93832), 14.84 MiB | 29.66 MiB/s Receiving objects: 15% (14075/93832), 14.84 MiB | 29.66 MiB/s Receiving objects: 16% (15014/93832), 14.84 MiB | 29.66 MiB/s Receiving objects: 17% (15952/93832), 14.84 MiB | 29.66 MiB/s Receiving objects: 18% (16890/93832), 14.84 MiB | 29.66 MiB/s Receiving objects: 19% (17829/93832), 14.84 MiB | 29.66 MiB/s Receiving objects: 20% (18767/93832), 14.84 MiB | 29.66 MiB/s Receiving objects: 21% (19705/93832), 14.84 MiB | 29.66 MiB/s Receiving objects: 22% (20644/93832), 14.84 MiB | 29.66 MiB/s Receiving objects: 23% (21582/93832), 14.84 MiB | 29.66 MiB/s Receiving objects: 24% (22520/93832), 14.84 MiB | 29.66 MiB/s Receiving objects: 25% (23458/93832), 14.84 MiB | 29.66 MiB/s Receiving objects: 26% (24397/93832), 14.84 MiB | 29.66 MiB/s Receiving objects: 27% (25335/93832), 14.84 MiB | 29.66 MiB/s Receiving objects: 28% (26273/93832), 14.84 MiB | 29.66 MiB/s Receiving objects: 29% (27212/93832), 14.84 MiB | 29.66 MiB/s Receiving objects: 30% (28150/93832), 14.84 MiB | 29.66 MiB/s Receiving objects: 31% (29088/93832), 14.84 MiB | 29.66 MiB/s Receiving objects: 32% (30027/93832), 14.84 MiB | 29.66 MiB/s Receiving objects: 33% (30965/93832), 14.84 MiB | 29.66 MiB/s Receiving objects: 34% (31903/93832), 14.84 MiB | 29.66 MiB/s Receiving objects: 35% (32842/93832), 14.84 MiB | 29.66 MiB/s Receiving objects: 35% (33272/93832), 14.84 MiB | 29.66 MiB/s Receiving objects: 36% (33780/93832), 31.12 MiB | 31.11 MiB/s Receiving objects: 37% (34718/93832), 31.12 MiB | 31.11 MiB/s Receiving objects: 38% (35657/93832), 31.12 MiB | 31.11 MiB/s Receiving objects: 39% (36595/93832), 31.12 MiB | 31.11 MiB/s Receiving objects: 40% (37533/93832), 31.12 MiB | 31.11 MiB/s Receiving objects: 41% (38472/93832), 31.12 MiB | 31.11 MiB/s Receiving objects: 42% (39410/93832), 31.12 MiB | 31.11 MiB/s Receiving objects: 43% (40348/93832), 47.64 MiB | 31.76 MiB/s Receiving objects: 44% (41287/93832), 47.64 MiB | 31.76 MiB/s Receiving objects: 45% (42225/93832), 47.64 MiB | 31.76 MiB/s Receiving objects: 46% (43163/93832), 47.64 MiB | 31.76 MiB/s Receiving objects: 47% (44102/93832), 47.64 MiB | 31.76 MiB/s Receiving objects: 48% (45040/93832), 47.64 MiB | 31.76 MiB/s Receiving objects: 49% (45978/93832), 47.64 MiB | 31.76 MiB/s Receiving objects: 50% (46916/93832), 47.64 MiB | 31.76 MiB/s Receiving objects: 51% (47855/93832), 47.64 MiB | 31.76 MiB/s Receiving objects: 51% (48754/93832), 63.85 MiB | 31.92 MiB/s Receiving objects: 52% (48793/93832), 63.85 MiB | 31.92 MiB/s Receiving objects: 53% (49731/93832), 63.85 MiB | 31.92 MiB/s Receiving objects: 54% (50670/93832), 63.85 MiB | 31.92 MiB/s Receiving objects: 55% (51608/93832), 63.85 MiB | 31.92 MiB/s Receiving objects: 56% (52546/93832), 63.85 MiB | 31.92 MiB/s Receiving objects: 57% (53485/93832), 63.85 MiB | 31.92 MiB/s Receiving objects: 58% (54423/93832), 79.86 MiB | 31.91 MiB/s Receiving objects: 59% (55361/93832), 79.86 MiB | 31.91 MiB/s Receiving objects: 60% (56300/93832), 79.86 MiB | 31.91 MiB/s Receiving objects: 61% (57238/93832), 79.86 MiB | 31.91 MiB/s Receiving objects: 61% (57339/93832), 95.76 MiB | 31.90 MiB/s Receiving objects: 61% (57496/93832), 127.71 MiB | 31.75 MiB/s Receiving objects: 61% (57592/93832), 143.83 MiB | 31.80 MiB/s Receiving objects: 61% (58032/93832), 175.71 MiB | 31.95 MiB/s Receiving objects: 62% (58176/93832), 207.61 MiB | 31.74 MiB/s Receiving objects: 63% (59115/93832), 207.61 MiB | 31.74 MiB/s Receiving objects: 64% (60053/93832), 207.61 MiB | 31.74 MiB/s Receiving objects: 65% (60991/93832), 207.61 MiB | 31.74 MiB/s Receiving objects: 66% (61930/93832), 207.61 MiB | 31.74 MiB/s Receiving objects: 67% (62868/93832), 207.61 MiB | 31.74 MiB/s Receiving objects: 67% (63600/93832), 207.61 MiB | 31.74 MiB/s Receiving objects: 68% (63806/93832), 207.61 MiB | 31.74 MiB/s Receiving objects: 69% (64745/93832), 223.64 MiB | 31.76 MiB/s Receiving objects: 70% (65683/93832), 223.64 MiB | 31.76 MiB/s Receiving objects: 71% (66621/93832), 239.50 MiB | 31.75 MiB/s Receiving objects: 72% (67560/93832), 239.50 MiB | 31.75 MiB/s Receiving objects: 73% (68498/93832), 239.50 MiB | 31.75 MiB/s Receiving objects: 74% (69436/93832), 239.50 MiB | 31.75 MiB/s Receiving objects: 75% (70374/93832), 239.50 MiB | 31.75 MiB/s Receiving objects: 76% (71313/93832), 239.50 MiB | 31.75 MiB/s Receiving objects: 77% (72251/93832), 239.50 MiB | 31.75 MiB/s Receiving objects: 78% (73189/93832), 239.50 MiB | 31.75 MiB/s Receiving objects: 79% (74128/93832), 239.50 MiB | 31.75 MiB/s Receiving objects: 80% (75066/93832), 239.50 MiB | 31.75 MiB/s Receiving objects: 81% (76004/93832), 239.50 MiB | 31.75 MiB/s Receiving objects: 81% (76250/93832), 239.50 MiB | 31.75 MiB/s Receiving objects: 82% (76943/93832), 255.46 MiB | 31.74 MiB/s Receiving objects: 83% (77881/93832), 271.28 MiB | 31.80 MiB/s Receiving objects: 84% (78819/93832), 271.28 MiB | 31.80 MiB/s Receiving objects: 85% (79758/93832), 271.28 MiB | 31.80 MiB/s Receiving objects: 85% (80178/93832), 271.28 MiB | 31.80 MiB/s Receiving objects: 86% (80696/93832), 287.20 MiB | 31.76 MiB/s Receiving objects: 87% (81634/93832), 287.20 MiB | 31.76 MiB/s Receiving objects: 88% (82573/93832), 287.20 MiB | 31.76 MiB/s Receiving objects: 89% (83511/93832), 287.20 MiB | 31.76 MiB/s Receiving objects: 90% (84449/93832), 287.20 MiB | 31.76 MiB/s Receiving objects: 91% (85388/93832), 303.33 MiB | 31.83 MiB/s Receiving objects: 92% (86326/93832), 303.33 MiB | 31.83 MiB/s Receiving objects: 93% (87264/93832), 303.33 MiB | 31.83 MiB/s Receiving objects: 94% (88203/93832), 303.33 MiB | 31.83 MiB/s Receiving objects: 95% (89141/93832), 303.33 MiB | 31.83 MiB/s Receiving objects: 96% (90079/93832), 303.33 MiB | 31.83 MiB/s Receiving objects: 97% (91018/93832), 303.33 MiB | 31.83 MiB/s Receiving objects: 98% (91956/93832), 303.33 MiB | 31.83 MiB/s Receiving objects: 99% (92894/93832), 303.33 MiB | 31.83 MiB/s remote: Total 93832 (delta 7875), reused 7207 (delta 7187), pack-reused 84794 (from 3)
  7. 13.77 s Receiving objects: 100% (93832/93832), 303.33 MiB | 31.83 MiB/s Receiving objects: 100% (93832/93832), 309.80 MiB | 31.83 MiB/s, done.
  8. 14.80 s Resolving deltas: 0% (0/63130) Resolving deltas: 1% (632/63130) Resolving deltas: 2% (1263/63130) Resolving deltas: 3% (1895/63130) Resolving deltas: 4% (2526/63130) Resolving deltas: 5% (3157/63130) Resolving deltas: 6% (3788/63130) Resolving deltas: 7% (4420/63130) Resolving deltas: 8% (5051/63130) Resolving deltas: 9% (5682/63130) Resolving deltas: 10% (6313/63130) Resolving deltas: 11% (6945/63130) Resolving deltas: 12% (7577/63130) Resolving deltas: 13% (8209/63130) Resolving deltas: 14% (8839/63130) Resolving deltas: 15% (9470/63130) Resolving deltas: 16% (10101/63130) Resolving deltas: 17% (10733/63130) Resolving deltas: 18% (11364/63130) Resolving deltas: 19% (11996/63130) Resolving deltas: 20% (12626/63130) Resolving deltas: 21% (13258/63130) Resolving deltas: 22% (13889/63130) Resolving deltas: 23% (14520/63130) Resolving deltas: 24% (15152/63130) Resolving deltas: 25% (15783/63130) Resolving deltas: 26% (16417/63130) Resolving deltas: 27% (17046/63130) Resolving deltas: 28% (17677/63130) Resolving deltas: 29% (18308/63130) Resolving deltas: 30% (18939/63130) Resolving deltas: 31% (19571/63130) Resolving deltas: 32% (20202/63130) Resolving deltas: 33% (20835/63130) Resolving deltas: 34% (21468/63130) Resolving deltas: 35% (22096/63130) Resolving deltas: 36% (22728/63130) Resolving deltas: 37% (23359/63130) Resolving deltas: 38% (23991/63130) Resolving deltas: 39% (24621/63130) Resolving deltas: 40% (25252/63130) Resolving deltas: 41% (25884/63130) Resolving deltas: 42% (26515/63130) Resolving deltas: 43% (27146/63130) Resolving deltas: 44% (27778/63130) Resolving deltas: 45% (28411/63130) Resolving deltas: 46% (29040/63130) Resolving deltas: 47% (29672/63130) Resolving deltas: 48% (30303/63130) Resolving deltas: 49% (30934/63130) Resolving deltas: 50% (31565/63130) Resolving deltas: 51% (32197/63130) Resolving deltas: 52% (32830/63130) Resolving deltas: 53% (33459/63130) Resolving deltas: 54% (34092/63130) Resolving deltas: 55% (34722/63130) Resolving deltas: 56% (35353/63130) Resolving deltas: 57% (35985/63130) Resolving deltas: 58% (36616/63130) Resolving deltas: 59% (37247/63130) Resolving deltas: 60% (37878/63130) Resolving deltas: 61% (38510/63130) Resolving deltas: 62% (39141/63130) Resolving deltas: 63% (39772/63130) Resolving deltas: 64% (40405/63130) Resolving deltas: 65% (41035/63130) Resolving deltas: 66% (41667/63130) Resolving deltas: 67% (42298/63130) Resolving deltas: 68% (42931/63130) Resolving deltas: 69% (43562/63130) Resolving deltas: 70% (44191/63130) Resolving deltas: 71% (44823/63130) Resolving deltas: 72% (45454/63130) Resolving deltas: 73% (46085/63130) Resolving deltas: 74% (46717/63130) Resolving deltas: 75% (47349/63130) Resolving deltas: 76% (47979/63130) Resolving deltas: 77% (48611/63130) Resolving deltas: 78% (49242/63130) Resolving deltas: 79% (49873/63130) Resolving deltas: 80% (50504/63130) Resolving deltas: 81% (51138/63130) Resolving deltas: 82% (51769/63130) Resolving deltas: 83% (52398/63130) Resolving deltas: 84% (53031/63130) Resolving deltas: 85% (53661/63130) Resolving deltas: 86% (54292/63130) Resolving deltas: 87% (54924/63130) Resolving deltas: 88% (55555/63130) Resolving deltas: 89% (56186/63130) Resolving deltas: 90% (56817/63130) Resolving deltas: 91% (57449/63130) Resolving deltas: 92% (58081/63130) Resolving deltas: 93% (58711/63130) Resolving deltas: 94% (59344/63130) Resolving deltas: 95% (59974/63130) Resolving deltas: 96% (60605/63130) Resolving deltas: 97% (61237/63130) Resolving deltas: 98% (61868/63130) Resolving deltas: 98% (61933/63130) Resolving deltas: 99% (62499/63130) Resolving deltas: 100% (63130/63130) Resolving deltas: 100% (63130/63130), done.
  9. 15.30 s Fetching commit 654d6aff73111149f97b220cbd7a9fe7bf7d23e4 for advanced_sampling ...
  10. 15.30 s $ /nix/store/bcnisk3ydfgv26v2gw3zlky24g00yww2-git-2.54.0/bin/git fetch origin 654d6aff73111149f97b220cbd7a9fe7bf7d23e4
  11. 16.02 s From https://github.com/alphal00p/gammaloop
  12. 16.02 s * branch 654d6aff73111149f97b220cbd7a9fe7bf7d23e4 -> FETCH_HEAD
  13. 16.03 s $ /nix/store/9ypz3flqsrl5xl495mm8h645gadjsxi1-coreutils-9.11/bin/timeout --kill-after=15s 7200s /nix/store/bcnisk3ydfgv26v2gw3zlky24g00yww2-git-2.54.0/bin/git -c advice.detachedHead=false checkout 654d6aff73111149f97b220cbd7a9fe7bf7d23e4
  14. 16.53 s HEAD is now at 654d6aff7 allow final underflow rounding and stage GL638 validation pilots
  15. 16.53 s $ /nix/store/9ypz3flqsrl5xl495mm8h645gadjsxi1-coreutils-9.11/bin/timeout --kill-after=15s 7200s /nix/store/23zk8sgzamrbmj1fday15szf7f2279s8-nix-2.34.7/bin/nix --extra-experimental-features nix-command --extra-experimental-features flakes --log-format internal-json run .#packages.x86_64-linux.nix-ci-check-gammaloop-nextest-python-api --print-build-logs
  16. 25.49 s
  17. 25.61 s Downloading cached boehm-gc from https://cache.nix-ci.com
  18. 25.61 s Downloading cached busybox from https://cache.nix-ci.com
  19. 25.61 s Downloading cached aws-c-common from https://cache.nix-ci.com
  20. 25.61 s Downloading cached brotli-1.2.0-lib from https://cache.nix-ci.com
  21. 25.61 s Downloading cached libcpuid from https://cache.nix-ci.com
  22. 25.61 s Downloading cached libseccomp-2.6.0-lib from https://cache.nix-ci.com
  23. 25.61 s Downloading cached libsodium-1.0.22-unstable-2026-04 from https://cache.nix-ci.com
  24. 25.61 s Downloading cached lowdown-3.0.1-lib from https://cache.nix-ci.com
  25. 25.61 s Downloading cached publicsuffix-list-0-unstable-2026-05 from https://cache.nix-ci.com
  26. 25.61 s Downloading cached icu4c from https://cache.nix-ci.com
  27. 25.61 s Downloading cached libssh2 from https://cache.nix-ci.com
  28. 25.61 s Downloading cached libxml2 from https://cache.nix-ci.com
  29. 25.61 s Downloading cached nghttp2-1.69.0-lib from https://cache.nix-ci.com
  30. 25.61 s Downloading cached nghttp3 from https://cache.nix-ci.com
  31. 25.61 s Downloading cached s2n-tls from https://cache.nix-ci.com
  32. 25.61 s Downloading cached ngtcp2 from https://cache.nix-ci.com
  33. 25.69 s Downloaded cached publicsuffix-list-0-unstable-2026-05 (329 KiB) in 77ms
  34. 25.69 s Progress: 0 of 1 built, 1 of 48 downloaded from cache (15 downloading)
  35. 25.69 s Downloading cached hwloc-2.14.0-lib from https://cache.nix-ci.com
  36. 25.69 s Downloaded cached hwloc-2.14.0-lib in 0ms
  37. 25.69 s Progress: 0 of 1 built, 2 of 48 downloaded from cache (15 downloading)
  38. 25.69 s Downloading cached keyutils-1.6.3-lib from https://cache.nix-ci.com
  39. 25.69 s Downloaded cached keyutils-1.6.3-lib in 0ms
  40. 25.69 s Progress: 0 of 1 built, 3 of 48 downloaded from cache (15 downloading)
  41. 25.69 s Downloading cached libpsl from https://cache.nix-ci.com
  42. 25.69 s Downloaded cached libpsl in 0ms
  43. 25.69 s Progress: 0 of 1 built, 4 of 48 downloaded from cache (15 downloading)
  44. 25.69 s Downloading cached krb5-1.22.2-lib from https://cache.nix-ci.com
  45. 25.71 s Downloaded cached nghttp2-1.69.0-lib (225 KiB) in 103ms
  46. 25.71 s Progress: 0 of 1 built, 5 of 48 downloaded from cache (15 downloading)
  47. 25.71 s Downloading cached onetbb from https://cache.nix-ci.com
  48. 25.71 s Downloaded cached onetbb in 0ms
  49. 25.71 s Progress: 0 of 1 built, 6 of 48 downloaded from cache (15 downloading)
  50. 25.71 s Downloading cached libblake3 from https://cache.nix-ci.com
  51. 25.71 s Downloaded cached libseccomp-2.6.0-lib (193 KiB) in 106ms
  52. 25.71 s Progress: 0 of 1 built, 7 of 48 downloaded from cache (15 downloading)
  53. 25.71 s Downloaded cached libcpuid (326 KiB) in 106ms
  54. 25.72 s Progress: 0 of 1 built, 8 of 48 downloaded from cache (14 downloading)
  55. 25.72 s Downloaded cached nghttp3 (228 KiB) in 106ms
  56. 25.72 s Progress: 0 of 1 built, 9 of 48 downloaded from cache (13 downloading)
  57. 25.73 s Downloaded cached libssh2 (330 KiB) in 120ms
  58. 25.73 s Progress: 0 of 1 built, 10 of 48 downloaded from cache (12 downloading)
  59. 25.73 s Downloaded cached busybox (230 KiB) in 123ms
  60. 25.73 s Progress: 0 of 1 built, 11 of 48 downloaded from cache (12 downloading)
  61. 25.73 s Downloading cached libgit2-1.9.4-lib from https://cache.nix-ci.com
  62. 25.73 s Downloaded cached libgit2-1.9.4-lib in 0ms
  63. 25.73 s Progress: 0 of 1 built, 12 of 48 downloaded from cache (11 downloading)
  64. 25.73 s Downloaded cached boehm-gc (312 KiB) in 123ms
  65. 25.73 s Progress: 0 of 1 built, 13 of 48 downloaded from cache (10 downloading)
  66. 25.73 s Downloaded cached lowdown-3.0.1-lib (341 KiB) in 121ms
  67. 25.73 s Progress: 0 of 1 built, 14 of 48 downloaded from cache (9 downloading)
  68. 25.73 s Downloaded cached ngtcp2 (515 KiB) in 121ms
  69. 25.73 s Progress: 0 of 1 built, 15 of 48 downloaded from cache (8 downloading)
  70. 25.73 s Downloaded cached aws-c-common (1.1 MiB) in 125ms
  71. 25.73 s Progress: 0 of 1 built, 16 of 48 downloaded from cache (7 downloading)
  72. 25.73 s Downloading cached aws-c-compression from https://cache.nix-ci.com
  73. 25.73 s Downloading cached aws-c-cal from https://cache.nix-ci.com
  74. 25.73 s Downloaded cached aws-c-compression in 0ms
  75. 25.73 s Downloading cached aws-c-sdkutils from https://cache.nix-ci.com
  76. 25.73 s Downloaded cached aws-c-cal in 0ms
  77. 25.73 s Downloaded cached aws-c-sdkutils in 0ms
  78. 25.73 s Downloading cached aws-checksums from https://cache.nix-ci.com
  79. 25.73 s Progress: 0 of 1 built, 17 of 48 downloaded from cache (10 downloading)
  80. 25.73 s Downloaded cached aws-checksums in 0ms
  81. 25.73 s Progress: 0 of 1 built, 18 of 48 downloaded from cache (9 downloading)
  82. 25.73 s Progress: 0 of 1 built, 19 of 48 downloaded from cache (8 downloading)
  83. 25.73 s Progress: 0 of 1 built, 20 of 48 downloaded from cache (7 downloading)
  84. 25.73 s Downloaded cached libsodium-1.0.22-unstable-2026-04 (666 KiB) in 126ms
  85. 25.73 s Progress: 0 of 1 built, 21 of 48 downloaded from cache (6 downloading)
  86. 25.74 s Downloaded cached s2n-tls (1.3 MiB) in 130ms
  87. 25.74 s Progress: 0 of 1 built, 22 of 48 downloaded from cache (5 downloading)
  88. 25.74 s Downloading cached aws-c-io from https://cache.nix-ci.com
  89. 25.74 s Downloaded cached aws-c-io in 0ms
  90. 25.74 s Progress: 0 of 1 built, 23 of 48 downloaded from cache (5 downloading)
  91. 25.74 s Downloading cached aws-c-event-stream from https://cache.nix-ci.com
  92. 25.74 s Downloading cached aws-c-http from https://cache.nix-ci.com
  93. 25.74 s Downloaded cached brotli-1.2.0-lib (961 KiB) in 133ms
  94. 25.74 s Progress: 0 of 1 built, 24 of 48 downloaded from cache (6 downloading)
  95. 25.75 s Downloaded cached libxml2 (1.4 MiB) in 137ms
  96. 25.75 s Progress: 0 of 1 built, 25 of 48 downloaded from cache (5 downloading)
  97. 25.75 s Downloading cached libarchive-3.8.8-lib from https://cache.nix-ci.com
  98. 25.75 s Downloaded cached libarchive-3.8.8-lib in 0ms
  99. 25.75 s Progress: 0 of 1 built, 26 of 48 downloaded from cache (5 downloading)
  100. 25.76 s Downloaded cached libblake3 (117 KiB) in 45ms
  101. 25.76 s Progress: 0 of 1 built, 27 of 48 downloaded from cache (4 downloading)
  102. 25.76 s Downloaded cached krb5-1.22.2-lib (2.7 MiB) in 71ms
  103. 25.76 s Progress: 0 of 1 built, 28 of 48 downloaded from cache (3 downloading)
  104. 25.76 s Downloading cached curl from https://cache.nix-ci.com
  105. 25.79 s Downloaded cached curl (1.2 MiB) in 27ms
  106. 25.79 s Progress: 0 of 1 built, 29 of 48 downloaded from cache (3 downloading)
  107. 25.79 s Downloaded cached aws-c-event-stream (176 KiB) in 50ms
  108. 25.79 s Progress: 0 of 1 built, 30 of 48 downloaded from cache (2 downloading)
  109. 25.80 s Downloaded cached aws-c-http (641 KiB) in 58ms
  110. 25.80 s Progress: 0 of 1 built, 31 of 48 downloaded from cache (1 downloading)
  111. 25.80 s Downloading cached aws-c-auth from https://cache.nix-ci.com
  112. 25.80 s Downloading cached aws-c-mqtt from https://cache.nix-ci.com
  113. 25.84 s Downloaded cached aws-c-auth (387 KiB) in 39ms
  114. 25.84 s Progress: 0 of 1 built, 32 of 48 downloaded from cache (2 downloading)
  115. 25.84 s Downloading cached aws-c-s3 from https://cache.nix-ci.com
  116. 25.84 s Downloaded cached aws-c-mqtt (557 KiB) in 44ms
  117. 25.84 s Progress: 0 of 1 built, 33 of 48 downloaded from cache (2 downloading)
  118. 25.88 s Downloaded cached aws-c-s3 (384 KiB) in 43ms
  119. 25.88 s Progress: 0 of 1 built, 34 of 48 downloaded from cache (1 downloading)
  120. 25.88 s Downloading cached aws-crt-cpp from https://cache.nix-ci.com
  121. 25.95 s Downloaded cached aws-crt-cpp (979 KiB) in 65ms
  122. 25.95 s Progress: 0 of 1 built, 35 of 48 downloaded from cache (1 downloading)
  123. 26.09 s Downloaded cached icu4c (38.2 MiB) in 484ms
  124. 26.09 s Progress: 0 of 1 built, 36 of 48 downloaded from cache
  125. 26.09 s Downloading cached boost from https://cache.nix-ci.com
  126. 26.09 s Downloaded cached boost in 0ms
  127. 26.09 s Progress: 0 of 1 built, 37 of 48 downloaded from cache
  128. 26.09 s Downloading cached nix-util from https://cache.nix-ci.com
  129. 26.09 s Downloaded cached nix-util in 0ms
  130. 26.09 s Progress: 0 of 1 built, 38 of 48 downloaded from cache
  131. 26.09 s Downloading cached nix-nswrapper from https://cache.nix-ci.com
  132. 26.09 s Downloaded cached nix-nswrapper in 0ms
  133. 26.09 s Progress: 0 of 1 built, 39 of 48 downloaded from cache (1 downloading)
  134. 26.09 s Downloading cached nix-store from https://cache.nix-ci.com
  135. 26.09 s Downloaded cached nix-store in 0ms
  136. 26.09 s Progress: 0 of 1 built, 40 of 48 downloaded from cache
  137. 26.09 s Downloading cached nix-fetchers from https://cache.nix-ci.com
  138. 26.09 s Downloaded cached nix-fetchers in 0ms
  139. 26.09 s Progress: 0 of 1 built, 41 of 48 downloaded from cache (1 downloading)
  140. 26.09 s Downloading cached nix-main from https://cache.nix-ci.com
  141. 26.09 s Downloaded cached nix-main in 0ms
  142. 26.09 s Progress: 0 of 1 built, 42 of 48 downloaded from cache (1 downloading)
  143. 26.09 s Downloading cached nix-expr from https://cache.nix-ci.com
  144. 26.12 s Downloaded cached nix-expr (3.3 MiB) in 29ms
  145. 26.12 s Progress: 0 of 1 built, 43 of 48 downloaded from cache
  146. 26.12 s Downloading cached nix-flake from https://cache.nix-ci.com
  147. 26.12 s Downloaded cached nix-flake in 0ms
  148. 26.12 s Progress: 0 of 1 built, 44 of 48 downloaded from cache
  149. 26.12 s Downloading cached nix-cmd from https://cache.nix-ci.com
  150. 26.14 s Downloaded cached nix-cmd (1 MiB) in 18ms
  151. 26.14 s Progress: 0 of 1 built, 45 of 48 downloaded from cache
  152. 26.14 s Downloading cached nix from https://cache.nix-ci.com
  153. 26.18 s Downloaded cached nix (3.9 MiB) in 36ms
  154. 26.18 s Progress: 0 of 1 built, 46 of 48 downloaded from cache
  155. 26.18 s Downloading cached nix from https://cache.nix-ci.com
  156. 26.18 s Downloaded cached nix in 0ms
  157. 26.18 s Progress: 0 of 1 built, 47 of 48 downloaded from cache
  158. 26.18 s Downloading cached nix-ci-check-gammaloop-nextest-python-api from https://cache.nix-ci.com
  159. 26.18 s Downloaded cached nix-ci-check-gammaloop-nextest-python-api (1104 B) in 3ms
  160. 26.18 s Progress: 0 of 1 built, 48 of 48 downloaded from cache
  161. 33.71 s evaluating derivation 'g copying '/nix/store/7nm0 evaluating derivation 'g copying '/nix/store/7nm0 evaluating derivation 'g copying '/nix/store/7nm0 evaluating derivation 'g copying '/nix/store/7nm0 evaluating derivation 'g copying '/nix/store/7nm0 evaluating derivation 'g copying '/nix/store/7nm0 evaluating derivation 'g copying '/nix/store/7nm0 evaluating derivation 'g copying '/nix/store/7nm0 evaluating derivation 'g copying '/nix/store/7nm0 evaluating derivation 'g copying '/nix/store/7nm0 evaluating derivation 'g querying gammaloop-nexte [0/9 built, 0.0 KiB DL] [0/1 built, 0.0 KiB DL] [1/0/1 built, 0.0 KiB DLgammaloop-nextest-python-api> Extracting 1 binary, 1 build script output directory, and 3 linked paths to /build/nextest-archive-Hwt2Lj
  162. 33.77 s gammaloop-nextest-python-api> Extracted 18 files to /build/nextest-archive-Hwt2Lj in 0.06s
  163. 33.78 s gammaloop-nextest-python-api> ------------
  164. 33.78 s gammaloop-nextest-python-api> Nextest run ID 71b70952-8308-4d0e-9e30-05a357df5f23 with nextest profile: ci_gammaloop
  165. 33.78 s gammaloop-nextest-python-api> Starting 5 tests across 1 binary
  166. 33.90 s gammaloop-nextest-python-api> FAIL [ 0.113s] (1/5) gammaloop-integration-tests::test_python_api python_evaluate_sample_honors_generate_events_and_observable_snapshots
  167. 33.90 s gammaloop-nextest-python-api> stdout ---
  168. 33.90 s gammaloop-nextest-python-api>
  169. 33.90 s gammaloop-nextest-python-api> running 1 test
  170. 33.90 s gammaloop-nextest-python-api> test python_evaluate_sample_honors_generate_events_and_observable_snapshots ... FAILED
  171. 33.90 s gammaloop-nextest-python-api>
  172. 33.90 s gammaloop-nextest-python-api> failures:
  173. 33.90 s gammaloop-nextest-python-api>
  174. 33.90 s gammaloop-nextest-python-api> failures:
  175. 33.90 s gammaloop-nextest-python-api> python_evaluate_sample_honors_generate_events_and_observable_snapshots
  176. 33.90 s gammaloop-nextest-python-api>
  177. 33.90 s gammaloop-nextest-python-api> test result: FAILED. 0 passed; 1 failed; 0 ignored; 0 measured; 4 filtered out; finished in 0.11s
  178. 33.90 s gammaloop-nextest-python-api>
  179. 33.90 s gammaloop-nextest-python-api> stderr ---
  180. 33.90 s gammaloop-nextest-python-api> Error: Python API test subprocess failed.
  181. 33.90 s gammaloop-nextest-python-api> stdout:
  182. 33.90 s gammaloop-nextest-python-api> ┌────────────────────────────────────────────────────────┐
  183. 33.90 s gammaloop-nextest-python-api> │ You are running a restricted Symbolica instance. │
  184. 33.90 s gammaloop-nextest-python-api> │ │
  185. 33.90 s gammaloop-nextest-python-api> │ This mode is only permitted for non-commercial use and │
  186. 33.90 s gammaloop-nextest-python-api> │ is limited to one instance and core per machine. │
  187. 33.90 s gammaloop-nextest-python-api> │ │
  188. 33.90 s gammaloop-nextest-python-api> │ Hobbyists can easily acquire a free license key │
  189. 33.90 s gammaloop-nextest-python-api> │ that unlocks all cores and removes this banner: │
  190. 33.90 s gammaloop-nextest-python-api> │ │
  191. 33.90 s gammaloop-nextest-python-api> │ from symbolica import * │
  192. 33.90 s gammaloop-nextest-python-api> │ request_hobbyist_license('YOUR_NAME', 'YOUR_EMAIL') │
  193. 33.90 s gammaloop-nextest-python-api> │ │
  194. 33.90 s gammaloop-nextest-python-api> │ All other users can obtain a free 30-day trial key: │
  195. 33.90 s gammaloop-nextest-python-api> │ │
  196. 33.90 s gammaloop-nextest-python-api> │ from symbolica import * │
  197. 33.90 s gammaloop-nextest-python-api> │ request_trial_license('NAME', 'EMAIL', 'EMPLOYER') │
  198. 33.90 s gammaloop-nextest-python-api> │ │
  199. 33.90 s gammaloop-nextest-python-api> │ See https://symbolica.io/docs/get_started.html#license │
  200. 33.90 s gammaloop-nextest-python-api> └────────────────────────────────────────────────────────┘
  201. 33.90 s gammaloop-nextest-python-api> ┌───────────────────────────────────────────────────────────────────────────────────────────────────────────┐
  202. 33.90 s gammaloop-nextest-python-api> │ Cannot start new unlicensed Symbolica instance since there is already another one running on the machine. │
  203. 33.90 s gammaloop-nextest-python-api> └───────────────────────────────────────────────────────────────────────────────────────────────────────────┘
  204. 33.90 s gammaloop-nextest-python-api>
  205. 33.90 s gammaloop-nextest-python-api> stderr:
  206. 33.90 s gammaloop-nextest-python-api>
  207. 33.90 s gammaloop-nextest-python-api> ┌───────────────────────────────────────────────────────────┐
  208. 33.90 s gammaloop-nextest-python-api> │ Could not resolve the IP of the Symbolica license server. │
  209. 33.90 s gammaloop-nextest-python-api> │ │
  210. 33.90 s gammaloop-nextest-python-api> │ Please check your DNS configuration. │
  211. 33.90 s gammaloop-nextest-python-api> └───────────────────────────────────────────────────────────┘
  212. 33.90 s gammaloop-nextest-python-api> Error: failed to lookup address information: Temporary failure in name resolution
  213. 33.90 s gammaloop-nextest-python-api>
  214. 33.90 s gammaloop-nextest-python-api>
  215. 33.90 s gammaloop-nextest-python-api> Location:
  216. 33.90 s gammaloop-nextest-python-api> tests/tests/test_python_api.rs:156:20
  217. 33.90 s gammaloop-nextest-python-api>
  218. 33.90 s gammaloop-nextest-python-api> FAIL [ 0.114s] (2/5) gammaloop-integration-tests::test_python_api python_evaluate_samples_batch_and_momentum_space_have_expected_shape
  219. 33.90 s gammaloop-nextest-python-api> stdout ---
  220. 33.90 s gammaloop-nextest-python-api>
  221. 33.90 s gammaloop-nextest-python-api> running 1 test
  222. 33.90 s gammaloop-nextest-python-api> test python_evaluate_samples_batch_and_momentum_space_have_expected_shape ... FAILED
  223. 33.90 s gammaloop-nextest-python-api>
  224. 33.90 s gammaloop-nextest-python-api> failures:
  225. 33.90 s gammaloop-nextest-python-api>
  226. 33.90 s gammaloop-nextest-python-api> failures:
  227. 33.90 s gammaloop-nextest-python-api> python_evaluate_samples_batch_and_momentum_space_have_expected_shape
  228. 33.90 s gammaloop-nextest-python-api>
  229. 33.90 s gammaloop-nextest-python-api> test result: FAILED. 0 passed; 1 failed; 0 ignored; 0 measured; 4 filtered out; finished in 0.11s
  230. 33.90 s gammaloop-nextest-python-api>
  231. 33.90 s gammaloop-nextest-python-api> stderr ---
  232. 33.90 s gammaloop-nextest-python-api> Error: Python API test subprocess failed.
  233. 33.90 s gammaloop-nextest-python-api> stdout:
  234. 33.90 s gammaloop-nextest-python-api> ┌────────────────────────────────────────────────────────┐
  235. 33.90 s gammaloop-nextest-python-api> │ You are running a restricted Symbolica instance. │
  236. 33.90 s gammaloop-nextest-python-api> │ │
  237. 33.90 s gammaloop-nextest-python-api> │ This mode is only permitted for non-commercial use and │
  238. 33.90 s gammaloop-nextest-python-api> │ is limited to one instance and core per machine. │
  239. 33.90 s gammaloop-nextest-python-api> │ │
  240. 33.90 s gammaloop-nextest-python-api> │ Hobbyists can easily acquire a free license key │
  241. 33.90 s gammaloop-nextest-python-api> │ that unlocks all cores and removes this banner: │
  242. 33.90 s gammaloop-nextest-python-api> │ │
  243. 33.90 s gammaloop-nextest-python-api> │ from symbolica import * │
  244. 33.90 s gammaloop-nextest-python-api> │ request_hobbyist_license('YOUR_NAME', 'YOUR_EMAIL') │
  245. 33.90 s gammaloop-nextest-python-api> │ │
  246. 33.90 s gammaloop-nextest-python-api> │ All other users can obtain a free 30-day trial key: │
  247. 33.90 s gammaloop-nextest-python-api> │ │
  248. 33.90 s gammaloop-nextest-python-api> │ from symbolica import * │
  249. 33.90 s gammaloop-nextest-python-api> │ request_trial_license('NAME', 'EMAIL', 'EMPLOYER') │
  250. 33.90 s gammaloop-nextest-python-api> │ │
  251. 33.90 s gammaloop-nextest-python-api> │ See https://symbolica.io/docs/get_started.html#license │
  252. 33.90 s gammaloop-nextest-python-api> └────────────────────────────────────────────────────────┘
  253. 33.90 s gammaloop-nextest-python-api> ┌───────────────────────────────────────────────────────────────────────────────────────────────────────────┐
  254. 33.90 s gammaloop-nextest-python-api> │ Cannot start new unlicensed Symbolica instance since there is already another one running on the machine. │
  255. 33.90 s gammaloop-nextest-python-api> └───────────────────────────────────────────────────────────────────────────────────────────────────────────┘
  256. 33.90 s gammaloop-nextest-python-api>
  257. 33.90 s gammaloop-nextest-python-api> stderr:
  258. 33.90 s gammaloop-nextest-python-api>
  259. 33.90 s gammaloop-nextest-python-api> ┌───────────────────────────────────────────────────────────┐
  260. 33.90 s gammaloop-nextest-python-api> │ Could not resolve the IP of the Symbolica license server. │
  261. 33.90 s gammaloop-nextest-python-api> │ │
  262. 33.90 s gammaloop-nextest-python-api> │ Please check your DNS configuration. │
  263. 33.90 s gammaloop-nextest-python-api> └───────────────────────────────────────────────────────────┘
  264. 33.90 s gammaloop-nextest-python-api> Error: failed to lookup address information: Temporary failure in name resolution
  265. 33.90 s gammaloop-nextest-python-api>
  266. 33.90 s gammaloop-nextest-python-api>
  267. 33.90 s gammaloop-nextest-python-api> Location:
  268. 33.90 s gammaloop-nextest-python-api> tests/tests/test_python_api.rs:156:20
  269. 33.90 s gammaloop-nextest-python-api>
  270. 33.90 s gammaloop-nextest-python-api> FAIL [ 0.118s] (3/5) gammaloop-integration-tests::test_python_api python_evaluate_sample_preserves_graph_grouping_and_incoming_pdgs
  271. 33.90 s gammaloop-nextest-python-api> stdout ---
  272. 33.90 s gammaloop-nextest-python-api>
  273. 33.90 s gammaloop-nextest-python-api> running 1 test
  274. 33.90 s gammaloop-nextest-python-api> test python_evaluate_sample_preserves_graph_grouping_and_incoming_pdgs ... FAILED
  275. 33.90 s gammaloop-nextest-python-api>
  276. 33.90 s gammaloop-nextest-python-api> failures:
  277. 33.90 s gammaloop-nextest-python-api>
  278. 33.90 s gammaloop-nextest-python-api> failures:
  279. 33.90 s gammaloop-nextest-python-api> python_evaluate_sample_preserves_graph_grouping_and_incoming_pdgs
  280. 33.90 s gammaloop-nextest-python-api>
  281. 33.90 s gammaloop-nextest-python-api> test result: FAILED. 0 passed; 1 failed; 0 ignored; 0 measured; 4 filtered out; finished in 0.11s
  282. 33.90 s gammaloop-nextest-python-api>
  283. 33.90 s gammaloop-nextest-python-api> stderr ---
  284. 33.90 s gammaloop-nextest-python-api> Error: Python API test subprocess failed.
  285. 33.90 s gammaloop-nextest-python-api> stdout:
  286. 33.90 s gammaloop-nextest-python-api> ┌────────────────────────────────────────────────────────┐
  287. 33.90 s gammaloop-nextest-python-api> │ You are running a restricted Symbolica instance. │
  288. 33.90 s gammaloop-nextest-python-api> │ │
  289. 33.90 s gammaloop-nextest-python-api> │ This mode is only permitted for non-commercial use and │
  290. 33.90 s gammaloop-nextest-python-api> │ is limited to one instance and core per machine. │
  291. 33.90 s gammaloop-nextest-python-api> │ │
  292. 33.90 s gammaloop-nextest-python-api> │ Hobbyists can easily acquire a free license key │
  293. 33.90 s gammaloop-nextest-python-api> │ that unlocks all cores and removes this banner: │
  294. 33.90 s gammaloop-nextest-python-api> │ │
  295. 33.90 s gammaloop-nextest-python-api> │ from symbolica import * │
  296. 33.90 s gammaloop-nextest-python-api> │ request_hobbyist_license('YOUR_NAME', 'YOUR_EMAIL') │
  297. 33.90 s gammaloop-nextest-python-api> │ │
  298. 33.90 s gammaloop-nextest-python-api> │ All other users can obtain a free 30-day trial key: │
  299. 33.90 s gammaloop-nextest-python-api> │ │
  300. 33.90 s gammaloop-nextest-python-api> │ from symbolica import * │
  301. 33.90 s gammaloop-nextest-python-api> │ request_trial_license('NAME', 'EMAIL', 'EMPLOYER') │
  302. 33.90 s gammaloop-nextest-python-api> │ │
  303. 33.90 s gammaloop-nextest-python-api> │ See https://symbolica.io/docs/get_started.html#license │
  304. 33.90 s gammaloop-nextest-python-api> └────────────────────────────────────────────────────────┘
  305. 33.90 s gammaloop-nextest-python-api> ┌───────────────────────────────────────────────────────────────────────────────────────────────────────────┐
  306. 33.90 s gammaloop-nextest-python-api> │ Cannot start new unlicensed Symbolica instance since there is already another one running on the machine. │
  307. 33.90 s gammaloop-nextest-python-api> └───────────────────────────────────────────────────────────────────────────────────────────────────────────┘
  308. 33.90 s gammaloop-nextest-python-api>
  309. 33.90 s gammaloop-nextest-python-api> stderr:
  310. 33.90 s gammaloop-nextest-python-api>
  311. 33.90 s gammaloop-nextest-python-api> ┌───────────────────────────────────────────────────────────┐
  312. 33.90 s gammaloop-nextest-python-api> │ Could not resolve the IP of the Symbolica license server. │
  313. 33.90 s gammaloop-nextest-python-api> │ │
  314. 33.90 s gammaloop-nextest-python-api> │ Please check your DNS configuration. │
  315. 33.90 s gammaloop-nextest-python-api> └───────────────────────────────────────────────────────────┘
  316. 33.90 s gammaloop-nextest-python-api> Error: failed to lookup address information: Temporary failure in name resolution
  317. 33.90 s gammaloop-nextest-python-api>
  318. 33.90 s gammaloop-nextest-python-api>
  319. 33.90 s gammaloop-nextest-python-api> Location:
  320. 33.90 s gammaloop-nextest-python-api> tests/tests/test_python_api.rs:156:20
  321. 33.90 s gammaloop-nextest-python-api>
  322. 33.90 s gammaloop-nextest-python-api> FAIL [ 0.118s] (4/5) gammaloop-integration-tests::test_python_api python_session_getters_return_live_toml_and_command_blocks
  323. 33.90 s gammaloop-nextest-python-api> stdout ---
  324. 33.90 s gammaloop-nextest-python-api>
  325. 33.90 s gammaloop-nextest-python-api> running 1 test
  326. 33.90 s gammaloop-nextest-python-api> test python_session_getters_return_live_toml_and_command_blocks ... FAILED
  327. 33.90 s gammaloop-nextest-python-api>
  328. 33.90 s gammaloop-nextest-python-api> failures:
  329. 33.90 s gammaloop-nextest-python-api>
  330. 33.90 s gammaloop-nextest-python-api> failures:
  331. 33.90 s gammaloop-nextest-python-api> python_session_getters_return_live_toml_and_command_blocks
  332. 33.90 s gammaloop-nextest-python-api>
  333. 33.90 s gammaloop-nextest-python-api> test result: FAILED. 0 passed; 1 failed; 0 ignored; 0 measured; 4 filtered out; finished in 0.11s
  334. 33.90 s gammaloop-nextest-python-api>
  335. 33.90 s gammaloop-nextest-python-api> stderr ---
  336. 33.90 s gammaloop-nextest-python-api> Error: Python API test subprocess failed.
  337. 33.90 s gammaloop-nextest-python-api> stdout:
  338. 33.90 s gammaloop-nextest-python-api> ┌────────────────────────────────────────────────────────┐
  339. 33.90 s gammaloop-nextest-python-api> │ You are running a restricted Symbolica instance. │
  340. 33.90 s gammaloop-nextest-python-api> │ │
  341. 33.90 s gammaloop-nextest-python-api> │ This mode is only permitted for non-commercial use and │
  342. 33.90 s gammaloop-nextest-python-api> │ is limited to one instance and core per machine. │
  343. 33.90 s gammaloop-nextest-python-api> │ │
  344. 33.90 s gammaloop-nextest-python-api> │ Hobbyists can easily acquire a free license key │
  345. 33.90 s gammaloop-nextest-python-api> │ that unlocks all cores and removes this banner: │
  346. 33.90 s gammaloop-nextest-python-api> │ │
  347. 33.90 s gammaloop-nextest-python-api> │ from symbolica import * │
  348. 33.90 s gammaloop-nextest-python-api> │ request_hobbyist_license('YOUR_NAME', 'YOUR_EMAIL') │
  349. 33.90 s gammaloop-nextest-python-api> │ │
  350. 33.90 s gammaloop-nextest-python-api> │ All other users can obtain a free 30-day trial key: │
  351. 33.90 s gammaloop-nextest-python-api> │ │
  352. 33.90 s gammaloop-nextest-python-api> │ from symbolica import * │
  353. 33.90 s gammaloop-nextest-python-api> │ request_trial_license('NAME', 'EMAIL', 'EMPLOYER') │
  354. 33.90 s gammaloop-nextest-python-api> │ │
  355. 33.90 s gammaloop-nextest-python-api> │ See https://symbolica.io/docs/get_started.html#license │
  356. 33.90 s gammaloop-nextest-python-api> └────────────────────────────────────────────────────────┘
  357. 33.90 s gammaloop-nextest-python-api> ┌───────────────────────────────────────────────────────────────────────────────────────────────────────────┐
  358. 33.90 s gammaloop-nextest-python-api> │ Cannot start new unlicensed Symbolica instance since there is already another one running on the machine. │
  359. 33.90 s gammaloop-nextest-python-api> └───────────────────────────────────────────────────────────────────────────────────────────────────────────┘
  360. 33.90 s gammaloop-nextest-python-api>
  361. 33.90 s gammaloop-nextest-python-api> stderr:
  362. 33.90 s gammaloop-nextest-python-api>
  363. 33.90 s gammaloop-nextest-python-api> ┌───────────────────────────────────────────────────────────┐
  364. 33.90 s gammaloop-nextest-python-api> │ Could not resolve the IP of the Symbolica license server. │
  365. 33.90 s gammaloop-nextest-python-api> │ │
  366. 33.90 s gammaloop-nextest-python-api> │ Please check your DNS configuration. │
  367. 33.90 s gammaloop-nextest-python-api> └───────────────────────────────────────────────────────────┘
  368. 33.90 s gammaloop-nextest-python-api> Error: failed to lookup address information: Temporary failure in name resolution
  369. 33.90 s gammaloop-nextest-python-api>
  370. 33.90 s gammaloop-nextest-python-api>
  371. 33.90 s gammaloop-nextest-python-api> Location:
  372. 33.90 s gammaloop-nextest-python-api> tests/tests/test_python_api.rs:156:20
  373. 33.90 s gammaloop-nextest-python-api>
  374. 34.07 s gammaloop-nextest-python-api> ------------
  375. 34.07 s gammaloop-nextest-python-api> Summary [ 0.286s] 5 tests run: 1 passed, 4 failed, 0 skipped
  376. 34.07 s gammaloop-nextest-python-api> FAIL [ 0.113s] (1/5) gammaloop-integration-tests::test_python_api python_evaluate_sample_honors_generate_events_and_observable_snapshots
  377. 34.07 s gammaloop-nextest-python-api> stdout ---
  378. 34.07 s gammaloop-nextest-python-api>
  379. 34.07 s gammaloop-nextest-python-api> running 1 test
  380. 34.07 s gammaloop-nextest-python-api> test python_evaluate_sample_honors_generate_events_and_observable_snapshots ... FAILED
  381. 34.07 s gammaloop-nextest-python-api>
  382. 34.07 s gammaloop-nextest-python-api> failures:
  383. 34.07 s gammaloop-nextest-python-api>
  384. 34.07 s gammaloop-nextest-python-api> failures:
  385. 34.07 s gammaloop-nextest-python-api> python_evaluate_sample_honors_generate_events_and_observable_snapshots
  386. 34.07 s gammaloop-nextest-python-api>
  387. 34.07 s gammaloop-nextest-python-api> test result: FAILED. 0 passed; 1 failed; 0 ignored; 0 measured; 4 filtered out; finished in 0.11s
  388. 34.07 s gammaloop-nextest-python-api>
  389. 34.07 s gammaloop-nextest-python-api> stderr ---
  390. 34.07 s gammaloop-nextest-python-api> Error: Python API test subprocess failed.
  391. 34.07 s gammaloop-nextest-python-api> stdout:
  392. 34.07 s gammaloop-nextest-python-api> ┌────────────────────────────────────────────────────────┐
  393. 34.07 s gammaloop-nextest-python-api> │ You are running a restricted Symbolica instance. │
  394. 34.07 s gammaloop-nextest-python-api> │ │
  395. 34.07 s gammaloop-nextest-python-api> │ This mode is only permitted for non-commercial use and │
  396. 34.07 s gammaloop-nextest-python-api> │ is limited to one instance and core per machine. │
  397. 34.07 s gammaloop-nextest-python-api> │ │
  398. 34.07 s gammaloop-nextest-python-api> │ Hobbyists can easily acquire a free license key │
  399. 34.07 s gammaloop-nextest-python-api> │ that unlocks all cores and removes this banner: │
  400. 34.07 s gammaloop-nextest-python-api> │ │
  401. 34.07 s gammaloop-nextest-python-api> │ from symbolica import * │
  402. 34.07 s gammaloop-nextest-python-api> │ request_hobbyist_license('YOUR_NAME', 'YOUR_EMAIL') │
  403. 34.07 s gammaloop-nextest-python-api> │ │
  404. 34.07 s gammaloop-nextest-python-api> │ All other users can obtain a free 30-day trial key: │
  405. 34.07 s gammaloop-nextest-python-api> │ │
  406. 34.07 s gammaloop-nextest-python-api> │ from symbolica import * │
  407. 34.07 s gammaloop-nextest-python-api> │ request_trial_license('NAME', 'EMAIL', 'EMPLOYER') │
  408. 34.07 s gammaloop-nextest-python-api> │ │
  409. 34.07 s gammaloop-nextest-python-api> │ See https://symbolica.io/docs/get_started.html#license │
  410. 34.07 s gammaloop-nextest-python-api> └────────────────────────────────────────────────────────┘
  411. 34.07 s gammaloop-nextest-python-api> ┌───────────────────────────────────────────────────────────────────────────────────────────────────────────┐
  412. 34.07 s gammaloop-nextest-python-api> │ Cannot start new unlicensed Symbolica instance since there is already another one running on the machine. │
  413. 34.07 s gammaloop-nextest-python-api> └───────────────────────────────────────────────────────────────────────────────────────────────────────────┘
  414. 34.07 s gammaloop-nextest-python-api>
  415. 34.07 s gammaloop-nextest-python-api> stderr:
  416. 34.07 s gammaloop-nextest-python-api>
  417. 34.07 s gammaloop-nextest-python-api> ┌───────────────────────────────────────────────────────────┐
  418. 34.07 s gammaloop-nextest-python-api> │ Could not resolve the IP of the Symbolica license server. │
  419. 34.07 s gammaloop-nextest-python-api> │ │
  420. 34.07 s gammaloop-nextest-python-api> │ Please check your DNS configuration. │
  421. 34.07 s gammaloop-nextest-python-api> └───────────────────────────────────────────────────────────┘
  422. 34.07 s gammaloop-nextest-python-api> Error: failed to lookup address information: Temporary failure in name resolution
  423. 34.07 s gammaloop-nextest-python-api>
  424. 34.07 s gammaloop-nextest-python-api>
  425. 34.07 s gammaloop-nextest-python-api> Location:
  426. 34.07 s gammaloop-nextest-python-api> tests/tests/test_python_api.rs:156:20
  427. 34.07 s gammaloop-nextest-python-api>
  428. 34.07 s gammaloop-nextest-python-api> FAIL [ 0.114s] (2/5) gammaloop-integration-tests::test_python_api python_evaluate_samples_batch_and_momentum_space_have_expected_shape
  429. 34.07 s gammaloop-nextest-python-api> stdout ---
  430. 34.07 s gammaloop-nextest-python-api>
  431. 34.07 s gammaloop-nextest-python-api> running 1 test
  432. 34.07 s gammaloop-nextest-python-api> test python_evaluate_samples_batch_and_momentum_space_have_expected_shape ... FAILED
  433. 34.07 s gammaloop-nextest-python-api>
  434. 34.07 s gammaloop-nextest-python-api> failures:
  435. 34.07 s gammaloop-nextest-python-api>
  436. 34.07 s gammaloop-nextest-python-api> failures:
  437. 34.07 s gammaloop-nextest-python-api> python_evaluate_samples_batch_and_momentum_space_have_expected_shape
  438. 34.07 s gammaloop-nextest-python-api>
  439. 34.07 s gammaloop-nextest-python-api> test result: FAILED. 0 passed; 1 failed; 0 ignored; 0 measured; 4 filtered out; finished in 0.11s
  440. 34.07 s gammaloop-nextest-python-api>
  441. 34.07 s gammaloop-nextest-python-api> stderr ---
  442. 34.07 s gammaloop-nextest-python-api> Error: Python API test subprocess failed.
  443. 34.07 s gammaloop-nextest-python-api> stdout:
  444. 34.07 s gammaloop-nextest-python-api> ┌────────────────────────────────────────────────────────┐
  445. 34.07 s gammaloop-nextest-python-api> │ You are running a restricted Symbolica instance. │
  446. 34.07 s gammaloop-nextest-python-api> │ │
  447. 34.07 s gammaloop-nextest-python-api> │ This mode is only permitted for non-commercial use and │
  448. 34.07 s gammaloop-nextest-python-api> │ is limited to one instance and core per machine. │
  449. 34.07 s gammaloop-nextest-python-api> │ │
  450. 34.07 s gammaloop-nextest-python-api> │ Hobbyists can easily acquire a free license key │
  451. 34.07 s gammaloop-nextest-python-api> │ that unlocks all cores and removes this banner: │
  452. 34.07 s gammaloop-nextest-python-api> │ │
  453. 34.07 s gammaloop-nextest-python-api> │ from symbolica import * │
  454. 34.07 s gammaloop-nextest-python-api> │ request_hobbyist_license('YOUR_NAME', 'YOUR_EMAIL') │
  455. 34.07 s gammaloop-nextest-python-api> │ │
  456. 34.07 s gammaloop-nextest-python-api> │ All other users can obtain a free 30-day trial key: │
  457. 34.07 s gammaloop-nextest-python-api> │ │
  458. 34.07 s gammaloop-nextest-python-api> │ from symbolica import * │
  459. 34.07 s gammaloop-nextest-python-api> │ request_trial_license('NAME', 'EMAIL', 'EMPLOYER') │
  460. 34.07 s gammaloop-nextest-python-api> │ │
  461. 34.07 s gammaloop-nextest-python-api> │ See https://symbolica.io/docs/get_started.html#license │
  462. 34.07 s gammaloop-nextest-python-api> └────────────────────────────────────────────────────────┘
  463. 34.07 s gammaloop-nextest-python-api> ┌───────────────────────────────────────────────────────────────────────────────────────────────────────────┐
  464. 34.07 s gammaloop-nextest-python-api> │ Cannot start new unlicensed Symbolica instance since there is already another one running on the machine. │
  465. 34.07 s gammaloop-nextest-python-api> └───────────────────────────────────────────────────────────────────────────────────────────────────────────┘
  466. 34.07 s gammaloop-nextest-python-api>
  467. 34.07 s gammaloop-nextest-python-api> stderr:
  468. 34.07 s gammaloop-nextest-python-api>
  469. 34.07 s gammaloop-nextest-python-api> ┌───────────────────────────────────────────────────────────┐
  470. 34.07 s gammaloop-nextest-python-api> │ Could not resolve the IP of the Symbolica license server. │
  471. 34.07 s gammaloop-nextest-python-api> │ │
  472. 34.07 s gammaloop-nextest-python-api> │ Please check your DNS configuration. │
  473. 34.07 s gammaloop-nextest-python-api> └───────────────────────────────────────────────────────────┘
  474. 34.07 s gammaloop-nextest-python-api> Error: failed to lookup address information: Temporary failure in name resolution
  475. 34.07 s gammaloop-nextest-python-api>
  476. 34.07 s gammaloop-nextest-python-api>
  477. 34.07 s gammaloop-nextest-python-api> Location:
  478. 34.07 s gammaloop-nextest-python-api> tests/tests/test_python_api.rs:156:20
  479. 34.07 s gammaloop-nextest-python-api>
  480. 34.07 s gammaloop-nextest-python-api> FAIL [ 0.118s] (3/5) gammaloop-integration-tests::test_python_api python_evaluate_sample_preserves_graph_grouping_and_incoming_pdgs
  481. 34.07 s gammaloop-nextest-python-api> stdout ---
  482. 34.07 s gammaloop-nextest-python-api>
  483. 34.07 s gammaloop-nextest-python-api> running 1 test
  484. 34.07 s gammaloop-nextest-python-api> test python_evaluate_sample_preserves_graph_grouping_and_incoming_pdgs ... FAILED
  485. 34.07 s gammaloop-nextest-python-api>
  486. 34.07 s gammaloop-nextest-python-api> failures:
  487. 34.07 s gammaloop-nextest-python-api>
  488. 34.07 s gammaloop-nextest-python-api> failures:
  489. 34.07 s gammaloop-nextest-python-api> python_evaluate_sample_preserves_graph_grouping_and_incoming_pdgs
  490. 34.07 s gammaloop-nextest-python-api>
  491. 34.07 s gammaloop-nextest-python-api> test result: FAILED. 0 passed; 1 failed; 0 ignored; 0 measured; 4 filtered out; finished in 0.11s
  492. 34.07 s gammaloop-nextest-python-api>
  493. 34.07 s gammaloop-nextest-python-api> stderr ---
  494. 34.07 s gammaloop-nextest-python-api> Error: Python API test subprocess failed.
  495. 34.07 s gammaloop-nextest-python-api> stdout:
  496. 34.07 s gammaloop-nextest-python-api> ┌────────────────────────────────────────────────────────┐
  497. 34.07 s gammaloop-nextest-python-api> │ You are running a restricted Symbolica instance. │
  498. 34.07 s gammaloop-nextest-python-api> │ │
  499. 34.07 s gammaloop-nextest-python-api> │ This mode is only permitted for non-commercial use and │
  500. 34.07 s gammaloop-nextest-python-api> │ is limited to one instance and core per machine. │
  501. 34.07 s gammaloop-nextest-python-api> │ │
  502. 34.07 s gammaloop-nextest-python-api> │ Hobbyists can easily acquire a free license key │
  503. 34.07 s gammaloop-nextest-python-api> │ that unlocks all cores and removes this banner: │
  504. 34.07 s gammaloop-nextest-python-api> │ │
  505. 34.07 s gammaloop-nextest-python-api> │ from symbolica import * │
  506. 34.07 s gammaloop-nextest-python-api> │ request_hobbyist_license('YOUR_NAME', 'YOUR_EMAIL') │
  507. 34.07 s gammaloop-nextest-python-api> │ │
  508. 34.07 s gammaloop-nextest-python-api> │ All other users can obtain a free 30-day trial key: │
  509. 34.07 s gammaloop-nextest-python-api> │ │
  510. 34.07 s gammaloop-nextest-python-api> │ from symbolica import * │
  511. 34.07 s gammaloop-nextest-python-api> │ request_trial_license('NAME', 'EMAIL', 'EMPLOYER') │
  512. 34.07 s gammaloop-nextest-python-api> │ │
  513. 34.07 s gammaloop-nextest-python-api> │ See https://symbolica.io/docs/get_started.html#license │
  514. 34.07 s gammaloop-nextest-python-api> └────────────────────────────────────────────────────────┘
  515. 34.07 s gammaloop-nextest-python-api> ┌───────────────────────────────────────────────────────────────────────────────────────────────────────────┐
  516. 34.07 s gammaloop-nextest-python-api> │ Cannot start new unlicensed Symbolica instance since there is already another one running on the machine. │
  517. 34.07 s gammaloop-nextest-python-api> └───────────────────────────────────────────────────────────────────────────────────────────────────────────┘
  518. 34.07 s gammaloop-nextest-python-api>
  519. 34.07 s gammaloop-nextest-python-api> stderr:
  520. 34.07 s gammaloop-nextest-python-api>
  521. 34.07 s gammaloop-nextest-python-api> ┌───────────────────────────────────────────────────────────┐
  522. 34.07 s gammaloop-nextest-python-api> │ Could not resolve the IP of the Symbolica license server. │
  523. 34.07 s gammaloop-nextest-python-api> │ │
  524. 34.07 s gammaloop-nextest-python-api> │ Please check your DNS configuration. │
  525. 34.07 s gammaloop-nextest-python-api> └───────────────────────────────────────────────────────────┘
  526. 34.07 s gammaloop-nextest-python-api> Error: failed to lookup address information: Temporary failure in name resolution
  527. 34.07 s gammaloop-nextest-python-api>
  528. 34.07 s gammaloop-nextest-python-api>
  529. 34.07 s gammaloop-nextest-python-api> Location:
  530. 34.07 s gammaloop-nextest-python-api> tests/tests/test_python_api.rs:156:20
  531. 34.07 s gammaloop-nextest-python-api>
  532. 34.07 s gammaloop-nextest-python-api> FAIL [ 0.118s] (4/5) gammaloop-integration-tests::test_python_api python_session_getters_return_live_toml_and_command_blocks
  533. 34.07 s gammaloop-nextest-python-api> stdout ---
  534. 34.07 s gammaloop-nextest-python-api>
  535. 34.07 s gammaloop-nextest-python-api> running 1 test
  536. 34.07 s gammaloop-nextest-python-api> test python_session_getters_return_live_toml_and_command_blocks ... FAILED
  537. 34.07 s gammaloop-nextest-python-api>
  538. 34.07 s gammaloop-nextest-python-api> failures:
  539. 34.07 s gammaloop-nextest-python-api>
  540. 34.07 s gammaloop-nextest-python-api> failures:
  541. 34.07 s gammaloop-nextest-python-api> python_session_getters_return_live_toml_and_command_blocks
  542. 34.07 s gammaloop-nextest-python-api>
  543. 34.07 s gammaloop-nextest-python-api> test result: FAILED. 0 passed; 1 failed; 0 ignored; 0 measured; 4 filtered out; finished in 0.11s
  544. 34.07 s gammaloop-nextest-python-api>
  545. 34.07 s gammaloop-nextest-python-api> stderr ---
  546. 34.07 s gammaloop-nextest-python-api> Error: Python API test subprocess failed.
  547. 34.07 s gammaloop-nextest-python-api> stdout:
  548. 34.07 s gammaloop-nextest-python-api> ┌────────────────────────────────────────────────────────┐
  549. 34.07 s gammaloop-nextest-python-api> │ You are running a restricted Symbolica instance. │
  550. 34.07 s gammaloop-nextest-python-api> │ │
  551. 34.07 s gammaloop-nextest-python-api> │ This mode is only permitted for non-commercial use and │
  552. 34.07 s gammaloop-nextest-python-api> │ is limited to one instance and core per machine. │
  553. 34.07 s gammaloop-nextest-python-api> │ │
  554. 34.07 s gammaloop-nextest-python-api> │ Hobbyists can easily acquire a free license key │
  555. 34.07 s gammaloop-nextest-python-api> │ that unlocks all cores and removes this banner: │
  556. 34.07 s gammaloop-nextest-python-api> │ │
  557. 34.07 s gammaloop-nextest-python-api> │ from symbolica import * │
  558. 34.07 s gammaloop-nextest-python-api> │ request_hobbyist_license('YOUR_NAME', 'YOUR_EMAIL') │
  559. 34.07 s gammaloop-nextest-python-api> │ │
  560. 34.07 s gammaloop-nextest-python-api> │ All other users can obtain a free 30-day trial key: │
  561. 34.07 s gammaloop-nextest-python-api> │ │
  562. 34.07 s gammaloop-nextest-python-api> │ from symbolica import * │
  563. 34.07 s gammaloop-nextest-python-api> │ request_trial_license('NAME', 'EMAIL', 'EMPLOYER') │
  564. 34.07 s gammaloop-nextest-python-api> │ │
  565. 34.07 s gammaloop-nextest-python-api> │ See https://symbolica.io/docs/get_started.html#license │
  566. 34.07 s gammaloop-nextest-python-api> └────────────────────────────────────────────────────────┘
  567. 34.07 s gammaloop-nextest-python-api> ┌───────────────────────────────────────────────────────────────────────────────────────────────────────────┐
  568. 34.07 s gammaloop-nextest-python-api> │ Cannot start new unlicensed Symbolica instance since there is already another one running on the machine. │
  569. 34.07 s gammaloop-nextest-python-api> └───────────────────────────────────────────────────────────────────────────────────────────────────────────┘
  570. 34.07 s gammaloop-nextest-python-api>
  571. 34.07 s gammaloop-nextest-python-api> stderr:
  572. 34.07 s gammaloop-nextest-python-api>
  573. 34.07 s gammaloop-nextest-python-api> ┌───────────────────────────────────────────────────────────┐
  574. 34.07 s gammaloop-nextest-python-api> │ Could not resolve the IP of the Symbolica license server. │
  575. 34.07 s gammaloop-nextest-python-api> │ │
  576. 34.07 s gammaloop-nextest-python-api> │ Please check your DNS configuration. │
  577. 34.07 s gammaloop-nextest-python-api> └───────────────────────────────────────────────────────────┘
  578. 34.07 s gammaloop-nextest-python-api> Error: failed to lookup address information: Temporary failure in name resolution
  579. 34.07 s gammaloop-nextest-python-api>
  580. 34.07 s gammaloop-nextest-python-api>
  581. 34.07 s gammaloop-nextest-python-api> Location:
  582. 34.07 s gammaloop-nextest-python-api> tests/tests/test_python_api.rs:156:20
  583. 34.07 s gammaloop-nextest-python-api>
  584. 34.08 s gammaloop-nextest-python-api> error: test run failed
  585. 34.10 s gammaloop-nextest-python-api>
  586. 34.10 s gammaloop-nextest-python-api> ========== nextest test summary ==========
  587. 34.10 s gammaloop-nextest-python-api> report: target/nextest/ci_gammaloop/junit.xml
  588. 34.10 s gammaloop-nextest-python-api> tests: 5, failures: 4, errors: 0
  589. 34.10 s gammaloop-nextest-python-api>
  590. 34.10 s gammaloop-nextest-python-api> 1. gammaloop-integration-tests::test_python_api::python_evaluate_sample_honors_generate_events_and_observable_snapshots
  591. 34.10 s gammaloop-nextest-python-api> failure: test failure with exit code 101
  592. 34.10 s gammaloop-nextest-python-api> Error: Python API test subprocess failed.
  593. 34.10 s gammaloop-nextest-python-api> stdout:
  594. 34.10 s gammaloop-nextest-python-api> ┌────────────────────────────────────────────────────────┐
  595. 34.10 s gammaloop-nextest-python-api> │ You are running a restricted Symbolica instance. │
  596. 34.10 s gammaloop-nextest-python-api> │ │
  597. 34.10 s gammaloop-nextest-python-api> │ This mode is only permitted for non-commercial use and │
  598. 34.10 s gammaloop-nextest-python-api> │ is limited to one instance and core per machine. │
  599. 34.10 s gammaloop-nextest-python-api> │ │
  600. 34.10 s gammaloop-nextest-python-api> │ Hobbyists can easily acquire a free license key │
  601. 34.10 s gammaloop-nextest-python-api> │ that unlocks all cores and removes this banner: │
  602. 34.10 s gammaloop-nextest-python-api> │ │
  603. 34.10 s gammaloop-nextest-python-api> │ from symbolica import * │
  604. 34.10 s gammaloop-nextest-python-api> │ request_hobbyist_license('YOUR_NAME', 'YOUR_EMAIL') │
  605. 34.10 s gammaloop-nextest-python-api> │ │
  606. 34.10 s gammaloop-nextest-python-api> │ All other users can obtain a free 30-day trial key: │
  607. 34.10 s gammaloop-nextest-python-api> │ │
  608. 34.10 s gammaloop-nextest-python-api> │ from symbolica import * │
  609. 34.10 s gammaloop-nextest-python-api> │ request_trial_license('NAME', 'EMAIL', 'EMPLOYER') │
  610. 34.10 s gammaloop-nextest-python-api> │ │
  611. 34.10 s gammaloop-nextest-python-api> │ See https://symbolica.io/docs/get_started.html#license │
  612. 34.10 s gammaloop-nextest-python-api> └────────────────────────────────────────────────────────┘
  613. 34.10 s gammaloop-nextest-python-api> ┌───────────────────────────────────────────────────────────────────────────────────────────────────────────┐
  614. 34.10 s gammaloop-nextest-python-api> │ Cannot start new unlicensed Symbolica instance since there is already another one running on the machine. │
  615. 34.10 s gammaloop-nextest-python-api> └───────────────────────────────────────────────────────────────────────────────────────────────────────────┘
  616. 34.10 s gammaloop-nextest-python-api>
  617. 34.10 s gammaloop-nextest-python-api> stderr:
  618. 34.10 s gammaloop-nextest-python-api>
  619. 34.10 s gammaloop-nextest-python-api> ┌───────────────────────────────────────────────────────────┐
  620. 34.10 s gammaloop-nextest-python-api> │ Could not resolve the IP of the Symbolica license server. │
  621. 34.10 s gammaloop-nextest-python-api> │ │
  622. 34.10 s gammaloop-nextest-python-api> │ Please check your DNS configuration. │
  623. 34.10 s gammaloop-nextest-python-api> └───────────────────────────────────────────────────────────┘
  624. 34.10 s gammaloop-nextest-python-api> Error: failed to lookup address information: Temporary failure in name resolution
  625. 34.10 s gammaloop-nextest-python-api>
  626. 34.10 s gammaloop-nextest-python-api>
  627. 34.10 s gammaloop-nextest-python-api> Location:
  628. 34.10 s gammaloop-nextest-python-api> tests/tests/test_python_api.rs:156:20
  629. 34.10 s gammaloop-nextest-python-api> system-out
  630. 34.10 s gammaloop-nextest-python-api> running 1 test
  631. 34.10 s gammaloop-nextest-python-api> test python_evaluate_sample_honors_generate_events_and_observable_snapshots ... FAILED
  632. 34.10 s gammaloop-nextest-python-api>
  633. 34.10 s gammaloop-nextest-python-api> failures:
  634. 34.10 s gammaloop-nextest-python-api>
  635. 34.10 s gammaloop-nextest-python-api> failures:
  636. 34.10 s gammaloop-nextest-python-api> python_evaluate_sample_honors_generate_events_and_observable_snapshots
  637. 34.10 s gammaloop-nextest-python-api>
  638. 34.10 s gammaloop-nextest-python-api> test result: FAILED. 0 passed; 1 failed; 0 ignored; 0 measured; 4 filtered out; finished in 0.11s
  639. 34.10 s gammaloop-nextest-python-api> system-err
  640. 34.10 s gammaloop-nextest-python-api> Error: Python API test subprocess failed.
  641. 34.10 s gammaloop-nextest-python-api> stdout:
  642. 34.10 s gammaloop-nextest-python-api> ┌────────────────────────────────────────────────────────┐
  643. 34.10 s gammaloop-nextest-python-api> │ You are running a restricted Symbolica instance. │
  644. 34.10 s gammaloop-nextest-python-api> │ │
  645. 34.10 s gammaloop-nextest-python-api> │ This mode is only permitted for non-commercial use and │
  646. 34.10 s gammaloop-nextest-python-api> │ is limited to one instance and core per machine. │
  647. 34.10 s gammaloop-nextest-python-api> │ │
  648. 34.10 s gammaloop-nextest-python-api> │ Hobbyists can easily acquire a free license key │
  649. 34.10 s gammaloop-nextest-python-api> │ that unlocks all cores and removes this banner: │
  650. 34.10 s gammaloop-nextest-python-api> │ │
  651. 34.10 s gammaloop-nextest-python-api> │ from symbolica import * │
  652. 34.10 s gammaloop-nextest-python-api> │ request_hobbyist_license('YOUR_NAME', 'YOUR_EMAIL') │
  653. 34.10 s gammaloop-nextest-python-api> │ │
  654. 34.10 s gammaloop-nextest-python-api> │ All other users can obtain a free 30-day trial key: │
  655. 34.10 s gammaloop-nextest-python-api> │ │
  656. 34.10 s gammaloop-nextest-python-api> │ from symbolica import * │
  657. 34.10 s gammaloop-nextest-python-api> │ request_trial_license('NAME', 'EMAIL', 'EMPLOYER') │
  658. 34.10 s gammaloop-nextest-python-api> │ │
  659. 34.10 s gammaloop-nextest-python-api> │ See https://symbolica.io/docs/get_started.html#license │
  660. 34.10 s gammaloop-nextest-python-api> └────────────────────────────────────────────────────────┘
  661. 34.10 s gammaloop-nextest-python-api> ┌───────────────────────────────────────────────────────────────────────────────────────────────────────────┐
  662. 34.10 s gammaloop-nextest-python-api> │ Cannot start new unlicensed Symbolica instance since there is already another one running on the machine. │
  663. 34.10 s gammaloop-nextest-python-api> └───────────────────────────────────────────────────────────────────────────────────────────────────────────┘
  664. 34.10 s gammaloop-nextest-python-api>
  665. 34.10 s gammaloop-nextest-python-api> stderr:
  666. 34.10 s gammaloop-nextest-python-api>
  667. 34.10 s gammaloop-nextest-python-api> ┌───────────────────────────────────────────────────────────┐
  668. 34.10 s gammaloop-nextest-python-api> │ Could not resolve the IP of the Symbolica license server. │
  669. 34.10 s gammaloop-nextest-python-api> │ │
  670. 34.10 s gammaloop-nextest-python-api> │ Please check your DNS configuration. │
  671. 34.10 s gammaloop-nextest-python-api> └───────────────────────────────────────────────────────────┘
  672. 34.10 s gammaloop-nextest-python-api> Error: failed to lookup address information: Temporary failure in name resolution
  673. 34.10 s gammaloop-nextest-python-api>
  674. 34.10 s gammaloop-nextest-python-api>
  675. 34.10 s gammaloop-nextest-python-api> Location:
  676. 34.10 s gammaloop-nextest-python-api> tests/tests/test_python_api.rs:156:20
  677. 34.10 s gammaloop-nextest-python-api>
  678. 34.10 s gammaloop-nextest-python-api> 2. gammaloop-integration-tests::test_python_api::python_evaluate_samples_batch_and_momentum_space_have_expected_shape
  679. 34.10 s gammaloop-nextest-python-api> failure: test failure with exit code 101
  680. 34.10 s gammaloop-nextest-python-api> Error: Python API test subprocess failed.
  681. 34.10 s gammaloop-nextest-python-api> stdout:
  682. 34.10 s gammaloop-nextest-python-api> ┌────────────────────────────────────────────────────────┐
  683. 34.10 s gammaloop-nextest-python-api> │ You are running a restricted Symbolica instance. │
  684. 34.10 s gammaloop-nextest-python-api> │ │
  685. 34.10 s gammaloop-nextest-python-api> │ This mode is only permitted for non-commercial use and │
  686. 34.10 s gammaloop-nextest-python-api> │ is limited to one instance and core per machine. │
  687. 34.10 s gammaloop-nextest-python-api> │ │
  688. 34.10 s gammaloop-nextest-python-api> │ Hobbyists can easily acquire a free license key │
  689. 34.10 s gammaloop-nextest-python-api> │ that unlocks all cores and removes this banner: │
  690. 34.10 s gammaloop-nextest-python-api> │ │
  691. 34.10 s gammaloop-nextest-python-api> │ from symbolica import * │
  692. 34.10 s gammaloop-nextest-python-api> │ request_hobbyist_license('YOUR_NAME', 'YOUR_EMAIL') │
  693. 34.10 s gammaloop-nextest-python-api> │ │
  694. 34.10 s gammaloop-nextest-python-api> │ All other users can obtain a free 30-day trial key: │
  695. 34.10 s gammaloop-nextest-python-api> │ │
  696. 34.10 s gammaloop-nextest-python-api> │ from symbolica import * │
  697. 34.10 s gammaloop-nextest-python-api> │ request_trial_license('NAME', 'EMAIL', 'EMPLOYER') │
  698. 34.10 s gammaloop-nextest-python-api> │ │
  699. 34.10 s gammaloop-nextest-python-api> │ See https://symbolica.io/docs/get_started.html#license │
  700. 34.10 s gammaloop-nextest-python-api> └────────────────────────────────────────────────────────┘
  701. 34.10 s gammaloop-nextest-python-api> ┌───────────────────────────────────────────────────────────────────────────────────────────────────────────┐
  702. 34.10 s gammaloop-nextest-python-api> │ Cannot start new unlicensed Symbolica instance since there is already another one running on the machine. │
  703. 34.10 s gammaloop-nextest-python-api> └───────────────────────────────────────────────────────────────────────────────────────────────────────────┘
  704. 34.10 s gammaloop-nextest-python-api>
  705. 34.10 s gammaloop-nextest-python-api> stderr:
  706. 34.10 s gammaloop-nextest-python-api>
  707. 34.10 s gammaloop-nextest-python-api> ┌───────────────────────────────────────────────────────────┐
  708. 34.10 s gammaloop-nextest-python-api> │ Could not resolve the IP of the Symbolica license server. │
  709. 34.10 s gammaloop-nextest-python-api> │ │
  710. 34.10 s gammaloop-nextest-python-api> │ Please check your DNS configuration. │
  711. 34.10 s gammaloop-nextest-python-api> └───────────────────────────────────────────────────────────┘
  712. 34.10 s gammaloop-nextest-python-api> Error: failed to lookup address information: Temporary failure in name resolution
  713. 34.10 s gammaloop-nextest-python-api>
  714. 34.10 s gammaloop-nextest-python-api>
  715. 34.10 s gammaloop-nextest-python-api> Location:
  716. 34.10 s gammaloop-nextest-python-api> tests/tests/test_python_api.rs:156:20
  717. 34.10 s gammaloop-nextest-python-api> system-out
  718. 34.10 s gammaloop-nextest-python-api> running 1 test
  719. 34.10 s gammaloop-nextest-python-api> test python_evaluate_samples_batch_and_momentum_space_have_expected_shape ... FAILED
  720. 34.10 s gammaloop-nextest-python-api>
  721. 34.10 s gammaloop-nextest-python-api> failures:
  722. 34.10 s gammaloop-nextest-python-api>
  723. 34.10 s gammaloop-nextest-python-api> failures:
  724. 34.10 s gammaloop-nextest-python-api> python_evaluate_samples_batch_and_momentum_space_have_expected_shape
  725. 34.10 s gammaloop-nextest-python-api>
  726. 34.10 s gammaloop-nextest-python-api> test result: FAILED. 0 passed; 1 failed; 0 ignored; 0 measured; 4 filtered out; finished in 0.11s
  727. 34.10 s gammaloop-nextest-python-api> system-err
  728. 34.10 s gammaloop-nextest-python-api> Error: Python API test subprocess failed.
  729. 34.10 s gammaloop-nextest-python-api> stdout:
  730. 34.10 s gammaloop-nextest-python-api> ┌────────────────────────────────────────────────────────┐
  731. 34.10 s gammaloop-nextest-python-api> │ You are running a restricted Symbolica instance. │
  732. 34.10 s gammaloop-nextest-python-api> │ │
  733. 34.10 s gammaloop-nextest-python-api> │ This mode is only permitted for non-commercial use and │
  734. 34.10 s gammaloop-nextest-python-api> │ is limited to one instance and core per machine. │
  735. 34.10 s gammaloop-nextest-python-api> │ │
  736. 34.10 s gammaloop-nextest-python-api> │ Hobbyists can easily acquire a free license key │
  737. 34.10 s gammaloop-nextest-python-api> │ that unlocks all cores and removes this banner: │
  738. 34.10 s gammaloop-nextest-python-api> │ │
  739. 34.10 s gammaloop-nextest-python-api> │ from symbolica import * │
  740. 34.10 s gammaloop-nextest-python-api> │ request_hobbyist_license('YOUR_NAME', 'YOUR_EMAIL') │
  741. 34.10 s gammaloop-nextest-python-api> │ │
  742. 34.10 s gammaloop-nextest-python-api> │ All other users can obtain a free 30-day trial key: │
  743. 34.10 s gammaloop-nextest-python-api> │ │
  744. 34.10 s gammaloop-nextest-python-api> │ from symbolica import * │
  745. 34.10 s gammaloop-nextest-python-api> │ request_trial_license('NAME', 'EMAIL', 'EMPLOYER') │
  746. 34.10 s gammaloop-nextest-python-api> │ │
  747. 34.10 s gammaloop-nextest-python-api> │ See https://symbolica.io/docs/get_started.html#license │
  748. 34.10 s gammaloop-nextest-python-api> └────────────────────────────────────────────────────────┘
  749. 34.10 s gammaloop-nextest-python-api> ┌───────────────────────────────────────────────────────────────────────────────────────────────────────────┐
  750. 34.10 s gammaloop-nextest-python-api> │ Cannot start new unlicensed Symbolica instance since there is already another one running on the machine. │
  751. 34.10 s gammaloop-nextest-python-api> └───────────────────────────────────────────────────────────────────────────────────────────────────────────┘
  752. 34.10 s gammaloop-nextest-python-api>
  753. 34.10 s gammaloop-nextest-python-api> stderr:
  754. 34.10 s gammaloop-nextest-python-api>
  755. 34.10 s gammaloop-nextest-python-api> ┌───────────────────────────────────────────────────────────┐
  756. 34.10 s gammaloop-nextest-python-api> │ Could not resolve the IP of the Symbolica license server. │
  757. 34.10 s gammaloop-nextest-python-api> │ │
  758. 34.10 s gammaloop-nextest-python-api> │ Please check your DNS configuration. │
  759. 34.10 s gammaloop-nextest-python-api> └───────────────────────────────────────────────────────────┘
  760. 34.10 s gammaloop-nextest-python-api> Error: failed to lookup address information: Temporary failure in name resolution
  761. 34.10 s gammaloop-nextest-python-api>
  762. 34.10 s gammaloop-nextest-python-api>
  763. 34.10 s gammaloop-nextest-python-api> Location:
  764. 34.10 s gammaloop-nextest-python-api> tests/tests/test_python_api.rs:156:20
  765. 34.10 s gammaloop-nextest-python-api>
  766. 34.10 s gammaloop-nextest-python-api> 3. gammaloop-integration-tests::test_python_api::python_evaluate_sample_preserves_graph_grouping_and_incoming_pdgs
  767. 34.10 s gammaloop-nextest-python-api> failure: test failure with exit code 101
  768. 34.10 s gammaloop-nextest-python-api> Error: Python API test subprocess failed.
  769. 34.10 s gammaloop-nextest-python-api> stdout:
  770. 34.10 s gammaloop-nextest-python-api> ┌────────────────────────────────────────────────────────┐
  771. 34.10 s gammaloop-nextest-python-api> │ You are running a restricted Symbolica instance. │
  772. 34.10 s gammaloop-nextest-python-api> │ │
  773. 34.10 s gammaloop-nextest-python-api> │ This mode is only permitted for non-commercial use and │
  774. 34.10 s gammaloop-nextest-python-api> │ is limited to one instance and core per machine. │
  775. 34.10 s gammaloop-nextest-python-api> │ │
  776. 34.10 s gammaloop-nextest-python-api> │ Hobbyists can easily acquire a free license key │
  777. 34.10 s gammaloop-nextest-python-api> │ that unlocks all cores and removes this banner: │
  778. 34.10 s gammaloop-nextest-python-api> │ │
  779. 34.10 s gammaloop-nextest-python-api> │ from symbolica import * │
  780. 34.10 s gammaloop-nextest-python-api> │ request_hobbyist_license('YOUR_NAME', 'YOUR_EMAIL') │
  781. 34.10 s gammaloop-nextest-python-api> │ │
  782. 34.10 s gammaloop-nextest-python-api> │ All other users can obtain a free 30-day trial key: │
  783. 34.10 s gammaloop-nextest-python-api> │ │
  784. 34.10 s gammaloop-nextest-python-api> │ from symbolica import * │
  785. 34.10 s gammaloop-nextest-python-api> │ request_trial_license('NAME', 'EMAIL', 'EMPLOYER') │
  786. 34.10 s gammaloop-nextest-python-api> │ │
  787. 34.10 s gammaloop-nextest-python-api> │ See https://symbolica.io/docs/get_started.html#license │
  788. 34.10 s gammaloop-nextest-python-api> └────────────────────────────────────────────────────────┘
  789. 34.10 s gammaloop-nextest-python-api> ┌───────────────────────────────────────────────────────────────────────────────────────────────────────────┐
  790. 34.10 s gammaloop-nextest-python-api> │ Cannot start new unlicensed Symbolica instance since there is already another one running on the machine. │
  791. 34.11 s gammaloop-nextest-python-api> └───────────────────────────────────────────────────────────────────────────────────────────────────────────┘
  792. 34.11 s gammaloop-nextest-python-api>
  793. 34.11 s gammaloop-nextest-python-api> stderr:
  794. 34.11 s gammaloop-nextest-python-api>
  795. 34.11 s gammaloop-nextest-python-api> ┌───────────────────────────────────────────────────────────┐
  796. 34.11 s gammaloop-nextest-python-api> │ Could not resolve the IP of the Symbolica license server. │
  797. 34.11 s gammaloop-nextest-python-api> │ │
  798. 34.11 s gammaloop-nextest-python-api> │ Please check your DNS configuration. │
  799. 34.11 s gammaloop-nextest-python-api> └───────────────────────────────────────────────────────────┘
  800. 34.11 s gammaloop-nextest-python-api> Error: failed to lookup address information: Temporary failure in name resolution
  801. 34.11 s gammaloop-nextest-python-api>
  802. 34.11 s gammaloop-nextest-python-api>
  803. 34.11 s gammaloop-nextest-python-api> Location:
  804. 34.11 s gammaloop-nextest-python-api> tests/tests/test_python_api.rs:156:20
  805. 34.11 s gammaloop-nextest-python-api> system-out
  806. 34.11 s gammaloop-nextest-python-api> running 1 test
  807. 34.11 s gammaloop-nextest-python-api> test python_evaluate_sample_preserves_graph_grouping_and_incoming_pdgs ... FAILED
  808. 34.11 s gammaloop-nextest-python-api>
  809. 34.11 s gammaloop-nextest-python-api> failures:
  810. 34.11 s gammaloop-nextest-python-api>
  811. 34.11 s gammaloop-nextest-python-api> failures:
  812. 34.11 s gammaloop-nextest-python-api> python_evaluate_sample_preserves_graph_grouping_and_incoming_pdgs
  813. 34.11 s gammaloop-nextest-python-api>
  814. 34.11 s gammaloop-nextest-python-api> test result: FAILED. 0 passed; 1 failed; 0 ignored; 0 measured; 4 filtered out; finished in 0.11s
  815. 34.11 s gammaloop-nextest-python-api> system-err
  816. 34.11 s gammaloop-nextest-python-api> Error: Python API test subprocess failed.
  817. 34.11 s gammaloop-nextest-python-api> stdout:
  818. 34.11 s gammaloop-nextest-python-api> ┌────────────────────────────────────────────────────────┐
  819. 34.11 s gammaloop-nextest-python-api> │ You are running a restricted Symbolica instance. │
  820. 34.11 s gammaloop-nextest-python-api> │ │
  821. 34.11 s gammaloop-nextest-python-api> │ This mode is only permitted for non-commercial use and │
  822. 34.11 s gammaloop-nextest-python-api> │ is limited to one instance and core per machine. │
  823. 34.11 s gammaloop-nextest-python-api> │ │
  824. 34.11 s gammaloop-nextest-python-api> │ Hobbyists can easily acquire a free license key │
  825. 34.11 s gammaloop-nextest-python-api> │ that unlocks all cores and removes this banner: │
  826. 34.11 s gammaloop-nextest-python-api> │ │
  827. 34.11 s gammaloop-nextest-python-api> │ from symbolica import * │
  828. 34.11 s gammaloop-nextest-python-api> │ request_hobbyist_license('YOUR_NAME', 'YOUR_EMAIL') │
  829. 34.11 s gammaloop-nextest-python-api> │ │
  830. 34.11 s gammaloop-nextest-python-api> │ All other users can obtain a free 30-day trial key: │
  831. 34.11 s gammaloop-nextest-python-api> │ │
  832. 34.11 s gammaloop-nextest-python-api> │ from symbolica import * │
  833. 34.11 s gammaloop-nextest-python-api> │ request_trial_license('NAME', 'EMAIL', 'EMPLOYER') │
  834. 34.11 s gammaloop-nextest-python-api> │ │
  835. 34.11 s gammaloop-nextest-python-api> │ See https://symbolica.io/docs/get_started.html#license │
  836. 34.11 s gammaloop-nextest-python-api> └────────────────────────────────────────────────────────┘
  837. 34.11 s gammaloop-nextest-python-api> ┌───────────────────────────────────────────────────────────────────────────────────────────────────────────┐
  838. 34.11 s gammaloop-nextest-python-api> │ Cannot start new unlicensed Symbolica instance since there is already another one running on the machine. │
  839. 34.11 s gammaloop-nextest-python-api> └───────────────────────────────────────────────────────────────────────────────────────────────────────────┘
  840. 34.11 s gammaloop-nextest-python-api>
  841. 34.11 s gammaloop-nextest-python-api> stderr:
  842. 34.11 s gammaloop-nextest-python-api>
  843. 34.11 s gammaloop-nextest-python-api> ┌───────────────────────────────────────────────────────────┐
  844. 34.11 s gammaloop-nextest-python-api> │ Could not resolve the IP of the Symbolica license server. │
  845. 34.11 s gammaloop-nextest-python-api> │ │
  846. 34.11 s gammaloop-nextest-python-api> │ Please check your DNS configuration. │
  847. 34.11 s gammaloop-nextest-python-api> └───────────────────────────────────────────────────────────┘
  848. 34.11 s gammaloop-nextest-python-api> Error: failed to lookup address information: Temporary failure in name resolution
  849. 34.11 s gammaloop-nextest-python-api>
  850. 34.11 s gammaloop-nextest-python-api>
  851. 34.11 s gammaloop-nextest-python-api> Location:
  852. 34.11 s gammaloop-nextest-python-api> tests/tests/test_python_api.rs:156:20
  853. 34.11 s gammaloop-nextest-python-api>
  854. 34.11 s gammaloop-nextest-python-api> 4. gammaloop-integration-tests::test_python_api::python_session_getters_return_live_toml_and_command_blocks
  855. 34.11 s gammaloop-nextest-python-api> failure: test failure with exit code 101
  856. 34.11 s gammaloop-nextest-python-api> Error: Python API test subprocess failed.
  857. 34.11 s gammaloop-nextest-python-api> stdout:
  858. 34.11 s gammaloop-nextest-python-api> ┌────────────────────────────────────────────────────────┐
  859. 34.11 s gammaloop-nextest-python-api> │ You are running a restricted Symbolica instance. │
  860. 34.11 s gammaloop-nextest-python-api> │ │
  861. 34.11 s gammaloop-nextest-python-api> │ This mode is only permitted for non-commercial use and │
  862. 34.11 s gammaloop-nextest-python-api> │ is limited to one instance and core per machine. │
  863. 34.11 s gammaloop-nextest-python-api> │ │
  864. 34.11 s gammaloop-nextest-python-api> │ Hobbyists can easily acquire a free license key │
  865. 34.11 s gammaloop-nextest-python-api> │ that unlocks all cores and removes this banner: │
  866. 34.11 s gammaloop-nextest-python-api> │ │
  867. 34.11 s gammaloop-nextest-python-api> │ from symbolica import * │
  868. 34.11 s gammaloop-nextest-python-api> │ request_hobbyist_license('YOUR_NAME', 'YOUR_EMAIL') │
  869. 34.11 s gammaloop-nextest-python-api> │ │
  870. 34.11 s gammaloop-nextest-python-api> │ All other users can obtain a free 30-day trial key: │
  871. 34.11 s gammaloop-nextest-python-api> │ │
  872. 34.11 s gammaloop-nextest-python-api> │ from symbolica import * │
  873. 34.11 s gammaloop-nextest-python-api> │ request_trial_license('NAME', 'EMAIL', 'EMPLOYER') │
  874. 34.11 s gammaloop-nextest-python-api> │ │
  875. 34.11 s gammaloop-nextest-python-api> │ See https://symbolica.io/docs/get_started.html#license │
  876. 34.11 s gammaloop-nextest-python-api> └────────────────────────────────────────────────────────┘
  877. 34.11 s gammaloop-nextest-python-api> ┌───────────────────────────────────────────────────────────────────────────────────────────────────────────┐
  878. 34.11 s gammaloop-nextest-python-api> │ Cannot start new unlicensed Symbolica instance since there is already another one running on the machine. │
  879. 34.11 s gammaloop-nextest-python-api> └───────────────────────────────────────────────────────────────────────────────────────────────────────────┘
  880. 34.11 s gammaloop-nextest-python-api>
  881. 34.11 s gammaloop-nextest-python-api> stderr:
  882. 34.11 s gammaloop-nextest-python-api>
  883. 34.11 s gammaloop-nextest-python-api> ┌───────────────────────────────────────────────────────────┐
  884. 34.11 s gammaloop-nextest-python-api> │ Could not resolve the IP of the Symbolica license server. │
  885. 34.11 s gammaloop-nextest-python-api> │ │
  886. 34.11 s gammaloop-nextest-python-api> │ Please check your DNS configuration. │
  887. 34.11 s gammaloop-nextest-python-api> └───────────────────────────────────────────────────────────┘
  888. 34.11 s gammaloop-nextest-python-api> Error: failed to lookup address information: Temporary failure in name resolution
  889. 34.11 s gammaloop-nextest-python-api>
  890. 34.11 s gammaloop-nextest-python-api>
  891. 34.11 s gammaloop-nextest-python-api> Location:
  892. 34.11 s gammaloop-nextest-python-api> tests/tests/test_python_api.rs:156:20
  893. 34.11 s gammaloop-nextest-python-api> system-out
  894. 34.11 s gammaloop-nextest-python-api> running 1 test
  895. 34.11 s gammaloop-nextest-python-api> test python_session_getters_return_live_toml_and_command_blocks ... FAILED
  896. 34.11 s gammaloop-nextest-python-api>
  897. 34.11 s gammaloop-nextest-python-api> failures:
  898. 34.11 s gammaloop-nextest-python-api>
  899. 34.11 s gammaloop-nextest-python-api> failures:
  900. 34.11 s gammaloop-nextest-python-api> python_session_getters_return_live_toml_and_command_blocks
  901. 34.11 s gammaloop-nextest-python-api>
  902. 34.11 s gammaloop-nextest-python-api> test result: FAILED. 0 passed; 1 failed; 0 ignored; 0 measured; 4 filtered out; finished in 0.11s
  903. 34.11 s gammaloop-nextest-python-api> system-err
  904. 34.11 s gammaloop-nextest-python-api> Error: Python API test subprocess failed.
  905. 34.11 s gammaloop-nextest-python-api> stdout:
  906. 34.11 s gammaloop-nextest-python-api> ┌────────────────────────────────────────────────────────┐
  907. 34.11 s gammaloop-nextest-python-api> │ You are running a restricted Symbolica instance. │
  908. 34.11 s gammaloop-nextest-python-api> │ │
  909. 34.11 s gammaloop-nextest-python-api> │ This mode is only permitted for non-commercial use and │
  910. 34.11 s gammaloop-nextest-python-api> │ is limited to one instance and core per machine. │
  911. 34.11 s gammaloop-nextest-python-api> │ │
  912. 34.11 s gammaloop-nextest-python-api> │ Hobbyists can easily acquire a free license key │
  913. 34.11 s gammaloop-nextest-python-api> │ that unlocks all cores and removes this banner: │
  914. 34.11 s gammaloop-nextest-python-api> │ │
  915. 34.11 s gammaloop-nextest-python-api> │ from symbolica import * │
  916. 34.11 s gammaloop-nextest-python-api> │ request_hobbyist_license('YOUR_NAME', 'YOUR_EMAIL') │
  917. 34.11 s gammaloop-nextest-python-api> │ │
  918. 34.11 s gammaloop-nextest-python-api> │ All other users can obtain a free 30-day trial key: │
  919. 34.11 s gammaloop-nextest-python-api> │ │
  920. 34.11 s gammaloop-nextest-python-api> │ from symbolica import * │
  921. 34.11 s gammaloop-nextest-python-api> │ request_trial_license('NAME', 'EMAIL', 'EMPLOYER') │
  922. 34.11 s gammaloop-nextest-python-api> │ │
  923. 34.11 s gammaloop-nextest-python-api> │ See https://symbolica.io/docs/get_started.html#license │
  924. 34.11 s gammaloop-nextest-python-api> └────────────────────────────────────────────────────────┘
  925. 34.11 s gammaloop-nextest-python-api> ┌───────────────────────────────────────────────────────────────────────────────────────────────────────────┐
  926. 34.11 s gammaloop-nextest-python-api> │ Cannot start new unlicensed Symbolica instance since there is already another one running on the machine. │
  927. 34.11 s gammaloop-nextest-python-api> └───────────────────────────────────────────────────────────────────────────────────────────────────────────┘
  928. 34.11 s gammaloop-nextest-python-api>
  929. 34.11 s gammaloop-nextest-python-api> stderr:
  930. 34.11 s gammaloop-nextest-python-api>
  931. 34.11 s gammaloop-nextest-python-api> ┌───────────────────────────────────────────────────────────┐
  932. 34.11 s gammaloop-nextest-python-api> │ Could not resolve the IP of the Symbolica license server. │
  933. 34.11 s gammaloop-nextest-python-api> │ │
  934. 34.11 s gammaloop-nextest-python-api> │ Please check your DNS configuration. │
  935. 34.11 s gammaloop-nextest-python-api> └───────────────────────────────────────────────────────────┘
  936. 34.11 s gammaloop-nextest-python-api> Error: failed to lookup address information: Temporary failure in name resolution
  937. 34.11 s gammaloop-nextest-python-api>
  938. 34.11 s gammaloop-nextest-python-api>
  939. 34.11 s gammaloop-nextest-python-api> Location:
  940. 34.11 s gammaloop-nextest-python-api> tests/tests/test_python_api.rs:156:20
  941. 34.11 s gammaloop-nextest-python-api> =========================================
  942. 34.15 s error: Cannot build '/nix/store/nmwgfm0zigizp5byy173df7l99i9kddz-gammaloop-nextest-python-api.drv'.
  943. 34.15 s Reason: builder failed with exit code 100.
  944. 34.15 s Output paths:
  945. 34.15 s /nix/store/0wmifwk23rqakrfsxal3kaig8chq1a34-gammaloop-nextest-python-api
  946. 34.15 s Last 781 log lines:
  947. 34.15 s > Extracting 1 binary, 1 build script output directory, and 3 linked paths to /build/nextest-archive-Hwt2Lj
  948. 34.15 s > Extracted 18 files to /build/nextest-archive-Hwt2Lj in 0.06s
  949. 34.15 s > ------------
  950. 34.15 s > Nextest run ID 71b70952-8308-4d0e-9e30-05a357df5f23 with nextest profile: ci_gammaloop
  951. 34.15 s > Starting 5 tests across 1 binary
  952. 34.15 s > FAIL [ 0.113s] (1/5) gammaloop-integration-tests::test_python_api python_evaluate_sample_honors_generate_events_and_observable_snapshots
  953. 34.15 s > stdout ---
  954. 34.15 s >
  955. 34.15 s > running 1 test
  956. 34.15 s > test python_evaluate_sample_honors_generate_events_and_observable_snapshots ... FAILED
  957. 34.15 s >
  958. 34.15 s > failures:
  959. 34.15 s >
  960. 34.15 s > failures:
  961. 34.15 s > python_evaluate_sample_honors_generate_events_and_observable_snapshots
  962. 34.15 s >
  963. 34.15 s > test result: FAILED. 0 passed; 1 failed; 0 ignored; 0 measured; 4 filtered out; finished in 0.11s
  964. 34.15 s >
  965. 34.15 s > stderr ---
  966. 34.15 s > Error: Python API test subprocess failed.
  967. 34.15 s > stdout:
  968. 34.15 s > ┌────────────────────────────────────────────────────────┐
  969. 34.15 s > │ You are running a restricted Symbolica instance. │
  970. 34.15 s > │ │
  971. 34.15 s > │ This mode is only permitted for non-commercial use and │
  972. 34.15 s > │ is limited to one instance and core per machine. │
  973. 34.15 s > │ │
  974. 34.15 s > │ Hobbyists can easily acquire a free license key │
  975. 34.15 s > │ that unlocks all cores and removes this banner: │
  976. 34.15 s > │ │
  977. 34.15 s > │ from symbolica import * │
  978. 34.15 s > │ request_hobbyist_license('YOUR_NAME', 'YOUR_EMAIL') │
  979. 34.15 s > │ │
  980. 34.15 s > │ All other users can obtain a free 30-day trial key: │
  981. 34.15 s > │ │
  982. 34.15 s > │ from symbolica import * │
  983. 34.15 s > │ request_trial_license('NAME', 'EMAIL', 'EMPLOYER') │
  984. 34.15 s > │ │
  985. 34.15 s > │ See https://symbolica.io/docs/get_started.html#license │
  986. 34.15 s > └────────────────────────────────────────────────────────┘
  987. 34.15 s > ┌───────────────────────────────────────────────────────────────────────────────────────────────────────────┐
  988. 34.15 s > │ Cannot start new unlicensed Symbolica instance since there is already another one running on the machine. │
  989. 34.15 s > └───────────────────────────────────────────────────────────────────────────────────────────────────────────┘
  990. 34.15 s >
  991. 34.15 s > stderr:
  992. 34.15 s >
  993. 34.15 s > ┌───────────────────────────────────────────────────────────┐
  994. 34.15 s > │ Could not resolve the IP of the Symbolica license server. │
  995. 34.15 s > │ │
  996. 34.15 s > │ Please check your DNS configuration. │
  997. 34.15 s > └───────────────────────────────────────────────────────────┘
  998. 34.15 s > Error: failed to lookup address information: Temporary failure in name resolution
  999. 34.15 s >
  1000. 34.15 s >
  1001. 34.15 s > Location:
  1002. 34.15 s > tests/tests/test_python_api.rs:156:20
  1003. 34.15 s >
  1004. 34.15 s > FAIL [ 0.114s] (2/5) gammaloop-integration-tests::test_python_api python_evaluate_samples_batch_and_momentum_space_have_expected_shape
  1005. 34.15 s > stdout ---
  1006. 34.15 s >
  1007. 34.15 s > running 1 test
  1008. 34.15 s > test python_evaluate_samples_batch_and_momentum_space_have_expected_shape ... FAILED
  1009. 34.15 s >
  1010. 34.15 s > failures:
  1011. 34.15 s >
  1012. 34.15 s > failures:
  1013. 34.15 s > python_evaluate_samples_batch_and_momentum_space_have_expected_shape
  1014. 34.15 s >
  1015. 34.15 s > test result: FAILED. 0 passed; 1 failed; 0 ignored; 0 measured; 4 filtered out; finished in 0.11s
  1016. 34.15 s >
  1017. 34.15 s > stderr ---
  1018. 34.15 s > Error: Python API test subprocess failed.
  1019. 34.15 s > stdout:
  1020. 34.15 s > ┌────────────────────────────────────────────────────────┐
  1021. 34.15 s > │ You are running a restricted Symbolica instance. │
  1022. 34.15 s > │ │
  1023. 34.15 s > │ This mode is only permitted for non-commercial use and │
  1024. 34.15 s > │ is limited to one instance and core per machine. │
  1025. 34.15 s > │ │
  1026. 34.15 s > │ Hobbyists can easily acquire a free license key │
  1027. 34.15 s > │ that unlocks all cores and removes this banner: │
  1028. 34.15 s > │ │
  1029. 34.15 s > │ from symbolica import * │
  1030. 34.15 s > │ request_hobbyist_license('YOUR_NAME', 'YOUR_EMAIL') │
  1031. 34.15 s > │ │
  1032. 34.15 s > │ All other users can obtain a free 30-day trial key: │
  1033. 34.15 s > │ │
  1034. 34.15 s > │ from symbolica import * │
  1035. 34.15 s > │ request_trial_license('NAME', 'EMAIL', 'EMPLOYER') │
  1036. 34.15 s > │ │
  1037. 34.15 s > │ See https://symbolica.io/docs/get_started.html#license │
  1038. 34.15 s > └────────────────────────────────────────────────────────┘
  1039. 34.15 s > ┌───────────────────────────────────────────────────────────────────────────────────────────────────────────┐
  1040. 34.15 s > │ Cannot start new unlicensed Symbolica instance since there is already another one running on the machine. │
  1041. 34.15 s > └───────────────────────────────────────────────────────────────────────────────────────────────────────────┘
  1042. 34.15 s >
  1043. 34.15 s > stderr:
  1044. 34.15 s >
  1045. 34.15 s > ┌───────────────────────────────────────────────────────────┐
  1046. 34.15 s > │ Could not resolve the IP of the Symbolica license server. │
  1047. 34.15 s > │ │
  1048. 34.15 s > │ Please check your DNS configuration. │
  1049. 34.15 s > └───────────────────────────────────────────────────────────┘
  1050. 34.15 s > Error: failed to lookup address information: Temporary failure in name resolution
  1051. 34.15 s >
  1052. 34.15 s >
  1053. 34.15 s > Location:
  1054. 34.15 s > tests/tests/test_python_api.rs:156:20
  1055. 34.15 s >
  1056. 34.15 s > FAIL [ 0.118s] (3/5) gammaloop-integration-tests::test_python_api python_evaluate_sample_preserves_graph_grouping_and_incoming_pdgs
  1057. 34.15 s > stdout ---
  1058. 34.15 s >
  1059. 34.15 s > running 1 test
  1060. 34.15 s > test python_evaluate_sample_preserves_graph_grouping_and_incoming_pdgs ... FAILED
  1061. 34.15 s >
  1062. 34.15 s > failures:
  1063. 34.15 s >
  1064. 34.15 s > failures:
  1065. 34.15 s > python_evaluate_sample_preserves_graph_grouping_and_incoming_pdgs
  1066. 34.15 s >
  1067. 34.15 s > test result: FAILED. 0 passed; 1 failed; 0 ignored; 0 measured; 4 filtered out; finished in 0.11s
  1068. 34.15 s >
  1069. 34.15 s > stderr ---
  1070. 34.15 s > Error: Python API test subprocess failed.
  1071. 34.15 s > stdout:
  1072. 34.15 s > ┌────────────────────────────────────────────────────────┐
  1073. 34.15 s > │ You are running a restricted Symbolica instance. │
  1074. 34.15 s > │ │
  1075. 34.15 s > │ This mode is only permitted for non-commercial use and │
  1076. 34.15 s > │ is limited to one instance and core per machine. │
  1077. 34.15 s > │ │
  1078. 34.15 s > │ Hobbyists can easily acquire a free license key │
  1079. 34.15 s > │ that unlocks all cores and removes this banner: │
  1080. 34.15 s > │ │
  1081. 34.15 s > │ from symbolica import * │
  1082. 34.15 s > │ request_hobbyist_license('YOUR_NAME', 'YOUR_EMAIL') │
  1083. 34.15 s > │ │
  1084. 34.15 s > │ All other users can obtain a free 30-day trial key: │
  1085. 34.15 s > │ │
  1086. 34.15 s > │ from symbolica import * │
  1087. 34.15 s > │ request_trial_license('NAME', 'EMAIL', 'EMPLOYER') │
  1088. 34.15 s > │ │
  1089. 34.15 s > │ See https://symbolica.io/docs/get_started.html#license │
  1090. 34.15 s > └────────────────────────────────────────────────────────┘
  1091. 34.15 s > ┌───────────────────────────────────────────────────────────────────────────────────────────────────────────┐
  1092. 34.15 s > │ Cannot start new unlicensed Symbolica instance since there is already another one running on the machine. │
  1093. 34.15 s > └───────────────────────────────────────────────────────────────────────────────────────────────────────────┘
  1094. 34.15 s >
  1095. 34.15 s > stderr:
  1096. 34.15 s >
  1097. 34.15 s > ┌───────────────────────────────────────────────────────────┐
  1098. 34.15 s > │ Could not resolve the IP of the Symbolica license server. │
  1099. 34.15 s > │ │
  1100. 34.15 s > │ Please check your DNS configuration. │
  1101. 34.15 s > └───────────────────────────────────────────────────────────┘
  1102. 34.15 s > Error: failed to lookup address information: Temporary failure in name resolution
  1103. 34.15 s >
  1104. 34.15 s >
  1105. 34.15 s > Location:
  1106. 34.15 s > tests/tests/test_python_api.rs:156:20
  1107. 34.15 s >
  1108. 34.15 s > FAIL [ 0.118s] (4/5) gammaloop-integration-tests::test_python_api python_session_getters_return_live_toml_and_command_blocks
  1109. 34.15 s > stdout ---
  1110. 34.15 s >
  1111. 34.15 s > running 1 test
  1112. 34.15 s > test python_session_getters_return_live_toml_and_command_blocks ... FAILED
  1113. 34.15 s >
  1114. 34.15 s > failures:
  1115. 34.15 s >
  1116. 34.15 s > failures:
  1117. 34.15 s > python_session_getters_return_live_toml_and_command_blocks
  1118. 34.15 s >
  1119. 34.15 s > test result: FAILED. 0 passed; 1 failed; 0 ignored; 0 measured; 4 filtered out; finished in 0.11s
  1120. 34.15 s >
  1121. 34.15 s > stderr ---
  1122. 34.15 s > Error: Python API test subprocess failed.
  1123. 34.15 s > stdout:
  1124. 34.15 s > ┌────────────────────────────────────────────────────────┐
  1125. 34.15 s > │ You are running a restricted Symbolica instance. │
  1126. 34.15 s > │ │
  1127. 34.15 s > │ This mode is only permitted for non-commercial use and │
  1128. 34.15 s > │ is limited to one instance and core per machine. │
  1129. 34.15 s > │ │
  1130. 34.15 s > │ Hobbyists can easily acquire a free license key │
  1131. 34.15 s > │ that unlocks all cores and removes this banner: │
  1132. 34.15 s > │ │
  1133. 34.15 s > │ from symbolica import * │
  1134. 34.15 s > │ request_hobbyist_license('YOUR_NAME', 'YOUR_EMAIL') │
  1135. 34.15 s > │ │
  1136. 34.15 s > │ All other users can obtain a free 30-day trial key: │
  1137. 34.15 s > │ │
  1138. 34.15 s > │ from symbolica import * │
  1139. 34.15 s > │ request_trial_license('NAME', 'EMAIL', 'EMPLOYER') │
  1140. 34.15 s > │ │
  1141. 34.15 s > │ See https://symbolica.io/docs/get_started.html#license │
  1142. 34.15 s > └────────────────────────────────────────────────────────┘
  1143. 34.15 s > ┌───────────────────────────────────────────────────────────────────────────────────────────────────────────┐
  1144. 34.15 s > │ Cannot start new unlicensed Symbolica instance since there is already another one running on the machine. │
  1145. 34.15 s > └───────────────────────────────────────────────────────────────────────────────────────────────────────────┘
  1146. 34.15 s >
  1147. 34.15 s > stderr:
  1148. 34.15 s >
  1149. 34.15 s > ┌───────────────────────────────────────────────────────────┐
  1150. 34.15 s > │ Could not resolve the IP of the Symbolica license server. │
  1151. 34.15 s > │ │
  1152. 34.15 s > │ Please check your DNS configuration. │
  1153. 34.15 s > └───────────────────────────────────────────────────────────┘
  1154. 34.15 s > Error: failed to lookup address information: Temporary failure in name resolution
  1155. 34.15 s >
  1156. 34.15 s >
  1157. 34.15 s > Location:
  1158. 34.15 s > tests/tests/test_python_api.rs:156:20
  1159. 34.15 s >
  1160. 34.15 s > ------------
  1161. 34.15 s > Summary [ 0.286s] 5 tests run: 1 passed, 4 failed, 0 skipped
  1162. 34.15 s > FAIL [ 0.113s] (1/5) gammaloop-integration-tests::test_python_api python_evaluate_sample_honors_generate_events_and_observable_snapshots
  1163. 34.15 s > stdout ---
  1164. 34.15 s >
  1165. 34.15 s > running 1 test
  1166. 34.15 s > test python_evaluate_sample_honors_generate_events_and_observable_snapshots ... FAILED
  1167. 34.15 s >
  1168. 34.15 s > failures:
  1169. 34.15 s >
  1170. 34.15 s > failures:
  1171. 34.15 s > python_evaluate_sample_honors_generate_events_and_observable_snapshots
  1172. 34.15 s >
  1173. 34.15 s > test result: FAILED. 0 passed; 1 failed; 0 ignored; 0 measured; 4 filtered out; finished in 0.11s
  1174. 34.15 s >
  1175. 34.15 s > stderr ---
  1176. 34.15 s > Error: Python API test subprocess failed.
  1177. 34.15 s > stdout:
  1178. 34.15 s > ┌────────────────────────────────────────────────────────┐
  1179. 34.15 s > │ You are running a restricted Symbolica instance. │
  1180. 34.15 s > │ │
  1181. 34.15 s > │ This mode is only permitted for non-commercial use and │
  1182. 34.15 s > │ is limited to one instance and core per machine. │
  1183. 34.15 s > │ │
  1184. 34.15 s > │ Hobbyists can easily acquire a free license key │
  1185. 34.15 s > │ that unlocks all cores and removes this banner: │
  1186. 34.15 s > │ │
  1187. 34.15 s > │ from symbolica import * │
  1188. 34.15 s > │ request_hobbyist_license('YOUR_NAME', 'YOUR_EMAIL') │
  1189. 34.15 s > │ │
  1190. 34.15 s > │ All other users can obtain a free 30-day trial key: │
  1191. 34.15 s > │ │
  1192. 34.15 s > │ from symbolica import * │
  1193. 34.15 s > │ request_trial_license('NAME', 'EMAIL', 'EMPLOYER') │
  1194. 34.15 s > │ │
  1195. 34.15 s > │ See https://symbolica.io/docs/get_started.html#license │
  1196. 34.15 s > └────────────────────────────────────────────────────────┘
  1197. 34.15 s > ┌───────────────────────────────────────────────────────────────────────────────────────────────────────────┐
  1198. 34.15 s > │ Cannot start new unlicensed Symbolica instance since there is already another one running on the machine. │
  1199. 34.15 s > └───────────────────────────────────────────────────────────────────────────────────────────────────────────┘
  1200. 34.15 s >
  1201. 34.15 s > stderr:
  1202. 34.15 s >
  1203. 34.15 s > ┌───────────────────────────────────────────────────────────┐
  1204. 34.15 s > │ Could not resolve the IP of the Symbolica license server. │
  1205. 34.15 s > │ │
  1206. 34.15 s > │ Please check your DNS configuration. │
  1207. 34.15 s > └───────────────────────────────────────────────────────────┘
  1208. 34.15 s > Error: failed to lookup address information: Temporary failure in name resolution
  1209. 34.15 s >
  1210. 34.15 s >
  1211. 34.15 s > Location:
  1212. 34.15 s > tests/tests/test_python_api.rs:156:20
  1213. 34.15 s >
  1214. 34.15 s > FAIL [ 0.114s] (2/5) gammaloop-integration-tests::test_python_api python_evaluate_samples_batch_and_momentum_space_have_expected_shape
  1215. 34.15 s > stdout ---
  1216. 34.15 s >
  1217. 34.15 s > running 1 test
  1218. 34.15 s > test python_evaluate_samples_batch_and_momentum_space_have_expected_shape ... FAILED
  1219. 34.15 s >
  1220. 34.15 s > failures:
  1221. 34.15 s >
  1222. 34.15 s > failures:
  1223. 34.15 s > python_evaluate_samples_batch_and_momentum_space_have_expected_shape
  1224. 34.15 s >
  1225. 34.15 s > test result: FAILED. 0 passed; 1 failed; 0 ignored; 0 measured; 4 filtered out; finished in 0.11s
  1226. 34.15 s >
  1227. 34.15 s > stderr ---
  1228. 34.15 s > Error: Python API test subprocess failed.
  1229. 34.15 s > stdout:
  1230. 34.15 s > ┌────────────────────────────────────────────────────────┐
  1231. 34.15 s > │ You are running a restricted Symbolica instance. │
  1232. 34.15 s > │ │
  1233. 34.15 s > │ This mode is only permitted for non-commercial use and │
  1234. 34.15 s > │ is limited to one instance and core per machine. │
  1235. 34.15 s > │ │
  1236. 34.15 s > │ Hobbyists can easily acquire a free license key │
  1237. 34.15 s > │ that unlocks all cores and removes this banner: │
  1238. 34.15 s > │ │
  1239. 34.15 s > │ from symbolica import * │
  1240. 34.15 s > │ request_hobbyist_license('YOUR_NAME', 'YOUR_EMAIL') │
  1241. 34.15 s > │ │
  1242. 34.15 s > │ All other users can obtain a free 30-day trial key: │
  1243. 34.15 s > │ │
  1244. 34.15 s > │ from symbolica import * │
  1245. 34.15 s > │ request_trial_license('NAME', 'EMAIL', 'EMPLOYER') │
  1246. 34.15 s > │ │
  1247. 34.15 s > │ See https://symbolica.io/docs/get_started.html#license │
  1248. 34.15 s > └────────────────────────────────────────────────────────┘
  1249. 34.15 s > ┌───────────────────────────────────────────────────────────────────────────────────────────────────────────┐
  1250. 34.15 s > │ Cannot start new unlicensed Symbolica instance since there is already another one running on the machine. │
  1251. 34.15 s > └───────────────────────────────────────────────────────────────────────────────────────────────────────────┘
  1252. 34.15 s >
  1253. 34.15 s > stderr:
  1254. 34.15 s >
  1255. 34.15 s > ┌───────────────────────────────────────────────────────────┐
  1256. 34.15 s > │ Could not resolve the IP of the Symbolica license server. │
  1257. 34.15 s > │ │
  1258. 34.15 s > │ Please check your DNS configuration. │
  1259. 34.15 s > └───────────────────────────────────────────────────────────┘
  1260. 34.15 s > Error: failed to lookup address information: Temporary failure in name resolution
  1261. 34.15 s >
  1262. 34.15 s >
  1263. 34.15 s > Location:
  1264. 34.15 s > tests/tests/test_python_api.rs:156:20
  1265. 34.15 s >
  1266. 34.15 s > FAIL [ 0.118s] (3/5) gammaloop-integration-tests::test_python_api python_evaluate_sample_preserves_graph_grouping_and_incoming_pdgs
  1267. 34.15 s > stdout ---
  1268. 34.15 s >
  1269. 34.15 s > running 1 test
  1270. 34.15 s > test python_evaluate_sample_preserves_graph_grouping_and_incoming_pdgs ... FAILED
  1271. 34.15 s >
  1272. 34.15 s > failures:
  1273. 34.15 s >
  1274. 34.15 s > failures:
  1275. 34.15 s > python_evaluate_sample_preserves_graph_grouping_and_incoming_pdgs
  1276. 34.15 s >
  1277. 34.15 s > test result: FAILED. 0 passed; 1 failed; 0 ignored; 0 measured; 4 filtered out; finished in 0.11s
  1278. 34.15 s >
  1279. 34.15 s > stderr ---
  1280. 34.15 s > Error: Python API test subprocess failed.
  1281. 34.15 s > stdout:
  1282. 34.15 s > ┌────────────────────────────────────────────────────────┐
  1283. 34.15 s > │ You are running a restricted Symbolica instance. │
  1284. 34.15 s > │ │
  1285. 34.15 s > │ This mode is only permitted for non-commercial use and │
  1286. 34.15 s > │ is limited to one instance and core per machine. │
  1287. 34.15 s > │ │
  1288. 34.15 s > │ Hobbyists can easily acquire a free license key │
  1289. 34.15 s > │ that unlocks all cores and removes this banner: │
  1290. 34.15 s > │ │
  1291. 34.15 s > │ from symbolica import * │
  1292. 34.15 s > │ request_hobbyist_license('YOUR_NAME', 'YOUR_EMAIL') │
  1293. 34.15 s > │ │
  1294. 34.15 s > │ All other users can obtain a free 30-day trial key: │
  1295. 34.15 s > │ │
  1296. 34.15 s > │ from symbolica import * │
  1297. 34.15 s > │ request_trial_license('NAME', 'EMAIL', 'EMPLOYER') │
  1298. 34.15 s > │ │
  1299. 34.15 s > │ See https://symbolica.io/docs/get_started.html#license │
  1300. 34.15 s > └────────────────────────────────────────────────────────┘
  1301. 34.15 s > ┌───────────────────────────────────────────────────────────────────────────────────────────────────────────┐
  1302. 34.15 s > │ Cannot start new unlicensed Symbolica instance since there is already another one running on the machine. │
  1303. 34.15 s > └───────────────────────────────────────────────────────────────────────────────────────────────────────────┘
  1304. 34.15 s >
  1305. 34.15 s > stderr:
  1306. 34.15 s >
  1307. 34.15 s > ┌───────────────────────────────────────────────────────────┐
  1308. 34.15 s > │ Could not resolve the IP of the Symbolica license server. │
  1309. 34.15 s > │ │
  1310. 34.15 s > │ Please check your DNS configuration. │
  1311. 34.15 s > └───────────────────────────────────────────────────────────┘
  1312. 34.15 s > Error: failed to lookup address information: Temporary failure in name resolution
  1313. 34.15 s >
  1314. 34.15 s >
  1315. 34.15 s > Location:
  1316. 34.15 s > tests/tests/test_python_api.rs:156:20
  1317. 34.15 s >
  1318. 34.15 s > FAIL [ 0.118s] (4/5) gammaloop-integration-tests::test_python_api python_session_getters_return_live_toml_and_command_blocks
  1319. 34.15 s > stdout ---
  1320. 34.15 s >
  1321. 34.15 s > running 1 test
  1322. 34.15 s > test python_session_getters_return_live_toml_and_command_blocks ... FAILED
  1323. 34.15 s >
  1324. 34.15 s > failures:
  1325. 34.15 s >
  1326. 34.15 s > failures:
  1327. 34.15 s > python_session_getters_return_live_toml_and_command_blocks
  1328. 34.15 s >
  1329. 34.15 s > test result: FAILED. 0 passed; 1 failed; 0 ignored; 0 measured; 4 filtered out; finished in 0.11s
  1330. 34.15 s >
  1331. 34.15 s > stderr ---
  1332. 34.15 s > Error: Python API test subprocess failed.
  1333. 34.15 s > stdout:
  1334. 34.15 s > ┌────────────────────────────────────────────────────────┐
  1335. 34.15 s > │ You are running a restricted Symbolica instance. │
  1336. 34.15 s > │ │
  1337. 34.15 s > │ This mode is only permitted for non-commercial use and │
  1338. 34.15 s > │ is limited to one instance and core per machine. │
  1339. 34.15 s > │ │
  1340. 34.15 s > │ Hobbyists can easily acquire a free license key │
  1341. 34.15 s > │ that unlocks all cores and removes this banner: │
  1342. 34.15 s > │ │
  1343. 34.15 s > │ from symbolica import * │
  1344. 34.15 s > │ request_hobbyist_license('YOUR_NAME', 'YOUR_EMAIL') │
  1345. 34.15 s > │ │
  1346. 34.15 s > │ All other users can obtain a free 30-day trial key: │
  1347. 34.15 s > │ │
  1348. 34.15 s > │ from symbolica import * │
  1349. 34.15 s > │ request_trial_license('NAME', 'EMAIL', 'EMPLOYER') │
  1350. 34.15 s > │ │
  1351. 34.15 s > │ See https://symbolica.io/docs/get_started.html#license │
  1352. 34.15 s > └────────────────────────────────────────────────────────┘
  1353. 34.15 s > ┌───────────────────────────────────────────────────────────────────────────────────────────────────────────┐
  1354. 34.15 s > │ Cannot start new unlicensed Symbolica instance since there is already another one running on the machine. │
  1355. 34.15 s > └───────────────────────────────────────────────────────────────────────────────────────────────────────────┘
  1356. 34.15 s >
  1357. 34.15 s > stderr:
  1358. 34.15 s >
  1359. 34.15 s > ┌───────────────────────────────────────────────────────────┐
  1360. 34.15 s > │ Could not resolve the IP of the Symbolica license server. │
  1361. 34.15 s > │ │
  1362. 34.15 s > │ Please check your DNS configuration. │
  1363. 34.15 s > └───────────────────────────────────────────────────────────┘
  1364. 34.15 s > Error: failed to lookup address information: Temporary failure in name resolution
  1365. 34.15 s >
  1366. 34.15 s >
  1367. 34.15 s > Location:
  1368. 34.15 s > tests/tests/test_python_api.rs:156:20
  1369. 34.15 s >
  1370. 34.15 s > error: test run failed
  1371. 34.15 s >
  1372. 34.15 s > ========== nextest test summary ==========
  1373. 34.15 s > report: target/nextest/ci_gammaloop/junit.xml
  1374. 34.15 s > tests: 5, failures: 4, errors: 0
  1375. 34.15 s >
  1376. 34.15 s > 1. gammaloop-integration-tests::test_python_api::python_evaluate_sample_honors_generate_events_and_observable_snapshots
  1377. 34.15 s > failure: test failure with exit code 101
  1378. 34.15 s > Error: Python API test subprocess failed.
  1379. 34.15 s > stdout:
  1380. 34.15 s > ┌────────────────────────────────────────────────────────┐
  1381. 34.15 s > │ You are running a restricted Symbolica instance. │
  1382. 34.15 s > │ │
  1383. 34.15 s > │ This mode is only permitted for non-commercial use and │
  1384. 34.15 s > │ is limited to one instance and core per machine. │
  1385. 34.15 s > │ │
  1386. 34.15 s > │ Hobbyists can easily acquire a free license key │
  1387. 34.15 s > │ that unlocks all cores and removes this banner: │
  1388. 34.15 s > │ │
  1389. 34.15 s > │ from symbolica import * │
  1390. 34.15 s > │ request_hobbyist_license('YOUR_NAME', 'YOUR_EMAIL') │
  1391. 34.15 s > │ │
  1392. 34.15 s > │ All other users can obtain a free 30-day trial key: │
  1393. 34.15 s > │ │
  1394. 34.15 s > │ from symbolica import * │
  1395. 34.15 s > │ request_trial_license('NAME', 'EMAIL', 'EMPLOYER') │
  1396. 34.15 s > │ │
  1397. 34.15 s > │ See https://symbolica.io/docs/get_started.html#license │
  1398. 34.15 s > └────────────────────────────────────────────────────────┘
  1399. 34.15 s > ┌───────────────────────────────────────────────────────────────────────────────────────────────────────────┐
  1400. 34.15 s > │ Cannot start new unlicensed Symbolica instance since there is already another one running on the machine. │
  1401. 34.15 s > └───────────────────────────────────────────────────────────────────────────────────────────────────────────┘
  1402. 34.15 s >
  1403. 34.15 s > stderr:
  1404. 34.15 s >
  1405. 34.15 s > ┌───────────────────────────────────────────────────────────┐
  1406. 34.15 s > │ Could not resolve the IP of the Symbolica license server. │
  1407. 34.15 s > │ │
  1408. 34.15 s > │ Please check your DNS configuration. │
  1409. 34.15 s > └───────────────────────────────────────────────────────────┘
  1410. 34.15 s > Error: failed to lookup address information: Temporary failure in name resolution
  1411. 34.15 s >
  1412. 34.15 s >
  1413. 34.15 s > Location:
  1414. 34.15 s > tests/tests/test_python_api.rs:156:20
  1415. 34.15 s > system-out
  1416. 34.15 s > running 1 test
  1417. 34.15 s > test python_evaluate_sample_honors_generate_events_and_observable_snapshots ... FAILED
  1418. 34.15 s >
  1419. 34.15 s > failures:
  1420. 34.15 s >
  1421. 34.15 s > failures:
  1422. 34.15 s > python_evaluate_sample_honors_generate_events_and_observable_snapshots
  1423. 34.15 s >
  1424. 34.15 s > test result: FAILED. 0 passed; 1 failed; 0 ignored; 0 measured; 4 filtered out; finished in 0.11s
  1425. 34.15 s > system-err
  1426. 34.15 s > Error: Python API test subprocess failed.
  1427. 34.15 s > stdout:
  1428. 34.15 s > ┌────────────────────────────────────────────────────────┐
  1429. 34.15 s > │ You are running a restricted Symbolica instance. │
  1430. 34.15 s > │ │
  1431. 34.15 s > │ This mode is only permitted for non-commercial use and │
  1432. 34.15 s > │ is limited to one instance and core per machine. │
  1433. 34.15 s > │ │
  1434. 34.15 s > │ Hobbyists can easily acquire a free license key │
  1435. 34.15 s > │ that unlocks all cores and removes this banner: │
  1436. 34.15 s > │ │
  1437. 34.15 s > │ from symbolica import * │
  1438. 34.15 s > │ request_hobbyist_license('YOUR_NAME', 'YOUR_EMAIL') │
  1439. 34.15 s > │ │
  1440. 34.15 s > │ All other users can obtain a free 30-day trial key: │
  1441. 34.15 s > │ │
  1442. 34.15 s > │ from symbolica import * │
  1443. 34.15 s > │ request_trial_license('NAME', 'EMAIL', 'EMPLOYER') │
  1444. 34.15 s > │ │
  1445. 34.15 s > │ See https://symbolica.io/docs/get_started.html#license │
  1446. 34.15 s > └────────────────────────────────────────────────────────┘
  1447. 34.15 s > ┌───────────────────────────────────────────────────────────────────────────────────────────────────────────┐
  1448. 34.15 s > │ Cannot start new unlicensed Symbolica instance since there is already another one running on the machine. │
  1449. 34.15 s > └───────────────────────────────────────────────────────────────────────────────────────────────────────────┘
  1450. 34.15 s >
  1451. 34.15 s > stderr:
  1452. 34.15 s >
  1453. 34.15 s > ┌───────────────────────────────────────────────────────────┐
  1454. 34.15 s > │ Could not resolve the IP of the Symbolica license server. │
  1455. 34.15 s > │ │
  1456. 34.15 s > │ Please check your DNS configuration. │
  1457. 34.15 s > └───────────────────────────────────────────────────────────┘
  1458. 34.15 s > Error: failed to lookup address information: Temporary failure in name resolution
  1459. 34.15 s >
  1460. 34.15 s >
  1461. 34.15 s > Location:
  1462. 34.15 s > tests/tests/test_python_api.rs:156:20
  1463. 34.15 s >
  1464. 34.15 s > 2. gammaloop-integration-tests::test_python_api::python_evaluate_samples_batch_and_momentum_space_have_expected_shape
  1465. 34.15 s > failure: test failure with exit code 101
  1466. 34.15 s > Error: Python API test subprocess failed.
  1467. 34.15 s > stdout:
  1468. 34.15 s > ┌────────────────────────────────────────────────────────┐
  1469. 34.15 s > │ You are running a restricted Symbolica instance. │
  1470. 34.15 s > │ │
  1471. 34.15 s > │ This mode is only permitted for non-commercial use and │
  1472. 34.15 s > │ is limited to one instance and core per machine. │
  1473. 34.15 s > │ │
  1474. 34.15 s > │ Hobbyists can easily acquire a free license key │
  1475. 34.15 s > │ that unlocks all cores and removes this banner: │
  1476. 34.15 s > │ │
  1477. 34.15 s > │ from symbolica import * │
  1478. 34.15 s > │ request_hobbyist_license('YOUR_NAME', 'YOUR_EMAIL') │
  1479. 34.15 s > │ │
  1480. 34.15 s > │ All other users can obtain a free 30-day trial key: │
  1481. 34.15 s > │ │
  1482. 34.15 s > │ from symbolica import * │
  1483. 34.15 s > │ request_trial_license('NAME', 'EMAIL', 'EMPLOYER') │
  1484. 34.15 s > │ │
  1485. 34.15 s > │ See https://symbolica.io/docs/get_started.html#license │
  1486. 34.15 s > └────────────────────────────────────────────────────────┘
  1487. 34.15 s > ┌───────────────────────────────────────────────────────────────────────────────────────────────────────────┐
  1488. 34.15 s > │ Cannot start new unlicensed Symbolica instance since there is already another one running on the machine. │
  1489. 34.15 s > └───────────────────────────────────────────────────────────────────────────────────────────────────────────┘
  1490. 34.15 s >
  1491. 34.15 s > stderr:
  1492. 34.15 s >
  1493. 34.15 s > ┌───────────────────────────────────────────────────────────┐
  1494. 34.15 s > │ Could not resolve the IP of the Symbolica license server. │
  1495. 34.15 s > │ │
  1496. 34.15 s > │ Please check your DNS configuration. │
  1497. 34.15 s > └───────────────────────────────────────────────────────────┘
  1498. 34.15 s > Error: failed to lookup address information: Temporary failure in name resolution
  1499. 34.15 s >
  1500. 34.15 s >
  1501. 34.15 s > Location:
  1502. 34.15 s > tests/tests/test_python_api.rs:156:20
  1503. 34.15 s > system-out
  1504. 34.15 s > running 1 test
  1505. 34.15 s > test python_evaluate_samples_batch_and_momentum_space_have_expected_shape ... FAILED
  1506. 34.15 s >
  1507. 34.15 s > failures:
  1508. 34.15 s >
  1509. 34.15 s > failures:
  1510. 34.15 s > python_evaluate_samples_batch_and_momentum_space_have_expected_shape
  1511. 34.15 s >
  1512. 34.15 s > test result: FAILED. 0 passed; 1 failed; 0 ignored; 0 measured; 4 filtered out; finished in 0.11s
  1513. 34.15 s > system-err
  1514. 34.15 s > Error: Python API test subprocess failed.
  1515. 34.15 s > stdout:
  1516. 34.15 s > ┌────────────────────────────────────────────────────────┐
  1517. 34.15 s > │ You are running a restricted Symbolica instance. │
  1518. 34.15 s > │ │
  1519. 34.15 s > │ This mode is only permitted for non-commercial use and │
  1520. 34.15 s > │ is limited to one instance and core per machine. │
  1521. 34.15 s > │ │
  1522. 34.15 s > │ Hobbyists can easily acquire a free license key │
  1523. 34.15 s > │ that unlocks all cores and removes this banner: │
  1524. 34.15 s > │ │
  1525. 34.15 s > │ from symbolica import * │
  1526. 34.15 s > │ request_hobbyist_license('YOUR_NAME', 'YOUR_EMAIL') │
  1527. 34.15 s > │ │
  1528. 34.15 s > │ All other users can obtain a free 30-day trial key: │
  1529. 34.15 s > │ │
  1530. 34.15 s > │ from symbolica import * │
  1531. 34.15 s > │ request_trial_license('NAME', 'EMAIL', 'EMPLOYER') │
  1532. 34.15 s > │ │
  1533. 34.15 s > │ See https://symbolica.io/docs/get_started.html#license │
  1534. 34.15 s > └────────────────────────────────────────────────────────┘
  1535. 34.15 s > ┌───────────────────────────────────────────────────────────────────────────────────────────────────────────┐
  1536. 34.15 s > │ Cannot start new unlicensed Symbolica instance since there is already another one running on the machine. │
  1537. 34.15 s > └───────────────────────────────────────────────────────────────────────────────────────────────────────────┘
  1538. 34.15 s >
  1539. 34.15 s > stderr:
  1540. 34.15 s >
  1541. 34.15 s > ┌───────────────────────────────────────────────────────────┐
  1542. 34.15 s > │ Could not resolve the IP of the Symbolica license server. │
  1543. 34.15 s > │ │
  1544. 34.15 s > │ Please check your DNS configuration. │
  1545. 34.15 s > └───────────────────────────────────────────────────────────┘
  1546. 34.15 s > Error: failed to lookup address information: Temporary failure in name resolution
  1547. 34.15 s >
  1548. 34.15 s >
  1549. 34.15 s > Location:
  1550. 34.15 s > tests/tests/test_python_api.rs:156:20
  1551. 34.15 s >
  1552. 34.15 s > 3. gammaloop-integration-tests::test_python_api::python_evaluate_sample_preserves_graph_grouping_and_incoming_pdgs
  1553. 34.15 s > failure: test failure with exit code 101
  1554. 34.15 s > Error: Python API test subprocess failed.
  1555. 34.15 s > stdout:
  1556. 34.15 s > ┌────────────────────────────────────────────────────────┐
  1557. 34.15 s > │ You are running a restricted Symbolica instance. │
  1558. 34.15 s > │ │
  1559. 34.15 s > │ This mode is only permitted for non-commercial use and │
  1560. 34.15 s > │ is limited to one instance and core per machine. │
  1561. 34.15 s > │ │
  1562. 34.15 s > │ Hobbyists can easily acquire a free license key │
  1563. 34.15 s > │ that unlocks all cores and removes this banner: │
  1564. 34.15 s > │ │
  1565. 34.15 s > │ from symbolica import * │
  1566. 34.15 s > │ request_hobbyist_license('YOUR_NAME', 'YOUR_EMAIL') │
  1567. 34.15 s > │ │
  1568. 34.15 s > │ All other users can obtain a free 30-day trial key: │
  1569. 34.15 s > │ │
  1570. 34.15 s > │ from symbolica import * │
  1571. 34.15 s > │ request_trial_license('NAME', 'EMAIL', 'EMPLOYER') │
  1572. 34.15 s > │ │
  1573. 34.15 s > │ See https://symbolica.io/docs/get_started.html#license │
  1574. 34.15 s > └────────────────────────────────────────────────────────┘
  1575. 34.15 s > ┌───────────────────────────────────────────────────────────────────────────────────────────────────────────┐
  1576. 34.15 s > │ Cannot start new unlicensed Symbolica instance since there is already another one running on the machine. │
  1577. 34.15 s > └───────────────────────────────────────────────────────────────────────────────────────────────────────────┘
  1578. 34.15 s >
  1579. 34.15 s > stderr:
  1580. 34.15 s >
  1581. 34.15 s > ┌───────────────────────────────────────────────────────────┐
  1582. 34.15 s > │ Could not resolve the IP of the Symbolica license server. │
  1583. 34.15 s > │ │
  1584. 34.15 s > │ Please check your DNS configuration. │
  1585. 34.15 s > └───────────────────────────────────────────────────────────┘
  1586. 34.15 s > Error: failed to lookup address information: Temporary failure in name resolution
  1587. 34.15 s >
  1588. 34.15 s >
  1589. 34.15 s > Location:
  1590. 34.15 s > tests/tests/test_python_api.rs:156:20
  1591. 34.15 s > system-out
  1592. 34.15 s > running 1 test
  1593. 34.15 s > test python_evaluate_sample_preserves_graph_grouping_and_incoming_pdgs ... FAILED
  1594. 34.15 s >
  1595. 34.15 s > failures:
  1596. 34.15 s >
  1597. 34.15 s > failures:
  1598. 34.15 s > python_evaluate_sample_preserves_graph_grouping_and_incoming_pdgs
  1599. 34.15 s >
  1600. 34.15 s > test result: FAILED. 0 passed; 1 failed; 0 ignored; 0 measured; 4 filtered out; finished in 0.11s
  1601. 34.15 s > system-err
  1602. 34.15 s > Error: Python API test subprocess failed.
  1603. 34.15 s > stdout:
  1604. 34.15 s > ┌────────────────────────────────────────────────────────┐
  1605. 34.15 s > │ You are running a restricted Symbolica instance. │
  1606. 34.15 s > │ │
  1607. 34.15 s > │ This mode is only permitted for non-commercial use and │
  1608. 34.15 s > │ is limited to one instance and core per machine. │
  1609. 34.15 s > │ │
  1610. 34.15 s > │ Hobbyists can easily acquire a free license key │
  1611. 34.15 s > │ that unlocks all cores and removes this banner: │
  1612. 34.15 s > │ │
  1613. 34.15 s > │ from symbolica import * │
  1614. 34.15 s > │ request_hobbyist_license('YOUR_NAME', 'YOUR_EMAIL') │
  1615. 34.15 s > │ │
  1616. 34.15 s > │ All other users can obtain a free 30-day trial key: │
  1617. 34.15 s > │ │
  1618. 34.15 s > │ from symbolica import * │
  1619. 34.15 s > │ request_trial_license('NAME', 'EMAIL', 'EMPLOYER') │
  1620. 34.15 s > │ │
  1621. 34.15 s > │ See https://symbolica.io/docs/get_started.html#license │
  1622. 34.15 s > └────────────────────────────────────────────────────────┘
  1623. 34.15 s > ┌───────────────────────────────────────────────────────────────────────────────────────────────────────────┐
  1624. 34.15 s > │ Cannot start new unlicensed Symbolica instance since there is already another one running on the machine. │
  1625. 34.15 s > └───────────────────────────────────────────────────────────────────────────────────────────────────────────┘
  1626. 34.15 s >
  1627. 34.15 s > stderr:
  1628. 34.15 s >
  1629. 34.15 s > ┌───────────────────────────────────────────────────────────┐
  1630. 34.15 s > │ Could not resolve the IP of the Symbolica license server. │
  1631. 34.15 s > │ │
  1632. 34.15 s > │ Please check your DNS configuration. │
  1633. 34.15 s > └───────────────────────────────────────────────────────────┘
  1634. 34.15 s > Error: failed to lookup address information: Temporary failure in name resolution
  1635. 34.15 s >
  1636. 34.15 s >
  1637. 34.15 s > Location:
  1638. 34.15 s > tests/tests/test_python_api.rs:156:20
  1639. 34.15 s >
  1640. 34.15 s > 4. gammaloop-integration-tests::test_python_api::python_session_getters_return_live_toml_and_command_blocks
  1641. 34.15 s > failure: test failure with exit code 101
  1642. 34.15 s > Error: Python API test subprocess failed.
  1643. 34.15 s > stdout:
  1644. 34.15 s > ┌────────────────────────────────────────────────────────┐
  1645. 34.15 s > │ You are running a restricted Symbolica instance. │
  1646. 34.15 s > │ │
  1647. 34.15 s > │ This mode is only permitted for non-commercial use and │
  1648. 34.15 s > │ is limited to one instance and core per machine. │
  1649. 34.15 s > │ │
  1650. 34.15 s > │ Hobbyists can easily acquire a free license key │
  1651. 34.15 s > │ that unlocks all cores and removes this banner: │
  1652. 34.15 s > │ │
  1653. 34.15 s > │ from symbolica import * │
  1654. 34.15 s > │ request_hobbyist_license('YOUR_NAME', 'YOUR_EMAIL') │
  1655. 34.15 s > │ │
  1656. 34.15 s > │ All other users can obtain a free 30-day trial key: │
  1657. 34.15 s > │ │
  1658. 34.15 s > │ from symbolica import * │
  1659. 34.15 s > │ request_trial_license('NAME', 'EMAIL', 'EMPLOYER') │
  1660. 34.15 s > │ │
  1661. 34.15 s > │ See https://symbolica.io/docs/get_started.html#license │
  1662. 34.15 s > └────────────────────────────────────────────────────────┘
  1663. 34.15 s > ┌───────────────────────────────────────────────────────────────────────────────────────────────────────────┐
  1664. 34.15 s > │ Cannot start new unlicensed Symbolica instance since there is already another one running on the machine. │
  1665. 34.15 s > └───────────────────────────────────────────────────────────────────────────────────────────────────────────┘
  1666. 34.15 s >
  1667. 34.15 s > stderr:
  1668. 34.15 s >
  1669. 34.15 s > ┌───────────────────────────────────────────────────────────┐
  1670. 34.15 s > │ Could not resolve the IP of the Symbolica license server. │
  1671. 34.15 s > │ │
  1672. 34.15 s > │ Please check your DNS configuration. │
  1673. 34.15 s > └───────────────────────────────────────────────────────────┘
  1674. 34.15 s > Error: failed to lookup address information: Temporary failure in name resolution
  1675. 34.15 s >
  1676. 34.15 s >
  1677. 34.15 s > Location:
  1678. 34.15 s > tests/tests/test_python_api.rs:156:20
  1679. 34.15 s > system-out
  1680. 34.15 s > running 1 test
  1681. 34.15 s > test python_session_getters_return_live_toml_and_command_blocks ... FAILED
  1682. 34.15 s >
  1683. 34.15 s > failures:
  1684. 34.15 s >
  1685. 34.15 s > failures:
  1686. 34.15 s > python_session_getters_return_live_toml_and_command_blocks
  1687. 34.15 s >
  1688. 34.15 s > test result: FAILED. 0 passed; 1 failed; 0 ignored; 0 measured; 4 filtered out; finished in 0.11s
  1689. 34.15 s > system-err
  1690. 34.15 s > Error: Python API test subprocess failed.
  1691. 34.15 s > stdout:
  1692. 34.15 s > ┌────────────────────────────────────────────────────────┐
  1693. 34.15 s > │ You are running a restricted Symbolica instance. │
  1694. 34.15 s > │ │
  1695. 34.15 s > │ This mode is only permitted for non-commercial use and │
  1696. 34.15 s > │ is limited to one instance and core per machine. │
  1697. 34.15 s > │ │
  1698. 34.15 s > │ Hobbyists can easily acquire a free license key │
  1699. 34.15 s > │ that unlocks all cores and removes this banner: │
  1700. 34.15 s > │ │
  1701. 34.15 s > │ from symbolica import * │
  1702. 34.15 s > │ request_hobbyist_license('YOUR_NAME', 'YOUR_EMAIL') │
  1703. 34.15 s > │ │
  1704. 34.15 s > │ All other users can obtain a free 30-day trial key: │
  1705. 34.15 s > │ │
  1706. 34.15 s > │ from symbolica import * │
  1707. 34.15 s > │ request_trial_license('NAME', 'EMAIL', 'EMPLOYER') │
  1708. 34.15 s > │ │
  1709. 34.15 s > │ See https://symbolica.io/docs/get_started.html#license │
  1710. 34.15 s > └────────────────────────────────────────────────────────┘
  1711. 34.15 s > ┌───────────────────────────────────────────────────────────────────────────────────────────────────────────┐
  1712. 34.15 s > │ Cannot start new unlicensed Symbolica instance since there is already another one running on the machine. │
  1713. 34.15 s > └───────────────────────────────────────────────────────────────────────────────────────────────────────────┘
  1714. 34.15 s >
  1715. 34.15 s > stderr:
  1716. 34.15 s >
  1717. 34.15 s > ┌───────────────────────────────────────────────────────────┐
  1718. 34.15 s > │ Could not resolve the IP of the Symbolica license server. │
  1719. 34.15 s > │ │
  1720. 34.15 s > │ Please check your DNS configuration. │
  1721. 34.15 s > └───────────────────────────────────────────────────────────┘
  1722. 34.15 s > Error: failed to lookup address information: Temporary failure in name resolution
  1723. 34.15 s >
  1724. 34.15 s >
  1725. 34.15 s > Location:
  1726. 34.15 s > tests/tests/test_python_api.rs:156:20
  1727. 34.15 s > =========================================
  1728. 34.15 s For full logs, run:
  1729. 34.15 s nix log /nix/store/nmwgfm0zigizp5byy173df7l99i9kddz-gammaloop-nextest-python-api.drv
  1730. 34.33 s [0 built (1 failed), 0.0Run failed.