build checks.x86_64-linux.gammaloop-check
0.21 s
$ /nix/store/9ypz3flqsrl5xl495mm8h645gadjsxi1-coreutils-9.11/bin/timeout --kill-after=15s 7200s /nix/store/23zk8sgzamrbmj1fday15szf7f2279s8-nix-2.34.7/bin/nix --extra-experimental-features nix-command --extra-experimental-features flakes --log-format internal-json build --no-link --print-out-paths git+https://github.com/alphal00p/gammaloop?ref=advanced_sampling&rev=882f80eb025a2aa807219cff35cbd70349e28440&shallow=1#checks.x86_64-linux.gammaloop-check --print-build-logs
5.20 s
5.67 s
Building /nix/store/8z7532y2mrxdvk4qgscgqrhdk179hn45-gammaloop-workspace-check-0.1.0.drv
5.80 s
[gammaloop-workspace-check] Phase: unpackPhase
5.80 s
[gammaloop-workspace-check] unpacking source archive /nix/store/lxd2pc2qjvxzkbjaklyikbcq1cjx91ck-source
6.80 s
[gammaloop-workspace-check] source root is source
6.86 s
[gammaloop-workspace-check] Phase: patchPhase
6.87 s
[gammaloop-workspace-check] Executing configureCargoCommonVars
6.88 s
[gammaloop-workspace-check] decompressing cargo artifacts from /nix/store/50vpxlcgfxf2d57i27v3d10zjwxxbm2r-gammaloop-workspace-deps-deps-0.1.0/target.tar.zst to target
9.06 s
[gammaloop-workspace-check] Phase: updateAutotoolsGnuConfigScriptsPhase
9.10 s
[gammaloop-workspace-check] Phase: configurePhase
9.11 s
[gammaloop-workspace-check] will append /build/source/.cargo-home/config.toml with contents of /nix/store/5drf77x6km4ky7gwlrzdx9bbd6fz09g3-vendor-cargo-deps/config.toml
9.11 s
[gammaloop-workspace-check] default configurePhase, nothing to do
9.11 s
[gammaloop-workspace-check] Phase: buildPhase
9.11 s
[gammaloop-workspace-check] +++ command cargo --version
9.12 s
[gammaloop-workspace-check] cargo 1.97.0 (c980f4866 2026-06-30)
9.17 s
[gammaloop-workspace-check] +++ command cargo check --profile ci-optim --locked --workspace --features gammaloop-tracing-filter/clap,gammaloop-tracing-filter/symbolica,idenso/bincode,idenso/reference-cases,linnet/bincode,linnet/drawing,linnet/rkyv,linnet/serde,linnet/symbolica,spenso-macros/shadowing,spenso/shadowing,symbolica/tracing_max_level_info,three-dimensional-reps/display,three-dimensional-reps/eval,three-dimensional-reps/serde --all-targets
9.97 s
[gammaloop-workspace-check] Checking cfg-if v1.0.4
9.97 s
[gammaloop-workspace-check] Checking memchr v2.8.0
9.97 s
[gammaloop-workspace-check] Checking once_cell v1.21.4
9.98 s
[gammaloop-workspace-check] Checking either v1.15.0
10.00 s
[gammaloop-workspace-check] Checking serde_core v1.0.228
10.00 s
[gammaloop-workspace-check] Checking libc v0.2.186
10.00 s
[gammaloop-workspace-check] Checking libm v0.2.16
10.02 s
[gammaloop-workspace-check] Checking itoa v1.0.18
10.02 s
[gammaloop-workspace-check] Checking log v0.4.29
10.02 s
[gammaloop-workspace-check] Checking regex-syntax v0.8.10
10.02 s
[gammaloop-workspace-check] Checking zerocopy v0.8.48
10.02 s
[gammaloop-workspace-check] Checking crossbeam-utils v0.8.21
10.03 s
[gammaloop-workspace-check] Checking equivalent v1.0.2
10.04 s
[gammaloop-workspace-check] Checking zmij v1.0.21
10.05 s
[gammaloop-workspace-check] Checking lazy_static v1.5.0
10.05 s
[gammaloop-workspace-check] Checking bytemuck v1.25.0
10.05 s
[gammaloop-workspace-check] Compiling target-lexicon v0.13.5
10.12 s
[gammaloop-workspace-check] Checking arrayvec v0.7.6
10.21 s
[gammaloop-workspace-check] Checking powerfmt v0.2.0
10.25 s
[gammaloop-workspace-check] Checking num-conv v0.2.1
10.27 s
[gammaloop-workspace-check] Checking itertools v0.14.0
10.28 s
[gammaloop-workspace-check] Checking num_threads v0.1.7
10.31 s
[gammaloop-workspace-check] Checking time-core v0.1.8
10.37 s
[gammaloop-workspace-check] Checking pin-project-lite v0.2.17
10.38 s
[gammaloop-workspace-check] Checking tracing-core v0.1.36
10.38 s
[gammaloop-workspace-check] Checking deranged v0.5.8
10.44 s
[gammaloop-workspace-check] Checking foldhash v0.2.0
10.46 s
[gammaloop-workspace-check] Checking safe_arch v0.7.4
10.46 s
[gammaloop-workspace-check] Checking allocator-api2 v0.2.21
10.55 s
[gammaloop-workspace-check] Checking const-random v0.1.18
10.62 s
[gammaloop-workspace-check] Checking winnow v1.0.2
10.66 s
[gammaloop-workspace-check] Checking nu-ansi-term v0.50.3
10.68 s
[gammaloop-workspace-check] Checking static_assertions v1.1.0
10.79 s
[gammaloop-workspace-check] Checking unty v0.0.4
10.88 s
[gammaloop-workspace-check] Checking safe_arch v1.0.0
11.08 s
[gammaloop-workspace-check] Checking aho-corasick v1.1.4
11.14 s
[gammaloop-workspace-check] Checking sharded-slab v0.1.7
11.14 s
[gammaloop-workspace-check] Checking hashbrown v0.16.1
11.29 s
[gammaloop-workspace-check] Checking wide v0.7.33
11.48 s
[gammaloop-workspace-check] Checking tracing v0.1.44
11.89 s
[gammaloop-workspace-check] Checking crossbeam-epoch v0.9.18
12.02 s
[gammaloop-workspace-check] Checking tracing-log v0.2.0
12.39 s
[gammaloop-workspace-check] Checking num-traits v0.2.19
12.42 s
[gammaloop-workspace-check] Checking thread_local v1.1.9
12.52 s
[gammaloop-workspace-check] Checking crossbeam-deque v0.8.6
12.65 s
[gammaloop-workspace-check] Checking indenter v0.3.4
12.73 s
[gammaloop-workspace-check] Checking az v1.3.0
12.80 s
[gammaloop-workspace-check] Checking toml_writer v1.1.1+spec-1.1.0
12.91 s
[gammaloop-workspace-check] Checking wide v1.3.0
13.09 s
[gammaloop-workspace-check] Compiling phf_shared v0.11.3
13.18 s
[gammaloop-workspace-check] Checking rayon-core v1.13.0
13.20 s
[gammaloop-workspace-check] Checking anyhow v1.0.102
13.71 s
[gammaloop-workspace-check] Checking rawpointer v0.2.1
13.83 s
[gammaloop-workspace-check] Checking dyn-clone v1.0.20
13.87 s
[gammaloop-workspace-check] Checking alloc-no-stdlib v2.0.4
13.89 s
[gammaloop-workspace-check] Checking utf8parse v0.2.2
14.02 s
[gammaloop-workspace-check] Checking matrixmultiply v0.3.10
14.04 s
[gammaloop-workspace-check] Checking anstyle-parse v1.0.0
14.05 s
[gammaloop-workspace-check] Checking alloc-stdlib v0.2.2
14.15 s
[gammaloop-workspace-check] Checking colored v3.1.1
14.22 s
[gammaloop-workspace-check] Checking is_terminal_polyfill v1.70.2
14.24 s
[gammaloop-workspace-check] Checking rayon v1.12.0
14.30 s
[gammaloop-workspace-check] Checking colorchoice v1.0.5
14.35 s
[gammaloop-workspace-check] Compiling pyo3-build-config v0.28.3
14.39 s
[gammaloop-workspace-check] Checking anstyle-query v1.1.5
14.41 s
[gammaloop-workspace-check] Checking anstyle v1.0.14
14.48 s
[gammaloop-workspace-check] Compiling phf_generator v0.11.3
14.51 s
[gammaloop-workspace-check] Checking regex-automata v0.4.14
14.55 s
[gammaloop-workspace-check] Checking approx v0.5.1
14.58 s
[gammaloop-workspace-check] Checking num-integer v0.1.46
14.68 s
[gammaloop-workspace-check] Checking eyre v0.6.12
14.69 s
[gammaloop-workspace-check] Checking unicode-width v0.2.2
14.77 s
[gammaloop-workspace-check] Checking bitflags v1.3.2
14.84 s
[gammaloop-workspace-check] Checking anstream v1.0.0
14.89 s
[gammaloop-workspace-check] Compiling phf_codegen v0.11.3
15.05 s
[gammaloop-workspace-check] Checking serde v1.0.228
15.17 s
[gammaloop-workspace-check] Checking serde_json v1.0.149
15.20 s
[gammaloop-workspace-check] Checking bitflags v2.11.1
15.27 s
[gammaloop-workspace-check] Checking serde_spanned v1.1.1
15.28 s
[gammaloop-workspace-check] Checking toml_datetime v1.1.1+spec-1.1.0
15.30 s
[gammaloop-workspace-check] Checking toml_parser v1.1.2+spec-1.1.0
15.48 s
[gammaloop-workspace-check] Checking brotli-decompressor v5.0.0
15.51 s
[gammaloop-workspace-check] Checking spec_math v0.1.6
15.55 s
[gammaloop-workspace-check] Checking inventory v0.3.24
15.56 s
[gammaloop-workspace-check] Checking getrandom v0.3.4
15.60 s
[gammaloop-workspace-check] Checking time v0.3.47
15.66 s
[gammaloop-workspace-check] Checking gmp-mpfr-sys v1.7.1
15.76 s
[gammaloop-workspace-check] Checking wasmtime-jit-icache-coherence v34.0.2
15.78 s
[gammaloop-workspace-check] Checking hugepage-rs v0.1.1
15.88 s
[gammaloop-workspace-check] Checking region v3.0.2
15.93 s
[gammaloop-workspace-check] Checking rand_core v0.9.5
15.99 s
[gammaloop-workspace-check] Checking thiserror v2.0.18
16.05 s
[gammaloop-workspace-check] Compiling getopts v0.2.24
16.08 s
[gammaloop-workspace-check] Checking libloading v0.9.0
16.09 s
[gammaloop-workspace-check] Checking bytes v1.11.1
16.16 s
[gammaloop-workspace-check] Checking smallvec v1.15.1
16.19 s
[gammaloop-workspace-check] Checking num-complex v0.4.6
16.23 s
[gammaloop-workspace-check] Checking tracing-serde v0.2.0
16.40 s
[gammaloop-workspace-check] Checking bincode v2.0.1
16.43 s
[gammaloop-workspace-check] Checking toml v1.1.2+spec-1.1.0
16.55 s
[gammaloop-workspace-check] Checking smartstring v1.0.1
16.57 s
[gammaloop-workspace-check] Checking self_cell v1.2.2
16.63 s
[gammaloop-workspace-check] Checking tinyjson v2.5.1
16.70 s
[gammaloop-workspace-check] Checking append-only-vec v0.1.8
16.77 s
[gammaloop-workspace-check] Checking byteorder v1.5.0
16.94 s
[gammaloop-workspace-check] Checking linux-raw-sys v0.12.1
17.02 s
[gammaloop-workspace-check] Compiling unic-char-range v0.9.0
17.39 s
[gammaloop-workspace-check] Compiling unicode_names2_generator v1.3.0
17.50 s
[gammaloop-workspace-check] Compiling unic-common v0.9.0
17.63 s
[gammaloop-workspace-check] Checking simba v0.9.1
17.66 s
[gammaloop-workspace-check] Compiling unic-char-property v0.9.0
17.72 s
[gammaloop-workspace-check] Compiling unic-ucd-version v0.9.0
17.75 s
[gammaloop-workspace-check] Compiling is-macro v0.3.7
17.87 s
[gammaloop-workspace-check] Compiling rustpython-parser-vendored v0.4.0
17.88 s
[gammaloop-workspace-check] Checking rustix v1.1.4
17.96 s
[gammaloop-workspace-check] Checking iana-time-zone v0.1.65
18.03 s
[gammaloop-workspace-check] Checking brotli v8.0.2
18.21 s
[gammaloop-workspace-check] Compiling rustpython-parser v0.4.0
18.25 s
[gammaloop-workspace-check] Checking ppv-lite86 v0.2.21
18.58 s
[gammaloop-workspace-check] Checking ahash v0.8.12
18.85 s
[gammaloop-workspace-check] Checking chrono v0.4.44
19.13 s
[gammaloop-workspace-check] Compiling phf v0.11.3
19.23 s
[gammaloop-workspace-check] Checking rustc-hash v2.1.2
19.33 s
[gammaloop-workspace-check] Checking rand_chacha v0.9.0
19.35 s
[gammaloop-workspace-check] Compiling unic-ucd-ident v0.9.0
19.42 s
[gammaloop-workspace-check] Compiling unic-emoji-char v0.9.0
19.47 s
[gammaloop-workspace-check] Checking ndarray v0.17.2
19.97 s
[gammaloop-workspace-check] Compiling rustc-hash v1.1.0
20.01 s
[gammaloop-workspace-check] Compiling lalrpop-util v0.20.2
20.17 s
[gammaloop-workspace-check] Checking rug v1.30.0
20.21 s
[gammaloop-workspace-check] Compiling symbolica v2.2.0 (https://github.com/alphal00p/symbolica?rev=a277a8dadbaae5a8d6605f2f381991a601e1f345#a277a8da)
20.23 s
[gammaloop-workspace-check] Checking unicode-segmentation v1.13.2
20.55 s
[gammaloop-workspace-check] Checking rand v0.9.4
20.68 s
[gammaloop-workspace-check] Checking typenum v1.20.0
20.81 s
[gammaloop-workspace-check] Checking getrandom v0.2.17
21.22 s
[gammaloop-workspace-check] Checking scopeguard v1.2.0
21.35 s
[gammaloop-workspace-check] Checking lock_api v0.4.14
22.11 s
[gammaloop-workspace-check] Checking parking_lot_core v0.9.12
22.22 s
[gammaloop-workspace-check] Checking unicode-ident v1.0.24
22.24 s
[gammaloop-workspace-check] Checking hashbrown v0.17.0
22.37 s
[gammaloop-workspace-check] Checking matchers v0.2.0
22.43 s
[gammaloop-workspace-check] Checking regex v1.12.3
22.57 s
[gammaloop-workspace-check] Checking tracing-subscriber v0.3.23
22.64 s
[gammaloop-workspace-check] Checking parking_lot v0.12.5
22.83 s
[gammaloop-workspace-check] Checking generic-array v0.14.7
22.99 s
[gammaloop-workspace-check] Checking terminal_size v0.4.4
23.02 s
[gammaloop-workspace-check] Checking errno v0.3.14
23.05 s
[gammaloop-workspace-check] Checking unicase v2.9.0
23.06 s
[gammaloop-workspace-check] Checking strsim v0.11.1
23.09 s
[gammaloop-workspace-check] Checking indexmap v2.14.0
23.12 s
[gammaloop-workspace-check] Checking clap_lex v1.1.0
23.13 s
[gammaloop-workspace-check] Checking vte v0.14.1
23.18 s
[gammaloop-workspace-check] Checking symjit v2.21.0
23.21 s
[gammaloop-workspace-check] Checking signal-hook-registry v1.4.8
23.26 s
[gammaloop-workspace-check] Checking same-file v1.0.6
23.43 s
[gammaloop-workspace-check] Checking half v2.7.1
23.44 s
[gammaloop-workspace-check] Checking walkdir v2.5.0
23.48 s
[gammaloop-workspace-check] Checking signal-hook v0.3.18
23.50 s
[gammaloop-workspace-check] Checking clap_builder v4.6.0
23.92 s
[gammaloop-workspace-check] Checking crypto-common v0.1.7
24.09 s
[gammaloop-workspace-check] Checking block-buffer v0.10.4
24.12 s
[gammaloop-workspace-check] Checking mio v1.2.0
24.17 s
[gammaloop-workspace-check] Checking ciborium-io v0.2.2
24.19 s
[gammaloop-workspace-check] Checking minimal-lexical v0.2.1
24.25 s
[gammaloop-workspace-check] Checking ciborium-ll v0.2.2
24.25 s
[gammaloop-workspace-check] Checking digest v0.10.7
24.44 s
[gammaloop-workspace-check] Checking derive_more v2.1.1
24.51 s
[gammaloop-workspace-check] Checking num-bigint v0.4.6
24.66 s
[gammaloop-workspace-check] Checking console v0.16.3
24.80 s
[gammaloop-workspace-check] Checking bstr v1.12.1
25.07 s
[gammaloop-workspace-check] Checking nom v7.1.3
25.22 s
[gammaloop-workspace-check] Checking signal-hook-mio v0.2.5
25.38 s
[gammaloop-workspace-check] Checking winnow v0.7.15
25.39 s
[gammaloop-workspace-check] Checking cpufeatures v0.2.17
25.41 s
[gammaloop-workspace-check] Checking linux-raw-sys v0.4.15
25.46 s
[gammaloop-workspace-check] Checking sha2 v0.10.9
26.05 s
[gammaloop-workspace-check] Checking rustix v0.38.44
26.20 s
[gammaloop-workspace-check] Checking globset v0.4.18
26.37 s
[gammaloop-workspace-check] Compiling unicode_names2 v1.3.0
26.64 s
[gammaloop-workspace-check] Checking ciborium v0.2.2
26.73 s
[gammaloop-workspace-check] Checking getrandom v0.4.2
26.77 s
[gammaloop-workspace-check] Checking xprec v0.2.2
26.97 s
[gammaloop-workspace-check] Checking rand_core v0.6.4
27.23 s
[gammaloop-workspace-check] Checking fastrand v2.4.1
27.24 s
[gammaloop-workspace-check] Checking plotters-backend v0.3.7
27.31 s
[gammaloop-workspace-check] Checking fnv v1.0.7
27.45 s
[gammaloop-workspace-check] Checking plotters-svg v0.3.7
27.45 s
[gammaloop-workspace-check] Checking rust-embed-utils v8.11.0
27.47 s
[gammaloop-workspace-check] Checking serde_spanned v0.6.9
27.47 s
[gammaloop-workspace-check] Checking toml_datetime v0.6.11
27.55 s
[gammaloop-workspace-check] Checking itertools v0.10.5
27.57 s
[gammaloop-workspace-check] Checking tempfile v3.27.0
27.66 s
[gammaloop-workspace-check] Checking cast v0.3.0
27.68 s
[gammaloop-workspace-check] Checking toml_write v0.1.2
27.85 s
[gammaloop-workspace-check] Checking tap v1.0.1
27.86 s
[gammaloop-workspace-check] Checking plotters v0.3.7
27.89 s
[gammaloop-workspace-check] Checking rand_chacha v0.3.1
27.95 s
[gammaloop-workspace-check] Checking wyz v0.5.1
28.07 s
[gammaloop-workspace-check] Checking radium v0.7.0
28.10 s
[gammaloop-workspace-check] Checking typeid v1.0.3
28.16 s
[gammaloop-workspace-check] Checking crossterm v0.28.1
28.22 s
[gammaloop-workspace-check] Checking similar v2.7.0
28.26 s
[gammaloop-workspace-check] Checking clap v4.6.1
28.28 s
[gammaloop-workspace-check] Checking tinytemplate v1.2.1
28.33 s
[gammaloop-workspace-check] Checking is-terminal v0.4.17
28.40 s
[gammaloop-workspace-check] Checking funty v2.0.0
28.48 s
[gammaloop-workspace-check] Checking anes v0.1.6
28.53 s
[gammaloop-workspace-check] Checking oorandom v11.1.5
28.70 s
[gammaloop-workspace-check] Checking ansitok v0.3.0
28.72 s
[gammaloop-workspace-check] Checking bytecount v0.6.9
29.04 s
[gammaloop-workspace-check] Checking ron v0.12.1
29.08 s
[gammaloop-workspace-check] Checking rand v0.8.6
29.10 s
[gammaloop-workspace-check] Checking criterion-plot v0.5.0
29.21 s
[gammaloop-workspace-check] Checking toml_edit v0.25.11+spec-1.1.0
29.35 s
[gammaloop-workspace-check] Checking bitvec v1.0.1
29.96 s
[gammaloop-workspace-check] Checking toml_edit v0.22.27
30.07 s
[gammaloop-workspace-check] Checking uncased v0.9.10
30.13 s
[gammaloop-workspace-check] Checking env_filter v1.0.1
30.29 s
[gammaloop-workspace-check] Checking ansi-str v0.9.0
30.33 s
[gammaloop-workspace-check] Checking testing_table v0.3.0
30.40 s
[gammaloop-workspace-check] Checking jiff v0.2.24
30.47 s
[gammaloop-workspace-check] Checking ptr_meta v0.1.4
30.56 s
[gammaloop-workspace-check] Checking ucd-trie v0.1.7
30.62 s
[gammaloop-workspace-check] Checking simdutf8 v0.1.5
30.72 s
[gammaloop-workspace-check] Checking ahash v0.7.8
30.75 s
[gammaloop-workspace-check] Checking criterion v0.5.1
30.86 s
[gammaloop-workspace-check] Checking bytecheck v0.6.12
30.92 s
[gammaloop-workspace-check] Checking pest v2.8.6
30.98 s
[gammaloop-workspace-check] Checking hashbrown v0.12.3
31.36 s
[gammaloop-workspace-check] Checking papergrid v0.17.0
31.49 s
[gammaloop-workspace-check] Checking approx v0.4.0
31.77 s
[gammaloop-workspace-check] Checking insta v1.47.2
31.80 s
[gammaloop-workspace-check] Checking seahash v4.1.0
32.09 s
[gammaloop-workspace-check] Checking cgmath v0.18.0
32.35 s
[gammaloop-workspace-check] Checking rend v0.4.2
32.59 s
[gammaloop-workspace-check] Checking num-rational v0.4.2
33.21 s
[gammaloop-workspace-check] Checking num-iter v0.1.45
33.60 s
[gammaloop-workspace-check] Checking ref-ops v0.2.5
33.61 s
[gammaloop-workspace-check] Checking num v0.4.3
33.79 s
[gammaloop-workspace-check] Checking rand_xoshiro v0.6.0
33.92 s
[gammaloop-workspace-check] Checking features v0.10.0
34.07 s
[gammaloop-workspace-check] Checking gat-lending-iterator v0.1.8
34.09 s
[gammaloop-workspace-check] Compiling pyo3-macros-backend v0.28.3
34.16 s
[gammaloop-workspace-check] Compiling pyo3-ffi v0.28.3
34.41 s
[gammaloop-workspace-check] Compiling pyo3 v0.28.3
34.88 s
[gammaloop-workspace-check] Compiling numpy v0.28.0
35.69 s
[gammaloop-workspace-check] Checking tabled v0.20.0
35.72 s
[gammaloop-workspace-check] Checking dot-parser v0.5.1
35.73 s
[gammaloop-workspace-check] Checking constcat v0.5.1
35.81 s
[gammaloop-workspace-check] Checking colored v2.2.0
35.82 s
[gammaloop-workspace-check] Checking constant_time_eq v0.4.2
36.07 s
[gammaloop-workspace-check] Checking cpufeatures v0.3.0
36.17 s
[gammaloop-workspace-check] Checking arrayref v0.3.9
36.20 s
[gammaloop-workspace-check] Checking base64 v0.22.1
36.28 s
[gammaloop-workspace-check] Checking blake3 v1.8.5
36.86 s
[gammaloop-workspace-check] Checking siphasher v1.0.2
36.97 s
[gammaloop-workspace-check] Checking joinery v2.1.0
37.26 s
[gammaloop-workspace-check] Checking phf_shared v0.13.1
37.42 s
[gammaloop-workspace-check] Checking subprocess v0.2.15
37.51 s
[gammaloop-workspace-check] Checking rust_lisp v0.18.0
37.55 s
[gammaloop-workspace-check] Checking titlecase v2.2.1
37.61 s
[gammaloop-workspace-check] Compiling vakint v0.1.2 (/build/source/crates/vakint)
37.66 s
[gammaloop-workspace-check] Checking version-compare v0.2.1
37.82 s
[gammaloop-workspace-check] Checking xpct v0.5.1
37.87 s
[gammaloop-workspace-check] Checking ryu v1.0.23
38.22 s
[gammaloop-workspace-check] Checking castaway v0.2.4
38.26 s
[gammaloop-workspace-check] Checking toml_datetime v0.7.5+spec-1.1.0
38.36 s
[gammaloop-workspace-check] Checking phf v0.13.1
38.49 s
[gammaloop-workspace-check] Checking strum v0.27.2
38.52 s
[gammaloop-workspace-check] Checking compact_str v0.9.0
38.66 s
[gammaloop-workspace-check] Checking unicode-truncate v2.0.1
38.67 s
[gammaloop-workspace-check] Checking kasuari v0.4.12
38.73 s
[gammaloop-workspace-check] Checking toml v0.8.23
38.90 s
[gammaloop-workspace-check] Checking lru v0.16.4
38.94 s
[gammaloop-workspace-check] Checking vte v0.15.0
39.01 s
[gammaloop-workspace-check] Checking string-template-plus v0.4.3
39.33 s
[gammaloop-workspace-check] Checking portable-atomic v1.13.1
39.49 s
[gammaloop-workspace-check] Checking toml v0.9.12+spec-1.1.0
39.54 s
[gammaloop-workspace-check] Checking vt100 v0.16.2
40.02 s
[gammaloop-workspace-check] Checking figment v0.10.19
40.24 s
[gammaloop-workspace-check] Checking unit-prefix v0.5.2
40.26 s
[gammaloop-workspace-check] Compiling rustpython-parser-core v0.4.0
40.31 s
[gammaloop-workspace-check] Checking ratatui-core v0.1.0
40.39 s
[gammaloop-workspace-check] Checking rand_distr v0.4.3
40.46 s
[gammaloop-workspace-check] Checking simba v0.6.0
40.46 s
[gammaloop-workspace-check] Checking line-clipping v0.3.7
40.70 s
[gammaloop-workspace-check] Compiling rustpython-ast v0.4.0
40.85 s
[gammaloop-workspace-check] Compiling three-dimensional-reps v0.1.0 (/build/source/crates/three-dimensional-reps)
40.93 s
[gammaloop-workspace-check] Checking gimli v0.32.3
40.96 s
[gammaloop-workspace-check] Checking env_logger v0.11.10
41.11 s
[gammaloop-workspace-check] Checking adler2 v2.0.1
41.20 s
[gammaloop-workspace-check] Checking thiserror v1.0.69
41.29 s
[gammaloop-workspace-check] Checking miniz_oxide v0.8.9
41.41 s
[gammaloop-workspace-check] Checking derive_builder v0.11.2
41.49 s
[gammaloop-workspace-check] Checking crossterm v0.29.0
41.78 s
[gammaloop-workspace-check] Checking object v0.37.3
41.84 s
[gammaloop-workspace-check] Checking owo-colors v4.3.0
41.89 s
[gammaloop-workspace-check] Checking tracing-error v0.2.1
41.98 s
[gammaloop-workspace-check] Checking indicatif v0.18.4
42.06 s
[gammaloop-workspace-check] Checking typed-index-collections v3.5.0
42.33 s
[gammaloop-workspace-check] Checking serde-big-array v0.5.1
42.84 s
[gammaloop-workspace-check] Checking amd v0.2.2
43.43 s
[gammaloop-workspace-check] Checking itertools v0.11.0
43.67 s
[gammaloop-workspace-check] Compiling gammaloop-tracing-filter-macros v0.1.0 (/build/source/crates/gammaloop-tracing-filter-macros)
43.70 s
[gammaloop-workspace-check] Checking option-ext v0.2.0
43.89 s
[gammaloop-workspace-check] Checking rustc-demangle v0.1.27
44.01 s
[gammaloop-workspace-check] Checking dirs-sys v0.5.0
44.18 s
[gammaloop-workspace-check] Checking ratatui-widgets v0.3.0
44.32 s
[gammaloop-workspace-check] Checking ref-cast v1.0.25
44.39 s
[gammaloop-workspace-check] Checking nix v0.31.2
44.54 s
[gammaloop-workspace-check] Checking integer-sqrt v0.1.5
44.57 s
[gammaloop-workspace-check] Checking ratatui-crossterm v0.1.0
44.79 s
[gammaloop-workspace-check] Checking brotli-decompressor v4.0.3
44.90 s
[gammaloop-workspace-check] Checking crossbeam-channel v0.5.15
45.14 s
[gammaloop-workspace-check] Checking itertools v0.12.1
45.18 s
[gammaloop-workspace-check] Compiling gammalooprs v0.3.4 (/build/source/crates/gammalooprs)
45.33 s
[gammaloop-workspace-check] Checking symlink v0.1.0
45.46 s
[gammaloop-workspace-check] Checking color-spantrace v0.3.0
45.64 s
[gammaloop-workspace-check] Checking unsafe-libyaml v0.2.11
45.84 s
[gammaloop-workspace-check] Checking tracing-indicatif v0.3.14
46.17 s
[gammaloop-workspace-check] Checking ctrlc v3.5.2
46.61 s
[gammaloop-workspace-check] Checking rkyv v0.7.46
46.64 s
[gammaloop-workspace-check] Checking include_dir v0.7.4
46.73 s
[gammaloop-workspace-check] Checking pathfinding v4.15.0
46.86 s
[gammaloop-workspace-check] Checking dirs v6.0.0
46.97 s
[gammaloop-workspace-check] Checking schemars v1.2.1
47.08 s
[gammaloop-workspace-check] Checking slotmap v1.1.1
47.27 s
[gammaloop-workspace-check] Checking tracing-appender v0.2.5
47.65 s
[gammaloop-workspace-check] Checking brotli v7.0.0
47.73 s
[gammaloop-workspace-check] Checking json5 v0.4.1
48.49 s
[gammaloop-workspace-check] Checking vectorize v0.2.0
48.49 s
[gammaloop-workspace-check] Checking serde_yaml v0.9.34+deprecated
48.64 s
[gammaloop-workspace-check] Checking base62 v2.2.4
48.96 s
[gammaloop-workspace-check] Checking clarabel v0.11.1
49.04 s
[gammaloop-workspace-check] Checking ringbuffer v0.16.0
49.26 s
[gammaloop-workspace-check] Checking ratatui-macros v0.7.0
49.55 s
[gammaloop-workspace-check] Checking ratatui v0.30.0
49.67 s
[gammaloop-workspace-check] Checking rust-embed v8.11.0
50.02 s
[gammaloop-workspace-check] Checking clap_complete v4.6.3
50.07 s
[gammaloop-workspace-check] Checking strip-ansi-escapes v0.2.1
50.11 s
[gammaloop-workspace-check] Checking addr2line v0.25.1
50.22 s
[gammaloop-workspace-check] Checking fd-lock v4.0.4
50.25 s
[gammaloop-workspace-check] Compiling gammaloop-api v0.1.0 (/build/source/crates/gammaloop-api)
50.29 s
[gammaloop-workspace-check] Checking itertools v0.13.0
50.50 s
[gammaloop-workspace-check] Checking strum v0.26.3
50.89 s
[gammaloop-workspace-check] Checking sysinfo v0.33.1
51.03 s
[gammaloop-workspace-check] Checking shlex v1.3.0
51.05 s
[gammaloop-workspace-check] Checking slab v0.4.12
51.20 s
[gammaloop-workspace-check] Checking futures-core v0.3.32
51.38 s
[gammaloop-workspace-check] Checking futures-task v0.3.32
51.48 s
[gammaloop-workspace-check] Checking sdd v3.0.10
51.48 s
[gammaloop-workspace-check] Checking clap_complete_nushell v4.6.0
51.55 s
[gammaloop-workspace-check] Compiling gammaloop-integration-tests v0.1.0 (/build/source/tests)
51.57 s
[gammaloop-workspace-check] Checking futures-util v0.3.32
51.98 s
[gammaloop-workspace-check] Compiling test-log-core v0.2.20
52.38 s
[gammaloop-workspace-check] Checking scc v2.4.0
53.26 s
[gammaloop-workspace-check] Compiling rustc_version v0.4.1
54.39 s
[gammaloop-workspace-check] Checking backtrace v0.3.76
54.58 s
[gammaloop-workspace-check] Checking which v8.0.2
54.87 s
[gammaloop-workspace-check] Checking reedline v0.42.0
55.24 s
[gammaloop-workspace-check] Checking bincode v1.3.3
55.62 s
[gammaloop-workspace-check] Compiling gungraun-runner v0.18.2
56.55 s
[gammaloop-workspace-check] Checking nalgebra v0.29.0
56.73 s
[gammaloop-workspace-check] Checking color-eyre v0.6.5
56.84 s
[gammaloop-workspace-check] Compiling gungraun-macros v0.8.0
57.29 s
[gammaloop-workspace-check] Checking proc-macro2 v1.0.106
58.04 s
[gammaloop-workspace-check] Checking maplit v1.0.2
58.18 s
[gammaloop-workspace-check] Checking base64 v0.21.7
58.60 s
[gammaloop-workspace-check] Checking quote v1.0.45
58.81 s
[gammaloop-workspace-check] Checking ron v0.8.1
59.19 s
[gammaloop-workspace-check] Compiling iai-callgrind-runner v0.14.2
59.30 s
[gammaloop-workspace-check] Checking kurbo v0.13.0
59.60 s
[gammaloop-workspace-check] Compiling test-log-macros v0.2.20
59.83 s
[gammaloop-workspace-check] Checking wait-timeout v0.2.1
60.10 s
[gammaloop-workspace-check] Checking bit-vec v0.8.0
60.51 s
[gammaloop-workspace-check] Checking quick-error v1.2.3
60.61 s
[gammaloop-workspace-check] Compiling iai-callgrind v0.14.2
60.63 s
[gammaloop-workspace-check] Checking bit-set v0.8.0
60.80 s
[gammaloop-workspace-check] Checking rusty-fork v0.3.1
61.29 s
[gammaloop-workspace-check] Checking syn v2.0.117
61.64 s
[gammaloop-workspace-check] Compiling iai-callgrind-macros v0.5.1
61.98 s
[gammaloop-workspace-check] Checking futures-executor v0.3.32
61.99 s
[gammaloop-workspace-check] Checking rand_xorshift v0.4.0
62.11 s
[gammaloop-workspace-check] Checking console v0.15.11
62.30 s
[gammaloop-workspace-check] Checking serial_test v3.4.0
62.38 s
[gammaloop-workspace-check] Checking pathdiff v0.2.3
62.60 s
[gammaloop-workspace-check] Checking unarray v0.1.4
62.83 s
[gammaloop-workspace-check] Checking proptest v1.11.0
62.89 s
[gammaloop-workspace-check] Checking clinnet v0.1.8 (/build/source/crates/clinnet)
63.31 s
[gammaloop-workspace-check] Checking similar-asserts v1.7.0
63.91 s
[gammaloop-workspace-check] Compiling numerica v2.2.0 (https://github.com/alphal00p/symbolica?rev=a277a8dadbaae5a8d6605f2f381991a601e1f345#a277a8da)
66.28 s
[gammaloop-workspace-check] Checking kurvst v0.1.0 (/build/source/crates/kurvst)
71.26 s
[gammaloop-workspace-check] Checking test-log v0.2.20
83.52 s
[gammaloop-workspace-check] Compiling graphica v2.1.0 (https://github.com/alphal00p/symbolica?rev=a277a8dadbaae5a8d6605f2f381991a601e1f345#a277a8da)
85.99 s
[gammaloop-workspace-check] Checking gungraun v0.18.2
86.48 s
[gammaloop-workspace-check] Checking statrs v0.16.1
89.53 s
[gammaloop-workspace-check] Checking momtrop v0.3.0
94.07 s
[gammaloop-workspace-check] Compiling pyo3-macros v0.28.3
98.46 s
[gammaloop-workspace-check] Compiling pyo3-stub-gen-derive v0.17.2
110.97 s
[gammaloop-workspace-check] Checking pyo3-stub-gen v0.17.2
128.79 s
[gammaloop-workspace-check] Checking symbolica-utils v0.1.0 (/build/source/crates/symbolica-utils)
128.80 s
[gammaloop-workspace-check] Checking spenso-macros v0.3.2 (/build/source/crates/spenso-macros)
468.53 s
[gammaloop-workspace-check] Compiling gammaloop-workspace-hack v0.1.0 (/build/source/crates/gammaloop-workspace-hack)
469.06 s
[gammaloop-workspace-check] Checking linnet v0.17.0 (/build/source/crates/linnet)
475.78 s
[gammaloop-workspace-check] Checking spenso v0.6.0 (/build/source/crates/spenso)
476.11 s
[gammaloop-workspace-check] Checking linnet-py v0.1.0 (/build/source/crates/linnet-py)
476.11 s
[gammaloop-workspace-check] Checking linnest v0.1.0 (/build/source/crates/linnest)
487.83 s
[gammaloop-workspace-check] Checking idenso v0.3.0 (/build/source/crates/idenso)
487.85 s
[gammaloop-workspace-check] Checking gammaloop-tracing-filter v0.1.0 (/build/source/crates/gammaloop-tracing-filter)
491.57 s
[gammaloop-workspace-check] Checking spenso-hep-lib v0.1.7 (/build/source/crates/spenso-hep-lib)
491.89 s
[gammaloop-workspace-check] Checking spynso3 v0.1.2 (/build/source/crates/spynso3)
560.01 s
[gammaloop-workspace-check] error[E0560] : struct `CutInfo` has no field named `lmb_channel_id`
560.01 s
[gammaloop-workspace-check] --> tests/tests/test_differential.rs:86:13
560.01 s
[gammaloop-workspace-check] |
560.01 s
[gammaloop-workspace-check] 86 | lmb_channel_id: None,
560.01 s
[gammaloop-workspace-check] | ^^^^^^^^^^^^^^ `CutInfo` does not have this field
560.01 s
[gammaloop-workspace-check] |
560.01 s
[gammaloop-workspace-check] = note : available fields are: `sampling_channel_id`, `sampling_channel_edge_ids`
560.01 s
[gammaloop-workspace-check]
560.01 s
[gammaloop-workspace-check] error[E0560] : struct `CutInfo` has no field named `lmb_channel_edge_ids`
560.01 s
[gammaloop-workspace-check] --> tests/tests/test_differential.rs:87:13
560.01 s
[gammaloop-workspace-check] |
560.01 s
[gammaloop-workspace-check] 87 | lmb_channel_edge_ids: None,
560.01 s
[gammaloop-workspace-check] | ^^^^^^^^^^^^^^^^^^^^ `CutInfo` does not have this field
560.01 s
[gammaloop-workspace-check] |
560.01 s
[gammaloop-workspace-check] = note : available fields are: `sampling_channel_id`, `sampling_channel_edge_ids`
560.01 s
[gammaloop-workspace-check]
560.07 s
[gammaloop-workspace-check] error[E0063] : missing field `reference_moments` in initializer of `GraphEvaluationResult<_>`
560.07 s
[gammaloop-workspace-check] --> tests/tests/test_differential.rs:532:19
560.07 s
[gammaloop-workspace-check] |
560.07 s
[gammaloop-workspace-check] 532 | let mut lhs = GraphEvaluationResult {
560.07 s
[gammaloop-workspace-check] | ^^^^^^^^^^^^^^^^^^^^^ missing `reference_moments`
560.07 s
[gammaloop-workspace-check]
560.07 s
[gammaloop-workspace-check] error[E0063] : missing field `reference_moments` in initializer of `GraphEvaluationResult<_>`
560.07 s
[gammaloop-workspace-check] --> tests/tests/test_differential.rs:539:15
560.07 s
[gammaloop-workspace-check] |
560.07 s
[gammaloop-workspace-check] 539 | let rhs = GraphEvaluationResult {
560.07 s
[gammaloop-workspace-check] | ^^^^^^^^^^^^^^^^^^^^^ missing `reference_moments`
560.07 s
[gammaloop-workspace-check]
560.44 s
[gammaloop-workspace-check] Some errors have detailed explanations: E0063, E0560.
560.44 s
[gammaloop-workspace-check] For more information about an error, try `rustc --explain E0063`.
560.47 s
[gammaloop-workspace-check] error : could not compile `gammaloop-integration-tests` (test "test_differential") due to 4 previous errors
560.47 s
[gammaloop-workspace-check] warning : build failed, waiting for other jobs to finish...
561.88 s
[gammaloop-workspace-check] error[E0609] : no field `lmb_channel_id` on type `CutInfo`
561.88 s
[gammaloop-workspace-check] --> tests/tests/test_runs/utils.rs:568:36
561.88 s
[gammaloop-workspace-check] |
561.88 s
[gammaloop-workspace-check] 568 | event.cut_info.lmb_channel_id,
561.88 s
[gammaloop-workspace-check] | ^^^^^^^^^^^^^^ unknown field
561.88 s
[gammaloop-workspace-check] |
561.88 s
[gammaloop-workspace-check] = note : available fields are: `particle_pdgs`, `cut_id`, `graph_id`, `graph_group_id`, `orientation_id` ... and 2 others
561.88 s
[gammaloop-workspace-check]
561.88 s
[gammaloop-workspace-check] error[E0609] : no field `lmb_channel_id` on type `CutInfo`
561.88 s
[gammaloop-workspace-check] --> tests/tests/test_runs/utils.rs:580:36
561.88 s
[gammaloop-workspace-check] |
561.88 s
[gammaloop-workspace-check] 580 | event.cut_info.lmb_channel_id,
561.88 s
[gammaloop-workspace-check] | ^^^^^^^^^^^^^^ unknown field
561.88 s
[gammaloop-workspace-check] |
561.88 s
[gammaloop-workspace-check] = note : available fields are: `particle_pdgs`, `cut_id`, `graph_id`, `graph_group_id`, `orientation_id` ... and 2 others
561.88 s
[gammaloop-workspace-check]
563.16 s
[gammaloop-workspace-check] For more information about this error, try `rustc --explain E0609`.
563.20 s
[gammaloop-workspace-check] error : could not compile `gammaloop-integration-tests` (test "test_runs") due to 2 previous errors
564.15 s
Progress: 0 of 1 built (1 failed)
564.15 s
Failed to build gammaloop-workspace-check after 9m18s
564.17 s
Cannot build ' /nix/store/8z7532y2mrxdvk4qgscgqrhdk179hn45-gammaloop-workspace-check-0.1.0.drv '.
564.17 s
Reason: builder failed with exit code 101 .
564.17 s
Output paths:
564.17 s
/nix/store/n6gsf2xm9lm4fvfa6mi0mspcv8dp17g0-gammaloop-workspace-check-0.1.0
564.17 s
Last 475 log lines:
564.17 s
> Running phase: unpackPhase
564.17 s
> unpacking source archive /nix/store/lxd2pc2qjvxzkbjaklyikbcq1cjx91ck-source
564.17 s
> source root is source
564.17 s
> Running phase: patchPhase
564.17 s
> Executing configureCargoCommonVars
564.17 s
> decompressing cargo artifacts from /nix/store/50vpxlcgfxf2d57i27v3d10zjwxxbm2r-gammaloop-workspace-deps-deps-0.1.0/target.tar.zst to target
564.17 s
> Running phase: updateAutotoolsGnuConfigScriptsPhase
564.17 s
> Running phase: configurePhase
564.17 s
> will append /build/source/.cargo-home/config.toml with contents of /nix/store/5drf77x6km4ky7gwlrzdx9bbd6fz09g3-vendor-cargo-deps/config.toml
564.17 s
> default configurePhase, nothing to do
564.17 s
> Running phase: buildPhase
564.17 s
> +++ command cargo --version
564.17 s
> cargo 1.97.0 (c980f4866 2026-06-30)
564.17 s
> +++ command cargo check --profile ci-optim --locked --workspace --features gammaloop-tracing-filter/clap,gammaloop-tracing-filter/symbolica,idenso/bincode,idenso/reference-cases,linnet/bincode,linnet/drawing,linnet/rkyv,linnet/serde,linnet/symbolica,spenso-macros/shadowing,spenso/shadowing,symbolica/tracing_max_level_info,three-dimensional-reps/display,three-dimensional-reps/eval,three-dimensional-reps/serde --all-targets
564.17 s
> Checking cfg-if v1.0.4
564.17 s
> Checking memchr v2.8.0
564.17 s
> Checking once_cell v1.21.4
564.17 s
> Checking either v1.15.0
564.17 s
> Checking serde_core v1.0.228
564.17 s
> Checking libc v0.2.186
564.17 s
> Checking libm v0.2.16
564.17 s
> Checking itoa v1.0.18
564.17 s
> Checking log v0.4.29
564.17 s
> Checking regex-syntax v0.8.10
564.17 s
> Checking zerocopy v0.8.48
564.17 s
> Checking crossbeam-utils v0.8.21
564.17 s
> Checking equivalent v1.0.2
564.17 s
> Checking zmij v1.0.21
564.17 s
> Checking lazy_static v1.5.0
564.17 s
> Checking bytemuck v1.25.0
564.17 s
> Compiling target-lexicon v0.13.5
564.17 s
> Checking arrayvec v0.7.6
564.17 s
> Checking powerfmt v0.2.0
564.17 s
> Checking num-conv v0.2.1
564.17 s
> Checking itertools v0.14.0
564.17 s
> Checking num_threads v0.1.7
564.17 s
> Checking time-core v0.1.8
564.17 s
> Checking pin-project-lite v0.2.17
564.17 s
> Checking tracing-core v0.1.36
564.17 s
> Checking deranged v0.5.8
564.17 s
> Checking foldhash v0.2.0
564.17 s
> Checking safe_arch v0.7.4
564.17 s
> Checking allocator-api2 v0.2.21
564.17 s
> Checking const-random v0.1.18
564.17 s
> Checking winnow v1.0.2
564.17 s
> Checking nu-ansi-term v0.50.3
564.17 s
> Checking static_assertions v1.1.0
564.17 s
> Checking unty v0.0.4
564.17 s
> Checking safe_arch v1.0.0
564.17 s
> Checking aho-corasick v1.1.4
564.17 s
> Checking sharded-slab v0.1.7
564.17 s
> Checking hashbrown v0.16.1
564.17 s
> Checking wide v0.7.33
564.17 s
> Checking tracing v0.1.44
564.17 s
> Checking crossbeam-epoch v0.9.18
564.17 s
> Checking tracing-log v0.2.0
564.17 s
> Checking num-traits v0.2.19
564.17 s
> Checking thread_local v1.1.9
564.17 s
> Checking crossbeam-deque v0.8.6
564.17 s
> Checking indenter v0.3.4
564.17 s
> Checking az v1.3.0
564.17 s
> Checking toml_writer v1.1.1+spec-1.1.0
564.17 s
> Checking wide v1.3.0
564.17 s
> Compiling phf_shared v0.11.3
564.17 s
> Checking rayon-core v1.13.0
564.17 s
> Checking anyhow v1.0.102
564.17 s
> Checking rawpointer v0.2.1
564.17 s
> Checking dyn-clone v1.0.20
564.17 s
> Checking alloc-no-stdlib v2.0.4
564.17 s
> Checking utf8parse v0.2.2
564.17 s
> Checking matrixmultiply v0.3.10
564.17 s
> Checking anstyle-parse v1.0.0
564.17 s
> Checking alloc-stdlib v0.2.2
564.17 s
> Checking colored v3.1.1
564.17 s
> Checking is_terminal_polyfill v1.70.2
564.17 s
> Checking rayon v1.12.0
564.17 s
> Checking colorchoice v1.0.5
564.17 s
> Compiling pyo3-build-config v0.28.3
564.17 s
> Checking anstyle-query v1.1.5
564.17 s
> Checking anstyle v1.0.14
564.17 s
> Compiling phf_generator v0.11.3
564.17 s
> Checking regex-automata v0.4.14
564.17 s
> Checking approx v0.5.1
564.17 s
> Checking num-integer v0.1.46
564.17 s
> Checking eyre v0.6.12
564.17 s
> Checking unicode-width v0.2.2
564.17 s
> Checking bitflags v1.3.2
564.17 s
> Checking anstream v1.0.0
564.17 s
> Compiling phf_codegen v0.11.3
564.17 s
> Checking serde v1.0.228
564.17 s
> Checking serde_json v1.0.149
564.17 s
> Checking bitflags v2.11.1
564.17 s
> Checking serde_spanned v1.1.1
564.17 s
> Checking toml_datetime v1.1.1+spec-1.1.0
564.17 s
> Checking toml_parser v1.1.2+spec-1.1.0
564.17 s
> Checking brotli-decompressor v5.0.0
564.17 s
> Checking spec_math v0.1.6
564.17 s
> Checking inventory v0.3.24
564.17 s
> Checking getrandom v0.3.4
564.17 s
> Checking time v0.3.47
564.17 s
> Checking gmp-mpfr-sys v1.7.1
564.17 s
> Checking wasmtime-jit-icache-coherence v34.0.2
564.17 s
> Checking hugepage-rs v0.1.1
564.17 s
> Checking region v3.0.2
564.17 s
> Checking rand_core v0.9.5
564.17 s
> Checking thiserror v2.0.18
564.17 s
> Compiling getopts v0.2.24
564.17 s
> Checking libloading v0.9.0
564.17 s
> Checking bytes v1.11.1
564.17 s
> Checking smallvec v1.15.1
564.17 s
> Checking num-complex v0.4.6
564.17 s
> Checking tracing-serde v0.2.0
564.17 s
> Checking bincode v2.0.1
564.17 s
> Checking toml v1.1.2+spec-1.1.0
564.17 s
> Checking smartstring v1.0.1
564.17 s
> Checking self_cell v1.2.2
564.17 s
> Checking tinyjson v2.5.1
564.17 s
> Checking append-only-vec v0.1.8
564.17 s
> Checking byteorder v1.5.0
564.17 s
> Checking linux-raw-sys v0.12.1
564.17 s
> Compiling unic-char-range v0.9.0
564.17 s
> Compiling unicode_names2_generator v1.3.0
564.17 s
> Compiling unic-common v0.9.0
564.17 s
> Checking simba v0.9.1
564.17 s
> Compiling unic-char-property v0.9.0
564.17 s
> Compiling unic-ucd-version v0.9.0
564.17 s
> Compiling is-macro v0.3.7
564.17 s
> Compiling rustpython-parser-vendored v0.4.0
564.17 s
> Checking rustix v1.1.4
564.17 s
> Checking iana-time-zone v0.1.65
564.17 s
> Checking brotli v8.0.2
564.17 s
> Compiling rustpython-parser v0.4.0
564.17 s
> Checking ppv-lite86 v0.2.21
564.17 s
> Checking ahash v0.8.12
564.17 s
> Checking chrono v0.4.44
564.17 s
> Compiling phf v0.11.3
564.17 s
> Checking rustc-hash v2.1.2
564.17 s
> Checking rand_chacha v0.9.0
564.17 s
> Compiling unic-ucd-ident v0.9.0
564.17 s
> Compiling unic-emoji-char v0.9.0
564.17 s
> Checking ndarray v0.17.2
564.17 s
> Compiling rustc-hash v1.1.0
564.17 s
> Compiling lalrpop-util v0.20.2
564.17 s
> Checking rug v1.30.0
564.17 s
> Compiling symbolica v2.2.0 (https://github.com/alphal00p/symbolica?rev=a277a8dadbaae5a8d6605f2f381991a601e1f345#a277a8da)
564.17 s
> Checking unicode-segmentation v1.13.2
564.17 s
> Checking rand v0.9.4
564.17 s
> Checking typenum v1.20.0
564.17 s
> Checking getrandom v0.2.17
564.17 s
> Checking scopeguard v1.2.0
564.17 s
> Checking lock_api v0.4.14
564.17 s
> Checking parking_lot_core v0.9.12
564.17 s
> Checking unicode-ident v1.0.24
564.17 s
> Checking hashbrown v0.17.0
564.17 s
> Checking matchers v0.2.0
564.17 s
> Checking regex v1.12.3
564.17 s
> Checking tracing-subscriber v0.3.23
564.17 s
> Checking parking_lot v0.12.5
564.17 s
> Checking generic-array v0.14.7
564.17 s
> Checking terminal_size v0.4.4
564.17 s
> Checking errno v0.3.14
564.17 s
> Checking unicase v2.9.0
564.17 s
> Checking strsim v0.11.1
564.17 s
> Checking indexmap v2.14.0
564.17 s
> Checking clap_lex v1.1.0
564.17 s
> Checking vte v0.14.1
564.17 s
> Checking symjit v2.21.0
564.17 s
> Checking signal-hook-registry v1.4.8
564.17 s
> Checking same-file v1.0.6
564.17 s
> Checking half v2.7.1
564.17 s
> Checking walkdir v2.5.0
564.17 s
> Checking signal-hook v0.3.18
564.17 s
> Checking clap_builder v4.6.0
564.17 s
> Checking crypto-common v0.1.7
564.17 s
> Checking block-buffer v0.10.4
564.17 s
> Checking mio v1.2.0
564.17 s
> Checking ciborium-io v0.2.2
564.17 s
> Checking minimal-lexical v0.2.1
564.17 s
> Checking ciborium-ll v0.2.2
564.17 s
> Checking digest v0.10.7
564.17 s
> Checking derive_more v2.1.1
564.17 s
> Checking num-bigint v0.4.6
564.17 s
> Checking console v0.16.3
564.17 s
> Checking bstr v1.12.1
564.17 s
> Checking nom v7.1.3
564.17 s
> Checking signal-hook-mio v0.2.5
564.17 s
> Checking winnow v0.7.15
564.17 s
> Checking cpufeatures v0.2.17
564.17 s
> Checking linux-raw-sys v0.4.15
564.17 s
> Checking sha2 v0.10.9
564.17 s
> Checking rustix v0.38.44
564.17 s
> Checking globset v0.4.18
564.17 s
> Compiling unicode_names2 v1.3.0
564.17 s
> Checking ciborium v0.2.2
564.17 s
> Checking getrandom v0.4.2
564.17 s
> Checking xprec v0.2.2
564.17 s
> Checking rand_core v0.6.4
564.17 s
> Checking fastrand v2.4.1
564.17 s
> Checking plotters-backend v0.3.7
564.17 s
> Checking fnv v1.0.7
564.17 s
> Checking plotters-svg v0.3.7
564.17 s
> Checking rust-embed-utils v8.11.0
564.17 s
> Checking serde_spanned v0.6.9
564.17 s
> Checking toml_datetime v0.6.11
564.17 s
> Checking itertools v0.10.5
564.17 s
> Checking tempfile v3.27.0
564.17 s
> Checking cast v0.3.0
564.17 s
> Checking toml_write v0.1.2
564.17 s
> Checking tap v1.0.1
564.17 s
> Checking plotters v0.3.7
564.17 s
> Checking rand_chacha v0.3.1
564.17 s
> Checking wyz v0.5.1
564.17 s
> Checking radium v0.7.0
564.17 s
> Checking typeid v1.0.3
564.17 s
> Checking crossterm v0.28.1
564.17 s
> Checking similar v2.7.0
564.17 s
> Checking clap v4.6.1
564.17 s
> Checking tinytemplate v1.2.1
564.17 s
> Checking is-terminal v0.4.17
564.17 s
> Checking funty v2.0.0
564.17 s
> Checking anes v0.1.6
564.17 s
> Checking oorandom v11.1.5
564.17 s
> Checking ansitok v0.3.0
564.17 s
> Checking bytecount v0.6.9
564.17 s
> Checking ron v0.12.1
564.17 s
> Checking rand v0.8.6
564.17 s
> Checking criterion-plot v0.5.0
564.17 s
> Checking toml_edit v0.25.11+spec-1.1.0
564.17 s
> Checking bitvec v1.0.1
564.17 s
> Checking toml_edit v0.22.27
564.17 s
> Checking uncased v0.9.10
564.17 s
> Checking env_filter v1.0.1
564.17 s
> Checking ansi-str v0.9.0
564.17 s
> Checking testing_table v0.3.0
564.17 s
> Checking jiff v0.2.24
564.17 s
> Checking ptr_meta v0.1.4
564.17 s
> Checking ucd-trie v0.1.7
564.17 s
> Checking simdutf8 v0.1.5
564.17 s
> Checking ahash v0.7.8
564.17 s
> Checking criterion v0.5.1
564.17 s
> Checking bytecheck v0.6.12
564.17 s
> Checking pest v2.8.6
564.17 s
> Checking hashbrown v0.12.3
564.17 s
> Checking papergrid v0.17.0
564.17 s
> Checking approx v0.4.0
564.17 s
> Checking insta v1.47.2
564.17 s
> Checking seahash v4.1.0
564.17 s
> Checking cgmath v0.18.0
564.17 s
> Checking rend v0.4.2
564.17 s
> Checking num-rational v0.4.2
564.17 s
> Checking num-iter v0.1.45
564.17 s
> Checking ref-ops v0.2.5
564.17 s
> Checking num v0.4.3
564.17 s
> Checking rand_xoshiro v0.6.0
564.17 s
> Checking features v0.10.0
564.17 s
> Checking gat-lending-iterator v0.1.8
564.17 s
> Compiling pyo3-macros-backend v0.28.3
564.17 s
> Compiling pyo3-ffi v0.28.3
564.17 s
> Compiling pyo3 v0.28.3
564.17 s
> Compiling numpy v0.28.0
564.17 s
> Checking tabled v0.20.0
564.17 s
> Checking dot-parser v0.5.1
564.17 s
> Checking constcat v0.5.1
564.17 s
> Checking colored v2.2.0
564.17 s
> Checking constant_time_eq v0.4.2
564.17 s
> Checking cpufeatures v0.3.0
564.17 s
> Checking arrayref v0.3.9
564.17 s
> Checking base64 v0.22.1
564.17 s
> Checking blake3 v1.8.5
564.17 s
> Checking siphasher v1.0.2
564.17 s
> Checking joinery v2.1.0
564.17 s
> Checking phf_shared v0.13.1
564.17 s
> Checking subprocess v0.2.15
564.17 s
> Checking rust_lisp v0.18.0
564.17 s
> Checking titlecase v2.2.1
564.17 s
> Compiling vakint v0.1.2 (/build/source/crates/vakint)
564.17 s
> Checking version-compare v0.2.1
564.17 s
> Checking xpct v0.5.1
564.17 s
> Checking ryu v1.0.23
564.17 s
> Checking castaway v0.2.4
564.17 s
> Checking toml_datetime v0.7.5+spec-1.1.0
564.17 s
> Checking phf v0.13.1
564.17 s
> Checking strum v0.27.2
564.17 s
> Checking compact_str v0.9.0
564.17 s
> Checking unicode-truncate v2.0.1
564.17 s
> Checking kasuari v0.4.12
564.17 s
> Checking toml v0.8.23
564.17 s
> Checking lru v0.16.4
564.17 s
> Checking vte v0.15.0
564.17 s
> Checking string-template-plus v0.4.3
564.17 s
> Checking portable-atomic v1.13.1
564.17 s
> Checking toml v0.9.12+spec-1.1.0
564.17 s
> Checking vt100 v0.16.2
564.17 s
> Checking figment v0.10.19
564.17 s
> Checking unit-prefix v0.5.2
564.17 s
> Compiling rustpython-parser-core v0.4.0
564.17 s
> Checking ratatui-core v0.1.0
564.17 s
> Checking rand_distr v0.4.3
564.17 s
> Checking simba v0.6.0
564.17 s
> Checking line-clipping v0.3.7
564.17 s
> Compiling rustpython-ast v0.4.0
564.17 s
> Compiling three-dimensional-reps v0.1.0 (/build/source/crates/three-dimensional-reps)
564.17 s
> Checking gimli v0.32.3
564.17 s
> Checking env_logger v0.11.10
564.17 s
> Checking adler2 v2.0.1
564.17 s
> Checking thiserror v1.0.69
564.17 s
> Checking miniz_oxide v0.8.9
564.17 s
> Checking derive_builder v0.11.2
564.17 s
> Checking crossterm v0.29.0
564.17 s
> Checking object v0.37.3
564.17 s
> Checking owo-colors v4.3.0
564.17 s
> Checking tracing-error v0.2.1
564.17 s
> Checking indicatif v0.18.4
564.17 s
> Checking typed-index-collections v3.5.0
564.17 s
> Checking serde-big-array v0.5.1
564.17 s
> Checking amd v0.2.2
564.17 s
> Checking itertools v0.11.0
564.17 s
> Compiling gammaloop-tracing-filter-macros v0.1.0 (/build/source/crates/gammaloop-tracing-filter-macros)
564.17 s
> Checking option-ext v0.2.0
564.17 s
> Checking rustc-demangle v0.1.27
564.17 s
> Checking dirs-sys v0.5.0
564.17 s
> Checking ratatui-widgets v0.3.0
564.17 s
> Checking ref-cast v1.0.25
564.17 s
> Checking nix v0.31.2
564.17 s
> Checking integer-sqrt v0.1.5
564.17 s
> Checking ratatui-crossterm v0.1.0
564.17 s
> Checking brotli-decompressor v4.0.3
564.17 s
> Checking crossbeam-channel v0.5.15
564.17 s
> Checking itertools v0.12.1
564.17 s
> Compiling gammalooprs v0.3.4 (/build/source/crates/gammalooprs)
564.17 s
> Checking symlink v0.1.0
564.17 s
> Checking color-spantrace v0.3.0
564.17 s
> Checking unsafe-libyaml v0.2.11
564.17 s
> Checking tracing-indicatif v0.3.14
564.17 s
> Checking ctrlc v3.5.2
564.17 s
> Checking rkyv v0.7.46
564.17 s
> Checking include_dir v0.7.4
564.17 s
> Checking pathfinding v4.15.0
564.17 s
> Checking dirs v6.0.0
564.17 s
> Checking schemars v1.2.1
564.17 s
> Checking slotmap v1.1.1
564.17 s
> Checking tracing-appender v0.2.5
564.17 s
> Checking brotli v7.0.0
564.17 s
> Checking json5 v0.4.1
564.17 s
> Checking vectorize v0.2.0
564.17 s
> Checking serde_yaml v0.9.34+deprecated
564.17 s
> Checking base62 v2.2.4
564.17 s
> Checking clarabel v0.11.1
564.17 s
> Checking ringbuffer v0.16.0
564.17 s
> Checking ratatui-macros v0.7.0
564.17 s
> Checking ratatui v0.30.0
564.17 s
> Checking rust-embed v8.11.0
564.17 s
> Checking clap_complete v4.6.3
564.17 s
> Checking strip-ansi-escapes v0.2.1
564.17 s
> Checking addr2line v0.25.1
564.17 s
> Checking fd-lock v4.0.4
564.17 s
> Compiling gammaloop-api v0.1.0 (/build/source/crates/gammaloop-api)
564.17 s
> Checking itertools v0.13.0
564.17 s
> Checking strum v0.26.3
564.17 s
> Checking sysinfo v0.33.1
564.17 s
> Checking shlex v1.3.0
564.17 s
> Checking slab v0.4.12
564.17 s
> Checking futures-core v0.3.32
564.17 s
> Checking futures-task v0.3.32
564.17 s
> Checking sdd v3.0.10
564.17 s
> Checking clap_complete_nushell v4.6.0
564.17 s
> Compiling gammaloop-integration-tests v0.1.0 (/build/source/tests)
564.17 s
> Checking futures-util v0.3.32
564.17 s
> Compiling test-log-core v0.2.20
564.17 s
> Checking scc v2.4.0
564.17 s
> Compiling rustc_version v0.4.1
564.17 s
> Checking backtrace v0.3.76
564.17 s
> Checking which v8.0.2
564.17 s
> Checking reedline v0.42.0
564.17 s
> Checking bincode v1.3.3
564.17 s
> Compiling gungraun-runner v0.18.2
564.17 s
> Checking nalgebra v0.29.0
564.17 s
> Checking color-eyre v0.6.5
564.17 s
> Compiling gungraun-macros v0.8.0
564.17 s
> Checking proc-macro2 v1.0.106
564.17 s
> Checking maplit v1.0.2
564.17 s
> Checking base64 v0.21.7
564.17 s
> Checking quote v1.0.45
564.17 s
> Checking ron v0.8.1
564.17 s
> Compiling iai-callgrind-runner v0.14.2
564.17 s
> Checking kurbo v0.13.0
564.17 s
> Compiling test-log-macros v0.2.20
564.17 s
> Checking wait-timeout v0.2.1
564.17 s
> Checking bit-vec v0.8.0
564.17 s
> Checking quick-error v1.2.3
564.17 s
> Compiling iai-callgrind v0.14.2
564.17 s
> Checking bit-set v0.8.0
564.17 s
> Checking rusty-fork v0.3.1
564.17 s
> Checking syn v2.0.117
564.17 s
> Compiling iai-callgrind-macros v0.5.1
564.17 s
> Checking futures-executor v0.3.32
564.17 s
> Checking rand_xorshift v0.4.0
564.17 s
> Checking console v0.15.11
564.17 s
> Checking serial_test v3.4.0
564.17 s
> Checking pathdiff v0.2.3
564.17 s
> Checking unarray v0.1.4
564.17 s
> Checking proptest v1.11.0
564.17 s
> Checking clinnet v0.1.8 (/build/source/crates/clinnet)
564.17 s
> Checking similar-asserts v1.7.0
564.17 s
> Compiling numerica v2.2.0 (https://github.com/alphal00p/symbolica?rev=a277a8dadbaae5a8d6605f2f381991a601e1f345#a277a8da)
564.17 s
> Checking kurvst v0.1.0 (/build/source/crates/kurvst)
564.17 s
> Checking test-log v0.2.20
564.17 s
> Compiling graphica v2.1.0 (https://github.com/alphal00p/symbolica?rev=a277a8dadbaae5a8d6605f2f381991a601e1f345#a277a8da)
564.17 s
> Checking gungraun v0.18.2
564.17 s
> Checking statrs v0.16.1
564.17 s
> Checking momtrop v0.3.0
564.17 s
> Compiling pyo3-macros v0.28.3
564.17 s
> Compiling pyo3-stub-gen-derive v0.17.2
564.17 s
> Checking pyo3-stub-gen v0.17.2
564.17 s
> Checking symbolica-utils v0.1.0 (/build/source/crates/symbolica-utils)
564.17 s
> Checking spenso-macros v0.3.2 (/build/source/crates/spenso-macros)
564.17 s
> Compiling gammaloop-workspace-hack v0.1.0 (/build/source/crates/gammaloop-workspace-hack)
564.17 s
> Checking linnet v0.17.0 (/build/source/crates/linnet)
564.17 s
> Checking spenso v0.6.0 (/build/source/crates/spenso)
564.17 s
> Checking linnet-py v0.1.0 (/build/source/crates/linnet-py)
564.17 s
> Checking linnest v0.1.0 (/build/source/crates/linnest)
564.17 s
> Checking idenso v0.3.0 (/build/source/crates/idenso)
564.17 s
> Checking gammaloop-tracing-filter v0.1.0 (/build/source/crates/gammaloop-tracing-filter)
564.17 s
> Checking spenso-hep-lib v0.1.7 (/build/source/crates/spenso-hep-lib)
564.17 s
> Checking spynso3 v0.1.2 (/build/source/crates/spynso3)
564.17 s
> error[E0560] : struct `CutInfo` has no field named `lmb_channel_id`
564.17 s
> --> tests/tests/test_differential.rs:86:13
564.17 s
> |
564.17 s
> 86 | lmb_channel_id: None,
564.17 s
> | ^^^^^^^^^^^^^^ `CutInfo` does not have this field
564.17 s
> |
564.17 s
> = note : available fields are: `sampling_channel_id`, `sampling_channel_edge_ids`
564.17 s
>
564.17 s
> error[E0560] : struct `CutInfo` has no field named `lmb_channel_edge_ids`
564.17 s
> --> tests/tests/test_differential.rs:87:13
564.17 s
> |
564.17 s
> 87 | lmb_channel_edge_ids: None,
564.17 s
> | ^^^^^^^^^^^^^^^^^^^^ `CutInfo` does not have this field
564.17 s
> |
564.17 s
> = note : available fields are: `sampling_channel_id`, `sampling_channel_edge_ids`
564.17 s
>
564.17 s
> error[E0063] : missing field `reference_moments` in initializer of `GraphEvaluationResult<_>`
564.17 s
> --> tests/tests/test_differential.rs:532:19
564.17 s
> |
564.17 s
> 532 | let mut lhs = GraphEvaluationResult {
564.17 s
> | ^^^^^^^^^^^^^^^^^^^^^ missing `reference_moments`
564.17 s
>
564.17 s
> error[E0063] : missing field `reference_moments` in initializer of `GraphEvaluationResult<_>`
564.17 s
> --> tests/tests/test_differential.rs:539:15
564.17 s
> |
564.17 s
> 539 | let rhs = GraphEvaluationResult {
564.17 s
> | ^^^^^^^^^^^^^^^^^^^^^ missing `reference_moments`
564.17 s
>
564.17 s
> Some errors have detailed explanations: E0063, E0560.
564.17 s
> For more information about an error, try `rustc --explain E0063`.
564.17 s
> error : could not compile `gammaloop-integration-tests` (test "test_differential") due to 4 previous errors
564.17 s
> warning : build failed, waiting for other jobs to finish...
564.17 s
> error[E0609] : no field `lmb_channel_id` on type `CutInfo`
564.17 s
> --> tests/tests/test_runs/utils.rs:568:36
564.17 s
> |
564.17 s
> 568 | event.cut_info.lmb_channel_id,
564.17 s
> | ^^^^^^^^^^^^^^ unknown field
564.17 s
> |
564.17 s
> = note : available fields are: `particle_pdgs`, `cut_id`, `graph_id`, `graph_group_id`, `orientation_id` ... and 2 others
564.17 s
>
564.17 s
> error[E0609] : no field `lmb_channel_id` on type `CutInfo`
564.17 s
> --> tests/tests/test_runs/utils.rs:580:36
564.17 s
> |
564.17 s
> 580 | event.cut_info.lmb_channel_id,
564.17 s
> | ^^^^^^^^^^^^^^ unknown field
564.17 s
> |
564.17 s
> = note : available fields are: `particle_pdgs`, `cut_id`, `graph_id`, `graph_group_id`, `orientation_id` ... and 2 others
564.17 s
>
564.17 s
> For more information about this error, try `rustc --explain E0609`.
564.17 s
> error : could not compile `gammaloop-integration-tests` (test "test_runs") due to 2 previous errors
564.17 s
For full logs, run:
564.17 s
nix log /nix/store/8z7532y2mrxdvk4qgscgqrhdk179hn45-gammaloop-workspace-check-0.1.0.drv
564.33 s
Build failed.