1. 0.01 s $ /nix/store/9ypz3flqsrl5xl495mm8h645gadjsxi1-coreutils-9.11/bin/timeout --kill-after=15s 7200s /nix/store/23zk8sgzamrbmj1fday15szf7f2279s8-nix-2.34.7/bin/nix --extra-experimental-features nix-command --extra-experimental-features flakes --log-format internal-json build --no-link --print-out-paths git+https://github.com/alphal00p/gammaloop?ref=advanced_sampling&rev=882f80eb025a2aa807219cff35cbd70349e28440&shallow=1#checks.x86_64-linux.gammaloop-check --print-build-logs
  2. 0.63 s
  3. 2.07 s Building /nix/store/8z7532y2mrxdvk4qgscgqrhdk179hn45-gammaloop-workspace-check-0.1.0.drv
  4. 2.27 s [gammaloop-workspace-check] Phase: unpackPhase
  5. 2.30 s [gammaloop-workspace-check] unpacking source archive /nix/store/lxd2pc2qjvxzkbjaklyikbcq1cjx91ck-source
  6. 2.84 s [gammaloop-workspace-check] source root is source
  7. 2.92 s [gammaloop-workspace-check] Phase: patchPhase
  8. 2.95 s [gammaloop-workspace-check] Executing configureCargoCommonVars
  9. 2.97 s [gammaloop-workspace-check] decompressing cargo artifacts from /nix/store/50vpxlcgfxf2d57i27v3d10zjwxxbm2r-gammaloop-workspace-deps-deps-0.1.0/target.tar.zst to target
  10. 8.54 s [gammaloop-workspace-check] Phase: updateAutotoolsGnuConfigScriptsPhase
  11. 8.62 s [gammaloop-workspace-check] Phase: configurePhase
  12. 8.63 s [gammaloop-workspace-check] will append /build/source/.cargo-home/config.toml with contents of /nix/store/5drf77x6km4ky7gwlrzdx9bbd6fz09g3-vendor-cargo-deps/config.toml
  13. 8.64 s [gammaloop-workspace-check] default configurePhase, nothing to do
  14. 8.65 s [gammaloop-workspace-check] Phase: buildPhase
  15. 8.66 s [gammaloop-workspace-check] +++ command cargo --version
  16. 8.67 s [gammaloop-workspace-check] cargo 1.97.0 (c980f4866 2026-06-30)
  17. 8.73 s [gammaloop-workspace-check] +++ command cargo check --profile ci-optim --locked --workspace --features gammaloop-tracing-filter/clap,gammaloop-tracing-filter/symbolica,idenso/bincode,idenso/reference-cases,linnet/bincode,linnet/drawing,linnet/rkyv,linnet/serde,linnet/symbolica,spenso-macros/shadowing,spenso/shadowing,symbolica/tracing_max_level_info,three-dimensional-reps/display,three-dimensional-reps/eval,three-dimensional-reps/serde --all-targets
  18. 9.77 s [gammaloop-workspace-check] Checking cfg-if v1.0.4
  19. 9.77 s [gammaloop-workspace-check] Checking memchr v2.8.0
  20. 9.77 s [gammaloop-workspace-check] Checking once_cell v1.21.4
  21. 9.81 s [gammaloop-workspace-check] Checking either v1.15.0
  22. 9.81 s [gammaloop-workspace-check] Checking serde_core v1.0.228
  23. 9.81 s [gammaloop-workspace-check] Checking libc v0.2.186
  24. 9.81 s [gammaloop-workspace-check] Checking libm v0.2.16
  25. 9.83 s [gammaloop-workspace-check] Checking itoa v1.0.18
  26. 9.83 s [gammaloop-workspace-check] Checking log v0.4.29
  27. 9.83 s [gammaloop-workspace-check] Checking regex-syntax v0.8.10
  28. 9.83 s [gammaloop-workspace-check] Checking zerocopy v0.8.48
  29. 9.87 s [gammaloop-workspace-check] Checking crossbeam-utils v0.8.21
  30. 9.87 s [gammaloop-workspace-check] Checking equivalent v1.0.2
  31. 9.87 s [gammaloop-workspace-check] Checking zmij v1.0.21
  32. 9.87 s [gammaloop-workspace-check] Checking bytemuck v1.25.0
  33. 9.87 s [gammaloop-workspace-check] Checking lazy_static v1.5.0
  34. 9.87 s [gammaloop-workspace-check] Compiling target-lexicon v0.13.5
  35. 10.05 s [gammaloop-workspace-check] Checking arrayvec v0.7.6
  36. 10.22 s [gammaloop-workspace-check] Checking powerfmt v0.2.0
  37. 10.22 s [gammaloop-workspace-check] Checking time-core v0.1.8
  38. 10.26 s [gammaloop-workspace-check] Checking pin-project-lite v0.2.17
  39. 10.44 s [gammaloop-workspace-check] Checking num_threads v0.1.7
  40. 10.61 s [gammaloop-workspace-check] Checking num-conv v0.2.1
  41. 10.71 s [gammaloop-workspace-check] Checking allocator-api2 v0.2.21
  42. 10.74 s [gammaloop-workspace-check] Checking foldhash v0.2.0
  43. 10.80 s [gammaloop-workspace-check] Checking safe_arch v0.7.4
  44. 10.85 s [gammaloop-workspace-check] Checking tracing-core v0.1.36
  45. 10.89 s [gammaloop-workspace-check] Checking deranged v0.5.8
  46. 10.98 s [gammaloop-workspace-check] Checking const-random v0.1.18
  47. 11.05 s [gammaloop-workspace-check] Checking static_assertions v1.1.0
  48. 11.09 s [gammaloop-workspace-check] Checking nu-ansi-term v0.50.3
  49. 11.14 s [gammaloop-workspace-check] Checking unty v0.0.4
  50. 11.17 s [gammaloop-workspace-check] Checking itertools v0.14.0
  51. 11.21 s [gammaloop-workspace-check] Checking winnow v1.0.2
  52. 11.30 s [gammaloop-workspace-check] Checking safe_arch v1.0.0
  53. 11.85 s [gammaloop-workspace-check] Checking sharded-slab v0.1.7
  54. 11.98 s [gammaloop-workspace-check] Checking crossbeam-epoch v0.9.18
  55. 12.33 s [gammaloop-workspace-check] Checking tracing-log v0.2.0
  56. 12.52 s [gammaloop-workspace-check] Checking wide v0.7.33
  57. 12.58 s [gammaloop-workspace-check] Checking aho-corasick v1.1.4
  58. 12.69 s [gammaloop-workspace-check] Checking hashbrown v0.16.1
  59. 12.72 s [gammaloop-workspace-check] Checking crossbeam-deque v0.8.6
  60. 12.81 s [gammaloop-workspace-check] Checking tracing v0.1.44
  61. 12.97 s [gammaloop-workspace-check] Checking rayon-core v1.13.0
  62. 13.24 s [gammaloop-workspace-check] Checking thread_local v1.1.9
  63. 13.70 s [gammaloop-workspace-check] Checking indenter v0.3.4
  64. 13.80 s [gammaloop-workspace-check] Checking toml_writer v1.1.1+spec-1.1.0
  65. 13.86 s [gammaloop-workspace-check] Checking num-traits v0.2.19
  66. 13.94 s [gammaloop-workspace-check] Checking az v1.3.0
  67. 14.30 s [gammaloop-workspace-check] Checking wide v1.3.0
  68. 14.33 s [gammaloop-workspace-check] Compiling phf_shared v0.11.3
  69. 14.91 s [gammaloop-workspace-check] Checking rayon v1.12.0
  70. 15.06 s [gammaloop-workspace-check] Checking anyhow v1.0.102
  71. 15.09 s [gammaloop-workspace-check] Checking utf8parse v0.2.2
  72. 15.31 s [gammaloop-workspace-check] Checking dyn-clone v1.0.20
  73. 15.48 s [gammaloop-workspace-check] Checking alloc-no-stdlib v2.0.4
  74. 15.71 s [gammaloop-workspace-check] Compiling pyo3-build-config v0.28.3
  75. 15.74 s [gammaloop-workspace-check] Checking rawpointer v0.2.1
  76. 15.76 s [gammaloop-workspace-check] Checking toml_parser v1.1.2+spec-1.1.0
  77. 15.89 s [gammaloop-workspace-check] Checking alloc-stdlib v0.2.2
  78. 15.90 s [gammaloop-workspace-check] Checking matrixmultiply v0.3.10
  79. 16.19 s [gammaloop-workspace-check] Checking anstyle-parse v1.0.0
  80. 16.25 s [gammaloop-workspace-check] Checking approx v0.5.1
  81. 16.32 s [gammaloop-workspace-check] Checking num-integer v0.1.46
  82. 16.57 s [gammaloop-workspace-check] Checking is_terminal_polyfill v1.70.2
  83. 16.59 s [gammaloop-workspace-check] Checking anstyle-query v1.1.5
  84. 16.67 s [gammaloop-workspace-check] Checking colored v3.1.1
  85. 16.69 s [gammaloop-workspace-check] Checking anstyle v1.0.14
  86. 16.75 s [gammaloop-workspace-check] Checking colorchoice v1.0.5
  87. 16.79 s [gammaloop-workspace-check] Compiling phf_generator v0.11.3
  88. 16.82 s [gammaloop-workspace-check] Checking eyre v0.6.12
  89. 16.88 s [gammaloop-workspace-check] Checking unicode-width v0.2.2
  90. 16.96 s [gammaloop-workspace-check] Checking bitflags v1.3.2
  91. 16.99 s [gammaloop-workspace-check] Checking regex-automata v0.4.14
  92. 17.02 s [gammaloop-workspace-check] Checking serde v1.0.228
  93. 17.10 s [gammaloop-workspace-check] Checking serde_json v1.0.149
  94. 17.13 s [gammaloop-workspace-check] Checking bitflags v2.11.1
  95. 17.17 s [gammaloop-workspace-check] Checking serde_spanned v1.1.1
  96. 17.18 s [gammaloop-workspace-check] Checking toml_datetime v1.1.1+spec-1.1.0
  97. 17.31 s [gammaloop-workspace-check] Checking anstream v1.0.0
  98. 17.33 s [gammaloop-workspace-check] Compiling phf_codegen v0.11.3
  99. 17.51 s [gammaloop-workspace-check] Checking brotli-decompressor v5.0.0
  100. 17.55 s [gammaloop-workspace-check] Checking inventory v0.3.24
  101. 17.57 s [gammaloop-workspace-check] Checking getrandom v0.3.4
  102. 17.57 s [gammaloop-workspace-check] Checking time v0.3.47
  103. 17.70 s [gammaloop-workspace-check] Checking gmp-mpfr-sys v1.7.1
  104. 17.72 s [gammaloop-workspace-check] Checking region v3.0.2
  105. 17.76 s [gammaloop-workspace-check] Checking wasmtime-jit-icache-coherence v34.0.2
  106. 17.87 s [gammaloop-workspace-check] Checking rand_core v0.9.5
  107. 17.89 s [gammaloop-workspace-check] Checking hugepage-rs v0.1.1
  108. 18.10 s [gammaloop-workspace-check] Checking spec_math v0.1.6
  109. 18.11 s [gammaloop-workspace-check] Checking toml v1.1.2+spec-1.1.0
  110. 18.16 s [gammaloop-workspace-check] Checking thiserror v2.0.18
  111. 18.26 s [gammaloop-workspace-check] Compiling getopts v0.2.24
  112. 18.29 s [gammaloop-workspace-check] Checking libloading v0.9.0
  113. 18.55 s [gammaloop-workspace-check] Checking append-only-vec v0.1.8
  114. 18.63 s [gammaloop-workspace-check] Checking byteorder v1.5.0
  115. 18.66 s [gammaloop-workspace-check] Checking bytes v1.11.1
  116. 18.81 s [gammaloop-workspace-check] Checking self_cell v1.2.2
  117. 18.84 s [gammaloop-workspace-check] Checking tinyjson v2.5.1
  118. 18.97 s [gammaloop-workspace-check] Compiling unicode_names2_generator v1.3.0
  119. 19.00 s [gammaloop-workspace-check] Compiling unic-common v0.9.0
  120. 19.15 s [gammaloop-workspace-check] Checking linux-raw-sys v0.12.1
  121. 19.36 s [gammaloop-workspace-check] Compiling unic-char-range v0.9.0
  122. 19.62 s [gammaloop-workspace-check] Compiling unic-char-property v0.9.0
  123. 19.73 s [gammaloop-workspace-check] Compiling unic-ucd-version v0.9.0
  124. 19.80 s [gammaloop-workspace-check] Compiling is-macro v0.3.7
  125. 19.87 s [gammaloop-workspace-check] Compiling rustpython-parser-vendored v0.4.0
  126. 19.94 s [gammaloop-workspace-check] Checking smallvec v1.15.1
  127. 20.10 s [gammaloop-workspace-check] Checking num-complex v0.4.6
  128. 20.70 s [gammaloop-workspace-check] Checking bincode v2.0.1
  129. 21.13 s [gammaloop-workspace-check] Checking tracing-serde v0.2.0
  130. 21.28 s [gammaloop-workspace-check] Checking smartstring v1.0.1
  131. 21.32 s [gammaloop-workspace-check] Checking brotli v8.0.2
  132. 21.40 s [gammaloop-workspace-check] Checking rustix v1.1.4
  133. 21.56 s [gammaloop-workspace-check] Checking iana-time-zone v0.1.65
  134. 21.65 s [gammaloop-workspace-check] Compiling rustpython-parser v0.4.0
  135. 21.84 s [gammaloop-workspace-check] Compiling phf v0.11.3
  136. 22.05 s [gammaloop-workspace-check] Checking rustc-hash v2.1.2
  137. 22.07 s [gammaloop-workspace-check] Checking simba v0.9.1
  138. 22.08 s [gammaloop-workspace-check] Checking chrono v0.4.44
  139. 22.27 s [gammaloop-workspace-check] Checking ndarray v0.17.2
  140. 22.64 s [gammaloop-workspace-check] Compiling unic-ucd-ident v0.9.0
  141. 23.34 s [gammaloop-workspace-check] Compiling unic-emoji-char v0.9.0
  142. 23.87 s [gammaloop-workspace-check] Compiling lalrpop-util v0.20.2
  143. 24.23 s [gammaloop-workspace-check] Compiling rustc-hash v1.1.0
  144. 24.51 s [gammaloop-workspace-check] Checking rug v1.30.0
  145. 24.57 s [gammaloop-workspace-check] Checking unicode-segmentation v1.13.2
  146. 24.58 s [gammaloop-workspace-check] Compiling symbolica v2.2.0 (https://github.com/alphal00p/symbolica?rev=a277a8dadbaae5a8d6605f2f381991a601e1f345#a277a8da)
  147. 24.72 s [gammaloop-workspace-check] Checking typenum v1.20.0
  148. 25.30 s [gammaloop-workspace-check] Checking getrandom v0.2.17
  149. 26.11 s [gammaloop-workspace-check] Checking scopeguard v1.2.0
  150. 26.32 s [gammaloop-workspace-check] Checking lock_api v0.4.14
  151. 26.90 s [gammaloop-workspace-check] Checking parking_lot_core v0.9.12
  152. 27.32 s [gammaloop-workspace-check] Checking hashbrown v0.17.0
  153. 27.59 s [gammaloop-workspace-check] Checking unicode-ident v1.0.24
  154. 28.11 s [gammaloop-workspace-check] Checking errno v0.3.14
  155. 28.17 s [gammaloop-workspace-check] Checking parking_lot v0.12.5
  156. 28.73 s [gammaloop-workspace-check] Checking unicase v2.9.0
  157. 28.81 s [gammaloop-workspace-check] Checking generic-array v0.14.7
  158. 29.07 s [gammaloop-workspace-check] Checking clap_lex v1.1.0
  159. 29.58 s [gammaloop-workspace-check] Checking strsim v0.11.1
  160. 29.89 s [gammaloop-workspace-check] Checking signal-hook-registry v1.4.8
  161. 29.96 s [gammaloop-workspace-check] Checking vte v0.14.1
  162. 30.24 s [gammaloop-workspace-check] Checking same-file v1.0.6
  163. 30.60 s [gammaloop-workspace-check] Checking mio v1.2.0
  164. 30.64 s [gammaloop-workspace-check] Checking walkdir v2.5.0
  165. 30.75 s [gammaloop-workspace-check] Checking signal-hook v0.3.18
  166. 30.78 s [gammaloop-workspace-check] Checking indexmap v2.14.0
  167. 31.62 s [gammaloop-workspace-check] Checking minimal-lexical v0.2.1
  168. 32.01 s [gammaloop-workspace-check] Checking ciborium-io v0.2.2
  169. 32.07 s [gammaloop-workspace-check] Checking ppv-lite86 v0.2.21
  170. 32.23 s [gammaloop-workspace-check] Checking ahash v0.8.12
  171. 32.64 s [gammaloop-workspace-check] Checking half v2.7.1
  172. 32.90 s [gammaloop-workspace-check] Checking crypto-common v0.1.7
  173. 33.10 s [gammaloop-workspace-check] Checking block-buffer v0.10.4
  174. 33.13 s [gammaloop-workspace-check] Checking nom v7.1.3
  175. 33.48 s [gammaloop-workspace-check] Checking digest v0.10.7
  176. 33.75 s [gammaloop-workspace-check] Checking matchers v0.2.0
  177. 33.79 s [gammaloop-workspace-check] Checking regex v1.12.3
  178. 33.83 s [gammaloop-workspace-check] Checking terminal_size v0.4.4
  179. 33.89 s [gammaloop-workspace-check] Checking signal-hook-mio v0.2.5
  180. 34.03 s [gammaloop-workspace-check] Checking tracing-subscriber v0.3.23
  181. 34.18 s [gammaloop-workspace-check] Checking derive_more v2.1.1
  182. 34.28 s [gammaloop-workspace-check] Checking rand_chacha v0.9.0
  183. 34.39 s [gammaloop-workspace-check] Checking clap_builder v4.6.0
  184. 34.45 s [gammaloop-workspace-check] Checking num-bigint v0.4.6
  185. 34.88 s [gammaloop-workspace-check] Checking ciborium-ll v0.2.2
  186. 35.01 s [gammaloop-workspace-check] Checking console v0.16.3
  187. 35.26 s [gammaloop-workspace-check] Checking rand v0.9.4
  188. 35.40 s [gammaloop-workspace-check] Checking bstr v1.12.1
  189. 36.08 s [gammaloop-workspace-check] Checking winnow v0.7.15
  190. 36.75 s [gammaloop-workspace-check] Checking linux-raw-sys v0.4.15
  191. 37.56 s [gammaloop-workspace-check] Checking cpufeatures v0.2.17
  192. 37.64 s [gammaloop-workspace-check] Compiling unicode_names2 v1.3.0
  193. 37.75 s [gammaloop-workspace-check] Checking sha2 v0.10.9
  194. 37.83 s [gammaloop-workspace-check] Checking symjit v2.21.0
  195. 38.76 s [gammaloop-workspace-check] Checking rustix v0.38.44
  196. 39.10 s [gammaloop-workspace-check] Checking ansitok v0.3.0
  197. 39.18 s [gammaloop-workspace-check] Checking globset v0.4.18
  198. 40.31 s [gammaloop-workspace-check] Checking ciborium v0.2.2
  199. 40.49 s [gammaloop-workspace-check] Checking getrandom v0.4.2
  200. 41.09 s [gammaloop-workspace-check] Checking rand_core v0.6.4
  201. 41.34 s [gammaloop-workspace-check] Checking plotters-backend v0.3.7
  202. 41.42 s [gammaloop-workspace-check] Checking fnv v1.0.7
  203. 41.48 s [gammaloop-workspace-check] Checking fastrand v2.4.1
  204. 41.54 s [gammaloop-workspace-check] Checking crossterm v0.28.1
  205. 42.21 s [gammaloop-workspace-check] Checking rust-embed-utils v8.11.0
  206. 42.23 s [gammaloop-workspace-check] Checking tempfile v3.27.0
  207. 42.31 s [gammaloop-workspace-check] Checking serde_spanned v0.6.9
  208. 42.38 s [gammaloop-workspace-check] Checking clap v4.6.1
  209. 42.39 s [gammaloop-workspace-check] Checking toml_datetime v0.6.11
  210. 42.51 s [gammaloop-workspace-check] Checking itertools v0.10.5
  211. 42.72 s [gammaloop-workspace-check] Checking tap v1.0.1
  212. 43.06 s [gammaloop-workspace-check] Checking plotters-svg v0.3.7
  213. 43.15 s [gammaloop-workspace-check] Checking cast v0.3.0
  214. 43.19 s [gammaloop-workspace-check] Checking toml_write v0.1.2
  215. 43.28 s [gammaloop-workspace-check] Checking wyz v0.5.1
  216. 43.53 s [gammaloop-workspace-check] Checking rand_chacha v0.3.1
  217. 43.58 s [gammaloop-workspace-check] Checking ansi-str v0.9.0
  218. 43.63 s [gammaloop-workspace-check] Checking plotters v0.3.7
  219. 44.07 s [gammaloop-workspace-check] Checking radium v0.7.0
  220. 44.26 s [gammaloop-workspace-check] Checking typeid v1.0.3
  221. 44.42 s [gammaloop-workspace-check] Checking similar v2.7.0
  222. 44.59 s [gammaloop-workspace-check] Checking tinytemplate v1.2.1
  223. 44.74 s [gammaloop-workspace-check] Checking is-terminal v0.4.17
  224. 44.90 s [gammaloop-workspace-check] Checking funty v2.0.0
  225. 45.17 s [gammaloop-workspace-check] Checking oorandom v11.1.5
  226. 45.25 s [gammaloop-workspace-check] Checking bytecount v0.6.9
  227. 45.30 s [gammaloop-workspace-check] Checking xprec v0.2.2
  228. 45.63 s [gammaloop-workspace-check] Checking anes v0.1.6
  229. 45.65 s [gammaloop-workspace-check] Checking rand v0.8.6
  230. 45.65 s [gammaloop-workspace-check] Checking papergrid v0.17.0
  231. 45.77 s [gammaloop-workspace-check] Checking ron v0.12.1
  232. 45.79 s [gammaloop-workspace-check] Checking testing_table v0.3.0
  233. 46.18 s [gammaloop-workspace-check] Checking toml_edit v0.25.11+spec-1.1.0
  234. 46.25 s [gammaloop-workspace-check] Checking env_filter v1.0.1
  235. 46.28 s [gammaloop-workspace-check] Checking toml_edit v0.22.27
  236. 46.71 s [gammaloop-workspace-check] Checking uncased v0.9.10
  237. 47.10 s [gammaloop-workspace-check] Checking jiff v0.2.24
  238. 47.20 s [gammaloop-workspace-check] Checking ptr_meta v0.1.4
  239. 47.49 s [gammaloop-workspace-check] Checking bitvec v1.0.1
  240. 47.60 s [gammaloop-workspace-check] Checking simdutf8 v0.1.5
  241. 47.63 s [gammaloop-workspace-check] Checking ucd-trie v0.1.7
  242. 48.05 s [gammaloop-workspace-check] Checking bytecheck v0.6.12
  243. 48.31 s [gammaloop-workspace-check] Checking pest v2.8.6
  244. 48.71 s [gammaloop-workspace-check] Checking ahash v0.7.8
  245. 49.28 s [gammaloop-workspace-check] Checking approx v0.4.0
  246. 49.40 s [gammaloop-workspace-check] Checking hashbrown v0.12.3
  247. 49.51 s [gammaloop-workspace-check] Checking seahash v4.1.0
  248. 49.55 s [gammaloop-workspace-check] Checking tabled v0.20.0
  249. 49.66 s [gammaloop-workspace-check] Checking cgmath v0.18.0
  250. 49.68 s [gammaloop-workspace-check] Checking num-rational v0.4.2
  251. 49.70 s [gammaloop-workspace-check] Checking insta v1.47.2
  252. 49.85 s [gammaloop-workspace-check] Checking rend v0.4.2
  253. 50.05 s [gammaloop-workspace-check] Checking criterion-plot v0.5.0
  254. 50.37 s [gammaloop-workspace-check] Checking num-iter v0.1.45
  255. 50.45 s [gammaloop-workspace-check] Compiling pyo3-macros-backend v0.28.3
  256. 50.65 s [gammaloop-workspace-check] Compiling pyo3-ffi v0.28.3
  257. 50.76 s [gammaloop-workspace-check] Compiling pyo3 v0.28.3
  258. 50.89 s [gammaloop-workspace-check] Compiling numpy v0.28.0
  259. 51.38 s [gammaloop-workspace-check] Checking criterion v0.5.1
  260. 51.41 s [gammaloop-workspace-check] Checking dot-parser v0.5.1
  261. 51.55 s [gammaloop-workspace-check] Checking ref-ops v0.2.5
  262. 51.69 s [gammaloop-workspace-check] Checking num v0.4.3
  263. 51.79 s [gammaloop-workspace-check] Checking rand_xoshiro v0.6.0
  264. 51.86 s [gammaloop-workspace-check] Checking features v0.10.0
  265. 52.00 s [gammaloop-workspace-check] Checking constcat v0.5.1
  266. 52.08 s [gammaloop-workspace-check] Checking gat-lending-iterator v0.1.8
  267. 52.28 s [gammaloop-workspace-check] Checking colored v2.2.0
  268. 52.42 s [gammaloop-workspace-check] Checking cpufeatures v0.3.0
  269. 52.47 s [gammaloop-workspace-check] Checking constant_time_eq v0.4.2
  270. 52.49 s [gammaloop-workspace-check] Checking arrayref v0.3.9
  271. 52.54 s [gammaloop-workspace-check] Checking base64 v0.22.1
  272. 52.56 s [gammaloop-workspace-check] Checking joinery v2.1.0
  273. 52.62 s [gammaloop-workspace-check] Checking blake3 v1.8.5
  274. 52.69 s [gammaloop-workspace-check] Checking siphasher v1.0.2
  275. 52.81 s [gammaloop-workspace-check] Checking titlecase v2.2.1
  276. 52.90 s [gammaloop-workspace-check] Checking subprocess v0.2.15
  277. 53.06 s [gammaloop-workspace-check] Checking phf_shared v0.13.1
  278. 53.23 s [gammaloop-workspace-check] Checking rust_lisp v0.18.0
  279. 53.27 s [gammaloop-workspace-check] Compiling vakint v0.1.2 (/build/source/crates/vakint)
  280. 53.34 s [gammaloop-workspace-check] Checking version-compare v0.2.1
  281. 53.36 s [gammaloop-workspace-check] Checking phf v0.13.1
  282. 53.59 s [gammaloop-workspace-check] Checking xpct v0.5.1
  283. 53.61 s [gammaloop-workspace-check] Compiling rustpython-parser-core v0.4.0
  284. 53.63 s [gammaloop-workspace-check] Checking ryu v1.0.23
  285. 53.99 s [gammaloop-workspace-check] Checking castaway v0.2.4
  286. 54.05 s [gammaloop-workspace-check] Checking toml_datetime v0.7.5+spec-1.1.0
  287. 54.14 s [gammaloop-workspace-check] Checking strum v0.27.2
  288. 54.34 s [gammaloop-workspace-check] Compiling rustpython-ast v0.4.0
  289. 54.38 s [gammaloop-workspace-check] Checking compact_str v0.9.0
  290. 54.42 s [gammaloop-workspace-check] Checking unicode-truncate v2.0.1
  291. 54.43 s [gammaloop-workspace-check] Checking toml v0.8.23
  292. 54.67 s [gammaloop-workspace-check] Checking kasuari v0.4.12
  293. 54.89 s [gammaloop-workspace-check] Checking lru v0.16.4
  294. 55.07 s [gammaloop-workspace-check] Checking toml v0.9.12+spec-1.1.0
  295. 55.10 s [gammaloop-workspace-check] Checking vte v0.15.0
  296. 55.14 s [gammaloop-workspace-check] Checking string-template-plus v0.4.3
  297. 55.21 s [gammaloop-workspace-check] Checking portable-atomic v1.13.1
  298. 55.25 s [gammaloop-workspace-check] Checking ratatui-core v0.1.0
  299. 55.25 s [gammaloop-workspace-check] Checking unit-prefix v0.5.2
  300. 55.35 s [gammaloop-workspace-check] Checking rand_distr v0.4.3
  301. 55.36 s [gammaloop-workspace-check] Checking figment v0.10.19
  302. 55.60 s [gammaloop-workspace-check] Checking vt100 v0.16.2
  303. 55.68 s [gammaloop-workspace-check] Checking simba v0.6.0
  304. 55.88 s [gammaloop-workspace-check] Checking line-clipping v0.3.7
  305. 55.94 s [gammaloop-workspace-check] Compiling three-dimensional-reps v0.1.0 (/build/source/crates/three-dimensional-reps)
  306. 55.96 s [gammaloop-workspace-check] Checking gimli v0.32.3
  307. 56.17 s [gammaloop-workspace-check] Checking adler2 v2.0.1
  308. 56.29 s [gammaloop-workspace-check] Checking miniz_oxide v0.8.9
  309. 56.33 s [gammaloop-workspace-check] Checking thiserror v1.0.69
  310. 56.47 s [gammaloop-workspace-check] Checking derive_builder v0.11.2
  311. 56.55 s [gammaloop-workspace-check] Checking object v0.37.3
  312. 56.74 s [gammaloop-workspace-check] Checking crossterm v0.29.0
  313. 56.78 s [gammaloop-workspace-check] Checking ratatui-widgets v0.3.0
  314. 56.84 s [gammaloop-workspace-check] Checking owo-colors v4.3.0
  315. 56.94 s [gammaloop-workspace-check] Checking tracing-error v0.2.1
  316. 57.06 s [gammaloop-workspace-check] Checking indicatif v0.18.4
  317. 57.34 s [gammaloop-workspace-check] Checking typed-index-collections v3.5.0
  318. 57.59 s [gammaloop-workspace-check] Checking serde-big-array v0.5.1
  319. 57.84 s [gammaloop-workspace-check] Checking amd v0.2.2
  320. 58.05 s [gammaloop-workspace-check] Checking itertools v0.11.0
  321. 58.13 s [gammaloop-workspace-check] Compiling gammaloop-tracing-filter-macros v0.1.0 (/build/source/crates/gammaloop-tracing-filter-macros)
  322. 58.16 s [gammaloop-workspace-check] Checking rustc-demangle v0.1.27
  323. 58.22 s [gammaloop-workspace-check] Checking option-ext v0.2.0
  324. 58.33 s [gammaloop-workspace-check] Checking dirs-sys v0.5.0
  325. 58.54 s [gammaloop-workspace-check] Checking ref-cast v1.0.25
  326. 58.65 s [gammaloop-workspace-check] Checking env_logger v0.11.10
  327. 58.70 s [gammaloop-workspace-check] Checking ratatui-crossterm v0.1.0
  328. 58.77 s [gammaloop-workspace-check] Checking nix v0.31.2
  329. 59.04 s [gammaloop-workspace-check] Checking integer-sqrt v0.1.5
  330. 59.17 s [gammaloop-workspace-check] Checking brotli-decompressor v4.0.3
  331. 59.19 s [gammaloop-workspace-check] Checking crossbeam-channel v0.5.15
  332. 59.22 s [gammaloop-workspace-check] Checking itertools v0.12.1
  333. 59.31 s [gammaloop-workspace-check] Compiling gammalooprs v0.3.4 (/build/source/crates/gammalooprs)
  334. 60.00 s [gammaloop-workspace-check] Checking ratatui-macros v0.7.0
  335. 60.03 s [gammaloop-workspace-check] Checking unsafe-libyaml v0.2.11
  336. 60.09 s [gammaloop-workspace-check] Checking symlink v0.1.0
  337. 60.14 s [gammaloop-workspace-check] Checking ratatui v0.30.0
  338. 60.27 s [gammaloop-workspace-check] Checking color-spantrace v0.3.0
  339. 60.36 s [gammaloop-workspace-check] Checking ctrlc v3.5.2
  340. 60.50 s [gammaloop-workspace-check] Checking include_dir v0.7.4
  341. 60.70 s [gammaloop-workspace-check] Checking tracing-indicatif v0.3.14
  342. 60.76 s [gammaloop-workspace-check] Checking tracing-appender v0.2.5
  343. 60.82 s [gammaloop-workspace-check] Checking pathfinding v4.15.0
  344. 60.82 s [gammaloop-workspace-check] Checking dirs v6.0.0
  345. 60.97 s [gammaloop-workspace-check] Checking schemars v1.2.1
  346. 61.28 s [gammaloop-workspace-check] Checking slotmap v1.1.1
  347. 61.33 s [gammaloop-workspace-check] Checking brotli v7.0.0
  348. 61.51 s [gammaloop-workspace-check] Checking json5 v0.4.1
  349. 62.25 s [gammaloop-workspace-check] Checking serde_yaml v0.9.34+deprecated
  350. 62.39 s [gammaloop-workspace-check] Checking vectorize v0.2.0
  351. 62.39 s [gammaloop-workspace-check] Checking ringbuffer v0.16.0
  352. 62.51 s [gammaloop-workspace-check] Checking base62 v2.2.4
  353. 62.68 s [gammaloop-workspace-check] Checking rkyv v0.7.46
  354. 62.79 s [gammaloop-workspace-check] Checking clarabel v0.11.1
  355. 62.81 s [gammaloop-workspace-check] Checking rust-embed v8.11.0
  356. 62.93 s [gammaloop-workspace-check] Checking clap_complete v4.6.3
  357. 63.03 s [gammaloop-workspace-check] Checking fd-lock v4.0.4
  358. 63.08 s [gammaloop-workspace-check] Checking strip-ansi-escapes v0.2.1
  359. 63.17 s [gammaloop-workspace-check] Compiling gammaloop-api v0.1.0 (/build/source/crates/gammaloop-api)
  360. 63.23 s [gammaloop-workspace-check] Checking itertools v0.13.0
  361. 63.32 s [gammaloop-workspace-check] Checking strum v0.26.3
  362. 63.41 s [gammaloop-workspace-check] Checking sysinfo v0.33.1
  363. 63.58 s [gammaloop-workspace-check] Compiling numerica v2.2.0 (https://github.com/alphal00p/symbolica?rev=a277a8dadbaae5a8d6605f2f381991a601e1f345#a277a8da)
  364. 63.92 s [gammaloop-workspace-check] Checking addr2line v0.25.1
  365. 64.00 s [gammaloop-workspace-check] Checking clap_complete_nushell v4.6.0
  366. 64.11 s [gammaloop-workspace-check] Checking shlex v1.3.0
  367. 64.27 s [gammaloop-workspace-check] Checking slab v0.4.12
  368. 64.38 s [gammaloop-workspace-check] Checking futures-core v0.3.32
  369. 64.43 s [gammaloop-workspace-check] Checking futures-task v0.3.32
  370. 64.57 s [gammaloop-workspace-check] Checking sdd v3.0.10
  371. 64.58 s [gammaloop-workspace-check] Compiling gammaloop-integration-tests v0.1.0 (/build/source/tests)
  372. 64.64 s [gammaloop-workspace-check] Compiling test-log-core v0.2.20
  373. 64.84 s [gammaloop-workspace-check] Checking futures-util v0.3.32
  374. 64.84 s [gammaloop-workspace-check] Compiling rustc_version v0.4.1
  375. 65.36 s [gammaloop-workspace-check] Checking scc v2.4.0
  376. 67.52 s [gammaloop-workspace-check] Checking which v8.0.2
  377. 68.06 s [gammaloop-workspace-check] Compiling gungraun-macros v0.8.0
  378. 68.11 s [gammaloop-workspace-check] Checking reedline v0.42.0
  379. 68.39 s [gammaloop-workspace-check] Checking bincode v1.3.3
  380. 68.49 s [gammaloop-workspace-check] Checking backtrace v0.3.76
  381. 68.59 s [gammaloop-workspace-check] Compiling gungraun-runner v0.18.2
  382. 69.11 s [gammaloop-workspace-check] Checking color-eyre v0.6.5
  383. 69.84 s [gammaloop-workspace-check] Checking proc-macro2 v1.0.106
  384. 70.30 s [gammaloop-workspace-check] Checking nalgebra v0.29.0
  385. 70.81 s [gammaloop-workspace-check] Checking maplit v1.0.2
  386. 71.03 s [gammaloop-workspace-check] Checking base64 v0.21.7
  387. 72.16 s [gammaloop-workspace-check] Checking quote v1.0.45
  388. 72.48 s [gammaloop-workspace-check] Checking ron v0.8.1
  389. 72.61 s [gammaloop-workspace-check] Compiling iai-callgrind-runner v0.14.2
  390. 72.82 s [gammaloop-workspace-check] Checking kurbo v0.13.0
  391. 73.15 s [gammaloop-workspace-check] Checking wait-timeout v0.2.1
  392. 73.38 s [gammaloop-workspace-check] Checking bit-vec v0.8.0
  393. 73.44 s [gammaloop-workspace-check] Checking futures-executor v0.3.32
  394. 73.55 s [gammaloop-workspace-check] Checking quick-error v1.2.3
  395. 73.78 s [gammaloop-workspace-check] Compiling iai-callgrind v0.14.2
  396. 73.81 s [gammaloop-workspace-check] Checking rusty-fork v0.3.1
  397. 73.84 s [gammaloop-workspace-check] Checking serial_test v3.4.0
  398. 74.07 s [gammaloop-workspace-check] Checking bit-set v0.8.0
  399. 74.24 s [gammaloop-workspace-check] Checking syn v2.0.117
  400. 74.34 s [gammaloop-workspace-check] Compiling iai-callgrind-macros v0.5.1
  401. 74.70 s [gammaloop-workspace-check] Checking rand_xorshift v0.4.0
  402. 74.92 s [gammaloop-workspace-check] Checking console v0.15.11
  403. 75.53 s [gammaloop-workspace-check] Compiling test-log-macros v0.2.20
  404. 76.15 s [gammaloop-workspace-check] Checking unarray v0.1.4
  405. 76.31 s [gammaloop-workspace-check] Checking pathdiff v0.2.3
  406. 76.55 s [gammaloop-workspace-check] Checking proptest v1.11.0
  407. 76.84 s [gammaloop-workspace-check] Checking similar-asserts v1.7.0
  408. 77.23 s [gammaloop-workspace-check] Checking clinnet v0.1.8 (/build/source/crates/clinnet)
  409. 78.12 s [gammaloop-workspace-check] Checking kurvst v0.1.0 (/build/source/crates/kurvst)
  410. 85.10 s [gammaloop-workspace-check] Compiling graphica v2.1.0 (https://github.com/alphal00p/symbolica?rev=a277a8dadbaae5a8d6605f2f381991a601e1f345#a277a8da)
  411. 85.13 s [gammaloop-workspace-check] Checking test-log v0.2.20
  412. 97.38 s [gammaloop-workspace-check] Checking gungraun v0.18.2
  413. 103.74 s [gammaloop-workspace-check] Checking statrs v0.16.1
  414. 105.02 s [gammaloop-workspace-check] Checking momtrop v0.3.0
  415. 107.50 s [gammaloop-workspace-check] Compiling pyo3-stub-gen-derive v0.17.2
  416. 108.53 s [gammaloop-workspace-check] Compiling pyo3-macros v0.28.3
  417. 120.24 s [gammaloop-workspace-check] Checking pyo3-stub-gen v0.17.2
  418. 130.37 s [gammaloop-workspace-check] Checking symbolica-utils v0.1.0 (/build/source/crates/symbolica-utils)
  419. 130.37 s [gammaloop-workspace-check] Checking spenso-macros v0.3.2 (/build/source/crates/spenso-macros)
  420. 452.15 s [gammaloop-workspace-check] Compiling gammaloop-workspace-hack v0.1.0 (/build/source/crates/gammaloop-workspace-hack)
  421. 452.71 s [gammaloop-workspace-check] Checking linnet v0.17.0 (/build/source/crates/linnet)
  422. 458.58 s [gammaloop-workspace-check] Checking spenso v0.6.0 (/build/source/crates/spenso)
  423. 458.58 s [gammaloop-workspace-check] Checking linnet-py v0.1.0 (/build/source/crates/linnet-py)
  424. 458.58 s [gammaloop-workspace-check] Checking linnest v0.1.0 (/build/source/crates/linnest)
  425. 467.81 s [gammaloop-workspace-check] Checking idenso v0.3.0 (/build/source/crates/idenso)
  426. 467.81 s [gammaloop-workspace-check] Checking gammaloop-tracing-filter v0.1.0 (/build/source/crates/gammaloop-tracing-filter)
  427. 472.02 s [gammaloop-workspace-check] Checking spenso-hep-lib v0.1.7 (/build/source/crates/spenso-hep-lib)
  428. 472.44 s [gammaloop-workspace-check] Checking spynso3 v0.1.2 (/build/source/crates/spynso3)
  429. 536.31 s [gammaloop-workspace-check] error[E0560]: struct `CutInfo` has no field named `lmb_channel_id`
  430. 536.31 s [gammaloop-workspace-check] --> tests/tests/test_differential.rs:86:13
  431. 536.31 s [gammaloop-workspace-check] |
  432. 536.31 s [gammaloop-workspace-check] 86 | lmb_channel_id: None,
  433. 536.31 s [gammaloop-workspace-check] | ^^^^^^^^^^^^^^ `CutInfo` does not have this field
  434. 536.31 s [gammaloop-workspace-check] |
  435. 536.31 s [gammaloop-workspace-check] = note: available fields are: `sampling_channel_id`, `sampling_channel_edge_ids`
  436. 536.31 s [gammaloop-workspace-check]
  437. 536.31 s [gammaloop-workspace-check] error[E0560]: struct `CutInfo` has no field named `lmb_channel_edge_ids`
  438. 536.31 s [gammaloop-workspace-check] --> tests/tests/test_differential.rs:87:13
  439. 536.31 s [gammaloop-workspace-check] |
  440. 536.31 s [gammaloop-workspace-check] 87 | lmb_channel_edge_ids: None,
  441. 536.31 s [gammaloop-workspace-check] | ^^^^^^^^^^^^^^^^^^^^ `CutInfo` does not have this field
  442. 536.31 s [gammaloop-workspace-check] |
  443. 536.31 s [gammaloop-workspace-check] = note: available fields are: `sampling_channel_id`, `sampling_channel_edge_ids`
  444. 536.31 s [gammaloop-workspace-check]
  445. 536.33 s [gammaloop-workspace-check] error[E0063]: missing field `reference_moments` in initializer of `GraphEvaluationResult<_>`
  446. 536.33 s [gammaloop-workspace-check] --> tests/tests/test_differential.rs:532:19
  447. 536.33 s [gammaloop-workspace-check] |
  448. 536.33 s [gammaloop-workspace-check] 532 | let mut lhs = GraphEvaluationResult {
  449. 536.33 s [gammaloop-workspace-check] | ^^^^^^^^^^^^^^^^^^^^^ missing `reference_moments`
  450. 536.33 s [gammaloop-workspace-check]
  451. 536.33 s [gammaloop-workspace-check] error[E0063]: missing field `reference_moments` in initializer of `GraphEvaluationResult<_>`
  452. 536.33 s [gammaloop-workspace-check] --> tests/tests/test_differential.rs:539:15
  453. 536.33 s [gammaloop-workspace-check] |
  454. 536.33 s [gammaloop-workspace-check] 539 | let rhs = GraphEvaluationResult {
  455. 536.33 s [gammaloop-workspace-check] | ^^^^^^^^^^^^^^^^^^^^^ missing `reference_moments`
  456. 536.33 s [gammaloop-workspace-check]
  457. 536.43 s [gammaloop-workspace-check] Some errors have detailed explanations: E0063, E0560.
  458. 536.43 s [gammaloop-workspace-check] For more information about an error, try `rustc --explain E0063`.
  459. 536.44 s [gammaloop-workspace-check] error: could not compile `gammaloop-integration-tests` (test "test_differential") due to 4 previous errors
  460. 536.45 s [gammaloop-workspace-check] warning: build failed, waiting for other jobs to finish...
  461. 537.73 s [gammaloop-workspace-check] error[E0609]: no field `lmb_channel_id` on type `CutInfo`
  462. 537.73 s [gammaloop-workspace-check] --> tests/tests/test_runs/utils.rs:568:36
  463. 537.73 s [gammaloop-workspace-check] |
  464. 537.73 s [gammaloop-workspace-check] 568 | event.cut_info.lmb_channel_id,
  465. 537.73 s [gammaloop-workspace-check] | ^^^^^^^^^^^^^^ unknown field
  466. 537.73 s [gammaloop-workspace-check] |
  467. 537.73 s [gammaloop-workspace-check] = note: available fields are: `particle_pdgs`, `cut_id`, `graph_id`, `graph_group_id`, `orientation_id` ... and 2 others
  468. 537.73 s [gammaloop-workspace-check]
  469. 537.73 s [gammaloop-workspace-check] error[E0609]: no field `lmb_channel_id` on type `CutInfo`
  470. 537.73 s [gammaloop-workspace-check] --> tests/tests/test_runs/utils.rs:580:36
  471. 537.73 s [gammaloop-workspace-check] |
  472. 537.73 s [gammaloop-workspace-check] 580 | event.cut_info.lmb_channel_id,
  473. 537.73 s [gammaloop-workspace-check] | ^^^^^^^^^^^^^^ unknown field
  474. 537.73 s [gammaloop-workspace-check] |
  475. 537.73 s [gammaloop-workspace-check] = note: available fields are: `particle_pdgs`, `cut_id`, `graph_id`, `graph_group_id`, `orientation_id` ... and 2 others
  476. 537.73 s [gammaloop-workspace-check]
  477. 538.48 s [gammaloop-workspace-check] For more information about this error, try `rustc --explain E0609`.
  478. 538.51 s [gammaloop-workspace-check] error: could not compile `gammaloop-integration-tests` (test "test_runs") due to 2 previous errors
  479. 539.34 s Progress: 0 of 1 built (1 failed)
  480. 539.34 s Failed to build gammaloop-workspace-check after 8m57s
  481. 539.35 s Cannot build '/nix/store/8z7532y2mrxdvk4qgscgqrhdk179hn45-gammaloop-workspace-check-0.1.0.drv'.
  482. 539.35 s Reason: builder failed with exit code 101.
  483. 539.35 s Output paths:
  484. 539.35 s /nix/store/n6gsf2xm9lm4fvfa6mi0mspcv8dp17g0-gammaloop-workspace-check-0.1.0
  485. 539.35 s Last 475 log lines:
  486. 539.35 s > Running phase: unpackPhase
  487. 539.35 s > unpacking source archive /nix/store/lxd2pc2qjvxzkbjaklyikbcq1cjx91ck-source
  488. 539.35 s > source root is source
  489. 539.35 s > Running phase: patchPhase
  490. 539.35 s > Executing configureCargoCommonVars
  491. 539.35 s > decompressing cargo artifacts from /nix/store/50vpxlcgfxf2d57i27v3d10zjwxxbm2r-gammaloop-workspace-deps-deps-0.1.0/target.tar.zst to target
  492. 539.35 s > Running phase: updateAutotoolsGnuConfigScriptsPhase
  493. 539.35 s > Running phase: configurePhase
  494. 539.35 s > will append /build/source/.cargo-home/config.toml with contents of /nix/store/5drf77x6km4ky7gwlrzdx9bbd6fz09g3-vendor-cargo-deps/config.toml
  495. 539.35 s > default configurePhase, nothing to do
  496. 539.35 s > Running phase: buildPhase
  497. 539.35 s > +++ command cargo --version
  498. 539.35 s > cargo 1.97.0 (c980f4866 2026-06-30)
  499. 539.35 s > +++ command cargo check --profile ci-optim --locked --workspace --features gammaloop-tracing-filter/clap,gammaloop-tracing-filter/symbolica,idenso/bincode,idenso/reference-cases,linnet/bincode,linnet/drawing,linnet/rkyv,linnet/serde,linnet/symbolica,spenso-macros/shadowing,spenso/shadowing,symbolica/tracing_max_level_info,three-dimensional-reps/display,three-dimensional-reps/eval,three-dimensional-reps/serde --all-targets
  500. 539.35 s > Checking cfg-if v1.0.4
  501. 539.35 s > Checking memchr v2.8.0
  502. 539.35 s > Checking once_cell v1.21.4
  503. 539.35 s > Checking either v1.15.0
  504. 539.35 s > Checking serde_core v1.0.228
  505. 539.35 s > Checking libc v0.2.186
  506. 539.35 s > Checking libm v0.2.16
  507. 539.35 s > Checking itoa v1.0.18
  508. 539.35 s > Checking log v0.4.29
  509. 539.35 s > Checking regex-syntax v0.8.10
  510. 539.35 s > Checking zerocopy v0.8.48
  511. 539.35 s > Checking crossbeam-utils v0.8.21
  512. 539.35 s > Checking equivalent v1.0.2
  513. 539.35 s > Checking zmij v1.0.21
  514. 539.35 s > Checking bytemuck v1.25.0
  515. 539.35 s > Checking lazy_static v1.5.0
  516. 539.35 s > Compiling target-lexicon v0.13.5
  517. 539.35 s > Checking arrayvec v0.7.6
  518. 539.35 s > Checking powerfmt v0.2.0
  519. 539.35 s > Checking time-core v0.1.8
  520. 539.35 s > Checking pin-project-lite v0.2.17
  521. 539.35 s > Checking num_threads v0.1.7
  522. 539.35 s > Checking num-conv v0.2.1
  523. 539.35 s > Checking allocator-api2 v0.2.21
  524. 539.35 s > Checking foldhash v0.2.0
  525. 539.35 s > Checking safe_arch v0.7.4
  526. 539.35 s > Checking tracing-core v0.1.36
  527. 539.35 s > Checking deranged v0.5.8
  528. 539.35 s > Checking const-random v0.1.18
  529. 539.35 s > Checking static_assertions v1.1.0
  530. 539.35 s > Checking nu-ansi-term v0.50.3
  531. 539.35 s > Checking unty v0.0.4
  532. 539.35 s > Checking itertools v0.14.0
  533. 539.35 s > Checking winnow v1.0.2
  534. 539.35 s > Checking safe_arch v1.0.0
  535. 539.35 s > Checking sharded-slab v0.1.7
  536. 539.35 s > Checking crossbeam-epoch v0.9.18
  537. 539.35 s > Checking tracing-log v0.2.0
  538. 539.35 s > Checking wide v0.7.33
  539. 539.35 s > Checking aho-corasick v1.1.4
  540. 539.35 s > Checking hashbrown v0.16.1
  541. 539.35 s > Checking crossbeam-deque v0.8.6
  542. 539.35 s > Checking tracing v0.1.44
  543. 539.35 s > Checking rayon-core v1.13.0
  544. 539.35 s > Checking thread_local v1.1.9
  545. 539.35 s > Checking indenter v0.3.4
  546. 539.35 s > Checking toml_writer v1.1.1+spec-1.1.0
  547. 539.35 s > Checking num-traits v0.2.19
  548. 539.35 s > Checking az v1.3.0
  549. 539.35 s > Checking wide v1.3.0
  550. 539.35 s > Compiling phf_shared v0.11.3
  551. 539.35 s > Checking rayon v1.12.0
  552. 539.35 s > Checking anyhow v1.0.102
  553. 539.35 s > Checking utf8parse v0.2.2
  554. 539.35 s > Checking dyn-clone v1.0.20
  555. 539.35 s > Checking alloc-no-stdlib v2.0.4
  556. 539.35 s > Compiling pyo3-build-config v0.28.3
  557. 539.35 s > Checking rawpointer v0.2.1
  558. 539.35 s > Checking toml_parser v1.1.2+spec-1.1.0
  559. 539.35 s > Checking alloc-stdlib v0.2.2
  560. 539.35 s > Checking matrixmultiply v0.3.10
  561. 539.35 s > Checking anstyle-parse v1.0.0
  562. 539.35 s > Checking approx v0.5.1
  563. 539.35 s > Checking num-integer v0.1.46
  564. 539.35 s > Checking is_terminal_polyfill v1.70.2
  565. 539.35 s > Checking anstyle-query v1.1.5
  566. 539.35 s > Checking colored v3.1.1
  567. 539.35 s > Checking anstyle v1.0.14
  568. 539.35 s > Checking colorchoice v1.0.5
  569. 539.35 s > Compiling phf_generator v0.11.3
  570. 539.35 s > Checking eyre v0.6.12
  571. 539.35 s > Checking unicode-width v0.2.2
  572. 539.35 s > Checking bitflags v1.3.2
  573. 539.35 s > Checking regex-automata v0.4.14
  574. 539.35 s > Checking serde v1.0.228
  575. 539.35 s > Checking serde_json v1.0.149
  576. 539.35 s > Checking bitflags v2.11.1
  577. 539.35 s > Checking serde_spanned v1.1.1
  578. 539.35 s > Checking toml_datetime v1.1.1+spec-1.1.0
  579. 539.35 s > Checking anstream v1.0.0
  580. 539.35 s > Compiling phf_codegen v0.11.3
  581. 539.35 s > Checking brotli-decompressor v5.0.0
  582. 539.35 s > Checking inventory v0.3.24
  583. 539.35 s > Checking getrandom v0.3.4
  584. 539.35 s > Checking time v0.3.47
  585. 539.35 s > Checking gmp-mpfr-sys v1.7.1
  586. 539.35 s > Checking region v3.0.2
  587. 539.35 s > Checking wasmtime-jit-icache-coherence v34.0.2
  588. 539.35 s > Checking rand_core v0.9.5
  589. 539.35 s > Checking hugepage-rs v0.1.1
  590. 539.35 s > Checking spec_math v0.1.6
  591. 539.35 s > Checking toml v1.1.2+spec-1.1.0
  592. 539.35 s > Checking thiserror v2.0.18
  593. 539.35 s > Compiling getopts v0.2.24
  594. 539.35 s > Checking libloading v0.9.0
  595. 539.35 s > Checking append-only-vec v0.1.8
  596. 539.35 s > Checking byteorder v1.5.0
  597. 539.35 s > Checking bytes v1.11.1
  598. 539.35 s > Checking self_cell v1.2.2
  599. 539.35 s > Checking tinyjson v2.5.1
  600. 539.35 s > Compiling unicode_names2_generator v1.3.0
  601. 539.35 s > Compiling unic-common v0.9.0
  602. 539.35 s > Checking linux-raw-sys v0.12.1
  603. 539.35 s > Compiling unic-char-range v0.9.0
  604. 539.35 s > Compiling unic-char-property v0.9.0
  605. 539.35 s > Compiling unic-ucd-version v0.9.0
  606. 539.35 s > Compiling is-macro v0.3.7
  607. 539.35 s > Compiling rustpython-parser-vendored v0.4.0
  608. 539.35 s > Checking smallvec v1.15.1
  609. 539.35 s > Checking num-complex v0.4.6
  610. 539.35 s > Checking bincode v2.0.1
  611. 539.35 s > Checking tracing-serde v0.2.0
  612. 539.35 s > Checking smartstring v1.0.1
  613. 539.35 s > Checking brotli v8.0.2
  614. 539.35 s > Checking rustix v1.1.4
  615. 539.35 s > Checking iana-time-zone v0.1.65
  616. 539.35 s > Compiling rustpython-parser v0.4.0
  617. 539.35 s > Compiling phf v0.11.3
  618. 539.35 s > Checking rustc-hash v2.1.2
  619. 539.35 s > Checking simba v0.9.1
  620. 539.35 s > Checking chrono v0.4.44
  621. 539.35 s > Checking ndarray v0.17.2
  622. 539.35 s > Compiling unic-ucd-ident v0.9.0
  623. 539.35 s > Compiling unic-emoji-char v0.9.0
  624. 539.35 s > Compiling lalrpop-util v0.20.2
  625. 539.35 s > Compiling rustc-hash v1.1.0
  626. 539.35 s > Checking rug v1.30.0
  627. 539.35 s > Checking unicode-segmentation v1.13.2
  628. 539.35 s > Compiling symbolica v2.2.0 (https://github.com/alphal00p/symbolica?rev=a277a8dadbaae5a8d6605f2f381991a601e1f345#a277a8da)
  629. 539.35 s > Checking typenum v1.20.0
  630. 539.35 s > Checking getrandom v0.2.17
  631. 539.35 s > Checking scopeguard v1.2.0
  632. 539.35 s > Checking lock_api v0.4.14
  633. 539.35 s > Checking parking_lot_core v0.9.12
  634. 539.35 s > Checking hashbrown v0.17.0
  635. 539.35 s > Checking unicode-ident v1.0.24
  636. 539.35 s > Checking errno v0.3.14
  637. 539.35 s > Checking parking_lot v0.12.5
  638. 539.35 s > Checking unicase v2.9.0
  639. 539.35 s > Checking generic-array v0.14.7
  640. 539.35 s > Checking clap_lex v1.1.0
  641. 539.35 s > Checking strsim v0.11.1
  642. 539.35 s > Checking signal-hook-registry v1.4.8
  643. 539.35 s > Checking vte v0.14.1
  644. 539.35 s > Checking same-file v1.0.6
  645. 539.35 s > Checking mio v1.2.0
  646. 539.35 s > Checking walkdir v2.5.0
  647. 539.35 s > Checking signal-hook v0.3.18
  648. 539.35 s > Checking indexmap v2.14.0
  649. 539.35 s > Checking minimal-lexical v0.2.1
  650. 539.35 s > Checking ciborium-io v0.2.2
  651. 539.35 s > Checking ppv-lite86 v0.2.21
  652. 539.35 s > Checking ahash v0.8.12
  653. 539.35 s > Checking half v2.7.1
  654. 539.35 s > Checking crypto-common v0.1.7
  655. 539.35 s > Checking block-buffer v0.10.4
  656. 539.35 s > Checking nom v7.1.3
  657. 539.35 s > Checking digest v0.10.7
  658. 539.35 s > Checking matchers v0.2.0
  659. 539.35 s > Checking regex v1.12.3
  660. 539.35 s > Checking terminal_size v0.4.4
  661. 539.35 s > Checking signal-hook-mio v0.2.5
  662. 539.35 s > Checking tracing-subscriber v0.3.23
  663. 539.35 s > Checking derive_more v2.1.1
  664. 539.35 s > Checking rand_chacha v0.9.0
  665. 539.35 s > Checking clap_builder v4.6.0
  666. 539.35 s > Checking num-bigint v0.4.6
  667. 539.35 s > Checking ciborium-ll v0.2.2
  668. 539.35 s > Checking console v0.16.3
  669. 539.35 s > Checking rand v0.9.4
  670. 539.35 s > Checking bstr v1.12.1
  671. 539.35 s > Checking winnow v0.7.15
  672. 539.35 s > Checking linux-raw-sys v0.4.15
  673. 539.35 s > Checking cpufeatures v0.2.17
  674. 539.35 s > Compiling unicode_names2 v1.3.0
  675. 539.35 s > Checking sha2 v0.10.9
  676. 539.35 s > Checking symjit v2.21.0
  677. 539.35 s > Checking rustix v0.38.44
  678. 539.35 s > Checking ansitok v0.3.0
  679. 539.35 s > Checking globset v0.4.18
  680. 539.35 s > Checking ciborium v0.2.2
  681. 539.35 s > Checking getrandom v0.4.2
  682. 539.35 s > Checking rand_core v0.6.4
  683. 539.35 s > Checking plotters-backend v0.3.7
  684. 539.35 s > Checking fnv v1.0.7
  685. 539.35 s > Checking fastrand v2.4.1
  686. 539.35 s > Checking crossterm v0.28.1
  687. 539.35 s > Checking rust-embed-utils v8.11.0
  688. 539.35 s > Checking tempfile v3.27.0
  689. 539.35 s > Checking serde_spanned v0.6.9
  690. 539.35 s > Checking clap v4.6.1
  691. 539.35 s > Checking toml_datetime v0.6.11
  692. 539.35 s > Checking itertools v0.10.5
  693. 539.35 s > Checking tap v1.0.1
  694. 539.35 s > Checking plotters-svg v0.3.7
  695. 539.35 s > Checking cast v0.3.0
  696. 539.35 s > Checking toml_write v0.1.2
  697. 539.35 s > Checking wyz v0.5.1
  698. 539.35 s > Checking rand_chacha v0.3.1
  699. 539.35 s > Checking ansi-str v0.9.0
  700. 539.35 s > Checking plotters v0.3.7
  701. 539.35 s > Checking radium v0.7.0
  702. 539.35 s > Checking typeid v1.0.3
  703. 539.35 s > Checking similar v2.7.0
  704. 539.35 s > Checking tinytemplate v1.2.1
  705. 539.35 s > Checking is-terminal v0.4.17
  706. 539.35 s > Checking funty v2.0.0
  707. 539.35 s > Checking oorandom v11.1.5
  708. 539.35 s > Checking bytecount v0.6.9
  709. 539.35 s > Checking xprec v0.2.2
  710. 539.35 s > Checking anes v0.1.6
  711. 539.35 s > Checking rand v0.8.6
  712. 539.35 s > Checking papergrid v0.17.0
  713. 539.35 s > Checking ron v0.12.1
  714. 539.35 s > Checking testing_table v0.3.0
  715. 539.35 s > Checking toml_edit v0.25.11+spec-1.1.0
  716. 539.35 s > Checking env_filter v1.0.1
  717. 539.35 s > Checking toml_edit v0.22.27
  718. 539.35 s > Checking uncased v0.9.10
  719. 539.35 s > Checking jiff v0.2.24
  720. 539.35 s > Checking ptr_meta v0.1.4
  721. 539.35 s > Checking bitvec v1.0.1
  722. 539.35 s > Checking simdutf8 v0.1.5
  723. 539.35 s > Checking ucd-trie v0.1.7
  724. 539.35 s > Checking bytecheck v0.6.12
  725. 539.35 s > Checking pest v2.8.6
  726. 539.35 s > Checking ahash v0.7.8
  727. 539.35 s > Checking approx v0.4.0
  728. 539.35 s > Checking hashbrown v0.12.3
  729. 539.35 s > Checking seahash v4.1.0
  730. 539.35 s > Checking tabled v0.20.0
  731. 539.35 s > Checking cgmath v0.18.0
  732. 539.35 s > Checking num-rational v0.4.2
  733. 539.35 s > Checking insta v1.47.2
  734. 539.35 s > Checking rend v0.4.2
  735. 539.35 s > Checking criterion-plot v0.5.0
  736. 539.35 s > Checking num-iter v0.1.45
  737. 539.35 s > Compiling pyo3-macros-backend v0.28.3
  738. 539.35 s > Compiling pyo3-ffi v0.28.3
  739. 539.35 s > Compiling pyo3 v0.28.3
  740. 539.35 s > Compiling numpy v0.28.0
  741. 539.35 s > Checking criterion v0.5.1
  742. 539.35 s > Checking dot-parser v0.5.1
  743. 539.35 s > Checking ref-ops v0.2.5
  744. 539.35 s > Checking num v0.4.3
  745. 539.35 s > Checking rand_xoshiro v0.6.0
  746. 539.35 s > Checking features v0.10.0
  747. 539.35 s > Checking constcat v0.5.1
  748. 539.35 s > Checking gat-lending-iterator v0.1.8
  749. 539.35 s > Checking colored v2.2.0
  750. 539.35 s > Checking cpufeatures v0.3.0
  751. 539.35 s > Checking constant_time_eq v0.4.2
  752. 539.35 s > Checking arrayref v0.3.9
  753. 539.35 s > Checking base64 v0.22.1
  754. 539.35 s > Checking joinery v2.1.0
  755. 539.35 s > Checking blake3 v1.8.5
  756. 539.35 s > Checking siphasher v1.0.2
  757. 539.35 s > Checking titlecase v2.2.1
  758. 539.35 s > Checking subprocess v0.2.15
  759. 539.35 s > Checking phf_shared v0.13.1
  760. 539.35 s > Checking rust_lisp v0.18.0
  761. 539.35 s > Compiling vakint v0.1.2 (/build/source/crates/vakint)
  762. 539.35 s > Checking version-compare v0.2.1
  763. 539.35 s > Checking phf v0.13.1
  764. 539.35 s > Checking xpct v0.5.1
  765. 539.35 s > Compiling rustpython-parser-core v0.4.0
  766. 539.35 s > Checking ryu v1.0.23
  767. 539.35 s > Checking castaway v0.2.4
  768. 539.35 s > Checking toml_datetime v0.7.5+spec-1.1.0
  769. 539.35 s > Checking strum v0.27.2
  770. 539.35 s > Compiling rustpython-ast v0.4.0
  771. 539.35 s > Checking compact_str v0.9.0
  772. 539.35 s > Checking unicode-truncate v2.0.1
  773. 539.35 s > Checking toml v0.8.23
  774. 539.35 s > Checking kasuari v0.4.12
  775. 539.35 s > Checking lru v0.16.4
  776. 539.35 s > Checking toml v0.9.12+spec-1.1.0
  777. 539.35 s > Checking vte v0.15.0
  778. 539.35 s > Checking string-template-plus v0.4.3
  779. 539.35 s > Checking portable-atomic v1.13.1
  780. 539.35 s > Checking ratatui-core v0.1.0
  781. 539.35 s > Checking unit-prefix v0.5.2
  782. 539.35 s > Checking rand_distr v0.4.3
  783. 539.35 s > Checking figment v0.10.19
  784. 539.35 s > Checking vt100 v0.16.2
  785. 539.35 s > Checking simba v0.6.0
  786. 539.35 s > Checking line-clipping v0.3.7
  787. 539.35 s > Compiling three-dimensional-reps v0.1.0 (/build/source/crates/three-dimensional-reps)
  788. 539.35 s > Checking gimli v0.32.3
  789. 539.35 s > Checking adler2 v2.0.1
  790. 539.35 s > Checking miniz_oxide v0.8.9
  791. 539.35 s > Checking thiserror v1.0.69
  792. 539.35 s > Checking derive_builder v0.11.2
  793. 539.35 s > Checking object v0.37.3
  794. 539.35 s > Checking crossterm v0.29.0
  795. 539.35 s > Checking ratatui-widgets v0.3.0
  796. 539.35 s > Checking owo-colors v4.3.0
  797. 539.35 s > Checking tracing-error v0.2.1
  798. 539.35 s > Checking indicatif v0.18.4
  799. 539.35 s > Checking typed-index-collections v3.5.0
  800. 539.35 s > Checking serde-big-array v0.5.1
  801. 539.35 s > Checking amd v0.2.2
  802. 539.35 s > Checking itertools v0.11.0
  803. 539.35 s > Compiling gammaloop-tracing-filter-macros v0.1.0 (/build/source/crates/gammaloop-tracing-filter-macros)
  804. 539.35 s > Checking rustc-demangle v0.1.27
  805. 539.35 s > Checking option-ext v0.2.0
  806. 539.35 s > Checking dirs-sys v0.5.0
  807. 539.35 s > Checking ref-cast v1.0.25
  808. 539.35 s > Checking env_logger v0.11.10
  809. 539.35 s > Checking ratatui-crossterm v0.1.0
  810. 539.35 s > Checking nix v0.31.2
  811. 539.35 s > Checking integer-sqrt v0.1.5
  812. 539.35 s > Checking brotli-decompressor v4.0.3
  813. 539.35 s > Checking crossbeam-channel v0.5.15
  814. 539.35 s > Checking itertools v0.12.1
  815. 539.35 s > Compiling gammalooprs v0.3.4 (/build/source/crates/gammalooprs)
  816. 539.35 s > Checking ratatui-macros v0.7.0
  817. 539.35 s > Checking unsafe-libyaml v0.2.11
  818. 539.35 s > Checking symlink v0.1.0
  819. 539.35 s > Checking ratatui v0.30.0
  820. 539.35 s > Checking color-spantrace v0.3.0
  821. 539.35 s > Checking ctrlc v3.5.2
  822. 539.35 s > Checking include_dir v0.7.4
  823. 539.35 s > Checking tracing-indicatif v0.3.14
  824. 539.35 s > Checking tracing-appender v0.2.5
  825. 539.35 s > Checking pathfinding v4.15.0
  826. 539.35 s > Checking dirs v6.0.0
  827. 539.35 s > Checking schemars v1.2.1
  828. 539.35 s > Checking slotmap v1.1.1
  829. 539.35 s > Checking brotli v7.0.0
  830. 539.35 s > Checking json5 v0.4.1
  831. 539.35 s > Checking serde_yaml v0.9.34+deprecated
  832. 539.35 s > Checking vectorize v0.2.0
  833. 539.35 s > Checking ringbuffer v0.16.0
  834. 539.35 s > Checking base62 v2.2.4
  835. 539.35 s > Checking rkyv v0.7.46
  836. 539.35 s > Checking clarabel v0.11.1
  837. 539.35 s > Checking rust-embed v8.11.0
  838. 539.35 s > Checking clap_complete v4.6.3
  839. 539.35 s > Checking fd-lock v4.0.4
  840. 539.35 s > Checking strip-ansi-escapes v0.2.1
  841. 539.35 s > Compiling gammaloop-api v0.1.0 (/build/source/crates/gammaloop-api)
  842. 539.35 s > Checking itertools v0.13.0
  843. 539.35 s > Checking strum v0.26.3
  844. 539.35 s > Checking sysinfo v0.33.1
  845. 539.35 s > Compiling numerica v2.2.0 (https://github.com/alphal00p/symbolica?rev=a277a8dadbaae5a8d6605f2f381991a601e1f345#a277a8da)
  846. 539.35 s > Checking addr2line v0.25.1
  847. 539.35 s > Checking clap_complete_nushell v4.6.0
  848. 539.35 s > Checking shlex v1.3.0
  849. 539.35 s > Checking slab v0.4.12
  850. 539.35 s > Checking futures-core v0.3.32
  851. 539.35 s > Checking futures-task v0.3.32
  852. 539.35 s > Checking sdd v3.0.10
  853. 539.35 s > Compiling gammaloop-integration-tests v0.1.0 (/build/source/tests)
  854. 539.35 s > Compiling test-log-core v0.2.20
  855. 539.35 s > Checking futures-util v0.3.32
  856. 539.35 s > Compiling rustc_version v0.4.1
  857. 539.35 s > Checking scc v2.4.0
  858. 539.35 s > Checking which v8.0.2
  859. 539.35 s > Compiling gungraun-macros v0.8.0
  860. 539.35 s > Checking reedline v0.42.0
  861. 539.35 s > Checking bincode v1.3.3
  862. 539.35 s > Checking backtrace v0.3.76
  863. 539.35 s > Compiling gungraun-runner v0.18.2
  864. 539.35 s > Checking color-eyre v0.6.5
  865. 539.35 s > Checking proc-macro2 v1.0.106
  866. 539.35 s > Checking nalgebra v0.29.0
  867. 539.35 s > Checking maplit v1.0.2
  868. 539.35 s > Checking base64 v0.21.7
  869. 539.35 s > Checking quote v1.0.45
  870. 539.35 s > Checking ron v0.8.1
  871. 539.35 s > Compiling iai-callgrind-runner v0.14.2
  872. 539.35 s > Checking kurbo v0.13.0
  873. 539.35 s > Checking wait-timeout v0.2.1
  874. 539.35 s > Checking bit-vec v0.8.0
  875. 539.35 s > Checking futures-executor v0.3.32
  876. 539.35 s > Checking quick-error v1.2.3
  877. 539.35 s > Compiling iai-callgrind v0.14.2
  878. 539.35 s > Checking rusty-fork v0.3.1
  879. 539.35 s > Checking serial_test v3.4.0
  880. 539.35 s > Checking bit-set v0.8.0
  881. 539.35 s > Checking syn v2.0.117
  882. 539.35 s > Compiling iai-callgrind-macros v0.5.1
  883. 539.35 s > Checking rand_xorshift v0.4.0
  884. 539.35 s > Checking console v0.15.11
  885. 539.35 s > Compiling test-log-macros v0.2.20
  886. 539.35 s > Checking unarray v0.1.4
  887. 539.35 s > Checking pathdiff v0.2.3
  888. 539.35 s > Checking proptest v1.11.0
  889. 539.35 s > Checking similar-asserts v1.7.0
  890. 539.35 s > Checking clinnet v0.1.8 (/build/source/crates/clinnet)
  891. 539.35 s > Checking kurvst v0.1.0 (/build/source/crates/kurvst)
  892. 539.35 s > Compiling graphica v2.1.0 (https://github.com/alphal00p/symbolica?rev=a277a8dadbaae5a8d6605f2f381991a601e1f345#a277a8da)
  893. 539.35 s > Checking test-log v0.2.20
  894. 539.35 s > Checking gungraun v0.18.2
  895. 539.35 s > Checking statrs v0.16.1
  896. 539.35 s > Checking momtrop v0.3.0
  897. 539.35 s > Compiling pyo3-stub-gen-derive v0.17.2
  898. 539.35 s > Compiling pyo3-macros v0.28.3
  899. 539.35 s > Checking pyo3-stub-gen v0.17.2
  900. 539.35 s > Checking symbolica-utils v0.1.0 (/build/source/crates/symbolica-utils)
  901. 539.35 s > Checking spenso-macros v0.3.2 (/build/source/crates/spenso-macros)
  902. 539.35 s > Compiling gammaloop-workspace-hack v0.1.0 (/build/source/crates/gammaloop-workspace-hack)
  903. 539.35 s > Checking linnet v0.17.0 (/build/source/crates/linnet)
  904. 539.35 s > Checking spenso v0.6.0 (/build/source/crates/spenso)
  905. 539.35 s > Checking linnet-py v0.1.0 (/build/source/crates/linnet-py)
  906. 539.35 s > Checking linnest v0.1.0 (/build/source/crates/linnest)
  907. 539.35 s > Checking idenso v0.3.0 (/build/source/crates/idenso)
  908. 539.35 s > Checking gammaloop-tracing-filter v0.1.0 (/build/source/crates/gammaloop-tracing-filter)
  909. 539.35 s > Checking spenso-hep-lib v0.1.7 (/build/source/crates/spenso-hep-lib)
  910. 539.35 s > Checking spynso3 v0.1.2 (/build/source/crates/spynso3)
  911. 539.35 s > error[E0560]: struct `CutInfo` has no field named `lmb_channel_id`
  912. 539.35 s > --> tests/tests/test_differential.rs:86:13
  913. 539.35 s > |
  914. 539.35 s > 86 | lmb_channel_id: None,
  915. 539.35 s > | ^^^^^^^^^^^^^^ `CutInfo` does not have this field
  916. 539.35 s > |
  917. 539.35 s > = note: available fields are: `sampling_channel_id`, `sampling_channel_edge_ids`
  918. 539.35 s >
  919. 539.35 s > error[E0560]: struct `CutInfo` has no field named `lmb_channel_edge_ids`
  920. 539.35 s > --> tests/tests/test_differential.rs:87:13
  921. 539.35 s > |
  922. 539.35 s > 87 | lmb_channel_edge_ids: None,
  923. 539.35 s > | ^^^^^^^^^^^^^^^^^^^^ `CutInfo` does not have this field
  924. 539.35 s > |
  925. 539.35 s > = note: available fields are: `sampling_channel_id`, `sampling_channel_edge_ids`
  926. 539.35 s >
  927. 539.35 s > error[E0063]: missing field `reference_moments` in initializer of `GraphEvaluationResult<_>`
  928. 539.35 s > --> tests/tests/test_differential.rs:532:19
  929. 539.35 s > |
  930. 539.35 s > 532 | let mut lhs = GraphEvaluationResult {
  931. 539.35 s > | ^^^^^^^^^^^^^^^^^^^^^ missing `reference_moments`
  932. 539.35 s >
  933. 539.35 s > error[E0063]: missing field `reference_moments` in initializer of `GraphEvaluationResult<_>`
  934. 539.35 s > --> tests/tests/test_differential.rs:539:15
  935. 539.35 s > |
  936. 539.35 s > 539 | let rhs = GraphEvaluationResult {
  937. 539.35 s > | ^^^^^^^^^^^^^^^^^^^^^ missing `reference_moments`
  938. 539.35 s >
  939. 539.35 s > Some errors have detailed explanations: E0063, E0560.
  940. 539.35 s > For more information about an error, try `rustc --explain E0063`.
  941. 539.35 s > error: could not compile `gammaloop-integration-tests` (test "test_differential") due to 4 previous errors
  942. 539.35 s > warning: build failed, waiting for other jobs to finish...
  943. 539.35 s > error[E0609]: no field `lmb_channel_id` on type `CutInfo`
  944. 539.35 s > --> tests/tests/test_runs/utils.rs:568:36
  945. 539.35 s > |
  946. 539.35 s > 568 | event.cut_info.lmb_channel_id,
  947. 539.35 s > | ^^^^^^^^^^^^^^ unknown field
  948. 539.35 s > |
  949. 539.35 s > = note: available fields are: `particle_pdgs`, `cut_id`, `graph_id`, `graph_group_id`, `orientation_id` ... and 2 others
  950. 539.35 s >
  951. 539.35 s > error[E0609]: no field `lmb_channel_id` on type `CutInfo`
  952. 539.35 s > --> tests/tests/test_runs/utils.rs:580:36
  953. 539.35 s > |
  954. 539.35 s > 580 | event.cut_info.lmb_channel_id,
  955. 539.35 s > | ^^^^^^^^^^^^^^ unknown field
  956. 539.35 s > |
  957. 539.35 s > = note: available fields are: `particle_pdgs`, `cut_id`, `graph_id`, `graph_group_id`, `orientation_id` ... and 2 others
  958. 539.35 s >
  959. 539.35 s > For more information about this error, try `rustc --explain E0609`.
  960. 539.35 s > error: could not compile `gammaloop-integration-tests` (test "test_runs") due to 2 previous errors
  961. 539.35 s For full logs, run:
  962. 539.35 s nix log /nix/store/8z7532y2mrxdvk4qgscgqrhdk179hn45-gammaloop-workspace-check-0.1.0.drv
  963. 539.38 s Build failed.