0.01 s
$ /nix/store/9ypz3flqsrl5xl495mm8h645gadjsxi1-coreutils-9.11/bin/timeout --kill-after=15s 7200s /nix/store/23zk8sgzamrbmj1fday15szf7f2279s8-nix-2.34.7/bin/nix --extra-experimental-features nix-command --extra-experimental-features flakes --log-format internal-json build --no-link --print-out-paths git+https://github.com/alphal00p/gammaloop?ref=advanced_sampling&rev=882f80eb025a2aa807219cff35cbd70349e28440&shallow=1#packages.x86_64-linux.crate-test-binaries-gammaloop-integration-tests --print-build-logs
10.23 s
12.34 s
Building /nix/store/44nbybdp83gdrw1ipz1r3ls09pr1b32a-gammaloop-crate-test-binaries-gammaloop-integration-tests-b8cda0d438c96d4f-inputs.drv
36.90 s
[gammaloop-crate-test-binaries-gammaloop-integration-tests-b8cda0d438c96d4f-inputs:post-build] Uploading to the NixCI cache: /nix/store/h781ax8lrlxrkl5z98111my201cmakhz-gammaloop-crate-test-binaries-gammaloop-integration-tests-b8cda0d438c96d4f-inputs
37.25 s
[gammaloop-crate-test-binaries-gammaloop-integration-tests-b8cda0d438c96d4f-inputs:post-build] warning: 'warn-short-path-literals' is deprecated, use 'lint-short-path-literals = ignore' instead
37.39 s
[gammaloop-crate-test-binaries-gammaloop-integration-tests-b8cda0d438c96d4f-inputs:post-build] copying 1 paths...
37.39 s
[gammaloop-crate-test-binaries-gammaloop-integration-tests-b8cda0d438c96d4f-inputs:post-build] copying path '/nix/store/h781ax8lrlxrkl5z98111my201cmakhz-gammaloop-crate-test-binaries-gammaloop-integration-tests-b8cda0d438c96d4f-inputs' to 'https://cache.nix-ci.com'...
217.13 s
[gammaloop-crate-test-binaries-gammaloop-integration-tests-b8cda0d438c96d4f-inputs:post-build] warning: 'warn-short-path-literals' is deprecated, use 'lint-short-path-literals = ignore' instead
217.50 s
[gammaloop-crate-test-binaries-gammaloop-integration-tests-b8cda0d438c96d4f-inputs:post-build] copying 1 paths...
217.50 s
[gammaloop-crate-test-binaries-gammaloop-integration-tests-b8cda0d438c96d4f-inputs:post-build] copying path '/nix/store/44nbybdp83gdrw1ipz1r3ls09pr1b32a-gammaloop-crate-test-binaries-gammaloop-integration-tests-b8cda0d438c96d4f-inputs.drv' to 'https://cache.nix-ci.com'...
218.02 s
Uploaded gammaloop-crate-test-binaries-gammaloop-integration-tests-b8cda0d438c96d4f-inputs in 3m01s
218.02 s
Progress: 1 of 4 built
218.02 s
Built gammaloop-crate-test-binaries-gammaloop-integration-tests-b8cda0d438c96d4f-inputs in 3m25s
218.22 s
Building /nix/store/v9fbvg5phx65q4bhq8lmx1ry55wprvwq-gammaloop-crate-test-binaries-gammaloop-integration-tests-b8cda0d438c96d4f-deps-0.1.0.drv
218.37 s
[gammaloop-crate-test-binaries-gammaloop-integration-tests-b8cda0d438c96d4f-deps] Phase: unpackPhase
218.39 s
[gammaloop-crate-test-binaries-gammaloop-integration-tests-b8cda0d438c96d4f-deps] unpacking source archive /nix/store/psvx16ar2vc9znc7wxbw3d2kjs3lpq85-source
219.69 s
[gammaloop-crate-test-binaries-gammaloop-integration-tests-b8cda0d438c96d4f-deps] source root is source
219.71 s
[gammaloop-crate-test-binaries-gammaloop-integration-tests-b8cda0d438c96d4f-deps] Phase: patchPhase
220.02 s
[gammaloop-crate-test-binaries-gammaloop-integration-tests-b8cda0d438c96d4f-deps] Executing configureCargoCommonVars
220.03 s
[gammaloop-crate-test-binaries-gammaloop-integration-tests-b8cda0d438c96d4f-deps] copying cargo artifacts from /nix/store/h781ax8lrlxrkl5z98111my201cmakhz-gammaloop-crate-test-binaries-gammaloop-integration-tests-b8cda0d438c96d4f-inputs/target to target
220.03 s
[gammaloop-crate-test-binaries-gammaloop-integration-tests-b8cda0d438c96d4f-deps] will deep copy artifacts (instead of symlinking) as requested
230.64 s
[gammaloop-crate-test-binaries-gammaloop-integration-tests-b8cda0d438c96d4f-deps] Phase: updateAutotoolsGnuConfigScriptsPhase
230.67 s
[gammaloop-crate-test-binaries-gammaloop-integration-tests-b8cda0d438c96d4f-deps] Phase: configurePhase
230.68 s
[gammaloop-crate-test-binaries-gammaloop-integration-tests-b8cda0d438c96d4f-deps] will append /build/source/.cargo-home/config.toml with contents of /nix/store/5drf77x6km4ky7gwlrzdx9bbd6fz09g3-vendor-cargo-deps/config.toml
230.68 s
[gammaloop-crate-test-binaries-gammaloop-integration-tests-b8cda0d438c96d4f-deps] default configurePhase, nothing to do
230.68 s
[gammaloop-crate-test-binaries-gammaloop-integration-tests-b8cda0d438c96d4f-deps] Phase: buildPhase
230.69 s
[gammaloop-crate-test-binaries-gammaloop-integration-tests-b8cda0d438c96d4f-deps] +++ command cargo --version
230.70 s
[gammaloop-crate-test-binaries-gammaloop-integration-tests-b8cda0d438c96d4f-deps] cargo 1.97.0 (c980f4866 2026-06-30)
230.70 s
[gammaloop-crate-test-binaries-gammaloop-integration-tests-b8cda0d438c96d4f-deps] +++ command cargo test --profile ci-optim --no-run --offline -p gammaloop-integration-tests
231.89 s
[gammaloop-crate-test-binaries-gammaloop-integration-tests-b8cda0d438c96d4f-deps] Compiling gammaloop-integration-tests v0.1.0 (/build/source/tests)
232.21 s
[gammaloop-crate-test-binaries-gammaloop-integration-tests-b8cda0d438c96d4f-deps] error[E0560] : struct `CutInfo` has no field named `lmb_channel_id`
232.21 s
[gammaloop-crate-test-binaries-gammaloop-integration-tests-b8cda0d438c96d4f-deps] --> tests/tests/test_differential.rs:86:13
232.21 s
[gammaloop-crate-test-binaries-gammaloop-integration-tests-b8cda0d438c96d4f-deps] |
232.21 s
[gammaloop-crate-test-binaries-gammaloop-integration-tests-b8cda0d438c96d4f-deps] 86 | lmb_channel_id: None,
232.21 s
[gammaloop-crate-test-binaries-gammaloop-integration-tests-b8cda0d438c96d4f-deps] | ^^^^^^^^^^^^^^ `CutInfo` does not have this field
232.21 s
[gammaloop-crate-test-binaries-gammaloop-integration-tests-b8cda0d438c96d4f-deps] |
232.21 s
[gammaloop-crate-test-binaries-gammaloop-integration-tests-b8cda0d438c96d4f-deps] = note : available fields are: `sampling_channel_id`, `sampling_channel_edge_ids`
232.21 s
[gammaloop-crate-test-binaries-gammaloop-integration-tests-b8cda0d438c96d4f-deps]
232.23 s
[gammaloop-crate-test-binaries-gammaloop-integration-tests-b8cda0d438c96d4f-deps] error[E0560] : struct `CutInfo` has no field named `lmb_channel_edge_ids`
232.23 s
[gammaloop-crate-test-binaries-gammaloop-integration-tests-b8cda0d438c96d4f-deps] --> tests/tests/test_differential.rs:87:13
232.23 s
[gammaloop-crate-test-binaries-gammaloop-integration-tests-b8cda0d438c96d4f-deps] |
232.23 s
[gammaloop-crate-test-binaries-gammaloop-integration-tests-b8cda0d438c96d4f-deps] 87 | lmb_channel_edge_ids: None,
232.23 s
[gammaloop-crate-test-binaries-gammaloop-integration-tests-b8cda0d438c96d4f-deps] | ^^^^^^^^^^^^^^^^^^^^ `CutInfo` does not have this field
232.23 s
[gammaloop-crate-test-binaries-gammaloop-integration-tests-b8cda0d438c96d4f-deps] |
232.23 s
[gammaloop-crate-test-binaries-gammaloop-integration-tests-b8cda0d438c96d4f-deps] = note : available fields are: `sampling_channel_id`, `sampling_channel_edge_ids`
232.23 s
[gammaloop-crate-test-binaries-gammaloop-integration-tests-b8cda0d438c96d4f-deps]
232.27 s
[gammaloop-crate-test-binaries-gammaloop-integration-tests-b8cda0d438c96d4f-deps] error[E0063] : missing field `reference_moments` in initializer of `GraphEvaluationResult<_>`
232.27 s
[gammaloop-crate-test-binaries-gammaloop-integration-tests-b8cda0d438c96d4f-deps] --> tests/tests/test_differential.rs:532:19
232.27 s
[gammaloop-crate-test-binaries-gammaloop-integration-tests-b8cda0d438c96d4f-deps] |
232.27 s
[gammaloop-crate-test-binaries-gammaloop-integration-tests-b8cda0d438c96d4f-deps] 532 | let mut lhs = GraphEvaluationResult {
232.27 s
[gammaloop-crate-test-binaries-gammaloop-integration-tests-b8cda0d438c96d4f-deps] | ^^^^^^^^^^^^^^^^^^^^^ missing `reference_moments`
232.27 s
[gammaloop-crate-test-binaries-gammaloop-integration-tests-b8cda0d438c96d4f-deps]
232.27 s
[gammaloop-crate-test-binaries-gammaloop-integration-tests-b8cda0d438c96d4f-deps] error[E0063] : missing field `reference_moments` in initializer of `GraphEvaluationResult<_>`
232.27 s
[gammaloop-crate-test-binaries-gammaloop-integration-tests-b8cda0d438c96d4f-deps] --> tests/tests/test_differential.rs:539:15
232.27 s
[gammaloop-crate-test-binaries-gammaloop-integration-tests-b8cda0d438c96d4f-deps] |
232.27 s
[gammaloop-crate-test-binaries-gammaloop-integration-tests-b8cda0d438c96d4f-deps] 539 | let rhs = GraphEvaluationResult {
232.27 s
[gammaloop-crate-test-binaries-gammaloop-integration-tests-b8cda0d438c96d4f-deps] | ^^^^^^^^^^^^^^^^^^^^^ missing `reference_moments`
232.27 s
[gammaloop-crate-test-binaries-gammaloop-integration-tests-b8cda0d438c96d4f-deps]
232.48 s
[gammaloop-crate-test-binaries-gammaloop-integration-tests-b8cda0d438c96d4f-deps] Some errors have detailed explanations: E0063, E0560.
232.48 s
[gammaloop-crate-test-binaries-gammaloop-integration-tests-b8cda0d438c96d4f-deps] For more information about an error, try `rustc --explain E0063`.
232.49 s
[gammaloop-crate-test-binaries-gammaloop-integration-tests-b8cda0d438c96d4f-deps] error : could not compile `gammaloop-integration-tests` (test "test_differential") due to 4 previous errors
232.50 s
[gammaloop-crate-test-binaries-gammaloop-integration-tests-b8cda0d438c96d4f-deps] warning : build failed, waiting for other jobs to finish...
233.80 s
[gammaloop-crate-test-binaries-gammaloop-integration-tests-b8cda0d438c96d4f-deps] error[E0609] : no field `lmb_channel_id` on type `CutInfo`
233.80 s
[gammaloop-crate-test-binaries-gammaloop-integration-tests-b8cda0d438c96d4f-deps] --> tests/tests/test_runs/utils.rs:568:36
233.80 s
[gammaloop-crate-test-binaries-gammaloop-integration-tests-b8cda0d438c96d4f-deps] |
233.80 s
[gammaloop-crate-test-binaries-gammaloop-integration-tests-b8cda0d438c96d4f-deps] 568 | event.cut_info.lmb_channel_id,
233.80 s
[gammaloop-crate-test-binaries-gammaloop-integration-tests-b8cda0d438c96d4f-deps] | ^^^^^^^^^^^^^^ unknown field
233.80 s
[gammaloop-crate-test-binaries-gammaloop-integration-tests-b8cda0d438c96d4f-deps] |
233.80 s
[gammaloop-crate-test-binaries-gammaloop-integration-tests-b8cda0d438c96d4f-deps] = note : available fields are: `particle_pdgs`, `cut_id`, `graph_id`, `graph_group_id`, `orientation_id` ... and 2 others
233.80 s
[gammaloop-crate-test-binaries-gammaloop-integration-tests-b8cda0d438c96d4f-deps]
233.80 s
[gammaloop-crate-test-binaries-gammaloop-integration-tests-b8cda0d438c96d4f-deps] error[E0609] : no field `lmb_channel_id` on type `CutInfo`
233.80 s
[gammaloop-crate-test-binaries-gammaloop-integration-tests-b8cda0d438c96d4f-deps] --> tests/tests/test_runs/utils.rs:580:36
233.80 s
[gammaloop-crate-test-binaries-gammaloop-integration-tests-b8cda0d438c96d4f-deps] |
233.80 s
[gammaloop-crate-test-binaries-gammaloop-integration-tests-b8cda0d438c96d4f-deps] 580 | event.cut_info.lmb_channel_id,
233.80 s
[gammaloop-crate-test-binaries-gammaloop-integration-tests-b8cda0d438c96d4f-deps] | ^^^^^^^^^^^^^^ unknown field
233.80 s
[gammaloop-crate-test-binaries-gammaloop-integration-tests-b8cda0d438c96d4f-deps] |
233.80 s
[gammaloop-crate-test-binaries-gammaloop-integration-tests-b8cda0d438c96d4f-deps] = note : available fields are: `particle_pdgs`, `cut_id`, `graph_id`, `graph_group_id`, `orientation_id` ... and 2 others
233.80 s
[gammaloop-crate-test-binaries-gammaloop-integration-tests-b8cda0d438c96d4f-deps]
234.50 s
[gammaloop-crate-test-binaries-gammaloop-integration-tests-b8cda0d438c96d4f-deps] For more information about this error, try `rustc --explain E0609`.
234.52 s
[gammaloop-crate-test-binaries-gammaloop-integration-tests-b8cda0d438c96d4f-deps] error : could not compile `gammaloop-integration-tests` (test "test_runs") due to 2 previous errors
360.81 s
Progress: 1 of 3 built (1 failed)
360.81 s
Failed to build gammaloop-crate-test-binaries-gammaloop-integration-tests-b8cda0d438c96d4f-deps after 2m22s
360.81 s
error: Cannot build '/nix/store/v9fbvg5phx65q4bhq8lmx1ry55wprvwq-gammaloop-crate-test-binaries-gammaloop-integration-tests-b8cda0d438c96d4f-deps-0.1.0.drv '.
360.81 s
Reason: builder failed with exit code 101 .
360.81 s
Output paths:
360.81 s
/nix/store/b1q2fmylzf4462mgj0dkx0lrx8mwckbw-gammaloop-crate-test-binaries-gammaloop-integration-tests-b8cda0d438c96d4f-deps-0.1.0
360.81 s
Last 66 log lines:
360.81 s
> Running phase: unpackPhase
360.81 s
> unpacking source archive /nix/store/psvx16ar2vc9znc7wxbw3d2kjs3lpq85-source
360.81 s
> source root is source
360.81 s
> Running phase: patchPhase
360.81 s
> Executing configureCargoCommonVars
360.81 s
> copying cargo artifacts from /nix/store/h781ax8lrlxrkl5z98111my201cmakhz-gammaloop-crate-test-binaries-gammaloop-integration-tests-b8cda0d438c96d4f-inputs/target to target
360.81 s
> will deep copy artifacts (instead of symlinking) as requested
360.81 s
> Running phase: updateAutotoolsGnuConfigScriptsPhase
360.81 s
> Running phase: configurePhase
360.81 s
> will append /build/source/.cargo-home/config.toml with contents of /nix/store/5drf77x6km4ky7gwlrzdx9bbd6fz09g3-vendor-cargo-deps/config.toml
360.81 s
> default configurePhase, nothing to do
360.81 s
> Running phase: buildPhase
360.81 s
> +++ command cargo --version
360.81 s
> cargo 1.97.0 (c980f4866 2026-06-30)
360.81 s
> +++ command cargo test --profile ci-optim --no-run --offline -p gammaloop-integration-tests
360.81 s
> Compiling gammaloop-integration-tests v0.1.0 (/build/source/tests)
360.81 s
> error[E0560] : struct `CutInfo` has no field named `lmb_channel_id`
360.81 s
> --> tests/tests/test_differential.rs:86:13
360.81 s
> |
360.81 s
> 86 | lmb_channel_id: None,
360.81 s
> | ^^^^^^^^^^^^^^ `CutInfo` does not have this field
360.81 s
> |
360.81 s
> = note : available fields are: `sampling_channel_id`, `sampling_channel_edge_ids`
360.81 s
>
360.81 s
> error[E0560] : struct `CutInfo` has no field named `lmb_channel_edge_ids`
360.81 s
> --> tests/tests/test_differential.rs:87:13
360.81 s
> |
360.81 s
> 87 | lmb_channel_edge_ids: None,
360.81 s
> | ^^^^^^^^^^^^^^^^^^^^ `CutInfo` does not have this field
360.81 s
> |
360.81 s
> = note : available fields are: `sampling_channel_id`, `sampling_channel_edge_ids`
360.81 s
>
360.81 s
> error[E0063] : missing field `reference_moments` in initializer of `GraphEvaluationResult<_>`
360.81 s
> --> tests/tests/test_differential.rs:532:19
360.81 s
> |
360.81 s
> 532 | let mut lhs = GraphEvaluationResult {
360.81 s
> | ^^^^^^^^^^^^^^^^^^^^^ missing `reference_moments`
360.81 s
>
360.81 s
> error[E0063] : missing field `reference_moments` in initializer of `GraphEvaluationResult<_>`
360.81 s
> --> tests/tests/test_differential.rs:539:15
360.81 s
> |
360.81 s
> 539 | let rhs = GraphEvaluationResult {
360.81 s
> | ^^^^^^^^^^^^^^^^^^^^^ missing `reference_moments`
360.81 s
>
360.81 s
> Some errors have detailed explanations: E0063, E0560.
360.81 s
> For more information about an error, try `rustc --explain E0063`.
360.81 s
> error : could not compile `gammaloop-integration-tests` (test "test_differential") due to 4 previous errors
360.81 s
> warning : build failed, waiting for other jobs to finish...
360.81 s
> error[E0609] : no field `lmb_channel_id` on type `CutInfo`
360.81 s
> --> tests/tests/test_runs/utils.rs:568:36
360.81 s
> |
360.81 s
> 568 | event.cut_info.lmb_channel_id,
360.81 s
> | ^^^^^^^^^^^^^^ unknown field
360.81 s
> |
360.81 s
> = note : available fields are: `particle_pdgs`, `cut_id`, `graph_id`, `graph_group_id`, `orientation_id` ... and 2 others
360.81 s
>
360.81 s
> error[E0609] : no field `lmb_channel_id` on type `CutInfo`
360.81 s
> --> tests/tests/test_runs/utils.rs:580:36
360.81 s
> |
360.81 s
> 580 | event.cut_info.lmb_channel_id,
360.81 s
> | ^^^^^^^^^^^^^^ unknown field
360.81 s
> |
360.81 s
> = note : available fields are: `particle_pdgs`, `cut_id`, `graph_id`, `graph_group_id`, `orientation_id` ... and 2 others
360.81 s
>
360.81 s
> For more information about this error, try `rustc --explain E0609`.
360.81 s
> error : could not compile `gammaloop-integration-tests` (test "test_runs") due to 2 previous errors
360.81 s
For full logs, run:
360.81 s
nix log /nix/store/v9fbvg5phx65q4bhq8lmx1ry55wprvwq-gammaloop-crate-test-binaries-gammaloop-integration-tests-b8cda0d438c96d4f-deps-0.1.0.drv
360.81 s
error: Cannot build '/nix/store/c6zrwslkp5lhq3ydjwrggl8i8r0jnzfm-nix-ci-artifact-barrier-crate-test-binaries-gammaloop-integration-tests.drv '.
360.81 s
Reason: 1 dependency failed .
360.81 s
Output paths:
360.81 s
/nix/store/9aycp10dl431wml081vyh6pl5lcqhs1z-nix-ci-artifact-barrier-crate-test-binaries-gammaloop-integration-tests
360.82 s
Build failed due to failed dependency
360.93 s
Build failed.