build packages.x86_64-linux.crate-test-binaries-python-api-gammaloop-integration-tests

Reproduce this run
Retry Run
  1. 0.00 s $ /nix/store/9ypz3flqsrl5xl495mm8h645gadjsxi1-coreutils-9.11/bin/timeout --kill-after=15s 7200s /nix/store/23zk8sgzamrbmj1fday15szf7f2279s8-nix-2.34.7/bin/nix --extra-experimental-features nix-command --extra-experimental-features flakes --log-format internal-json build --no-link --print-out-paths git+https://github.com/alphal00p/gammaloop?ref=advanced_sampling&rev=ad713af8ba0173320df0aef4e53935ec4cf8a238&shallow=1#packages.x86_64-linux.crate-test-binaries-python-api-gammaloop-integration-tests --print-build-logs
  2. 7.68 s
  3. 8.72 s Building /nix/store/25cw93xc9r5ymlp634wywx92mcvp6416-gammaloop-ci-test-binary-dependencies-d6e55b48f8214f9c-gammaloop-integration-tests-dev-dependency.toml.drv
  4. 8.83 s Building /nix/store/4k2a4lcrq95acbxk958qnbv21yrrxd9r-gammaloop-crate-test-binaries-gammaloop-integration-tests-d6e55b48f8214f9c-inputs.drv
  5. 8.85 s [gammaloop-ci-test-binary-dependencies-d6e55b48f8214f9c-gammaloop-integration-tests-dev-dependency.toml:post-build] Uploading to the NixCI cache: /nix/store/lfx53ya8cr1igbixws20ksh85z7d7in6-gammaloop-ci-test-binary-dependencies-d6e55b48f8214f9c-gammaloop-integration-tests-dev-dependency.toml
  6. 8.89 s [gammaloop-ci-test-binary-dependencies-d6e55b48f8214f9c-gammaloop-integration-tests-dev-dependency.toml:post-build] warning: 'warn-short-path-literals' is deprecated, use 'lint-short-path-literals = ignore' instead
  7. 9.01 s [gammaloop-ci-test-binary-dependencies-d6e55b48f8214f9c-gammaloop-integration-tests-dev-dependency.toml:post-build] copying 0 paths...
  8. 9.06 s [gammaloop-ci-test-binary-dependencies-d6e55b48f8214f9c-gammaloop-integration-tests-dev-dependency.toml:post-build] warning: 'warn-short-path-literals' is deprecated, use 'lint-short-path-literals = ignore' instead
  9. 9.20 s [gammaloop-ci-test-binary-dependencies-d6e55b48f8214f9c-gammaloop-integration-tests-dev-dependency.toml:post-build] copying 0 paths...
  10. 9.22 s Uploaded gammaloop-ci-test-binary-dependencies-d6e55b48f8214f9c-gammaloop-integration-tests-dev-dependency.toml in 378ms
  11. 9.22 s Progress: 1 of 5 built (1 building)
  12. 9.22 s Built gammaloop-ci-test-binary-dependencies-d6e55b48f8214f9c-gammaloop-integration-tests-dev-dependency.toml in 491ms
  13. 17.24 s [gammaloop-crate-test-binaries-gammaloop-integration-tests-d6e55b48f8214f9c-inputs:post-build] Uploading to the NixCI cache: /nix/store/mfb414248p3fii27bb1l8z3309p80la0-gammaloop-crate-test-binaries-gammaloop-integration-tests-d6e55b48f8214f9c-inputs
  14. 17.28 s [gammaloop-crate-test-binaries-gammaloop-integration-tests-d6e55b48f8214f9c-inputs:post-build] warning: 'warn-short-path-literals' is deprecated, use 'lint-short-path-literals = ignore' instead
  15. 17.32 s [gammaloop-crate-test-binaries-gammaloop-integration-tests-d6e55b48f8214f9c-inputs:post-build] copying 1 paths...
  16. 17.32 s [gammaloop-crate-test-binaries-gammaloop-integration-tests-d6e55b48f8214f9c-inputs:post-build] copying path '/nix/store/mfb414248p3fii27bb1l8z3309p80la0-gammaloop-crate-test-binaries-gammaloop-integration-tests-d6e55b48f8214f9c-inputs' to 'https://cache.nix-ci.com'...
  17. 98.47 s [gammaloop-crate-test-binaries-gammaloop-integration-tests-d6e55b48f8214f9c-inputs:post-build] warning: 'warn-short-path-literals' is deprecated, use 'lint-short-path-literals = ignore' instead
  18. 98.80 s [gammaloop-crate-test-binaries-gammaloop-integration-tests-d6e55b48f8214f9c-inputs:post-build] copying 1 paths...
  19. 98.80 s [gammaloop-crate-test-binaries-gammaloop-integration-tests-d6e55b48f8214f9c-inputs:post-build] copying path '/nix/store/4k2a4lcrq95acbxk958qnbv21yrrxd9r-gammaloop-crate-test-binaries-gammaloop-integration-tests-d6e55b48f8214f9c-inputs.drv' to 'https://cache.nix-ci.com'...
  20. 99.05 s Uploaded gammaloop-crate-test-binaries-gammaloop-integration-tests-d6e55b48f8214f9c-inputs in 1m21s
  21. 99.05 s Progress: 2 of 5 built
  22. 99.05 s Built gammaloop-crate-test-binaries-gammaloop-integration-tests-d6e55b48f8214f9c-inputs in 1m30s
  23. 99.11 s Building /nix/store/y9lln3gy6zafqrqybglp5alj2wykf6r9-gammaloop-crate-test-binaries-gammaloop-integration-tests-d6e55b48f8214f9c-deps-0.1.0.drv
  24. 99.17 s [gammaloop-crate-test-binaries-gammaloop-integration-tests-d6e55b48f8214f9c-deps] Phase: unpackPhase
  25. 99.18 s [gammaloop-crate-test-binaries-gammaloop-integration-tests-d6e55b48f8214f9c-deps] unpacking source archive /nix/store/a2mf5ss32qm0vv8qxhcf041bxajmsxnq-source
  26. 99.23 s [gammaloop-crate-test-binaries-gammaloop-integration-tests-d6e55b48f8214f9c-deps] source root is source
  27. 99.24 s [gammaloop-crate-test-binaries-gammaloop-integration-tests-d6e55b48f8214f9c-deps] Phase: patchPhase
  28. 99.31 s [gammaloop-crate-test-binaries-gammaloop-integration-tests-d6e55b48f8214f9c-deps] Executing configureCargoCommonVars
  29. 99.32 s [gammaloop-crate-test-binaries-gammaloop-integration-tests-d6e55b48f8214f9c-deps] copying cargo artifacts from /nix/store/mfb414248p3fii27bb1l8z3309p80la0-gammaloop-crate-test-binaries-gammaloop-integration-tests-d6e55b48f8214f9c-inputs/target to target
  30. 99.32 s [gammaloop-crate-test-binaries-gammaloop-integration-tests-d6e55b48f8214f9c-deps] will deep copy artifacts (instead of symlinking) as requested
  31. 100.51 s [gammaloop-crate-test-binaries-gammaloop-integration-tests-d6e55b48f8214f9c-deps] Phase: updateAutotoolsGnuConfigScriptsPhase
  32. 100.54 s [gammaloop-crate-test-binaries-gammaloop-integration-tests-d6e55b48f8214f9c-deps] Phase: configurePhase
  33. 100.55 s [gammaloop-crate-test-binaries-gammaloop-integration-tests-d6e55b48f8214f9c-deps] will append /build/source/.cargo-home/config.toml with contents of /nix/store/5drf77x6km4ky7gwlrzdx9bbd6fz09g3-vendor-cargo-deps/config.toml
  34. 100.55 s [gammaloop-crate-test-binaries-gammaloop-integration-tests-d6e55b48f8214f9c-deps] default configurePhase, nothing to do
  35. 100.55 s [gammaloop-crate-test-binaries-gammaloop-integration-tests-d6e55b48f8214f9c-deps] Phase: buildPhase
  36. 100.55 s [gammaloop-crate-test-binaries-gammaloop-integration-tests-d6e55b48f8214f9c-deps] +++ command cargo --version
  37. 100.56 s [gammaloop-crate-test-binaries-gammaloop-integration-tests-d6e55b48f8214f9c-deps] cargo 1.97.0 (c980f4866 2026-06-30)
  38. 100.56 s [gammaloop-crate-test-binaries-gammaloop-integration-tests-d6e55b48f8214f9c-deps] +++ command cargo test --profile ci-optim --no-run --offline -p gammaloop-integration-tests --features gammaloop-integration-tests/python-api-tests
  39. 100.89 s [gammaloop-crate-test-binaries-gammaloop-integration-tests-d6e55b48f8214f9c-deps] Compiling gammaloop-integration-tests v0.1.0 (/build/source/tests)
  40. 100.99 s [gammaloop-crate-test-binaries-gammaloop-integration-tests-d6e55b48f8214f9c-deps] error[E0560]: struct `CutInfo` has no field named `lmb_channel_id`
  41. 100.99 s [gammaloop-crate-test-binaries-gammaloop-integration-tests-d6e55b48f8214f9c-deps] --> tests/tests/test_differential.rs:86:13
  42. 100.99 s [gammaloop-crate-test-binaries-gammaloop-integration-tests-d6e55b48f8214f9c-deps] |
  43. 100.99 s [gammaloop-crate-test-binaries-gammaloop-integration-tests-d6e55b48f8214f9c-deps] 86 | lmb_channel_id: None,
  44. 100.99 s [gammaloop-crate-test-binaries-gammaloop-integration-tests-d6e55b48f8214f9c-deps] | ^^^^^^^^^^^^^^ `CutInfo` does not have this field
  45. 100.99 s [gammaloop-crate-test-binaries-gammaloop-integration-tests-d6e55b48f8214f9c-deps] |
  46. 100.99 s [gammaloop-crate-test-binaries-gammaloop-integration-tests-d6e55b48f8214f9c-deps] = note: available fields are: `sampling_channel_id`, `sampling_channel_edge_ids`
  47. 100.99 s [gammaloop-crate-test-binaries-gammaloop-integration-tests-d6e55b48f8214f9c-deps]
  48. 100.99 s [gammaloop-crate-test-binaries-gammaloop-integration-tests-d6e55b48f8214f9c-deps] error[E0560]: struct `CutInfo` has no field named `lmb_channel_edge_ids`
  49. 100.99 s [gammaloop-crate-test-binaries-gammaloop-integration-tests-d6e55b48f8214f9c-deps] --> tests/tests/test_differential.rs:87:13
  50. 100.99 s [gammaloop-crate-test-binaries-gammaloop-integration-tests-d6e55b48f8214f9c-deps] |
  51. 100.99 s [gammaloop-crate-test-binaries-gammaloop-integration-tests-d6e55b48f8214f9c-deps] 87 | lmb_channel_edge_ids: None,
  52. 100.99 s [gammaloop-crate-test-binaries-gammaloop-integration-tests-d6e55b48f8214f9c-deps] | ^^^^^^^^^^^^^^^^^^^^ `CutInfo` does not have this field
  53. 100.99 s [gammaloop-crate-test-binaries-gammaloop-integration-tests-d6e55b48f8214f9c-deps] |
  54. 100.99 s [gammaloop-crate-test-binaries-gammaloop-integration-tests-d6e55b48f8214f9c-deps] = note: available fields are: `sampling_channel_id`, `sampling_channel_edge_ids`
  55. 100.99 s [gammaloop-crate-test-binaries-gammaloop-integration-tests-d6e55b48f8214f9c-deps]
  56. 101.00 s [gammaloop-crate-test-binaries-gammaloop-integration-tests-d6e55b48f8214f9c-deps] error[E0063]: missing field `reference_moments` in initializer of `GraphEvaluationResult<_>`
  57. 101.00 s [gammaloop-crate-test-binaries-gammaloop-integration-tests-d6e55b48f8214f9c-deps] --> tests/tests/test_differential.rs:532:19
  58. 101.00 s [gammaloop-crate-test-binaries-gammaloop-integration-tests-d6e55b48f8214f9c-deps] |
  59. 101.00 s [gammaloop-crate-test-binaries-gammaloop-integration-tests-d6e55b48f8214f9c-deps] 532 | let mut lhs = GraphEvaluationResult {
  60. 101.00 s [gammaloop-crate-test-binaries-gammaloop-integration-tests-d6e55b48f8214f9c-deps] | ^^^^^^^^^^^^^^^^^^^^^ missing `reference_moments`
  61. 101.00 s [gammaloop-crate-test-binaries-gammaloop-integration-tests-d6e55b48f8214f9c-deps]
  62. 101.00 s [gammaloop-crate-test-binaries-gammaloop-integration-tests-d6e55b48f8214f9c-deps] error[E0063]: missing field `reference_moments` in initializer of `GraphEvaluationResult<_>`
  63. 101.00 s [gammaloop-crate-test-binaries-gammaloop-integration-tests-d6e55b48f8214f9c-deps] --> tests/tests/test_differential.rs:539:15
  64. 101.00 s [gammaloop-crate-test-binaries-gammaloop-integration-tests-d6e55b48f8214f9c-deps] |
  65. 101.00 s [gammaloop-crate-test-binaries-gammaloop-integration-tests-d6e55b48f8214f9c-deps] 539 | let rhs = GraphEvaluationResult {
  66. 101.00 s [gammaloop-crate-test-binaries-gammaloop-integration-tests-d6e55b48f8214f9c-deps] | ^^^^^^^^^^^^^^^^^^^^^ missing `reference_moments`
  67. 101.00 s [gammaloop-crate-test-binaries-gammaloop-integration-tests-d6e55b48f8214f9c-deps]
  68. 101.05 s [gammaloop-crate-test-binaries-gammaloop-integration-tests-d6e55b48f8214f9c-deps] Some errors have detailed explanations: E0063, E0560.
  69. 101.05 s [gammaloop-crate-test-binaries-gammaloop-integration-tests-d6e55b48f8214f9c-deps] For more information about an error, try `rustc --explain E0063`.
  70. 101.05 s [gammaloop-crate-test-binaries-gammaloop-integration-tests-d6e55b48f8214f9c-deps] error[E0609]: no field `lmb_channel_edge_ids` on type `CutInfo`
  71. 101.05 s [gammaloop-crate-test-binaries-gammaloop-integration-tests-d6e55b48f8214f9c-deps] --> tests/tests/test_evaluation_api.rs:311:10
  72. 101.05 s [gammaloop-crate-test-binaries-gammaloop-integration-tests-d6e55b48f8214f9c-deps] |
  73. 101.05 s [gammaloop-crate-test-binaries-gammaloop-integration-tests-d6e55b48f8214f9c-deps] 311 | .lmb_channel_edge_ids
  74. 101.05 s [gammaloop-crate-test-binaries-gammaloop-integration-tests-d6e55b48f8214f9c-deps] | ^^^^^^^^^^^^^^^^^^^^ unknown field
  75. 101.05 s [gammaloop-crate-test-binaries-gammaloop-integration-tests-d6e55b48f8214f9c-deps] |
  76. 101.05 s [gammaloop-crate-test-binaries-gammaloop-integration-tests-d6e55b48f8214f9c-deps] = note: available fields are: `particle_pdgs`, `cut_id`, `graph_id`, `graph_group_id`, `orientation_id` ... and 2 others
  77. 101.05 s [gammaloop-crate-test-binaries-gammaloop-integration-tests-d6e55b48f8214f9c-deps]
  78. 101.05 s [gammaloop-crate-test-binaries-gammaloop-integration-tests-d6e55b48f8214f9c-deps] error: could not compile `gammaloop-integration-tests` (test "test_differential") due to 4 previous errors
  79. 101.06 s [gammaloop-crate-test-binaries-gammaloop-integration-tests-d6e55b48f8214f9c-deps] warning: build failed, waiting for other jobs to finish...
  80. 101.08 s [gammaloop-crate-test-binaries-gammaloop-integration-tests-d6e55b48f8214f9c-deps] error[E0609]: no field `lmb_channel_edge_ids` on type `CutInfo`
  81. 101.08 s [gammaloop-crate-test-binaries-gammaloop-integration-tests-d6e55b48f8214f9c-deps] --> tests/tests/test_evaluation_api.rs:591:26
  82. 101.08 s [gammaloop-crate-test-binaries-gammaloop-integration-tests-d6e55b48f8214f9c-deps] |
  83. 101.08 s [gammaloop-crate-test-binaries-gammaloop-integration-tests-d6e55b48f8214f9c-deps] 591 | .lmb_channel_edge_ids
  84. 101.08 s [gammaloop-crate-test-binaries-gammaloop-integration-tests-d6e55b48f8214f9c-deps] | ^^^^^^^^^^^^^^^^^^^^ unknown field
  85. 101.08 s [gammaloop-crate-test-binaries-gammaloop-integration-tests-d6e55b48f8214f9c-deps] |
  86. 101.08 s [gammaloop-crate-test-binaries-gammaloop-integration-tests-d6e55b48f8214f9c-deps] = note: available fields are: `particle_pdgs`, `cut_id`, `graph_id`, `graph_group_id`, `orientation_id` ... and 2 others
  87. 101.08 s [gammaloop-crate-test-binaries-gammaloop-integration-tests-d6e55b48f8214f9c-deps]
  88. 101.11 s [gammaloop-crate-test-binaries-gammaloop-integration-tests-d6e55b48f8214f9c-deps] error[E0609]: no field `lmb_channel_edge_ids` on type `CutInfo`
  89. 101.11 s [gammaloop-crate-test-binaries-gammaloop-integration-tests-d6e55b48f8214f9c-deps] --> tests/tests/test_evaluation_api.rs:1177:18
  90. 101.11 s [gammaloop-crate-test-binaries-gammaloop-integration-tests-d6e55b48f8214f9c-deps] |
  91. 101.11 s [gammaloop-crate-test-binaries-gammaloop-integration-tests-d6e55b48f8214f9c-deps] 1177 | .lmb_channel_edge_ids
  92. 101.11 s [gammaloop-crate-test-binaries-gammaloop-integration-tests-d6e55b48f8214f9c-deps] | ^^^^^^^^^^^^^^^^^^^^ unknown field
  93. 101.11 s [gammaloop-crate-test-binaries-gammaloop-integration-tests-d6e55b48f8214f9c-deps] |
  94. 101.11 s [gammaloop-crate-test-binaries-gammaloop-integration-tests-d6e55b48f8214f9c-deps] = note: available fields are: `particle_pdgs`, `cut_id`, `graph_id`, `graph_group_id`, `orientation_id` ... and 2 others
  95. 101.11 s [gammaloop-crate-test-binaries-gammaloop-integration-tests-d6e55b48f8214f9c-deps]
  96. 101.18 s [gammaloop-crate-test-binaries-gammaloop-integration-tests-d6e55b48f8214f9c-deps] error[E0609]: no field `lmb_channel_edge_ids` on type `CutInfo`
  97. 101.18 s [gammaloop-crate-test-binaries-gammaloop-integration-tests-d6e55b48f8214f9c-deps] --> tests/tests/test_evaluation_api.rs:1222:22
  98. 101.18 s [gammaloop-crate-test-binaries-gammaloop-integration-tests-d6e55b48f8214f9c-deps] |
  99. 101.18 s [gammaloop-crate-test-binaries-gammaloop-integration-tests-d6e55b48f8214f9c-deps] 1222 | .lmb_channel_edge_ids
  100. 101.18 s [gammaloop-crate-test-binaries-gammaloop-integration-tests-d6e55b48f8214f9c-deps] | ^^^^^^^^^^^^^^^^^^^^ unknown field
  101. 101.18 s [gammaloop-crate-test-binaries-gammaloop-integration-tests-d6e55b48f8214f9c-deps] |
  102. 101.18 s [gammaloop-crate-test-binaries-gammaloop-integration-tests-d6e55b48f8214f9c-deps] = note: available fields are: `particle_pdgs`, `cut_id`, `graph_id`, `graph_group_id`, `orientation_id` ... and 2 others
  103. 101.18 s [gammaloop-crate-test-binaries-gammaloop-integration-tests-d6e55b48f8214f9c-deps]
  104. 101.18 s [gammaloop-crate-test-binaries-gammaloop-integration-tests-d6e55b48f8214f9c-deps] error[E0609]: no field `lmb_channel_edge_ids` on type `CutInfo`
  105. 101.18 s [gammaloop-crate-test-binaries-gammaloop-integration-tests-d6e55b48f8214f9c-deps] --> tests/tests/test_evaluation_api.rs:1281:14
  106. 101.18 s [gammaloop-crate-test-binaries-gammaloop-integration-tests-d6e55b48f8214f9c-deps] |
  107. 101.18 s [gammaloop-crate-test-binaries-gammaloop-integration-tests-d6e55b48f8214f9c-deps] 1281 | .lmb_channel_edge_ids
  108. 101.18 s [gammaloop-crate-test-binaries-gammaloop-integration-tests-d6e55b48f8214f9c-deps] | ^^^^^^^^^^^^^^^^^^^^ unknown field
  109. 101.18 s [gammaloop-crate-test-binaries-gammaloop-integration-tests-d6e55b48f8214f9c-deps] |
  110. 101.18 s [gammaloop-crate-test-binaries-gammaloop-integration-tests-d6e55b48f8214f9c-deps] = note: available fields are: `particle_pdgs`, `cut_id`, `graph_id`, `graph_group_id`, `orientation_id` ... and 2 others
  111. 101.18 s [gammaloop-crate-test-binaries-gammaloop-integration-tests-d6e55b48f8214f9c-deps]
  112. 101.21 s [gammaloop-crate-test-binaries-gammaloop-integration-tests-d6e55b48f8214f9c-deps] error[E0609]: no field `lmb_channel_edge_ids` on type `CutInfo`
  113. 101.21 s [gammaloop-crate-test-binaries-gammaloop-integration-tests-d6e55b48f8214f9c-deps] --> tests/tests/test_evaluation_api.rs:1428:18
  114. 101.21 s [gammaloop-crate-test-binaries-gammaloop-integration-tests-d6e55b48f8214f9c-deps] |
  115. 101.21 s [gammaloop-crate-test-binaries-gammaloop-integration-tests-d6e55b48f8214f9c-deps] 1428 | .lmb_channel_edge_ids
  116. 101.21 s [gammaloop-crate-test-binaries-gammaloop-integration-tests-d6e55b48f8214f9c-deps] | ^^^^^^^^^^^^^^^^^^^^ unknown field
  117. 101.21 s [gammaloop-crate-test-binaries-gammaloop-integration-tests-d6e55b48f8214f9c-deps] |
  118. 101.21 s [gammaloop-crate-test-binaries-gammaloop-integration-tests-d6e55b48f8214f9c-deps] = note: available fields are: `particle_pdgs`, `cut_id`, `graph_id`, `graph_group_id`, `orientation_id` ... and 2 others
  119. 101.21 s [gammaloop-crate-test-binaries-gammaloop-integration-tests-d6e55b48f8214f9c-deps]
  120. 101.29 s [gammaloop-crate-test-binaries-gammaloop-integration-tests-d6e55b48f8214f9c-deps] For more information about this error, try `rustc --explain E0609`.
  121. 101.31 s [gammaloop-crate-test-binaries-gammaloop-integration-tests-d6e55b48f8214f9c-deps] error: could not compile `gammaloop-integration-tests` (test "test_evaluation_api") due to 6 previous errors
  122. 101.86 s [gammaloop-crate-test-binaries-gammaloop-integration-tests-d6e55b48f8214f9c-deps] error[E0609]: no field `lmb_channel_id` on type `CutInfo`
  123. 101.86 s [gammaloop-crate-test-binaries-gammaloop-integration-tests-d6e55b48f8214f9c-deps] --> tests/tests/test_runs/utils.rs:568:36
  124. 101.86 s [gammaloop-crate-test-binaries-gammaloop-integration-tests-d6e55b48f8214f9c-deps] |
  125. 101.86 s [gammaloop-crate-test-binaries-gammaloop-integration-tests-d6e55b48f8214f9c-deps] 568 | event.cut_info.lmb_channel_id,
  126. 101.86 s [gammaloop-crate-test-binaries-gammaloop-integration-tests-d6e55b48f8214f9c-deps] | ^^^^^^^^^^^^^^ unknown field
  127. 101.86 s [gammaloop-crate-test-binaries-gammaloop-integration-tests-d6e55b48f8214f9c-deps] |
  128. 101.86 s [gammaloop-crate-test-binaries-gammaloop-integration-tests-d6e55b48f8214f9c-deps] = note: available fields are: `particle_pdgs`, `cut_id`, `graph_id`, `graph_group_id`, `orientation_id` ... and 2 others
  129. 101.86 s [gammaloop-crate-test-binaries-gammaloop-integration-tests-d6e55b48f8214f9c-deps]
  130. 101.86 s [gammaloop-crate-test-binaries-gammaloop-integration-tests-d6e55b48f8214f9c-deps] error[E0609]: no field `lmb_channel_id` on type `CutInfo`
  131. 101.86 s [gammaloop-crate-test-binaries-gammaloop-integration-tests-d6e55b48f8214f9c-deps] --> tests/tests/test_runs/utils.rs:580:36
  132. 101.86 s [gammaloop-crate-test-binaries-gammaloop-integration-tests-d6e55b48f8214f9c-deps] |
  133. 101.86 s [gammaloop-crate-test-binaries-gammaloop-integration-tests-d6e55b48f8214f9c-deps] 580 | event.cut_info.lmb_channel_id,
  134. 101.86 s [gammaloop-crate-test-binaries-gammaloop-integration-tests-d6e55b48f8214f9c-deps] | ^^^^^^^^^^^^^^ unknown field
  135. 101.86 s [gammaloop-crate-test-binaries-gammaloop-integration-tests-d6e55b48f8214f9c-deps] |
  136. 101.86 s [gammaloop-crate-test-binaries-gammaloop-integration-tests-d6e55b48f8214f9c-deps] = note: available fields are: `particle_pdgs`, `cut_id`, `graph_id`, `graph_group_id`, `orientation_id` ... and 2 others
  137. 101.86 s [gammaloop-crate-test-binaries-gammaloop-integration-tests-d6e55b48f8214f9c-deps]
  138. 102.52 s [gammaloop-crate-test-binaries-gammaloop-integration-tests-d6e55b48f8214f9c-deps] error: could not compile `gammaloop-integration-tests` (test "test_runs") due to 2 previous errors
  139. 144.63 s Progress: 2 of 4 built (1 failed)
  140. 144.63 s Failed to build gammaloop-crate-test-binaries-gammaloop-integration-tests-d6e55b48f8214f9c-deps after 45.5s
  141. 144.63 s error: Cannot build '/nix/store/y9lln3gy6zafqrqybglp5alj2wykf6r9-gammaloop-crate-test-binaries-gammaloop-integration-tests-d6e55b48f8214f9c-deps-0.1.0.drv'.
  142. 144.63 s Reason: builder failed with exit code 101.
  143. 144.63 s Output paths:
  144. 144.63 s /nix/store/p97fy69k7fjn19pkl3jw963frbgdzgl8-gammaloop-crate-test-binaries-gammaloop-integration-tests-d6e55b48f8214f9c-deps-0.1.0
  145. 144.63 s Last 115 log lines:
  146. 144.63 s > Running phase: unpackPhase
  147. 144.63 s > unpacking source archive /nix/store/a2mf5ss32qm0vv8qxhcf041bxajmsxnq-source
  148. 144.63 s > source root is source
  149. 144.63 s > Running phase: patchPhase
  150. 144.63 s > Executing configureCargoCommonVars
  151. 144.63 s > copying cargo artifacts from /nix/store/mfb414248p3fii27bb1l8z3309p80la0-gammaloop-crate-test-binaries-gammaloop-integration-tests-d6e55b48f8214f9c-inputs/target to target
  152. 144.63 s > will deep copy artifacts (instead of symlinking) as requested
  153. 144.63 s > Running phase: updateAutotoolsGnuConfigScriptsPhase
  154. 144.63 s > Running phase: configurePhase
  155. 144.63 s > will append /build/source/.cargo-home/config.toml with contents of /nix/store/5drf77x6km4ky7gwlrzdx9bbd6fz09g3-vendor-cargo-deps/config.toml
  156. 144.63 s > default configurePhase, nothing to do
  157. 144.63 s > Running phase: buildPhase
  158. 144.63 s > +++ command cargo --version
  159. 144.63 s > cargo 1.97.0 (c980f4866 2026-06-30)
  160. 144.63 s > +++ command cargo test --profile ci-optim --no-run --offline -p gammaloop-integration-tests --features gammaloop-integration-tests/python-api-tests
  161. 144.63 s > Compiling gammaloop-integration-tests v0.1.0 (/build/source/tests)
  162. 144.63 s > error[E0560]: struct `CutInfo` has no field named `lmb_channel_id`
  163. 144.63 s > --> tests/tests/test_differential.rs:86:13
  164. 144.63 s > |
  165. 144.63 s > 86 | lmb_channel_id: None,
  166. 144.63 s > | ^^^^^^^^^^^^^^ `CutInfo` does not have this field
  167. 144.63 s > |
  168. 144.63 s > = note: available fields are: `sampling_channel_id`, `sampling_channel_edge_ids`
  169. 144.63 s >
  170. 144.63 s > error[E0560]: struct `CutInfo` has no field named `lmb_channel_edge_ids`
  171. 144.63 s > --> tests/tests/test_differential.rs:87:13
  172. 144.63 s > |
  173. 144.63 s > 87 | lmb_channel_edge_ids: None,
  174. 144.63 s > | ^^^^^^^^^^^^^^^^^^^^ `CutInfo` does not have this field
  175. 144.63 s > |
  176. 144.63 s > = note: available fields are: `sampling_channel_id`, `sampling_channel_edge_ids`
  177. 144.63 s >
  178. 144.63 s > error[E0063]: missing field `reference_moments` in initializer of `GraphEvaluationResult<_>`
  179. 144.63 s > --> tests/tests/test_differential.rs:532:19
  180. 144.63 s > |
  181. 144.63 s > 532 | let mut lhs = GraphEvaluationResult {
  182. 144.63 s > | ^^^^^^^^^^^^^^^^^^^^^ missing `reference_moments`
  183. 144.63 s >
  184. 144.63 s > error[E0063]: missing field `reference_moments` in initializer of `GraphEvaluationResult<_>`
  185. 144.63 s > --> tests/tests/test_differential.rs:539:15
  186. 144.63 s > |
  187. 144.63 s > 539 | let rhs = GraphEvaluationResult {
  188. 144.63 s > | ^^^^^^^^^^^^^^^^^^^^^ missing `reference_moments`
  189. 144.63 s >
  190. 144.63 s > Some errors have detailed explanations: E0063, E0560.
  191. 144.63 s > For more information about an error, try `rustc --explain E0063`.
  192. 144.63 s > error[E0609]: no field `lmb_channel_edge_ids` on type `CutInfo`
  193. 144.63 s > --> tests/tests/test_evaluation_api.rs:311:10
  194. 144.63 s > |
  195. 144.63 s > 311 | .lmb_channel_edge_ids
  196. 144.63 s > | ^^^^^^^^^^^^^^^^^^^^ unknown field
  197. 144.63 s > |
  198. 144.63 s > = note: available fields are: `particle_pdgs`, `cut_id`, `graph_id`, `graph_group_id`, `orientation_id` ... and 2 others
  199. 144.63 s >
  200. 144.63 s > error: could not compile `gammaloop-integration-tests` (test "test_differential") due to 4 previous errors
  201. 144.63 s > warning: build failed, waiting for other jobs to finish...
  202. 144.63 s > error[E0609]: no field `lmb_channel_edge_ids` on type `CutInfo`
  203. 144.63 s > --> tests/tests/test_evaluation_api.rs:591:26
  204. 144.63 s > |
  205. 144.63 s > 591 | .lmb_channel_edge_ids
  206. 144.63 s > | ^^^^^^^^^^^^^^^^^^^^ unknown field
  207. 144.63 s > |
  208. 144.63 s > = note: available fields are: `particle_pdgs`, `cut_id`, `graph_id`, `graph_group_id`, `orientation_id` ... and 2 others
  209. 144.63 s >
  210. 144.63 s > error[E0609]: no field `lmb_channel_edge_ids` on type `CutInfo`
  211. 144.63 s > --> tests/tests/test_evaluation_api.rs:1177:18
  212. 144.63 s > |
  213. 144.63 s > 1177 | .lmb_channel_edge_ids
  214. 144.63 s > | ^^^^^^^^^^^^^^^^^^^^ unknown field
  215. 144.63 s > |
  216. 144.63 s > = note: available fields are: `particle_pdgs`, `cut_id`, `graph_id`, `graph_group_id`, `orientation_id` ... and 2 others
  217. 144.63 s >
  218. 144.63 s > error[E0609]: no field `lmb_channel_edge_ids` on type `CutInfo`
  219. 144.63 s > --> tests/tests/test_evaluation_api.rs:1222:22
  220. 144.63 s > |
  221. 144.63 s > 1222 | .lmb_channel_edge_ids
  222. 144.63 s > | ^^^^^^^^^^^^^^^^^^^^ unknown field
  223. 144.63 s > |
  224. 144.63 s > = note: available fields are: `particle_pdgs`, `cut_id`, `graph_id`, `graph_group_id`, `orientation_id` ... and 2 others
  225. 144.63 s >
  226. 144.63 s > error[E0609]: no field `lmb_channel_edge_ids` on type `CutInfo`
  227. 144.63 s > --> tests/tests/test_evaluation_api.rs:1281:14
  228. 144.63 s > |
  229. 144.63 s > 1281 | .lmb_channel_edge_ids
  230. 144.63 s > | ^^^^^^^^^^^^^^^^^^^^ unknown field
  231. 144.63 s > |
  232. 144.63 s > = note: available fields are: `particle_pdgs`, `cut_id`, `graph_id`, `graph_group_id`, `orientation_id` ... and 2 others
  233. 144.63 s >
  234. 144.63 s > error[E0609]: no field `lmb_channel_edge_ids` on type `CutInfo`
  235. 144.63 s > --> tests/tests/test_evaluation_api.rs:1428:18
  236. 144.63 s > |
  237. 144.63 s > 1428 | .lmb_channel_edge_ids
  238. 144.63 s > | ^^^^^^^^^^^^^^^^^^^^ unknown field
  239. 144.63 s > |
  240. 144.63 s > = note: available fields are: `particle_pdgs`, `cut_id`, `graph_id`, `graph_group_id`, `orientation_id` ... and 2 others
  241. 144.63 s >
  242. 144.63 s > For more information about this error, try `rustc --explain E0609`.
  243. 144.63 s > error: could not compile `gammaloop-integration-tests` (test "test_evaluation_api") due to 6 previous errors
  244. 144.63 s > error[E0609]: no field `lmb_channel_id` on type `CutInfo`
  245. 144.63 s > --> tests/tests/test_runs/utils.rs:568:36
  246. 144.63 s > |
  247. 144.63 s > 568 | event.cut_info.lmb_channel_id,
  248. 144.63 s > | ^^^^^^^^^^^^^^ unknown field
  249. 144.63 s > |
  250. 144.63 s > = note: available fields are: `particle_pdgs`, `cut_id`, `graph_id`, `graph_group_id`, `orientation_id` ... and 2 others
  251. 144.63 s >
  252. 144.63 s > error[E0609]: no field `lmb_channel_id` on type `CutInfo`
  253. 144.63 s > --> tests/tests/test_runs/utils.rs:580:36
  254. 144.63 s > |
  255. 144.63 s > 580 | event.cut_info.lmb_channel_id,
  256. 144.63 s > | ^^^^^^^^^^^^^^ unknown field
  257. 144.63 s > |
  258. 144.63 s > = note: available fields are: `particle_pdgs`, `cut_id`, `graph_id`, `graph_group_id`, `orientation_id` ... and 2 others
  259. 144.63 s >
  260. 144.63 s > error: could not compile `gammaloop-integration-tests` (test "test_runs") due to 2 previous errors
  261. 144.63 s For full logs, run:
  262. 144.63 s nix log /nix/store/y9lln3gy6zafqrqybglp5alj2wykf6r9-gammaloop-crate-test-binaries-gammaloop-integration-tests-d6e55b48f8214f9c-deps-0.1.0.drv
  263. 144.63 s error: Cannot build '/nix/store/hhhl8803dsipi40hpgplqymzcrlkddp3-nix-ci-artifact-barrier-crate-test-binaries-python-api-gammaloop-integration-tests.drv'.
  264. 144.63 s Reason: 1 dependency failed.
  265. 144.63 s Output paths:
  266. 144.63 s /nix/store/x6s28q9k9hx0qh4kcqpc0hgn0877bsrm-nix-ci-artifact-barrier-crate-test-binaries-python-api-gammaloop-integration-tests
  267. 144.63 s Build failed due to failed dependency
  268. 144.69 s Build failed.