0.00 s
$ /nix/store/9ypz3flqsrl5xl495mm8h645gadjsxi1-coreutils-9.11/bin/timeout --kill-after=15s 7200s /nix/store/23zk8sgzamrbmj1fday15szf7f2279s8-nix-2.34.7/bin/nix --extra-experimental-features nix-command --extra-experimental-features flakes --log-format internal-json build --no-link --print-out-paths git+https://github.com/alphal00p/gammaloop?ref=advanced_sampling&rev=ad713af8ba0173320df0aef4e53935ec4cf8a238&shallow=1#packages.x86_64-linux.crate-test-binaries-python-api-gammaloop-integration-tests --print-build-logs
7.68 s
8.72 s
Building /nix/store/25cw93xc9r5ymlp634wywx92mcvp6416-gammaloop-ci-test-binary-dependencies-d6e55b48f8214f9c-gammaloop-integration-tests-dev-dependency.toml.drv
8.83 s
Building /nix/store/4k2a4lcrq95acbxk958qnbv21yrrxd9r-gammaloop-crate-test-binaries-gammaloop-integration-tests-d6e55b48f8214f9c-inputs.drv
8.85 s
[gammaloop-ci-test-binary-dependencies-d6e55b48f8214f9c-gammaloop-integration-tests-dev-dependency.toml:post-build] Uploading to the NixCI cache: /nix/store/lfx53ya8cr1igbixws20ksh85z7d7in6-gammaloop-ci-test-binary-dependencies-d6e55b48f8214f9c-gammaloop-integration-tests-dev-dependency.toml
8.89 s
[gammaloop-ci-test-binary-dependencies-d6e55b48f8214f9c-gammaloop-integration-tests-dev-dependency.toml:post-build] warning: 'warn-short-path-literals' is deprecated, use 'lint-short-path-literals = ignore' instead
9.01 s
[gammaloop-ci-test-binary-dependencies-d6e55b48f8214f9c-gammaloop-integration-tests-dev-dependency.toml:post-build] copying 0 paths...
9.06 s
[gammaloop-ci-test-binary-dependencies-d6e55b48f8214f9c-gammaloop-integration-tests-dev-dependency.toml:post-build] warning: 'warn-short-path-literals' is deprecated, use 'lint-short-path-literals = ignore' instead
9.20 s
[gammaloop-ci-test-binary-dependencies-d6e55b48f8214f9c-gammaloop-integration-tests-dev-dependency.toml:post-build] copying 0 paths...
9.22 s
Uploaded gammaloop-ci-test-binary-dependencies-d6e55b48f8214f9c-gammaloop-integration-tests-dev-dependency.toml in 378ms
9.22 s
Progress: 1 of 5 built (1 building)
9.22 s
Built gammaloop-ci-test-binary-dependencies-d6e55b48f8214f9c-gammaloop-integration-tests-dev-dependency.toml in 491ms
17.24 s
[gammaloop-crate-test-binaries-gammaloop-integration-tests-d6e55b48f8214f9c-inputs:post-build] Uploading to the NixCI cache: /nix/store/mfb414248p3fii27bb1l8z3309p80la0-gammaloop-crate-test-binaries-gammaloop-integration-tests-d6e55b48f8214f9c-inputs
17.28 s
[gammaloop-crate-test-binaries-gammaloop-integration-tests-d6e55b48f8214f9c-inputs:post-build] warning: 'warn-short-path-literals' is deprecated, use 'lint-short-path-literals = ignore' instead
17.32 s
[gammaloop-crate-test-binaries-gammaloop-integration-tests-d6e55b48f8214f9c-inputs:post-build] copying 1 paths...
17.32 s
[gammaloop-crate-test-binaries-gammaloop-integration-tests-d6e55b48f8214f9c-inputs:post-build] copying path '/nix/store/mfb414248p3fii27bb1l8z3309p80la0-gammaloop-crate-test-binaries-gammaloop-integration-tests-d6e55b48f8214f9c-inputs' to 'https://cache.nix-ci.com'...
98.47 s
[gammaloop-crate-test-binaries-gammaloop-integration-tests-d6e55b48f8214f9c-inputs:post-build] warning: 'warn-short-path-literals' is deprecated, use 'lint-short-path-literals = ignore' instead
98.80 s
[gammaloop-crate-test-binaries-gammaloop-integration-tests-d6e55b48f8214f9c-inputs:post-build] copying 1 paths...
98.80 s
[gammaloop-crate-test-binaries-gammaloop-integration-tests-d6e55b48f8214f9c-inputs:post-build] copying path '/nix/store/4k2a4lcrq95acbxk958qnbv21yrrxd9r-gammaloop-crate-test-binaries-gammaloop-integration-tests-d6e55b48f8214f9c-inputs.drv' to 'https://cache.nix-ci.com'...
99.05 s
Uploaded gammaloop-crate-test-binaries-gammaloop-integration-tests-d6e55b48f8214f9c-inputs in 1m21s
99.05 s
Progress: 2 of 5 built
99.05 s
Built gammaloop-crate-test-binaries-gammaloop-integration-tests-d6e55b48f8214f9c-inputs in 1m30s
99.11 s
Building /nix/store/y9lln3gy6zafqrqybglp5alj2wykf6r9-gammaloop-crate-test-binaries-gammaloop-integration-tests-d6e55b48f8214f9c-deps-0.1.0.drv
99.17 s
[gammaloop-crate-test-binaries-gammaloop-integration-tests-d6e55b48f8214f9c-deps] Phase: unpackPhase
99.18 s
[gammaloop-crate-test-binaries-gammaloop-integration-tests-d6e55b48f8214f9c-deps] unpacking source archive /nix/store/a2mf5ss32qm0vv8qxhcf041bxajmsxnq-source
99.23 s
[gammaloop-crate-test-binaries-gammaloop-integration-tests-d6e55b48f8214f9c-deps] source root is source
99.24 s
[gammaloop-crate-test-binaries-gammaloop-integration-tests-d6e55b48f8214f9c-deps] Phase: patchPhase
99.31 s
[gammaloop-crate-test-binaries-gammaloop-integration-tests-d6e55b48f8214f9c-deps] Executing configureCargoCommonVars
99.32 s
[gammaloop-crate-test-binaries-gammaloop-integration-tests-d6e55b48f8214f9c-deps] copying cargo artifacts from /nix/store/mfb414248p3fii27bb1l8z3309p80la0-gammaloop-crate-test-binaries-gammaloop-integration-tests-d6e55b48f8214f9c-inputs/target to target
99.32 s
[gammaloop-crate-test-binaries-gammaloop-integration-tests-d6e55b48f8214f9c-deps] will deep copy artifacts (instead of symlinking) as requested
100.51 s
[gammaloop-crate-test-binaries-gammaloop-integration-tests-d6e55b48f8214f9c-deps] Phase: updateAutotoolsGnuConfigScriptsPhase
100.54 s
[gammaloop-crate-test-binaries-gammaloop-integration-tests-d6e55b48f8214f9c-deps] Phase: configurePhase
100.55 s
[gammaloop-crate-test-binaries-gammaloop-integration-tests-d6e55b48f8214f9c-deps] will append /build/source/.cargo-home/config.toml with contents of /nix/store/5drf77x6km4ky7gwlrzdx9bbd6fz09g3-vendor-cargo-deps/config.toml
100.55 s
[gammaloop-crate-test-binaries-gammaloop-integration-tests-d6e55b48f8214f9c-deps] default configurePhase, nothing to do
100.55 s
[gammaloop-crate-test-binaries-gammaloop-integration-tests-d6e55b48f8214f9c-deps] Phase: buildPhase
100.55 s
[gammaloop-crate-test-binaries-gammaloop-integration-tests-d6e55b48f8214f9c-deps] +++ command cargo --version
100.56 s
[gammaloop-crate-test-binaries-gammaloop-integration-tests-d6e55b48f8214f9c-deps] cargo 1.97.0 (c980f4866 2026-06-30)
100.56 s
[gammaloop-crate-test-binaries-gammaloop-integration-tests-d6e55b48f8214f9c-deps] +++ command cargo test --profile ci-optim --no-run --offline -p gammaloop-integration-tests --features gammaloop-integration-tests/python-api-tests
100.89 s
[gammaloop-crate-test-binaries-gammaloop-integration-tests-d6e55b48f8214f9c-deps] Compiling gammaloop-integration-tests v0.1.0 (/build/source/tests)
100.99 s
[gammaloop-crate-test-binaries-gammaloop-integration-tests-d6e55b48f8214f9c-deps] error[E0560] : struct `CutInfo` has no field named `lmb_channel_id`
100.99 s
[gammaloop-crate-test-binaries-gammaloop-integration-tests-d6e55b48f8214f9c-deps] --> tests/tests/test_differential.rs:86:13
100.99 s
[gammaloop-crate-test-binaries-gammaloop-integration-tests-d6e55b48f8214f9c-deps] |
100.99 s
[gammaloop-crate-test-binaries-gammaloop-integration-tests-d6e55b48f8214f9c-deps] 86 | lmb_channel_id: None,
100.99 s
[gammaloop-crate-test-binaries-gammaloop-integration-tests-d6e55b48f8214f9c-deps] | ^^^^^^^^^^^^^^ `CutInfo` does not have this field
100.99 s
[gammaloop-crate-test-binaries-gammaloop-integration-tests-d6e55b48f8214f9c-deps] |
100.99 s
[gammaloop-crate-test-binaries-gammaloop-integration-tests-d6e55b48f8214f9c-deps] = note : available fields are: `sampling_channel_id`, `sampling_channel_edge_ids`
100.99 s
[gammaloop-crate-test-binaries-gammaloop-integration-tests-d6e55b48f8214f9c-deps]
100.99 s
[gammaloop-crate-test-binaries-gammaloop-integration-tests-d6e55b48f8214f9c-deps] error[E0560] : struct `CutInfo` has no field named `lmb_channel_edge_ids`
100.99 s
[gammaloop-crate-test-binaries-gammaloop-integration-tests-d6e55b48f8214f9c-deps] --> tests/tests/test_differential.rs:87:13
100.99 s
[gammaloop-crate-test-binaries-gammaloop-integration-tests-d6e55b48f8214f9c-deps] |
100.99 s
[gammaloop-crate-test-binaries-gammaloop-integration-tests-d6e55b48f8214f9c-deps] 87 | lmb_channel_edge_ids: None,
100.99 s
[gammaloop-crate-test-binaries-gammaloop-integration-tests-d6e55b48f8214f9c-deps] | ^^^^^^^^^^^^^^^^^^^^ `CutInfo` does not have this field
100.99 s
[gammaloop-crate-test-binaries-gammaloop-integration-tests-d6e55b48f8214f9c-deps] |
100.99 s
[gammaloop-crate-test-binaries-gammaloop-integration-tests-d6e55b48f8214f9c-deps] = note : available fields are: `sampling_channel_id`, `sampling_channel_edge_ids`
100.99 s
[gammaloop-crate-test-binaries-gammaloop-integration-tests-d6e55b48f8214f9c-deps]
101.00 s
[gammaloop-crate-test-binaries-gammaloop-integration-tests-d6e55b48f8214f9c-deps] error[E0063] : missing field `reference_moments` in initializer of `GraphEvaluationResult<_>`
101.00 s
[gammaloop-crate-test-binaries-gammaloop-integration-tests-d6e55b48f8214f9c-deps] --> tests/tests/test_differential.rs:532:19
101.00 s
[gammaloop-crate-test-binaries-gammaloop-integration-tests-d6e55b48f8214f9c-deps] |
101.00 s
[gammaloop-crate-test-binaries-gammaloop-integration-tests-d6e55b48f8214f9c-deps] 532 | let mut lhs = GraphEvaluationResult {
101.00 s
[gammaloop-crate-test-binaries-gammaloop-integration-tests-d6e55b48f8214f9c-deps] | ^^^^^^^^^^^^^^^^^^^^^ missing `reference_moments`
101.00 s
[gammaloop-crate-test-binaries-gammaloop-integration-tests-d6e55b48f8214f9c-deps]
101.00 s
[gammaloop-crate-test-binaries-gammaloop-integration-tests-d6e55b48f8214f9c-deps] error[E0063] : missing field `reference_moments` in initializer of `GraphEvaluationResult<_>`
101.00 s
[gammaloop-crate-test-binaries-gammaloop-integration-tests-d6e55b48f8214f9c-deps] --> tests/tests/test_differential.rs:539:15
101.00 s
[gammaloop-crate-test-binaries-gammaloop-integration-tests-d6e55b48f8214f9c-deps] |
101.00 s
[gammaloop-crate-test-binaries-gammaloop-integration-tests-d6e55b48f8214f9c-deps] 539 | let rhs = GraphEvaluationResult {
101.00 s
[gammaloop-crate-test-binaries-gammaloop-integration-tests-d6e55b48f8214f9c-deps] | ^^^^^^^^^^^^^^^^^^^^^ missing `reference_moments`
101.00 s
[gammaloop-crate-test-binaries-gammaloop-integration-tests-d6e55b48f8214f9c-deps]
101.05 s
[gammaloop-crate-test-binaries-gammaloop-integration-tests-d6e55b48f8214f9c-deps] Some errors have detailed explanations: E0063, E0560.
101.05 s
[gammaloop-crate-test-binaries-gammaloop-integration-tests-d6e55b48f8214f9c-deps] For more information about an error, try `rustc --explain E0063`.
101.05 s
[gammaloop-crate-test-binaries-gammaloop-integration-tests-d6e55b48f8214f9c-deps] error[E0609] : no field `lmb_channel_edge_ids` on type `CutInfo`
101.05 s
[gammaloop-crate-test-binaries-gammaloop-integration-tests-d6e55b48f8214f9c-deps] --> tests/tests/test_evaluation_api.rs:311:10
101.05 s
[gammaloop-crate-test-binaries-gammaloop-integration-tests-d6e55b48f8214f9c-deps] |
101.05 s
[gammaloop-crate-test-binaries-gammaloop-integration-tests-d6e55b48f8214f9c-deps] 311 | .lmb_channel_edge_ids
101.05 s
[gammaloop-crate-test-binaries-gammaloop-integration-tests-d6e55b48f8214f9c-deps] | ^^^^^^^^^^^^^^^^^^^^ unknown field
101.05 s
[gammaloop-crate-test-binaries-gammaloop-integration-tests-d6e55b48f8214f9c-deps] |
101.05 s
[gammaloop-crate-test-binaries-gammaloop-integration-tests-d6e55b48f8214f9c-deps] = note : available fields are: `particle_pdgs`, `cut_id`, `graph_id`, `graph_group_id`, `orientation_id` ... and 2 others
101.05 s
[gammaloop-crate-test-binaries-gammaloop-integration-tests-d6e55b48f8214f9c-deps]
101.05 s
[gammaloop-crate-test-binaries-gammaloop-integration-tests-d6e55b48f8214f9c-deps] error : could not compile `gammaloop-integration-tests` (test "test_differential") due to 4 previous errors
101.06 s
[gammaloop-crate-test-binaries-gammaloop-integration-tests-d6e55b48f8214f9c-deps] warning : build failed, waiting for other jobs to finish...
101.08 s
[gammaloop-crate-test-binaries-gammaloop-integration-tests-d6e55b48f8214f9c-deps] error[E0609] : no field `lmb_channel_edge_ids` on type `CutInfo`
101.08 s
[gammaloop-crate-test-binaries-gammaloop-integration-tests-d6e55b48f8214f9c-deps] --> tests/tests/test_evaluation_api.rs:591:26
101.08 s
[gammaloop-crate-test-binaries-gammaloop-integration-tests-d6e55b48f8214f9c-deps] |
101.08 s
[gammaloop-crate-test-binaries-gammaloop-integration-tests-d6e55b48f8214f9c-deps] 591 | .lmb_channel_edge_ids
101.08 s
[gammaloop-crate-test-binaries-gammaloop-integration-tests-d6e55b48f8214f9c-deps] | ^^^^^^^^^^^^^^^^^^^^ unknown field
101.08 s
[gammaloop-crate-test-binaries-gammaloop-integration-tests-d6e55b48f8214f9c-deps] |
101.08 s
[gammaloop-crate-test-binaries-gammaloop-integration-tests-d6e55b48f8214f9c-deps] = note : available fields are: `particle_pdgs`, `cut_id`, `graph_id`, `graph_group_id`, `orientation_id` ... and 2 others
101.08 s
[gammaloop-crate-test-binaries-gammaloop-integration-tests-d6e55b48f8214f9c-deps]
101.11 s
[gammaloop-crate-test-binaries-gammaloop-integration-tests-d6e55b48f8214f9c-deps] error[E0609] : no field `lmb_channel_edge_ids` on type `CutInfo`
101.11 s
[gammaloop-crate-test-binaries-gammaloop-integration-tests-d6e55b48f8214f9c-deps] --> tests/tests/test_evaluation_api.rs:1177:18
101.11 s
[gammaloop-crate-test-binaries-gammaloop-integration-tests-d6e55b48f8214f9c-deps] |
101.11 s
[gammaloop-crate-test-binaries-gammaloop-integration-tests-d6e55b48f8214f9c-deps] 1177 | .lmb_channel_edge_ids
101.11 s
[gammaloop-crate-test-binaries-gammaloop-integration-tests-d6e55b48f8214f9c-deps] | ^^^^^^^^^^^^^^^^^^^^ unknown field
101.11 s
[gammaloop-crate-test-binaries-gammaloop-integration-tests-d6e55b48f8214f9c-deps] |
101.11 s
[gammaloop-crate-test-binaries-gammaloop-integration-tests-d6e55b48f8214f9c-deps] = note : available fields are: `particle_pdgs`, `cut_id`, `graph_id`, `graph_group_id`, `orientation_id` ... and 2 others
101.11 s
[gammaloop-crate-test-binaries-gammaloop-integration-tests-d6e55b48f8214f9c-deps]
101.18 s
[gammaloop-crate-test-binaries-gammaloop-integration-tests-d6e55b48f8214f9c-deps] error[E0609] : no field `lmb_channel_edge_ids` on type `CutInfo`
101.18 s
[gammaloop-crate-test-binaries-gammaloop-integration-tests-d6e55b48f8214f9c-deps] --> tests/tests/test_evaluation_api.rs:1222:22
101.18 s
[gammaloop-crate-test-binaries-gammaloop-integration-tests-d6e55b48f8214f9c-deps] |
101.18 s
[gammaloop-crate-test-binaries-gammaloop-integration-tests-d6e55b48f8214f9c-deps] 1222 | .lmb_channel_edge_ids
101.18 s
[gammaloop-crate-test-binaries-gammaloop-integration-tests-d6e55b48f8214f9c-deps] | ^^^^^^^^^^^^^^^^^^^^ unknown field
101.18 s
[gammaloop-crate-test-binaries-gammaloop-integration-tests-d6e55b48f8214f9c-deps] |
101.18 s
[gammaloop-crate-test-binaries-gammaloop-integration-tests-d6e55b48f8214f9c-deps] = note : available fields are: `particle_pdgs`, `cut_id`, `graph_id`, `graph_group_id`, `orientation_id` ... and 2 others
101.18 s
[gammaloop-crate-test-binaries-gammaloop-integration-tests-d6e55b48f8214f9c-deps]
101.18 s
[gammaloop-crate-test-binaries-gammaloop-integration-tests-d6e55b48f8214f9c-deps] error[E0609] : no field `lmb_channel_edge_ids` on type `CutInfo`
101.18 s
[gammaloop-crate-test-binaries-gammaloop-integration-tests-d6e55b48f8214f9c-deps] --> tests/tests/test_evaluation_api.rs:1281:14
101.18 s
[gammaloop-crate-test-binaries-gammaloop-integration-tests-d6e55b48f8214f9c-deps] |
101.18 s
[gammaloop-crate-test-binaries-gammaloop-integration-tests-d6e55b48f8214f9c-deps] 1281 | .lmb_channel_edge_ids
101.18 s
[gammaloop-crate-test-binaries-gammaloop-integration-tests-d6e55b48f8214f9c-deps] | ^^^^^^^^^^^^^^^^^^^^ unknown field
101.18 s
[gammaloop-crate-test-binaries-gammaloop-integration-tests-d6e55b48f8214f9c-deps] |
101.18 s
[gammaloop-crate-test-binaries-gammaloop-integration-tests-d6e55b48f8214f9c-deps] = note : available fields are: `particle_pdgs`, `cut_id`, `graph_id`, `graph_group_id`, `orientation_id` ... and 2 others
101.18 s
[gammaloop-crate-test-binaries-gammaloop-integration-tests-d6e55b48f8214f9c-deps]
101.21 s
[gammaloop-crate-test-binaries-gammaloop-integration-tests-d6e55b48f8214f9c-deps] error[E0609] : no field `lmb_channel_edge_ids` on type `CutInfo`
101.21 s
[gammaloop-crate-test-binaries-gammaloop-integration-tests-d6e55b48f8214f9c-deps] --> tests/tests/test_evaluation_api.rs:1428:18
101.21 s
[gammaloop-crate-test-binaries-gammaloop-integration-tests-d6e55b48f8214f9c-deps] |
101.21 s
[gammaloop-crate-test-binaries-gammaloop-integration-tests-d6e55b48f8214f9c-deps] 1428 | .lmb_channel_edge_ids
101.21 s
[gammaloop-crate-test-binaries-gammaloop-integration-tests-d6e55b48f8214f9c-deps] | ^^^^^^^^^^^^^^^^^^^^ unknown field
101.21 s
[gammaloop-crate-test-binaries-gammaloop-integration-tests-d6e55b48f8214f9c-deps] |
101.21 s
[gammaloop-crate-test-binaries-gammaloop-integration-tests-d6e55b48f8214f9c-deps] = note : available fields are: `particle_pdgs`, `cut_id`, `graph_id`, `graph_group_id`, `orientation_id` ... and 2 others
101.21 s
[gammaloop-crate-test-binaries-gammaloop-integration-tests-d6e55b48f8214f9c-deps]
101.29 s
[gammaloop-crate-test-binaries-gammaloop-integration-tests-d6e55b48f8214f9c-deps] For more information about this error, try `rustc --explain E0609`.
101.31 s
[gammaloop-crate-test-binaries-gammaloop-integration-tests-d6e55b48f8214f9c-deps] error : could not compile `gammaloop-integration-tests` (test "test_evaluation_api") due to 6 previous errors
101.86 s
[gammaloop-crate-test-binaries-gammaloop-integration-tests-d6e55b48f8214f9c-deps] error[E0609] : no field `lmb_channel_id` on type `CutInfo`
101.86 s
[gammaloop-crate-test-binaries-gammaloop-integration-tests-d6e55b48f8214f9c-deps] --> tests/tests/test_runs/utils.rs:568:36
101.86 s
[gammaloop-crate-test-binaries-gammaloop-integration-tests-d6e55b48f8214f9c-deps] |
101.86 s
[gammaloop-crate-test-binaries-gammaloop-integration-tests-d6e55b48f8214f9c-deps] 568 | event.cut_info.lmb_channel_id,
101.86 s
[gammaloop-crate-test-binaries-gammaloop-integration-tests-d6e55b48f8214f9c-deps] | ^^^^^^^^^^^^^^ unknown field
101.86 s
[gammaloop-crate-test-binaries-gammaloop-integration-tests-d6e55b48f8214f9c-deps] |
101.86 s
[gammaloop-crate-test-binaries-gammaloop-integration-tests-d6e55b48f8214f9c-deps] = note : available fields are: `particle_pdgs`, `cut_id`, `graph_id`, `graph_group_id`, `orientation_id` ... and 2 others
101.86 s
[gammaloop-crate-test-binaries-gammaloop-integration-tests-d6e55b48f8214f9c-deps]
101.86 s
[gammaloop-crate-test-binaries-gammaloop-integration-tests-d6e55b48f8214f9c-deps] error[E0609] : no field `lmb_channel_id` on type `CutInfo`
101.86 s
[gammaloop-crate-test-binaries-gammaloop-integration-tests-d6e55b48f8214f9c-deps] --> tests/tests/test_runs/utils.rs:580:36
101.86 s
[gammaloop-crate-test-binaries-gammaloop-integration-tests-d6e55b48f8214f9c-deps] |
101.86 s
[gammaloop-crate-test-binaries-gammaloop-integration-tests-d6e55b48f8214f9c-deps] 580 | event.cut_info.lmb_channel_id,
101.86 s
[gammaloop-crate-test-binaries-gammaloop-integration-tests-d6e55b48f8214f9c-deps] | ^^^^^^^^^^^^^^ unknown field
101.86 s
[gammaloop-crate-test-binaries-gammaloop-integration-tests-d6e55b48f8214f9c-deps] |
101.86 s
[gammaloop-crate-test-binaries-gammaloop-integration-tests-d6e55b48f8214f9c-deps] = note : available fields are: `particle_pdgs`, `cut_id`, `graph_id`, `graph_group_id`, `orientation_id` ... and 2 others
101.86 s
[gammaloop-crate-test-binaries-gammaloop-integration-tests-d6e55b48f8214f9c-deps]
102.52 s
[gammaloop-crate-test-binaries-gammaloop-integration-tests-d6e55b48f8214f9c-deps] error : could not compile `gammaloop-integration-tests` (test "test_runs") due to 2 previous errors
144.63 s
Progress: 2 of 4 built (1 failed)
144.63 s
Failed to build gammaloop-crate-test-binaries-gammaloop-integration-tests-d6e55b48f8214f9c-deps after 45.5s
144.63 s
error: Cannot build '/nix/store/y9lln3gy6zafqrqybglp5alj2wykf6r9-gammaloop-crate-test-binaries-gammaloop-integration-tests-d6e55b48f8214f9c-deps-0.1.0.drv '.
144.63 s
Reason: builder failed with exit code 101 .
144.63 s
Output paths:
144.63 s
/nix/store/p97fy69k7fjn19pkl3jw963frbgdzgl8-gammaloop-crate-test-binaries-gammaloop-integration-tests-d6e55b48f8214f9c-deps-0.1.0
144.63 s
Last 115 log lines:
144.63 s
> Running phase: unpackPhase
144.63 s
> unpacking source archive /nix/store/a2mf5ss32qm0vv8qxhcf041bxajmsxnq-source
144.63 s
> source root is source
144.63 s
> Running phase: patchPhase
144.63 s
> Executing configureCargoCommonVars
144.63 s
> copying cargo artifacts from /nix/store/mfb414248p3fii27bb1l8z3309p80la0-gammaloop-crate-test-binaries-gammaloop-integration-tests-d6e55b48f8214f9c-inputs/target to target
144.63 s
> will deep copy artifacts (instead of symlinking) as requested
144.63 s
> Running phase: updateAutotoolsGnuConfigScriptsPhase
144.63 s
> Running phase: configurePhase
144.63 s
> will append /build/source/.cargo-home/config.toml with contents of /nix/store/5drf77x6km4ky7gwlrzdx9bbd6fz09g3-vendor-cargo-deps/config.toml
144.63 s
> default configurePhase, nothing to do
144.63 s
> Running phase: buildPhase
144.63 s
> +++ command cargo --version
144.63 s
> cargo 1.97.0 (c980f4866 2026-06-30)
144.63 s
> +++ command cargo test --profile ci-optim --no-run --offline -p gammaloop-integration-tests --features gammaloop-integration-tests/python-api-tests
144.63 s
> Compiling gammaloop-integration-tests v0.1.0 (/build/source/tests)
144.63 s
> error[E0560] : struct `CutInfo` has no field named `lmb_channel_id`
144.63 s
> --> tests/tests/test_differential.rs:86:13
144.63 s
> |
144.63 s
> 86 | lmb_channel_id: None,
144.63 s
> | ^^^^^^^^^^^^^^ `CutInfo` does not have this field
144.63 s
> |
144.63 s
> = note : available fields are: `sampling_channel_id`, `sampling_channel_edge_ids`
144.63 s
>
144.63 s
> error[E0560] : struct `CutInfo` has no field named `lmb_channel_edge_ids`
144.63 s
> --> tests/tests/test_differential.rs:87:13
144.63 s
> |
144.63 s
> 87 | lmb_channel_edge_ids: None,
144.63 s
> | ^^^^^^^^^^^^^^^^^^^^ `CutInfo` does not have this field
144.63 s
> |
144.63 s
> = note : available fields are: `sampling_channel_id`, `sampling_channel_edge_ids`
144.63 s
>
144.63 s
> error[E0063] : missing field `reference_moments` in initializer of `GraphEvaluationResult<_>`
144.63 s
> --> tests/tests/test_differential.rs:532:19
144.63 s
> |
144.63 s
> 532 | let mut lhs = GraphEvaluationResult {
144.63 s
> | ^^^^^^^^^^^^^^^^^^^^^ missing `reference_moments`
144.63 s
>
144.63 s
> error[E0063] : missing field `reference_moments` in initializer of `GraphEvaluationResult<_>`
144.63 s
> --> tests/tests/test_differential.rs:539:15
144.63 s
> |
144.63 s
> 539 | let rhs = GraphEvaluationResult {
144.63 s
> | ^^^^^^^^^^^^^^^^^^^^^ missing `reference_moments`
144.63 s
>
144.63 s
> Some errors have detailed explanations: E0063, E0560.
144.63 s
> For more information about an error, try `rustc --explain E0063`.
144.63 s
> error[E0609] : no field `lmb_channel_edge_ids` on type `CutInfo`
144.63 s
> --> tests/tests/test_evaluation_api.rs:311:10
144.63 s
> |
144.63 s
> 311 | .lmb_channel_edge_ids
144.63 s
> | ^^^^^^^^^^^^^^^^^^^^ unknown field
144.63 s
> |
144.63 s
> = note : available fields are: `particle_pdgs`, `cut_id`, `graph_id`, `graph_group_id`, `orientation_id` ... and 2 others
144.63 s
>
144.63 s
> error : could not compile `gammaloop-integration-tests` (test "test_differential") due to 4 previous errors
144.63 s
> warning : build failed, waiting for other jobs to finish...
144.63 s
> error[E0609] : no field `lmb_channel_edge_ids` on type `CutInfo`
144.63 s
> --> tests/tests/test_evaluation_api.rs:591:26
144.63 s
> |
144.63 s
> 591 | .lmb_channel_edge_ids
144.63 s
> | ^^^^^^^^^^^^^^^^^^^^ unknown field
144.63 s
> |
144.63 s
> = note : available fields are: `particle_pdgs`, `cut_id`, `graph_id`, `graph_group_id`, `orientation_id` ... and 2 others
144.63 s
>
144.63 s
> error[E0609] : no field `lmb_channel_edge_ids` on type `CutInfo`
144.63 s
> --> tests/tests/test_evaluation_api.rs:1177:18
144.63 s
> |
144.63 s
> 1177 | .lmb_channel_edge_ids
144.63 s
> | ^^^^^^^^^^^^^^^^^^^^ unknown field
144.63 s
> |
144.63 s
> = note : available fields are: `particle_pdgs`, `cut_id`, `graph_id`, `graph_group_id`, `orientation_id` ... and 2 others
144.63 s
>
144.63 s
> error[E0609] : no field `lmb_channel_edge_ids` on type `CutInfo`
144.63 s
> --> tests/tests/test_evaluation_api.rs:1222:22
144.63 s
> |
144.63 s
> 1222 | .lmb_channel_edge_ids
144.63 s
> | ^^^^^^^^^^^^^^^^^^^^ unknown field
144.63 s
> |
144.63 s
> = note : available fields are: `particle_pdgs`, `cut_id`, `graph_id`, `graph_group_id`, `orientation_id` ... and 2 others
144.63 s
>
144.63 s
> error[E0609] : no field `lmb_channel_edge_ids` on type `CutInfo`
144.63 s
> --> tests/tests/test_evaluation_api.rs:1281:14
144.63 s
> |
144.63 s
> 1281 | .lmb_channel_edge_ids
144.63 s
> | ^^^^^^^^^^^^^^^^^^^^ unknown field
144.63 s
> |
144.63 s
> = note : available fields are: `particle_pdgs`, `cut_id`, `graph_id`, `graph_group_id`, `orientation_id` ... and 2 others
144.63 s
>
144.63 s
> error[E0609] : no field `lmb_channel_edge_ids` on type `CutInfo`
144.63 s
> --> tests/tests/test_evaluation_api.rs:1428:18
144.63 s
> |
144.63 s
> 1428 | .lmb_channel_edge_ids
144.63 s
> | ^^^^^^^^^^^^^^^^^^^^ unknown field
144.63 s
> |
144.63 s
> = note : available fields are: `particle_pdgs`, `cut_id`, `graph_id`, `graph_group_id`, `orientation_id` ... and 2 others
144.63 s
>
144.63 s
> For more information about this error, try `rustc --explain E0609`.
144.63 s
> error : could not compile `gammaloop-integration-tests` (test "test_evaluation_api") due to 6 previous errors
144.63 s
> error[E0609] : no field `lmb_channel_id` on type `CutInfo`
144.63 s
> --> tests/tests/test_runs/utils.rs:568:36
144.63 s
> |
144.63 s
> 568 | event.cut_info.lmb_channel_id,
144.63 s
> | ^^^^^^^^^^^^^^ unknown field
144.63 s
> |
144.63 s
> = note : available fields are: `particle_pdgs`, `cut_id`, `graph_id`, `graph_group_id`, `orientation_id` ... and 2 others
144.63 s
>
144.63 s
> error[E0609] : no field `lmb_channel_id` on type `CutInfo`
144.63 s
> --> tests/tests/test_runs/utils.rs:580:36
144.63 s
> |
144.63 s
> 580 | event.cut_info.lmb_channel_id,
144.63 s
> | ^^^^^^^^^^^^^^ unknown field
144.63 s
> |
144.63 s
> = note : available fields are: `particle_pdgs`, `cut_id`, `graph_id`, `graph_group_id`, `orientation_id` ... and 2 others
144.63 s
>
144.63 s
> error : could not compile `gammaloop-integration-tests` (test "test_runs") due to 2 previous errors
144.63 s
For full logs, run:
144.63 s
nix log /nix/store/y9lln3gy6zafqrqybglp5alj2wykf6r9-gammaloop-crate-test-binaries-gammaloop-integration-tests-d6e55b48f8214f9c-deps-0.1.0.drv
144.63 s
error: Cannot build '/nix/store/hhhl8803dsipi40hpgplqymzcrlkddp3-nix-ci-artifact-barrier-crate-test-binaries-python-api-gammaloop-integration-tests.drv '.
144.63 s
Reason: 1 dependency failed .
144.63 s
Output paths:
144.63 s
/nix/store/x6s28q9k9hx0qh4kcqpc0hgn0877bsrm-nix-ci-artifact-barrier-crate-test-binaries-python-api-gammaloop-integration-tests
144.63 s
Build failed due to failed dependency
144.69 s
Build failed.