build packages.x86_64-linux.crate-test-binaries-gammaloop-integration-tests

Reproduce this run
Original Run
  1. 0.00 s $ /nix/store/9ypz3flqsrl5xl495mm8h645gadjsxi1-coreutils-9.11/bin/timeout --kill-after=15s 7200s /nix/store/23zk8sgzamrbmj1fday15szf7f2279s8-nix-2.34.7/bin/nix --extra-experimental-features nix-command --extra-experimental-features flakes --log-format internal-json build --no-link --print-out-paths git+https://github.com/alphal00p/gammaloop?ref=advanced_sampling&rev=ad713af8ba0173320df0aef4e53935ec4cf8a238&shallow=1#packages.x86_64-linux.crate-test-binaries-gammaloop-integration-tests --print-build-logs
  2. 0.17 s
  3. 0.57 s Building /nix/store/87hq7ppbbyjsyasszv0zcc1zv7d81635-gammaloop-crate-test-binaries-gammaloop-integration-tests-b8cda0d438c96d4f-deps-0.1.0.drv
  4. 0.68 s [gammaloop-crate-test-binaries-gammaloop-integration-tests-b8cda0d438c96d4f-deps] Phase: unpackPhase
  5. 0.69 s [gammaloop-crate-test-binaries-gammaloop-integration-tests-b8cda0d438c96d4f-deps] unpacking source archive /nix/store/a2mf5ss32qm0vv8qxhcf041bxajmsxnq-source
  6. 0.77 s [gammaloop-crate-test-binaries-gammaloop-integration-tests-b8cda0d438c96d4f-deps] source root is source
  7. 0.79 s [gammaloop-crate-test-binaries-gammaloop-integration-tests-b8cda0d438c96d4f-deps] Phase: patchPhase
  8. 0.90 s [gammaloop-crate-test-binaries-gammaloop-integration-tests-b8cda0d438c96d4f-deps] Executing configureCargoCommonVars
  9. 0.91 s [gammaloop-crate-test-binaries-gammaloop-integration-tests-b8cda0d438c96d4f-deps] copying cargo artifacts from /nix/store/crwvzla71cgag15sf2ldrx93yxi308jj-gammaloop-crate-test-binaries-gammaloop-integration-tests-b8cda0d438c96d4f-inputs/target to target
  10. 0.91 s [gammaloop-crate-test-binaries-gammaloop-integration-tests-b8cda0d438c96d4f-deps] will deep copy artifacts (instead of symlinking) as requested
  11. 2.70 s [gammaloop-crate-test-binaries-gammaloop-integration-tests-b8cda0d438c96d4f-deps] Phase: updateAutotoolsGnuConfigScriptsPhase
  12. 2.75 s [gammaloop-crate-test-binaries-gammaloop-integration-tests-b8cda0d438c96d4f-deps] Phase: configurePhase
  13. 2.76 s [gammaloop-crate-test-binaries-gammaloop-integration-tests-b8cda0d438c96d4f-deps] will append /build/source/.cargo-home/config.toml with contents of /nix/store/5drf77x6km4ky7gwlrzdx9bbd6fz09g3-vendor-cargo-deps/config.toml
  14. 2.76 s [gammaloop-crate-test-binaries-gammaloop-integration-tests-b8cda0d438c96d4f-deps] default configurePhase, nothing to do
  15. 2.76 s [gammaloop-crate-test-binaries-gammaloop-integration-tests-b8cda0d438c96d4f-deps] Phase: buildPhase
  16. 2.77 s [gammaloop-crate-test-binaries-gammaloop-integration-tests-b8cda0d438c96d4f-deps] +++ command cargo --version
  17. 2.78 s [gammaloop-crate-test-binaries-gammaloop-integration-tests-b8cda0d438c96d4f-deps] cargo 1.97.0 (c980f4866 2026-06-30)
  18. 2.78 s [gammaloop-crate-test-binaries-gammaloop-integration-tests-b8cda0d438c96d4f-deps] +++ command cargo test --profile ci-optim --no-run --offline -p gammaloop-integration-tests
  19. 3.47 s [gammaloop-crate-test-binaries-gammaloop-integration-tests-b8cda0d438c96d4f-deps] Compiling gammaloop-integration-tests v0.1.0 (/build/source/tests)
  20. 3.60 s [gammaloop-crate-test-binaries-gammaloop-integration-tests-b8cda0d438c96d4f-deps] error[E0560]: struct `CutInfo` has no field named `lmb_channel_id`
  21. 3.60 s [gammaloop-crate-test-binaries-gammaloop-integration-tests-b8cda0d438c96d4f-deps] --> tests/tests/test_differential.rs:86:13
  22. 3.60 s [gammaloop-crate-test-binaries-gammaloop-integration-tests-b8cda0d438c96d4f-deps] |
  23. 3.60 s [gammaloop-crate-test-binaries-gammaloop-integration-tests-b8cda0d438c96d4f-deps] 86 | lmb_channel_id: None,
  24. 3.60 s [gammaloop-crate-test-binaries-gammaloop-integration-tests-b8cda0d438c96d4f-deps] | ^^^^^^^^^^^^^^ `CutInfo` does not have this field
  25. 3.60 s [gammaloop-crate-test-binaries-gammaloop-integration-tests-b8cda0d438c96d4f-deps] |
  26. 3.60 s [gammaloop-crate-test-binaries-gammaloop-integration-tests-b8cda0d438c96d4f-deps] = note: available fields are: `sampling_channel_id`, `sampling_channel_edge_ids`
  27. 3.60 s [gammaloop-crate-test-binaries-gammaloop-integration-tests-b8cda0d438c96d4f-deps]
  28. 3.60 s [gammaloop-crate-test-binaries-gammaloop-integration-tests-b8cda0d438c96d4f-deps] error[E0560]: struct `CutInfo` has no field named `lmb_channel_edge_ids`
  29. 3.60 s [gammaloop-crate-test-binaries-gammaloop-integration-tests-b8cda0d438c96d4f-deps] --> tests/tests/test_differential.rs:87:13
  30. 3.60 s [gammaloop-crate-test-binaries-gammaloop-integration-tests-b8cda0d438c96d4f-deps] |
  31. 3.60 s [gammaloop-crate-test-binaries-gammaloop-integration-tests-b8cda0d438c96d4f-deps] 87 | lmb_channel_edge_ids: None,
  32. 3.60 s [gammaloop-crate-test-binaries-gammaloop-integration-tests-b8cda0d438c96d4f-deps] | ^^^^^^^^^^^^^^^^^^^^ `CutInfo` does not have this field
  33. 3.60 s [gammaloop-crate-test-binaries-gammaloop-integration-tests-b8cda0d438c96d4f-deps] |
  34. 3.60 s [gammaloop-crate-test-binaries-gammaloop-integration-tests-b8cda0d438c96d4f-deps] = note: available fields are: `sampling_channel_id`, `sampling_channel_edge_ids`
  35. 3.60 s [gammaloop-crate-test-binaries-gammaloop-integration-tests-b8cda0d438c96d4f-deps]
  36. 3.62 s [gammaloop-crate-test-binaries-gammaloop-integration-tests-b8cda0d438c96d4f-deps] error[E0063]: missing field `reference_moments` in initializer of `GraphEvaluationResult<_>`
  37. 3.62 s [gammaloop-crate-test-binaries-gammaloop-integration-tests-b8cda0d438c96d4f-deps] --> tests/tests/test_differential.rs:532:19
  38. 3.62 s [gammaloop-crate-test-binaries-gammaloop-integration-tests-b8cda0d438c96d4f-deps] |
  39. 3.62 s [gammaloop-crate-test-binaries-gammaloop-integration-tests-b8cda0d438c96d4f-deps] 532 | let mut lhs = GraphEvaluationResult {
  40. 3.62 s [gammaloop-crate-test-binaries-gammaloop-integration-tests-b8cda0d438c96d4f-deps] | ^^^^^^^^^^^^^^^^^^^^^ missing `reference_moments`
  41. 3.62 s [gammaloop-crate-test-binaries-gammaloop-integration-tests-b8cda0d438c96d4f-deps]
  42. 3.62 s [gammaloop-crate-test-binaries-gammaloop-integration-tests-b8cda0d438c96d4f-deps] error[E0063]: missing field `reference_moments` in initializer of `GraphEvaluationResult<_>`
  43. 3.62 s [gammaloop-crate-test-binaries-gammaloop-integration-tests-b8cda0d438c96d4f-deps] --> tests/tests/test_differential.rs:539:15
  44. 3.62 s [gammaloop-crate-test-binaries-gammaloop-integration-tests-b8cda0d438c96d4f-deps] |
  45. 3.62 s [gammaloop-crate-test-binaries-gammaloop-integration-tests-b8cda0d438c96d4f-deps] 539 | let rhs = GraphEvaluationResult {
  46. 3.62 s [gammaloop-crate-test-binaries-gammaloop-integration-tests-b8cda0d438c96d4f-deps] | ^^^^^^^^^^^^^^^^^^^^^ missing `reference_moments`
  47. 3.62 s [gammaloop-crate-test-binaries-gammaloop-integration-tests-b8cda0d438c96d4f-deps]
  48. 3.72 s [gammaloop-crate-test-binaries-gammaloop-integration-tests-b8cda0d438c96d4f-deps] Some errors have detailed explanations: E0063, E0560.
  49. 3.72 s [gammaloop-crate-test-binaries-gammaloop-integration-tests-b8cda0d438c96d4f-deps] For more information about an error, try `rustc --explain E0063`.
  50. 3.73 s [gammaloop-crate-test-binaries-gammaloop-integration-tests-b8cda0d438c96d4f-deps] error: could not compile `gammaloop-integration-tests` (test "test_differential") due to 4 previous errors
  51. 3.73 s [gammaloop-crate-test-binaries-gammaloop-integration-tests-b8cda0d438c96d4f-deps] warning: build failed, waiting for other jobs to finish...
  52. 3.74 s [gammaloop-crate-test-binaries-gammaloop-integration-tests-b8cda0d438c96d4f-deps] error[E0609]: no field `lmb_channel_edge_ids` on type `CutInfo`
  53. 3.74 s [gammaloop-crate-test-binaries-gammaloop-integration-tests-b8cda0d438c96d4f-deps] --> tests/tests/test_evaluation_api.rs:311:10
  54. 3.74 s [gammaloop-crate-test-binaries-gammaloop-integration-tests-b8cda0d438c96d4f-deps] |
  55. 3.74 s [gammaloop-crate-test-binaries-gammaloop-integration-tests-b8cda0d438c96d4f-deps] 311 | .lmb_channel_edge_ids
  56. 3.74 s [gammaloop-crate-test-binaries-gammaloop-integration-tests-b8cda0d438c96d4f-deps] | ^^^^^^^^^^^^^^^^^^^^ unknown field
  57. 3.74 s [gammaloop-crate-test-binaries-gammaloop-integration-tests-b8cda0d438c96d4f-deps] |
  58. 3.74 s [gammaloop-crate-test-binaries-gammaloop-integration-tests-b8cda0d438c96d4f-deps] = note: available fields are: `particle_pdgs`, `cut_id`, `graph_id`, `graph_group_id`, `orientation_id` ... and 2 others
  59. 3.74 s [gammaloop-crate-test-binaries-gammaloop-integration-tests-b8cda0d438c96d4f-deps]
  60. 3.78 s [gammaloop-crate-test-binaries-gammaloop-integration-tests-b8cda0d438c96d4f-deps] error[E0609]: no field `lmb_channel_edge_ids` on type `CutInfo`
  61. 3.78 s [gammaloop-crate-test-binaries-gammaloop-integration-tests-b8cda0d438c96d4f-deps] --> tests/tests/test_evaluation_api.rs:591:26
  62. 3.78 s [gammaloop-crate-test-binaries-gammaloop-integration-tests-b8cda0d438c96d4f-deps] |
  63. 3.78 s [gammaloop-crate-test-binaries-gammaloop-integration-tests-b8cda0d438c96d4f-deps] 591 | .lmb_channel_edge_ids
  64. 3.78 s [gammaloop-crate-test-binaries-gammaloop-integration-tests-b8cda0d438c96d4f-deps] | ^^^^^^^^^^^^^^^^^^^^ unknown field
  65. 3.78 s [gammaloop-crate-test-binaries-gammaloop-integration-tests-b8cda0d438c96d4f-deps] |
  66. 3.78 s [gammaloop-crate-test-binaries-gammaloop-integration-tests-b8cda0d438c96d4f-deps] = note: available fields are: `particle_pdgs`, `cut_id`, `graph_id`, `graph_group_id`, `orientation_id` ... and 2 others
  67. 3.78 s [gammaloop-crate-test-binaries-gammaloop-integration-tests-b8cda0d438c96d4f-deps]
  68. 3.84 s [gammaloop-crate-test-binaries-gammaloop-integration-tests-b8cda0d438c96d4f-deps] error[E0609]: no field `lmb_channel_edge_ids` on type `CutInfo`
  69. 3.84 s [gammaloop-crate-test-binaries-gammaloop-integration-tests-b8cda0d438c96d4f-deps] --> tests/tests/test_evaluation_api.rs:1177:18
  70. 3.84 s [gammaloop-crate-test-binaries-gammaloop-integration-tests-b8cda0d438c96d4f-deps] |
  71. 3.84 s [gammaloop-crate-test-binaries-gammaloop-integration-tests-b8cda0d438c96d4f-deps] 1177 | .lmb_channel_edge_ids
  72. 3.84 s [gammaloop-crate-test-binaries-gammaloop-integration-tests-b8cda0d438c96d4f-deps] | ^^^^^^^^^^^^^^^^^^^^ unknown field
  73. 3.84 s [gammaloop-crate-test-binaries-gammaloop-integration-tests-b8cda0d438c96d4f-deps] |
  74. 3.84 s [gammaloop-crate-test-binaries-gammaloop-integration-tests-b8cda0d438c96d4f-deps] = note: available fields are: `particle_pdgs`, `cut_id`, `graph_id`, `graph_group_id`, `orientation_id` ... and 2 others
  75. 3.84 s [gammaloop-crate-test-binaries-gammaloop-integration-tests-b8cda0d438c96d4f-deps]
  76. 4.00 s [gammaloop-crate-test-binaries-gammaloop-integration-tests-b8cda0d438c96d4f-deps] error[E0609]: no field `lmb_channel_edge_ids` on type `CutInfo`
  77. 4.00 s [gammaloop-crate-test-binaries-gammaloop-integration-tests-b8cda0d438c96d4f-deps] --> tests/tests/test_evaluation_api.rs:1222:22
  78. 4.00 s [gammaloop-crate-test-binaries-gammaloop-integration-tests-b8cda0d438c96d4f-deps] |
  79. 4.00 s [gammaloop-crate-test-binaries-gammaloop-integration-tests-b8cda0d438c96d4f-deps] 1222 | .lmb_channel_edge_ids
  80. 4.00 s [gammaloop-crate-test-binaries-gammaloop-integration-tests-b8cda0d438c96d4f-deps] | ^^^^^^^^^^^^^^^^^^^^ unknown field
  81. 4.00 s [gammaloop-crate-test-binaries-gammaloop-integration-tests-b8cda0d438c96d4f-deps] |
  82. 4.00 s [gammaloop-crate-test-binaries-gammaloop-integration-tests-b8cda0d438c96d4f-deps] = note: available fields are: `particle_pdgs`, `cut_id`, `graph_id`, `graph_group_id`, `orientation_id` ... and 2 others
  83. 4.00 s [gammaloop-crate-test-binaries-gammaloop-integration-tests-b8cda0d438c96d4f-deps]
  84. 4.01 s [gammaloop-crate-test-binaries-gammaloop-integration-tests-b8cda0d438c96d4f-deps] error[E0609]: no field `lmb_channel_edge_ids` on type `CutInfo`
  85. 4.01 s [gammaloop-crate-test-binaries-gammaloop-integration-tests-b8cda0d438c96d4f-deps] --> tests/tests/test_evaluation_api.rs:1281:14
  86. 4.01 s [gammaloop-crate-test-binaries-gammaloop-integration-tests-b8cda0d438c96d4f-deps] |
  87. 4.01 s [gammaloop-crate-test-binaries-gammaloop-integration-tests-b8cda0d438c96d4f-deps] 1281 | .lmb_channel_edge_ids
  88. 4.01 s [gammaloop-crate-test-binaries-gammaloop-integration-tests-b8cda0d438c96d4f-deps] | ^^^^^^^^^^^^^^^^^^^^ unknown field
  89. 4.01 s [gammaloop-crate-test-binaries-gammaloop-integration-tests-b8cda0d438c96d4f-deps] |
  90. 4.01 s [gammaloop-crate-test-binaries-gammaloop-integration-tests-b8cda0d438c96d4f-deps] = note: available fields are: `particle_pdgs`, `cut_id`, `graph_id`, `graph_group_id`, `orientation_id` ... and 2 others
  91. 4.01 s [gammaloop-crate-test-binaries-gammaloop-integration-tests-b8cda0d438c96d4f-deps]
  92. 4.10 s [gammaloop-crate-test-binaries-gammaloop-integration-tests-b8cda0d438c96d4f-deps] error[E0609]: no field `lmb_channel_edge_ids` on type `CutInfo`
  93. 4.10 s [gammaloop-crate-test-binaries-gammaloop-integration-tests-b8cda0d438c96d4f-deps] --> tests/tests/test_evaluation_api.rs:1428:18
  94. 4.11 s [gammaloop-crate-test-binaries-gammaloop-integration-tests-b8cda0d438c96d4f-deps] |
  95. 4.11 s [gammaloop-crate-test-binaries-gammaloop-integration-tests-b8cda0d438c96d4f-deps] 1428 | .lmb_channel_edge_ids
  96. 4.11 s [gammaloop-crate-test-binaries-gammaloop-integration-tests-b8cda0d438c96d4f-deps] | ^^^^^^^^^^^^^^^^^^^^ unknown field
  97. 4.11 s [gammaloop-crate-test-binaries-gammaloop-integration-tests-b8cda0d438c96d4f-deps] |
  98. 4.11 s [gammaloop-crate-test-binaries-gammaloop-integration-tests-b8cda0d438c96d4f-deps] = note: available fields are: `particle_pdgs`, `cut_id`, `graph_id`, `graph_group_id`, `orientation_id` ... and 2 others
  99. 4.11 s [gammaloop-crate-test-binaries-gammaloop-integration-tests-b8cda0d438c96d4f-deps]
  100. 4.30 s [gammaloop-crate-test-binaries-gammaloop-integration-tests-b8cda0d438c96d4f-deps] For more information about this error, try `rustc --explain E0609`.
  101. 4.32 s [gammaloop-crate-test-binaries-gammaloop-integration-tests-b8cda0d438c96d4f-deps] error: could not compile `gammaloop-integration-tests` (test "test_evaluation_api") due to 6 previous errors
  102. 5.31 s [gammaloop-crate-test-binaries-gammaloop-integration-tests-b8cda0d438c96d4f-deps] error[E0609]: no field `lmb_channel_id` on type `CutInfo`
  103. 5.31 s [gammaloop-crate-test-binaries-gammaloop-integration-tests-b8cda0d438c96d4f-deps] --> tests/tests/test_runs/utils.rs:568:36
  104. 5.31 s [gammaloop-crate-test-binaries-gammaloop-integration-tests-b8cda0d438c96d4f-deps] |
  105. 5.31 s [gammaloop-crate-test-binaries-gammaloop-integration-tests-b8cda0d438c96d4f-deps] 568 | event.cut_info.lmb_channel_id,
  106. 5.31 s [gammaloop-crate-test-binaries-gammaloop-integration-tests-b8cda0d438c96d4f-deps] | ^^^^^^^^^^^^^^ unknown field
  107. 5.31 s [gammaloop-crate-test-binaries-gammaloop-integration-tests-b8cda0d438c96d4f-deps] |
  108. 5.31 s [gammaloop-crate-test-binaries-gammaloop-integration-tests-b8cda0d438c96d4f-deps] = note: available fields are: `particle_pdgs`, `cut_id`, `graph_id`, `graph_group_id`, `orientation_id` ... and 2 others
  109. 5.31 s [gammaloop-crate-test-binaries-gammaloop-integration-tests-b8cda0d438c96d4f-deps]
  110. 5.31 s [gammaloop-crate-test-binaries-gammaloop-integration-tests-b8cda0d438c96d4f-deps] error[E0609]: no field `lmb_channel_id` on type `CutInfo`
  111. 5.31 s [gammaloop-crate-test-binaries-gammaloop-integration-tests-b8cda0d438c96d4f-deps] --> tests/tests/test_runs/utils.rs:580:36
  112. 5.31 s [gammaloop-crate-test-binaries-gammaloop-integration-tests-b8cda0d438c96d4f-deps] |
  113. 5.31 s [gammaloop-crate-test-binaries-gammaloop-integration-tests-b8cda0d438c96d4f-deps] 580 | event.cut_info.lmb_channel_id,
  114. 5.31 s [gammaloop-crate-test-binaries-gammaloop-integration-tests-b8cda0d438c96d4f-deps] | ^^^^^^^^^^^^^^ unknown field
  115. 5.31 s [gammaloop-crate-test-binaries-gammaloop-integration-tests-b8cda0d438c96d4f-deps] |
  116. 5.31 s [gammaloop-crate-test-binaries-gammaloop-integration-tests-b8cda0d438c96d4f-deps] = note: available fields are: `particle_pdgs`, `cut_id`, `graph_id`, `graph_group_id`, `orientation_id` ... and 2 others
  117. 5.31 s [gammaloop-crate-test-binaries-gammaloop-integration-tests-b8cda0d438c96d4f-deps]
  118. 6.49 s [gammaloop-crate-test-binaries-gammaloop-integration-tests-b8cda0d438c96d4f-deps] error: could not compile `gammaloop-integration-tests` (test "test_runs") due to 2 previous errors
  119. 55.39 s Progress: 0 of 2 built (1 failed)
  120. 55.39 s Failed to build gammaloop-crate-test-binaries-gammaloop-integration-tests-b8cda0d438c96d4f-deps after 54.8s
  121. 55.39 s error: Cannot build '/nix/store/87hq7ppbbyjsyasszv0zcc1zv7d81635-gammaloop-crate-test-binaries-gammaloop-integration-tests-b8cda0d438c96d4f-deps-0.1.0.drv'.
  122. 55.39 s Reason: builder failed with exit code 101.
  123. 55.39 s Output paths:
  124. 55.39 s /nix/store/8k7s2i9d6dyh8kk6s8dp9rn2f63qcf5n-gammaloop-crate-test-binaries-gammaloop-integration-tests-b8cda0d438c96d4f-deps-0.1.0
  125. 55.39 s Last 115 log lines:
  126. 55.39 s > Running phase: unpackPhase
  127. 55.39 s > unpacking source archive /nix/store/a2mf5ss32qm0vv8qxhcf041bxajmsxnq-source
  128. 55.39 s > source root is source
  129. 55.39 s > Running phase: patchPhase
  130. 55.39 s > Executing configureCargoCommonVars
  131. 55.39 s > copying cargo artifacts from /nix/store/crwvzla71cgag15sf2ldrx93yxi308jj-gammaloop-crate-test-binaries-gammaloop-integration-tests-b8cda0d438c96d4f-inputs/target to target
  132. 55.39 s > will deep copy artifacts (instead of symlinking) as requested
  133. 55.39 s > Running phase: updateAutotoolsGnuConfigScriptsPhase
  134. 55.39 s > Running phase: configurePhase
  135. 55.39 s > will append /build/source/.cargo-home/config.toml with contents of /nix/store/5drf77x6km4ky7gwlrzdx9bbd6fz09g3-vendor-cargo-deps/config.toml
  136. 55.39 s > default configurePhase, nothing to do
  137. 55.39 s > Running phase: buildPhase
  138. 55.39 s > +++ command cargo --version
  139. 55.39 s > cargo 1.97.0 (c980f4866 2026-06-30)
  140. 55.39 s > +++ command cargo test --profile ci-optim --no-run --offline -p gammaloop-integration-tests
  141. 55.39 s > Compiling gammaloop-integration-tests v0.1.0 (/build/source/tests)
  142. 55.39 s > error[E0560]: struct `CutInfo` has no field named `lmb_channel_id`
  143. 55.39 s > --> tests/tests/test_differential.rs:86:13
  144. 55.39 s > |
  145. 55.39 s > 86 | lmb_channel_id: None,
  146. 55.39 s > | ^^^^^^^^^^^^^^ `CutInfo` does not have this field
  147. 55.39 s > |
  148. 55.39 s > = note: available fields are: `sampling_channel_id`, `sampling_channel_edge_ids`
  149. 55.39 s >
  150. 55.39 s > error[E0560]: struct `CutInfo` has no field named `lmb_channel_edge_ids`
  151. 55.39 s > --> tests/tests/test_differential.rs:87:13
  152. 55.39 s > |
  153. 55.39 s > 87 | lmb_channel_edge_ids: None,
  154. 55.39 s > | ^^^^^^^^^^^^^^^^^^^^ `CutInfo` does not have this field
  155. 55.39 s > |
  156. 55.39 s > = note: available fields are: `sampling_channel_id`, `sampling_channel_edge_ids`
  157. 55.39 s >
  158. 55.39 s > error[E0063]: missing field `reference_moments` in initializer of `GraphEvaluationResult<_>`
  159. 55.39 s > --> tests/tests/test_differential.rs:532:19
  160. 55.39 s > |
  161. 55.39 s > 532 | let mut lhs = GraphEvaluationResult {
  162. 55.39 s > | ^^^^^^^^^^^^^^^^^^^^^ missing `reference_moments`
  163. 55.39 s >
  164. 55.39 s > error[E0063]: missing field `reference_moments` in initializer of `GraphEvaluationResult<_>`
  165. 55.39 s > --> tests/tests/test_differential.rs:539:15
  166. 55.39 s > |
  167. 55.39 s > 539 | let rhs = GraphEvaluationResult {
  168. 55.39 s > | ^^^^^^^^^^^^^^^^^^^^^ missing `reference_moments`
  169. 55.39 s >
  170. 55.39 s > Some errors have detailed explanations: E0063, E0560.
  171. 55.39 s > For more information about an error, try `rustc --explain E0063`.
  172. 55.39 s > error: could not compile `gammaloop-integration-tests` (test "test_differential") due to 4 previous errors
  173. 55.39 s > warning: build failed, waiting for other jobs to finish...
  174. 55.39 s > error[E0609]: no field `lmb_channel_edge_ids` on type `CutInfo`
  175. 55.39 s > --> tests/tests/test_evaluation_api.rs:311:10
  176. 55.39 s > |
  177. 55.39 s > 311 | .lmb_channel_edge_ids
  178. 55.39 s > | ^^^^^^^^^^^^^^^^^^^^ unknown field
  179. 55.39 s > |
  180. 55.39 s > = note: available fields are: `particle_pdgs`, `cut_id`, `graph_id`, `graph_group_id`, `orientation_id` ... and 2 others
  181. 55.39 s >
  182. 55.39 s > error[E0609]: no field `lmb_channel_edge_ids` on type `CutInfo`
  183. 55.39 s > --> tests/tests/test_evaluation_api.rs:591:26
  184. 55.39 s > |
  185. 55.39 s > 591 | .lmb_channel_edge_ids
  186. 55.39 s > | ^^^^^^^^^^^^^^^^^^^^ unknown field
  187. 55.39 s > |
  188. 55.39 s > = note: available fields are: `particle_pdgs`, `cut_id`, `graph_id`, `graph_group_id`, `orientation_id` ... and 2 others
  189. 55.39 s >
  190. 55.39 s > error[E0609]: no field `lmb_channel_edge_ids` on type `CutInfo`
  191. 55.39 s > --> tests/tests/test_evaluation_api.rs:1177:18
  192. 55.39 s > |
  193. 55.39 s > 1177 | .lmb_channel_edge_ids
  194. 55.39 s > | ^^^^^^^^^^^^^^^^^^^^ unknown field
  195. 55.39 s > |
  196. 55.39 s > = note: available fields are: `particle_pdgs`, `cut_id`, `graph_id`, `graph_group_id`, `orientation_id` ... and 2 others
  197. 55.39 s >
  198. 55.39 s > error[E0609]: no field `lmb_channel_edge_ids` on type `CutInfo`
  199. 55.39 s > --> tests/tests/test_evaluation_api.rs:1222:22
  200. 55.39 s > |
  201. 55.39 s > 1222 | .lmb_channel_edge_ids
  202. 55.39 s > | ^^^^^^^^^^^^^^^^^^^^ unknown field
  203. 55.39 s > |
  204. 55.39 s > = note: available fields are: `particle_pdgs`, `cut_id`, `graph_id`, `graph_group_id`, `orientation_id` ... and 2 others
  205. 55.39 s >
  206. 55.39 s > error[E0609]: no field `lmb_channel_edge_ids` on type `CutInfo`
  207. 55.39 s > --> tests/tests/test_evaluation_api.rs:1281:14
  208. 55.39 s > |
  209. 55.39 s > 1281 | .lmb_channel_edge_ids
  210. 55.39 s > | ^^^^^^^^^^^^^^^^^^^^ unknown field
  211. 55.39 s > |
  212. 55.39 s > = note: available fields are: `particle_pdgs`, `cut_id`, `graph_id`, `graph_group_id`, `orientation_id` ... and 2 others
  213. 55.39 s >
  214. 55.39 s > error[E0609]: no field `lmb_channel_edge_ids` on type `CutInfo`
  215. 55.39 s > --> tests/tests/test_evaluation_api.rs:1428:18
  216. 55.39 s > |
  217. 55.39 s > 1428 | .lmb_channel_edge_ids
  218. 55.39 s > | ^^^^^^^^^^^^^^^^^^^^ unknown field
  219. 55.39 s > |
  220. 55.39 s > = note: available fields are: `particle_pdgs`, `cut_id`, `graph_id`, `graph_group_id`, `orientation_id` ... and 2 others
  221. 55.39 s >
  222. 55.39 s > For more information about this error, try `rustc --explain E0609`.
  223. 55.39 s > error: could not compile `gammaloop-integration-tests` (test "test_evaluation_api") due to 6 previous errors
  224. 55.39 s > error[E0609]: no field `lmb_channel_id` on type `CutInfo`
  225. 55.39 s > --> tests/tests/test_runs/utils.rs:568:36
  226. 55.39 s > |
  227. 55.39 s > 568 | event.cut_info.lmb_channel_id,
  228. 55.39 s > | ^^^^^^^^^^^^^^ unknown field
  229. 55.39 s > |
  230. 55.39 s > = note: available fields are: `particle_pdgs`, `cut_id`, `graph_id`, `graph_group_id`, `orientation_id` ... and 2 others
  231. 55.39 s >
  232. 55.39 s > error[E0609]: no field `lmb_channel_id` on type `CutInfo`
  233. 55.39 s > --> tests/tests/test_runs/utils.rs:580:36
  234. 55.39 s > |
  235. 55.39 s > 580 | event.cut_info.lmb_channel_id,
  236. 55.39 s > | ^^^^^^^^^^^^^^ unknown field
  237. 55.39 s > |
  238. 55.39 s > = note: available fields are: `particle_pdgs`, `cut_id`, `graph_id`, `graph_group_id`, `orientation_id` ... and 2 others
  239. 55.39 s >
  240. 55.39 s > error: could not compile `gammaloop-integration-tests` (test "test_runs") due to 2 previous errors
  241. 55.39 s For full logs, run:
  242. 55.39 s nix log /nix/store/87hq7ppbbyjsyasszv0zcc1zv7d81635-gammaloop-crate-test-binaries-gammaloop-integration-tests-b8cda0d438c96d4f-deps-0.1.0.drv
  243. 55.39 s error: Cannot build '/nix/store/lm6y269bqrdbaw9nlnfib2x02cf702w3-nix-ci-artifact-barrier-crate-test-binaries-gammaloop-integration-tests.drv'.
  244. 55.39 s Reason: 1 dependency failed.
  245. 55.39 s Output paths:
  246. 55.39 s /nix/store/clbszfvrq0b59j8j7yx83vr1vs7l8rbq-nix-ci-artifact-barrier-crate-test-binaries-gammaloop-integration-tests
  247. 55.39 s Build failed due to failed dependency
  248. 55.40 s Build failed.