build packages.x86_64-linux.crate-test-binaries-gammaloop-integration-tests

Reproduce this run
Retry Run
  1. 0.00 s $ /nix/store/9ypz3flqsrl5xl495mm8h645gadjsxi1-coreutils-9.11/bin/timeout --kill-after=15s 7200s /nix/store/23zk8sgzamrbmj1fday15szf7f2279s8-nix-2.34.7/bin/nix --extra-experimental-features nix-command --extra-experimental-features flakes --log-format internal-json build --no-link --print-out-paths git+https://github.com/alphal00p/gammaloop?ref=advanced_sampling&rev=ad713af8ba0173320df0aef4e53935ec4cf8a238&shallow=1#packages.x86_64-linux.crate-test-binaries-gammaloop-integration-tests --print-build-logs
  2. 3.32 s
  3. 4.25 s Downloading cached cargoHelperFunctionsHook from https://cache.nix-ci.com
  4. 4.25 s Downloading cached configureCargoCommonVarsHook from https://cache.nix-ci.com
  5. 4.25 s Downloading cached configureCargoVendoredDepsHook from https://cache.nix-ci.com
  6. 4.25 s Downloading cached gammaloop-ci-test-binary-dependencies-b8cda0d438c96d4f-Cargo.toml from https://cache.nix-ci.com
  7. 4.26 s Downloading cached inheritCargoArtifactsHook from https://cache.nix-ci.com
  8. 4.26 s Downloading cached installCargoArtifactsHook from https://cache.nix-ci.com
  9. 4.26 s Downloading cached replaceCargoLockHook from https://cache.nix-ci.com
  10. 4.26 s Downloading cached mailcap from https://cache.nix-ci.com
  11. 4.26 s Downloading cached tzdata from https://cache.nix-ci.com
  12. 4.26 s Downloading cached expand-response-params from https://cache.nix-ci.com
  13. 4.26 s Downloading cached expand-response-params from https://cache.nix-ci.com
  14. 4.26 s Downloading cached expat from https://cache.nix-ci.com
  15. 4.26 s Downloading cached gdbm-1.26-lib from https://cache.nix-ci.com
  16. 4.26 s Downloading cached gmp-with-cxx from https://cache.nix-ci.com
  17. 4.26 s Downloading cached gnum4 from https://cache.nix-ci.com
  18. 4.26 s Downloading cached linux-headers from https://cache.nix-ci.com
  19. 4.27 s Downloaded cached configureCargoVendoredDepsHook (1632 B) in 12ms
  20. 4.27 s Downloaded cached configureCargoCommonVarsHook (2728 B) in 12ms
  21. 4.27 s Downloaded cached cargoHelperFunctionsHook (1016 B) in 13ms
  22. 4.27 s Downloaded cached gammaloop-ci-test-binary-dependencies-b8cda0d438c96d4f-Cargo.toml (1344 B) in 13ms
  23. 4.27 s Downloaded cached inheritCargoArtifactsHook (5944 B) in 13ms
  24. 4.27 s Downloaded cached installCargoArtifactsHook (4624 B) in 14ms
  25. 4.27 s Downloaded cached replaceCargoLockHook (1032 B) in 13ms
  26. 4.28 s Downloaded cached mailcap (116 KiB) in 17ms
  27. 4.28 s Downloaded cached expand-response-params (16 KiB) in 22ms
  28. 4.29 s Downloaded cached expand-response-params (16 KiB) in 27ms
  29. 4.30 s Downloaded cached expat (312 KiB) in 42ms
  30. 4.30 s Downloaded cached gdbm-1.26-lib (448 KiB) in 42ms
  31. 4.31 s Downloaded cached gmp-with-cxx (765 KiB) in 45ms
  32. 4.31 s Downloaded cached gnum4 (1.1 MiB) in 52ms
  33. 4.33 s Building /nix/store/lw1x11cpmlidxcnakx6xvy0laaxvcp34-crane-dummy-cargo-target.rs.drv
  34. 4.35 s Downloaded cached tzdata (2 MiB) in 89ms
  35. 4.35 s Building /nix/store/9d5pq3a3kirmah8ad81bjkjxw8qcs37i-crane-dummy-proc-macro-cargo-target.rs.drv
  36. 4.37 s Building /nix/store/7bvilb8f8jk96pxj7jzk23i0qicj2vy5-gammaloop-ci-test-binary-dependencies-b8cda0d438c96d4f-gammaloop-integration-tests-dev-dependency.toml.drv
  37. 4.39 s Progress: 0 of 40 built (3 building), 1 of 82 downloaded from cache (15 downloading)
  38. 4.39 s Progress: 0 of 40 built (3 building), 2 of 82 downloaded from cache (14 downloading)
  39. 4.39 s Progress: 0 of 40 built (3 building), 3 of 82 downloaded from cache (13 downloading)
  40. 4.40 s Progress: 0 of 40 built (3 building), 4 of 82 downloaded from cache (12 downloading)
  41. 4.40 s Progress: 0 of 40 built (3 building), 5 of 82 downloaded from cache (11 downloading)
  42. 4.40 s Progress: 0 of 40 built (3 building), 6 of 82 downloaded from cache (10 downloading)
  43. 4.40 s Progress: 0 of 40 built (3 building), 7 of 82 downloaded from cache (9 downloading)
  44. 4.40 s Progress: 0 of 40 built (3 building), 8 of 82 downloaded from cache (8 downloading)
  45. 4.40 s Progress: 0 of 40 built (3 building), 9 of 82 downloaded from cache (7 downloading)
  46. 4.40 s Progress: 0 of 40 built (3 building), 10 of 82 downloaded from cache (6 downloading)
  47. 4.40 s Progress: 0 of 40 built (3 building), 11 of 82 downloaded from cache (5 downloading)
  48. 4.40 s Progress: 0 of 40 built (3 building), 12 of 82 downloaded from cache (4 downloading)
  49. 4.40 s Progress: 0 of 40 built (3 building), 13 of 82 downloaded from cache (3 downloading)
  50. 4.40 s Progress: 0 of 40 built (3 building), 14 of 82 downloaded from cache (2 downloading)
  51. 4.40 s Progress: 0 of 40 built (3 building), 15 of 82 downloaded from cache (1 downloading)
  52. 4.41 s Downloaded cached linux-headers (7.1 MiB) in 144ms
  53. 4.41 s [crane-dummy-cargo-target.rs:post-build] Uploading to the NixCI cache: /nix/store/hd50hqi25fymr09a2w4xdiy5jmb2cfl5-crane-dummy-cargo-target.rs
  54. 4.45 s [crane-dummy-cargo-target.rs:post-build] warning: 'warn-short-path-literals' is deprecated, use 'lint-short-path-literals = ignore' instead
  55. 4.47 s [crane-dummy-cargo-target.rs:post-build] copying 0 paths...
  56. 4.51 s [crane-dummy-cargo-target.rs:post-build] warning: 'warn-short-path-literals' is deprecated, use 'lint-short-path-literals = ignore' instead
  57. 4.55 s [crane-dummy-cargo-target.rs:post-build] copying 0 paths...
  58. 4.55 s Uploaded crane-dummy-cargo-target.rs in 155ms
  59. 4.55 s Progress: 1 of 41 built (2 building), 15 of 82 downloaded from cache (1 downloading)
  60. 4.55 s Built crane-dummy-cargo-target.rs in 224ms
  61. 4.57 s [crane-dummy-proc-macro-cargo-target.rs:post-build] Uploading to the NixCI cache: /nix/store/z0b4s6pznqwlbyw5v4bbq7k1kp721g19-crane-dummy-proc-macro-cargo-target.rs
  62. 4.60 s [crane-dummy-proc-macro-cargo-target.rs:post-build] warning: 'warn-short-path-literals' is deprecated, use 'lint-short-path-literals = ignore' instead
  63. 4.63 s [crane-dummy-proc-macro-cargo-target.rs:post-build] copying 0 paths...
  64. 4.67 s [crane-dummy-proc-macro-cargo-target.rs:post-build] warning: 'warn-short-path-literals' is deprecated, use 'lint-short-path-literals = ignore' instead
  65. 4.70 s [crane-dummy-proc-macro-cargo-target.rs:post-build] copying 0 paths...
  66. 4.71 s Uploaded crane-dummy-proc-macro-cargo-target.rs in 154ms
  67. 4.71 s Progress: 2 of 42 built (1 building), 15 of 82 downloaded from cache (1 downloading)
  68. 4.71 s Built crane-dummy-proc-macro-cargo-target.rs in 362ms
  69. 4.71 s Downloading cached binutils-2.46-lib from https://cache.nix-ci.com
  70. 4.71 s Downloading cached cargo-stable-2026-07 from https://cache.nix-ci.com
  71. 4.71 s Downloading cached clippy-preview-stable-2026-07 from https://cache.nix-ci.com
  72. 4.71 s Downloading cached dummyBuild.rs from https://cache.nix-ci.com
  73. 4.71 s Downloading cached gammaloop-crate-gammaloop-workspace-hack-deps from https://cache.nix-ci.com
  74. 4.71 s Downloading cached glibc-2.42-67-bin from https://cache.nix-ci.com
  75. 4.71 s Downloading cached gmp from https://cache.nix-ci.com
  76. 4.71 s Downloading cached gnutar from https://cache.nix-ci.com
  77. 4.71 s Downloading cached libffi from https://cache.nix-ci.com
  78. 4.71 s Downloading cached llvm-tools-preview-stable-2026-07 from https://cache.nix-ci.com
  79. 4.71 s Downloading cached lndir from https://cache.nix-ci.com
  80. 4.71 s Downloading cached lz4-1.10.0-lib from https://cache.nix-ci.com
  81. 4.71 s Downloading cached mpdecimal from https://cache.nix-ci.com
  82. 4.71 s Downloading cached ncurses from https://cache.nix-ci.com
  83. 4.71 s Downloading cached openssl from https://cache.nix-ci.com
  84. 4.72 s Progress: 2 of 31 built (1 building), 16 of 82 downloaded from cache (15 downloading)
  85. 4.73 s [gammaloop-ci-test-binary-dependencies-b8cda0d438c96d4f-gammaloop-integration-tests-dev-dependency.toml:post-build] Uploading to the NixCI cache: /nix/store/2lfqmlw92swx4z82ikq7m59s1qqd8l2d-gammaloop-ci-test-binary-dependencies-b8cda0d438c96d4f-gammaloop-integration-tests-dev-dependency.toml
  86. 4.74 s Downloaded cached lndir (23 KiB) in 20ms
  87. 4.74 s Downloaded cached lz4-1.10.0-lib (256 KiB) in 27ms
  88. 4.75 s Downloaded cached libffi (72 KiB) in 35ms
  89. 4.75 s Downloaded cached gmp (722 KiB) in 38ms
  90. 4.76 s Downloaded cached gnutar (2.7 MiB) in 43ms
  91. 4.76 s Downloaded cached dummyBuild.rs (640 B) in 44ms
  92. 4.76 s Downloaded cached binutils-2.46-lib (2.9 MiB) in 48ms
  93. 4.76 s Downloaded cached mpdecimal (220 KiB) in 47ms
  94. 4.79 s Downloaded cached glibc-2.42-67-bin (2.8 MiB) in 75ms
  95. 4.79 s Downloaded cached openssl (8.9 MiB) in 75ms
  96. 4.80 s [gammaloop-ci-test-binary-dependencies-b8cda0d438c96d4f-gammaloop-integration-tests-dev-dependency.toml:post-build] warning: 'warn-short-path-literals' is deprecated, use 'lint-short-path-literals = ignore' instead
  97. 4.84 s [gammaloop-ci-test-binary-dependencies-b8cda0d438c96d4f-gammaloop-integration-tests-dev-dependency.toml:post-build] copying 0 paths...
  98. 4.89 s [gammaloop-ci-test-binary-dependencies-b8cda0d438c96d4f-gammaloop-integration-tests-dev-dependency.toml:post-build] warning: 'warn-short-path-literals' is deprecated, use 'lint-short-path-literals = ignore' instead
  99. 4.90 s Downloaded cached ncurses (3.7 MiB) in 182ms
  100. 4.94 s Downloaded cached clippy-preview-stable-2026-07 (22.9 MiB) in 226ms
  101. 4.95 s [gammaloop-ci-test-binary-dependencies-b8cda0d438c96d4f-gammaloop-integration-tests-dev-dependency.toml:post-build] copying 0 paths...
  102. 4.96 s Uploaded gammaloop-ci-test-binary-dependencies-b8cda0d438c96d4f-gammaloop-integration-tests-dev-dependency.toml in 242ms
  103. 4.96 s Progress: 3 of 32 built, 16 of 82 downloaded from cache (15 downloading)
  104. 4.96 s Built gammaloop-ci-test-binary-dependencies-b8cda0d438c96d4f-gammaloop-integration-tests-dev-dependency.toml in 591ms
  105. 4.96 s Downloading cached gmp-with-cxx-6.3.0-dev from https://cache.nix-ci.com
  106. 4.96 s Progress: 3 of 31 built, 17 of 82 downloaded from cache (15 downloading)
  107. 4.96 s Progress: 3 of 31 built, 18 of 82 downloaded from cache (14 downloading)
  108. 4.96 s Progress: 3 of 31 built, 19 of 82 downloaded from cache (13 downloading)
  109. 4.96 s Progress: 3 of 31 built, 20 of 82 downloaded from cache (12 downloading)
  110. 4.96 s Progress: 3 of 31 built, 21 of 82 downloaded from cache (11 downloading)
  111. 4.96 s Progress: 3 of 31 built, 22 of 82 downloaded from cache (10 downloading)
  112. 4.96 s Progress: 3 of 31 built, 23 of 82 downloaded from cache (9 downloading)
  113. 4.96 s Progress: 3 of 31 built, 24 of 82 downloaded from cache (8 downloading)
  114. 4.96 s Progress: 3 of 31 built, 25 of 82 downloaded from cache (7 downloading)
  115. 4.96 s Progress: 3 of 31 built, 26 of 82 downloaded from cache (6 downloading)
  116. 4.96 s Progress: 3 of 31 built, 27 of 82 downloaded from cache (5 downloading)
  117. 4.96 s Progress: 3 of 31 built, 28 of 82 downloaded from cache (4 downloading)
  118. 4.96 s Downloading cached mpfr from https://cache.nix-ci.com
  119. 4.96 s Downloading cached pkg-config from https://cache.nix-ci.com
  120. 4.97 s Downloading cached popt from https://cache.nix-ci.com
  121. 4.97 s Downloading cached rust-std-stable-2026-07 from https://cache.nix-ci.com
  122. 4.97 s Downloading cached rustc-stable-2026-07 from https://cache.nix-ci.com
  123. 4.97 s Downloading cached sqlite from https://cache.nix-ci.com
  124. 4.97 s Downloading cached util-linux-minimal-2.42.2-lib from https://cache.nix-ci.com
  125. 4.97 s Downloading cached xxhash from https://cache.nix-ci.com
  126. 4.97 s Downloading cached zstd from https://cache.nix-ci.com
  127. 4.97 s Downloading cached binutils from https://cache.nix-ci.com
  128. 4.97 s Downloading cached gammaloop-workspace-deps-deps from https://cache.nix-ci.com
  129. 4.97 s Downloading cached glibc-2.42-67-dev from https://cache.nix-ci.com
  130. 4.99 s Downloaded cached gmp-with-cxx-6.3.0-dev (211 KiB) in 27ms
  131. 4.99 s Progress: 3 of 27 built, 29 of 82 downloaded from cache (15 downloading)
  132. 4.99 s Downloading cached isl from https://cache.nix-ci.com
  133. 4.99 s Downloaded cached pkg-config (673 KiB) in 27ms
  134. 4.99 s Progress: 3 of 26 built, 30 of 82 downloaded from cache (15 downloading)
  135. 4.99 s Downloading cached mpfr from https://cache.nix-ci.com
  136. 5.00 s Downloaded cached mpfr (803 KiB) in 30ms
  137. 5.00 s Progress: 3 of 26 built, 31 of 82 downloaded from cache (15 downloading)
  138. 5.00 s Downloading cached openssl-3.6.3-bin from https://cache.nix-ci.com
  139. 5.01 s Downloaded cached popt (161 KiB) in 46ms
  140. 5.01 s Progress: 3 of 25 built, 32 of 82 downloaded from cache (15 downloading)
  141. 5.01 s Downloading cached libmpc from https://cache.nix-ci.com
  142. 5.01 s Downloaded cached util-linux-minimal-2.42.2-lib (2 MiB) in 48ms
  143. 5.01 s Progress: 3 of 25 built, 33 of 82 downloaded from cache (15 downloading)
  144. 5.01 s Downloading cached mpfr-4.2.2-dev from https://cache.nix-ci.com
  145. 5.02 s Downloaded cached xxhash (413 KiB) in 49ms
  146. 5.02 s Progress: 3 of 25 built, 34 of 82 downloaded from cache (15 downloading)
  147. 5.02 s Downloading cached pkg-config-wrapper from https://cache.nix-ci.com
  148. 5.03 s Downloaded cached sqlite (5.7 MiB) in 65ms
  149. 5.03 s Progress: 3 of 25 built, 35 of 82 downloaded from cache (15 downloading)
  150. 5.03 s Downloading cached readline from https://cache.nix-ci.com
  151. 5.03 s Downloaded cached zstd (1.1 MiB) in 68ms
  152. 5.03 s Progress: 3 of 25 built, 36 of 82 downloaded from cache (15 downloading)
  153. 5.03 s Downloading cached rsync from https://cache.nix-ci.com
  154. 5.06 s Downloaded cached openssl-3.6.3-bin (1.3 MiB) in 64ms
  155. 5.06 s Progress: 3 of 25 built, 37 of 82 downloaded from cache (15 downloading)
  156. 5.06 s Downloading cached zstd-1.5.7-bin from https://cache.nix-ci.com
  157. 5.06 s Downloaded cached mpfr (803 KiB) in 70ms
  158. 5.06 s Progress: 3 of 25 built, 38 of 82 downloaded from cache (15 downloading)
  159. 5.06 s Downloading cached openssl-3.6.3-dev from https://cache.nix-ci.com
  160. 5.06 s Downloaded cached pkg-config-wrapper (11 KiB) in 48ms
  161. 5.06 s Progress: 3 of 25 built, 39 of 82 downloaded from cache (15 downloading)
  162. 5.06 s Downloading cached libmpc from https://cache.nix-ci.com
  163. 5.07 s Downloaded cached mpfr-4.2.2-dev (64 KiB) in 50ms
  164. 5.07 s Progress: 3 of 24 built, 40 of 82 downloaded from cache (15 downloading)
  165. 5.07 s Downloaded cached libmpc (301 KiB) in 53ms
  166. 5.07 s Progress: 3 of 23 built, 41 of 82 downloaded from cache (14 downloading)
  167. 5.07 s Downloaded cached glibc-2.42-67-dev (2.3 MiB) in 108ms
  168. 5.07 s Progress: 3 of 22 built, 42 of 82 downloaded from cache (13 downloading)
  169. 5.08 s Downloaded cached readline (494 KiB) in 53ms
  170. 5.08 s Progress: 3 of 22 built, 43 of 82 downloaded from cache (12 downloading)
  171. 5.08 s Downloading cached python3 from https://cache.nix-ci.com
  172. 5.09 s Downloaded cached isl (2.5 MiB) in 94ms
  173. 5.09 s Progress: 3 of 22 built, 44 of 82 downloaded from cache (12 downloading)
  174. 5.09 s Downloaded cached rsync (710 KiB) in 53ms
  175. 5.09 s Progress: 3 of 22 built, 45 of 82 downloaded from cache (11 downloading)
  176. 5.10 s Downloaded cached zstd-1.5.7-bin (380 KiB) in 41ms
  177. 5.10 s Progress: 3 of 21 built, 46 of 82 downloaded from cache (10 downloading)
  178. 5.10 s Downloading cached zstd-1.5.7-dev from https://cache.nix-ci.com
  179. 5.11 s Downloaded cached libmpc (301 KiB) in 41ms
  180. 5.11 s Progress: 3 of 21 built, 47 of 82 downloaded from cache (10 downloading)
  181. 5.11 s Downloading cached gcc from https://cache.nix-ci.com
  182. 5.11 s Downloaded cached openssl-3.6.3-dev (1.9 MiB) in 46ms
  183. 5.11 s Progress: 3 of 21 built, 48 of 82 downloaded from cache (10 downloading)
  184. 5.16 s Downloaded cached zstd-1.5.7-dev (219 KiB) in 58ms
  185. 5.16 s Progress: 3 of 20 built, 49 of 82 downloaded from cache (9 downloading)
  186. 5.16 s Downloaded cached cargo-stable-2026-07 (41.1 MiB) in 450ms
  187. 5.16 s Progress: 3 of 19 built, 50 of 82 downloaded from cache (8 downloading)
  188. 5.30 s Downloaded cached binutils (32.6 MiB) in 329ms
  189. 5.30 s Progress: 3 of 18 built, 51 of 82 downloaded from cache (7 downloading)
  190. 5.30 s Downloading cached binutils-wrapper from https://cache.nix-ci.com
  191. 5.35 s Downloaded cached binutils-wrapper (55 KiB) in 50ms
  192. 5.35 s Progress: 3 of 18 built, 52 of 82 downloaded from cache (7 downloading)
  193. 6.23 s Downloaded cached python3 (127 MiB) in 1.1s
  194. 6.23 s Progress: 3 of 18 built, 53 of 82 downloaded from cache (6 downloading)
  195. 6.79 s Downloaded cached rust-std-stable-2026-07 (161.4 MiB) in 1.8s
  196. 6.79 s Progress: 3 of 17 built, 54 of 82 downloaded from cache (5 downloading)
  197. 6.88 s Downloaded cached llvm-tools-preview-stable-2026-07 (201.8 MiB) in 2.1s
  198. 6.88 s Progress: 3 of 16 built, 55 of 82 downloaded from cache (4 downloading)
  199. 7.59 s Downloaded cached gcc (264.1 MiB) in 2.4s
  200. 7.59 s Progress: 3 of 15 built, 56 of 82 downloaded from cache (3 downloading)
  201. 7.59 s Downloading cached gcc-wrapper from https://cache.nix-ci.com
  202. 7.62 s Downloaded cached gcc-wrapper (69 KiB) in 21ms
  203. 7.62 s Progress: 3 of 15 built, 57 of 82 downloaded from cache (3 downloading)
  204. 7.62 s Downloading cached stdenv-linux from https://cache.nix-ci.com
  205. 7.64 s Downloaded cached stdenv-linux (60 KiB) in 25ms
  206. 7.64 s Progress: 3 of 14 built, 58 of 82 downloaded from cache (3 downloading)
  207. 8.85 s Downloaded cached rustc-stable-2026-07 (395.4 MiB) in 3.8s
  208. 8.85 s Progress: 3 of 13 built, 59 of 82 downloaded from cache (2 downloading)
  209. 8.85 s Downloading cached rustfmt-preview-stable-2026-07 from https://cache.nix-ci.com
  210. 8.89 s Building /nix/store/0278k537z0dbnrpx1zavbqcn0h9lxpnr-clippy-stable-with-std-2026-07-09.drv
  211. 8.92 s Building /nix/store/hb2gbp84is9q8ij9m36pw4n1c0ngrpd6-rust-stable-with-std-2026-07-09.drv
  212. 8.98 s Downloaded cached rustfmt-preview-stable-2026-07 (8.7 MiB) in 128ms
  213. 8.98 s Progress: 3 of 12 built (2 building), 60 of 82 downloaded from cache (2 downloading)
  214. 8.98 s Downloading cached rust-stable-with-components-2026-07 from https://cache.nix-ci.com
  215. 9.15 s Downloaded cached gammaloop-crate-gammaloop-workspace-hack-deps (186.2 MiB) in 4.4s
  216. 9.23 s [rust-stable-with-std-2026-07:post-build] Uploading to the NixCI cache: /nix/store/imnwv6nazijihjlgf2h3l1qm63m7l9wk-rust-stable-with-std-2026-07-09
  217. 9.27 s [rust-stable-with-std-2026-07:post-build] warning: 'warn-short-path-literals' is deprecated, use 'lint-short-path-literals = ignore' instead
  218. 9.31 s [rust-stable-with-std-2026-07:post-build] copying 0 paths...
  219. 9.36 s [rust-stable-with-std-2026-07:post-build] warning: 'warn-short-path-literals' is deprecated, use 'lint-short-path-literals = ignore' instead
  220. 9.40 s [rust-stable-with-std-2026-07:post-build] copying 0 paths...
  221. 9.41 s Uploaded rust-stable-with-std-2026-07 in 202ms
  222. 9.41 s Progress: 4 of 12 built (1 building), 60 of 82 downloaded from cache (3 downloading)
  223. 9.41 s Built rust-stable-with-std-2026-07 in 494ms
  224. 9.41 s Progress: 4 of 11 built (1 building), 61 of 82 downloaded from cache (2 downloading)
  225. 9.58 s [clippy-stable-with-std-2026-07:post-build] Uploading to the NixCI cache: /nix/store/r4bjy93lvnfma1awpi480n2mz3af0adx-clippy-stable-with-std-2026-07-09
  226. 9.62 s [clippy-stable-with-std-2026-07:post-build] warning: 'warn-short-path-literals' is deprecated, use 'lint-short-path-literals = ignore' instead
  227. 9.66 s [clippy-stable-with-std-2026-07:post-build] copying 0 paths...
  228. 9.71 s [clippy-stable-with-std-2026-07:post-build] warning: 'warn-short-path-literals' is deprecated, use 'lint-short-path-literals = ignore' instead
  229. 9.75 s [clippy-stable-with-std-2026-07:post-build] copying 0 paths...
  230. 9.76 s Uploaded clippy-stable-with-std-2026-07 in 201ms
  231. 9.76 s Progress: 5 of 12 built, 61 of 82 downloaded from cache (2 downloading)
  232. 9.76 s Built clippy-stable-with-std-2026-07 in 876ms
  233. 9.76 s Downloading cached gammaloop-crate-gammaloop-workspace-hack-build from https://cache.nix-ci.com
  234. 9.77 s Waiting for lock on rust-stable-with-components-2026-07
  235. 9.78 s Downloaded cached gammaloop-crate-gammaloop-workspace-hack-build (196 KiB) in 15ms
  236. 9.78 s Progress: 5 of 11 built, 62 of 82 downloaded from cache (2 downloading)
  237. 10.37 s Downloaded cached gammaloop-workspace-deps-deps (306.1 MiB) in 5.4s
  238. 10.37 s Progress: 5 of 11 built, 63 of 82 downloaded from cache (1 downloading)
  239. 10.37 s Downloading cached gammaloop-crate-test-dependencies-01b6df4f694091ad-inputs from https://cache.nix-ci.com
  240. 10.37 s Downloading cached gammaloop-crate-test-dependencies-1b17e1ec025c6580-inputs from https://cache.nix-ci.com
  241. 10.37 s Downloading cached gammaloop-crate-test-dependencies-78814cb8a1862b52-inputs from https://cache.nix-ci.com
  242. 11.24 s Downloaded cached rust-stable-with-components-2026-07 (240.3 MiB) in 2.2s
  243. 11.24 s Progress: 5 of 10 built, 64 of 82 downloaded from cache (3 downloading)
  244. 17.97 s Downloaded cached gammaloop-crate-test-dependencies-1b17e1ec025c6580-inputs (1.1 GiB) in 7.5s
  245. 17.97 s Progress: 5 of 9 built, 65 of 82 downloaded from cache (2 downloading)
  246. 17.97 s Downloading cached gammaloop-crate-test-dependencies-1b17e1ec025c6580-deps from https://cache.nix-ci.com
  247. 17.98 s Downloaded cached gammaloop-crate-test-dependencies-1b17e1ec025c6580-deps (305 KiB) in 8ms
  248. 17.98 s Progress: 5 of 9 built, 66 of 82 downloaded from cache (2 downloading)
  249. 17.99 s Downloaded cached gammaloop-crate-test-dependencies-78814cb8a1862b52-inputs (1.1 GiB) in 7.6s
  250. 17.99 s Progress: 5 of 9 built, 67 of 82 downloaded from cache (1 downloading)
  251. 17.99 s Downloading cached gammaloop-crate-test-dependencies-78814cb8a1862b52-deps from https://cache.nix-ci.com
  252. 17.99 s Downloaded cached gammaloop-crate-test-dependencies-01b6df4f694091ad-inputs (1.1 GiB) in 7.6s
  253. 17.99 s Progress: 5 of 9 built, 68 of 82 downloaded from cache (1 downloading)
  254. 17.99 s Downloading cached gammaloop-crate-test-dependencies-01b6df4f694091ad-deps from https://cache.nix-ci.com
  255. 18.28 s Downloaded cached gammaloop-crate-test-dependencies-01b6df4f694091ad-deps (22.5 MiB) in 289ms
  256. 18.28 s Progress: 5 of 9 built, 69 of 82 downloaded from cache (1 downloading)
  257. 18.52 s Downloaded cached gammaloop-crate-test-dependencies-78814cb8a1862b52-deps (60.7 MiB) in 533ms
  258. 18.52 s Progress: 5 of 9 built, 70 of 82 downloaded from cache
  259. 18.52 s Downloading cached gammaloop-crate-test-dependencies-b6a0734be42e3503-inputs from https://cache.nix-ci.com
  260. 18.52 s Downloading cached gammaloop-crate-test-dependencies-ef81405b5d18987b-inputs from https://cache.nix-ci.com
  261. 27.47 s Downloaded cached gammaloop-crate-test-dependencies-b6a0734be42e3503-inputs (1.4 GiB) in 8.9s
  262. 27.47 s Progress: 5 of 9 built, 71 of 82 downloaded from cache (1 downloading)
  263. 27.47 s Downloading cached gammaloop-crate-test-dependencies-b6a0734be42e3503-deps from https://cache.nix-ci.com
  264. 27.56 s Downloaded cached gammaloop-crate-test-dependencies-ef81405b5d18987b-inputs (1.4 GiB) in 9.0s
  265. 27.56 s Progress: 5 of 9 built, 72 of 82 downloaded from cache (1 downloading)
  266. 27.56 s Downloading cached gammaloop-crate-test-dependencies-ef81405b5d18987b-deps from https://cache.nix-ci.com
  267. 28.29 s Downloaded cached gammaloop-crate-test-dependencies-ef81405b5d18987b-deps (21.1 MiB) in 730ms
  268. 28.29 s Progress: 5 of 9 built, 73 of 82 downloaded from cache (1 downloading)
  269. 28.41 s Downloaded cached gammaloop-crate-test-dependencies-b6a0734be42e3503-deps (36.2 MiB) in 938ms
  270. 28.41 s Progress: 5 of 9 built, 74 of 82 downloaded from cache
  271. 28.41 s Downloading cached gammaloop-crate-test-dependencies-91f21e5f130440bb-inputs from https://cache.nix-ci.com
  272. 37.99 s Downloaded cached gammaloop-crate-test-dependencies-91f21e5f130440bb-inputs (1.5 GiB) in 9.5s
  273. 37.99 s Progress: 5 of 9 built, 75 of 82 downloaded from cache
  274. 37.99 s Downloading cached gammaloop-crate-test-dependencies-91f21e5f130440bb-deps from https://cache.nix-ci.com
  275. 38.20 s Downloaded cached gammaloop-crate-test-dependencies-91f21e5f130440bb-deps (29.8 MiB) in 205ms
  276. 38.20 s Progress: 5 of 9 built, 76 of 82 downloaded from cache
  277. 38.20 s Downloading cached gammaloop-crate-test-dependencies-ea99827d76e4dd39-inputs from https://cache.nix-ci.com
  278. 49.82 s Downloaded cached gammaloop-crate-test-dependencies-ea99827d76e4dd39-inputs (1.8 GiB) in 11.6s
  279. 49.82 s Progress: 5 of 9 built, 77 of 82 downloaded from cache
  280. 49.82 s Downloading cached gammaloop-crate-test-dependencies-ea99827d76e4dd39-deps from https://cache.nix-ci.com
  281. 50.39 s Downloaded cached gammaloop-crate-test-dependencies-ea99827d76e4dd39-deps (93.1 MiB) in 566ms
  282. 50.39 s Progress: 5 of 9 built, 78 of 82 downloaded from cache
  283. 50.39 s Downloading cached gammaloop-crate-test-dependencies-6e86b9f305aafb81-inputs from https://cache.nix-ci.com
  284. 66.01 s Downloaded cached gammaloop-crate-test-dependencies-6e86b9f305aafb81-inputs (2.4 GiB) in 15.6s
  285. 66.01 s Progress: 5 of 9 built, 79 of 82 downloaded from cache
  286. 66.01 s Downloading cached gammaloop-crate-test-dependencies-6e86b9f305aafb81-deps from https://cache.nix-ci.com
  287. 66.85 s Downloaded cached gammaloop-crate-test-dependencies-6e86b9f305aafb81-deps (124.1 MiB) in 837ms
  288. 66.85 s Progress: 5 of 9 built, 80 of 82 downloaded from cache
  289. 66.85 s Downloading cached gammaloop-crate-test-dependencies-b8cda0d438c96d4f-inputs from https://cache.nix-ci.com
  290. 91.91 s Downloaded cached gammaloop-crate-test-dependencies-b8cda0d438c96d4f-inputs (3.1 GiB) in 25.0s
  291. 91.91 s Progress: 5 of 9 built, 81 of 82 downloaded from cache
  292. 91.91 s Downloading cached gammaloop-crate-test-dependencies-b8cda0d438c96d4f-deps from https://cache.nix-ci.com
  293. 92.11 s Downloaded cached gammaloop-crate-test-dependencies-b8cda0d438c96d4f-deps (30 MiB) in 201ms
  294. 92.11 s Progress: 5 of 9 built, 82 of 82 downloaded from cache
  295. 92.26 s Building /nix/store/2a7a6bfvaxbdily0ba9vx91v3v4kn44r-gammaloop-crate-test-binaries-gammaloop-integration-tests-b8cda0d438c96d4f-inputs.drv
  296. 103.26 s [gammaloop-crate-test-binaries-gammaloop-integration-tests-b8cda0d438c96d4f-inputs:post-build] Uploading to the NixCI cache: /nix/store/crwvzla71cgag15sf2ldrx93yxi308jj-gammaloop-crate-test-binaries-gammaloop-integration-tests-b8cda0d438c96d4f-inputs
  297. 103.30 s [gammaloop-crate-test-binaries-gammaloop-integration-tests-b8cda0d438c96d4f-inputs:post-build] warning: 'warn-short-path-literals' is deprecated, use 'lint-short-path-literals = ignore' instead
  298. 103.33 s [gammaloop-crate-test-binaries-gammaloop-integration-tests-b8cda0d438c96d4f-inputs:post-build] copying 1 paths...
  299. 103.33 s [gammaloop-crate-test-binaries-gammaloop-integration-tests-b8cda0d438c96d4f-inputs:post-build] copying path '/nix/store/crwvzla71cgag15sf2ldrx93yxi308jj-gammaloop-crate-test-binaries-gammaloop-integration-tests-b8cda0d438c96d4f-inputs' to 'https://cache.nix-ci.com'...
  300. 180.74 s [gammaloop-crate-test-binaries-gammaloop-integration-tests-b8cda0d438c96d4f-inputs:post-build] warning: 'warn-short-path-literals' is deprecated, use 'lint-short-path-literals = ignore' instead
  301. 180.98 s [gammaloop-crate-test-binaries-gammaloop-integration-tests-b8cda0d438c96d4f-inputs:post-build] copying 1 paths...
  302. 180.98 s [gammaloop-crate-test-binaries-gammaloop-integration-tests-b8cda0d438c96d4f-inputs:post-build] copying path '/nix/store/2a7a6bfvaxbdily0ba9vx91v3v4kn44r-gammaloop-crate-test-binaries-gammaloop-integration-tests-b8cda0d438c96d4f-inputs.drv' to 'https://cache.nix-ci.com'...
  303. 181.14 s Uploaded gammaloop-crate-test-binaries-gammaloop-integration-tests-b8cda0d438c96d4f-inputs in 1m17s
  304. 181.14 s Progress: 6 of 9 built, 82 of 82 downloaded from cache
  305. 181.14 s Built gammaloop-crate-test-binaries-gammaloop-integration-tests-b8cda0d438c96d4f-inputs in 1m28s
  306. 181.22 s Building /nix/store/87hq7ppbbyjsyasszv0zcc1zv7d81635-gammaloop-crate-test-binaries-gammaloop-integration-tests-b8cda0d438c96d4f-deps-0.1.0.drv
  307. 181.29 s [gammaloop-crate-test-binaries-gammaloop-integration-tests-b8cda0d438c96d4f-deps] Phase: unpackPhase
  308. 181.29 s [gammaloop-crate-test-binaries-gammaloop-integration-tests-b8cda0d438c96d4f-deps] unpacking source archive /nix/store/a2mf5ss32qm0vv8qxhcf041bxajmsxnq-source
  309. 181.35 s [gammaloop-crate-test-binaries-gammaloop-integration-tests-b8cda0d438c96d4f-deps] source root is source
  310. 181.37 s [gammaloop-crate-test-binaries-gammaloop-integration-tests-b8cda0d438c96d4f-deps] Phase: patchPhase
  311. 181.45 s [gammaloop-crate-test-binaries-gammaloop-integration-tests-b8cda0d438c96d4f-deps] Executing configureCargoCommonVars
  312. 181.45 s [gammaloop-crate-test-binaries-gammaloop-integration-tests-b8cda0d438c96d4f-deps] copying cargo artifacts from /nix/store/crwvzla71cgag15sf2ldrx93yxi308jj-gammaloop-crate-test-binaries-gammaloop-integration-tests-b8cda0d438c96d4f-inputs/target to target
  313. 181.45 s [gammaloop-crate-test-binaries-gammaloop-integration-tests-b8cda0d438c96d4f-deps] will deep copy artifacts (instead of symlinking) as requested
  314. 183.30 s [gammaloop-crate-test-binaries-gammaloop-integration-tests-b8cda0d438c96d4f-deps] Phase: updateAutotoolsGnuConfigScriptsPhase
  315. 183.33 s [gammaloop-crate-test-binaries-gammaloop-integration-tests-b8cda0d438c96d4f-deps] Phase: configurePhase
  316. 183.34 s [gammaloop-crate-test-binaries-gammaloop-integration-tests-b8cda0d438c96d4f-deps] will append /build/source/.cargo-home/config.toml with contents of /nix/store/5drf77x6km4ky7gwlrzdx9bbd6fz09g3-vendor-cargo-deps/config.toml
  317. 183.34 s [gammaloop-crate-test-binaries-gammaloop-integration-tests-b8cda0d438c96d4f-deps] default configurePhase, nothing to do
  318. 183.34 s [gammaloop-crate-test-binaries-gammaloop-integration-tests-b8cda0d438c96d4f-deps] Phase: buildPhase
  319. 183.35 s [gammaloop-crate-test-binaries-gammaloop-integration-tests-b8cda0d438c96d4f-deps] +++ command cargo --version
  320. 183.35 s [gammaloop-crate-test-binaries-gammaloop-integration-tests-b8cda0d438c96d4f-deps] cargo 1.97.0 (c980f4866 2026-06-30)
  321. 183.35 s [gammaloop-crate-test-binaries-gammaloop-integration-tests-b8cda0d438c96d4f-deps] +++ command cargo test --profile ci-optim --no-run --offline -p gammaloop-integration-tests
  322. 183.79 s [gammaloop-crate-test-binaries-gammaloop-integration-tests-b8cda0d438c96d4f-deps] Compiling gammaloop-integration-tests v0.1.0 (/build/source/tests)
  323. 183.93 s [gammaloop-crate-test-binaries-gammaloop-integration-tests-b8cda0d438c96d4f-deps] error[E0560]: struct `CutInfo` has no field named `lmb_channel_id`
  324. 183.93 s [gammaloop-crate-test-binaries-gammaloop-integration-tests-b8cda0d438c96d4f-deps] --> tests/tests/test_differential.rs:86:13
  325. 183.93 s [gammaloop-crate-test-binaries-gammaloop-integration-tests-b8cda0d438c96d4f-deps] |
  326. 183.93 s [gammaloop-crate-test-binaries-gammaloop-integration-tests-b8cda0d438c96d4f-deps] 86 | lmb_channel_id: None,
  327. 183.93 s [gammaloop-crate-test-binaries-gammaloop-integration-tests-b8cda0d438c96d4f-deps] | ^^^^^^^^^^^^^^ `CutInfo` does not have this field
  328. 183.93 s [gammaloop-crate-test-binaries-gammaloop-integration-tests-b8cda0d438c96d4f-deps] |
  329. 183.93 s [gammaloop-crate-test-binaries-gammaloop-integration-tests-b8cda0d438c96d4f-deps] = note: available fields are: `sampling_channel_id`, `sampling_channel_edge_ids`
  330. 183.93 s [gammaloop-crate-test-binaries-gammaloop-integration-tests-b8cda0d438c96d4f-deps]
  331. 183.93 s [gammaloop-crate-test-binaries-gammaloop-integration-tests-b8cda0d438c96d4f-deps] error[E0560]: struct `CutInfo` has no field named `lmb_channel_edge_ids`
  332. 183.93 s [gammaloop-crate-test-binaries-gammaloop-integration-tests-b8cda0d438c96d4f-deps] --> tests/tests/test_differential.rs:87:13
  333. 183.93 s [gammaloop-crate-test-binaries-gammaloop-integration-tests-b8cda0d438c96d4f-deps] |
  334. 183.93 s [gammaloop-crate-test-binaries-gammaloop-integration-tests-b8cda0d438c96d4f-deps] 87 | lmb_channel_edge_ids: None,
  335. 183.93 s [gammaloop-crate-test-binaries-gammaloop-integration-tests-b8cda0d438c96d4f-deps] | ^^^^^^^^^^^^^^^^^^^^ `CutInfo` does not have this field
  336. 183.93 s [gammaloop-crate-test-binaries-gammaloop-integration-tests-b8cda0d438c96d4f-deps] |
  337. 183.93 s [gammaloop-crate-test-binaries-gammaloop-integration-tests-b8cda0d438c96d4f-deps] = note: available fields are: `sampling_channel_id`, `sampling_channel_edge_ids`
  338. 183.93 s [gammaloop-crate-test-binaries-gammaloop-integration-tests-b8cda0d438c96d4f-deps]
  339. 183.94 s [gammaloop-crate-test-binaries-gammaloop-integration-tests-b8cda0d438c96d4f-deps] error[E0063]: missing field `reference_moments` in initializer of `GraphEvaluationResult<_>`
  340. 183.94 s [gammaloop-crate-test-binaries-gammaloop-integration-tests-b8cda0d438c96d4f-deps] --> tests/tests/test_differential.rs:532:19
  341. 183.94 s [gammaloop-crate-test-binaries-gammaloop-integration-tests-b8cda0d438c96d4f-deps] |
  342. 183.94 s [gammaloop-crate-test-binaries-gammaloop-integration-tests-b8cda0d438c96d4f-deps] 532 | let mut lhs = GraphEvaluationResult {
  343. 183.94 s [gammaloop-crate-test-binaries-gammaloop-integration-tests-b8cda0d438c96d4f-deps] | ^^^^^^^^^^^^^^^^^^^^^ missing `reference_moments`
  344. 183.94 s [gammaloop-crate-test-binaries-gammaloop-integration-tests-b8cda0d438c96d4f-deps]
  345. 183.94 s [gammaloop-crate-test-binaries-gammaloop-integration-tests-b8cda0d438c96d4f-deps] error[E0063]: missing field `reference_moments` in initializer of `GraphEvaluationResult<_>`
  346. 183.94 s [gammaloop-crate-test-binaries-gammaloop-integration-tests-b8cda0d438c96d4f-deps] --> tests/tests/test_differential.rs:539:15
  347. 183.94 s [gammaloop-crate-test-binaries-gammaloop-integration-tests-b8cda0d438c96d4f-deps] |
  348. 183.94 s [gammaloop-crate-test-binaries-gammaloop-integration-tests-b8cda0d438c96d4f-deps] 539 | let rhs = GraphEvaluationResult {
  349. 183.94 s [gammaloop-crate-test-binaries-gammaloop-integration-tests-b8cda0d438c96d4f-deps] | ^^^^^^^^^^^^^^^^^^^^^ missing `reference_moments`
  350. 183.94 s [gammaloop-crate-test-binaries-gammaloop-integration-tests-b8cda0d438c96d4f-deps]
  351. 184.00 s [gammaloop-crate-test-binaries-gammaloop-integration-tests-b8cda0d438c96d4f-deps] error[E0609]: no field `lmb_channel_edge_ids` on type `CutInfo`
  352. 184.00 s [gammaloop-crate-test-binaries-gammaloop-integration-tests-b8cda0d438c96d4f-deps] --> tests/tests/test_evaluation_api.rs:311:10
  353. 184.00 s [gammaloop-crate-test-binaries-gammaloop-integration-tests-b8cda0d438c96d4f-deps] |
  354. 184.00 s [gammaloop-crate-test-binaries-gammaloop-integration-tests-b8cda0d438c96d4f-deps] 311 | .lmb_channel_edge_ids
  355. 184.00 s [gammaloop-crate-test-binaries-gammaloop-integration-tests-b8cda0d438c96d4f-deps] | ^^^^^^^^^^^^^^^^^^^^ unknown field
  356. 184.00 s [gammaloop-crate-test-binaries-gammaloop-integration-tests-b8cda0d438c96d4f-deps] |
  357. 184.00 s [gammaloop-crate-test-binaries-gammaloop-integration-tests-b8cda0d438c96d4f-deps] = note: available fields are: `particle_pdgs`, `cut_id`, `graph_id`, `graph_group_id`, `orientation_id` ... and 2 others
  358. 184.00 s [gammaloop-crate-test-binaries-gammaloop-integration-tests-b8cda0d438c96d4f-deps]
  359. 184.00 s [gammaloop-crate-test-binaries-gammaloop-integration-tests-b8cda0d438c96d4f-deps] Some errors have detailed explanations: E0063, E0560.
  360. 184.00 s [gammaloop-crate-test-binaries-gammaloop-integration-tests-b8cda0d438c96d4f-deps] For more information about an error, try `rustc --explain E0063`.
  361. 184.00 s [gammaloop-crate-test-binaries-gammaloop-integration-tests-b8cda0d438c96d4f-deps] error: could not compile `gammaloop-integration-tests` (test "test_differential") due to 4 previous errors
  362. 184.00 s [gammaloop-crate-test-binaries-gammaloop-integration-tests-b8cda0d438c96d4f-deps] warning: build failed, waiting for other jobs to finish...
  363. 184.02 s [gammaloop-crate-test-binaries-gammaloop-integration-tests-b8cda0d438c96d4f-deps] error[E0609]: no field `lmb_channel_edge_ids` on type `CutInfo`
  364. 184.02 s [gammaloop-crate-test-binaries-gammaloop-integration-tests-b8cda0d438c96d4f-deps] --> tests/tests/test_evaluation_api.rs:591:26
  365. 184.02 s [gammaloop-crate-test-binaries-gammaloop-integration-tests-b8cda0d438c96d4f-deps] |
  366. 184.02 s [gammaloop-crate-test-binaries-gammaloop-integration-tests-b8cda0d438c96d4f-deps] 591 | .lmb_channel_edge_ids
  367. 184.02 s [gammaloop-crate-test-binaries-gammaloop-integration-tests-b8cda0d438c96d4f-deps] | ^^^^^^^^^^^^^^^^^^^^ unknown field
  368. 184.02 s [gammaloop-crate-test-binaries-gammaloop-integration-tests-b8cda0d438c96d4f-deps] |
  369. 184.02 s [gammaloop-crate-test-binaries-gammaloop-integration-tests-b8cda0d438c96d4f-deps] = note: available fields are: `particle_pdgs`, `cut_id`, `graph_id`, `graph_group_id`, `orientation_id` ... and 2 others
  370. 184.02 s [gammaloop-crate-test-binaries-gammaloop-integration-tests-b8cda0d438c96d4f-deps]
  371. 184.06 s [gammaloop-crate-test-binaries-gammaloop-integration-tests-b8cda0d438c96d4f-deps] error[E0609]: no field `lmb_channel_edge_ids` on type `CutInfo`
  372. 184.06 s [gammaloop-crate-test-binaries-gammaloop-integration-tests-b8cda0d438c96d4f-deps] --> tests/tests/test_evaluation_api.rs:1177:18
  373. 184.06 s [gammaloop-crate-test-binaries-gammaloop-integration-tests-b8cda0d438c96d4f-deps] |
  374. 184.06 s [gammaloop-crate-test-binaries-gammaloop-integration-tests-b8cda0d438c96d4f-deps] 1177 | .lmb_channel_edge_ids
  375. 184.06 s [gammaloop-crate-test-binaries-gammaloop-integration-tests-b8cda0d438c96d4f-deps] | ^^^^^^^^^^^^^^^^^^^^ unknown field
  376. 184.06 s [gammaloop-crate-test-binaries-gammaloop-integration-tests-b8cda0d438c96d4f-deps] |
  377. 184.06 s [gammaloop-crate-test-binaries-gammaloop-integration-tests-b8cda0d438c96d4f-deps] = note: available fields are: `particle_pdgs`, `cut_id`, `graph_id`, `graph_group_id`, `orientation_id` ... and 2 others
  378. 184.06 s [gammaloop-crate-test-binaries-gammaloop-integration-tests-b8cda0d438c96d4f-deps]
  379. 184.17 s [gammaloop-crate-test-binaries-gammaloop-integration-tests-b8cda0d438c96d4f-deps] error[E0609]: no field `lmb_channel_edge_ids` on type `CutInfo`
  380. 184.17 s [gammaloop-crate-test-binaries-gammaloop-integration-tests-b8cda0d438c96d4f-deps] --> tests/tests/test_evaluation_api.rs:1222:22
  381. 184.17 s [gammaloop-crate-test-binaries-gammaloop-integration-tests-b8cda0d438c96d4f-deps] |
  382. 184.17 s [gammaloop-crate-test-binaries-gammaloop-integration-tests-b8cda0d438c96d4f-deps] 1222 | .lmb_channel_edge_ids
  383. 184.17 s [gammaloop-crate-test-binaries-gammaloop-integration-tests-b8cda0d438c96d4f-deps] | ^^^^^^^^^^^^^^^^^^^^ unknown field
  384. 184.17 s [gammaloop-crate-test-binaries-gammaloop-integration-tests-b8cda0d438c96d4f-deps] |
  385. 184.17 s [gammaloop-crate-test-binaries-gammaloop-integration-tests-b8cda0d438c96d4f-deps] = note: available fields are: `particle_pdgs`, `cut_id`, `graph_id`, `graph_group_id`, `orientation_id` ... and 2 others
  386. 184.17 s [gammaloop-crate-test-binaries-gammaloop-integration-tests-b8cda0d438c96d4f-deps]
  387. 184.17 s [gammaloop-crate-test-binaries-gammaloop-integration-tests-b8cda0d438c96d4f-deps] error[E0609]: no field `lmb_channel_edge_ids` on type `CutInfo`
  388. 184.17 s [gammaloop-crate-test-binaries-gammaloop-integration-tests-b8cda0d438c96d4f-deps] --> tests/tests/test_evaluation_api.rs:1281:14
  389. 184.17 s [gammaloop-crate-test-binaries-gammaloop-integration-tests-b8cda0d438c96d4f-deps] |
  390. 184.17 s [gammaloop-crate-test-binaries-gammaloop-integration-tests-b8cda0d438c96d4f-deps] 1281 | .lmb_channel_edge_ids
  391. 184.17 s [gammaloop-crate-test-binaries-gammaloop-integration-tests-b8cda0d438c96d4f-deps] | ^^^^^^^^^^^^^^^^^^^^ unknown field
  392. 184.17 s [gammaloop-crate-test-binaries-gammaloop-integration-tests-b8cda0d438c96d4f-deps] |
  393. 184.17 s [gammaloop-crate-test-binaries-gammaloop-integration-tests-b8cda0d438c96d4f-deps] = note: available fields are: `particle_pdgs`, `cut_id`, `graph_id`, `graph_group_id`, `orientation_id` ... and 2 others
  394. 184.17 s [gammaloop-crate-test-binaries-gammaloop-integration-tests-b8cda0d438c96d4f-deps]
  395. 184.21 s [gammaloop-crate-test-binaries-gammaloop-integration-tests-b8cda0d438c96d4f-deps] error[E0609]: no field `lmb_channel_edge_ids` on type `CutInfo`
  396. 184.21 s [gammaloop-crate-test-binaries-gammaloop-integration-tests-b8cda0d438c96d4f-deps] --> tests/tests/test_evaluation_api.rs:1428:18
  397. 184.21 s [gammaloop-crate-test-binaries-gammaloop-integration-tests-b8cda0d438c96d4f-deps] |
  398. 184.21 s [gammaloop-crate-test-binaries-gammaloop-integration-tests-b8cda0d438c96d4f-deps] 1428 | .lmb_channel_edge_ids
  399. 184.21 s [gammaloop-crate-test-binaries-gammaloop-integration-tests-b8cda0d438c96d4f-deps] | ^^^^^^^^^^^^^^^^^^^^ unknown field
  400. 184.21 s [gammaloop-crate-test-binaries-gammaloop-integration-tests-b8cda0d438c96d4f-deps] |
  401. 184.21 s [gammaloop-crate-test-binaries-gammaloop-integration-tests-b8cda0d438c96d4f-deps] = note: available fields are: `particle_pdgs`, `cut_id`, `graph_id`, `graph_group_id`, `orientation_id` ... and 2 others
  402. 184.21 s [gammaloop-crate-test-binaries-gammaloop-integration-tests-b8cda0d438c96d4f-deps]
  403. 184.30 s [gammaloop-crate-test-binaries-gammaloop-integration-tests-b8cda0d438c96d4f-deps] For more information about this error, try `rustc --explain E0609`.
  404. 184.31 s [gammaloop-crate-test-binaries-gammaloop-integration-tests-b8cda0d438c96d4f-deps] error: could not compile `gammaloop-integration-tests` (test "test_evaluation_api") due to 6 previous errors
  405. 184.91 s [gammaloop-crate-test-binaries-gammaloop-integration-tests-b8cda0d438c96d4f-deps] error[E0609]: no field `lmb_channel_id` on type `CutInfo`
  406. 184.91 s [gammaloop-crate-test-binaries-gammaloop-integration-tests-b8cda0d438c96d4f-deps] --> tests/tests/test_runs/utils.rs:568:36
  407. 184.91 s [gammaloop-crate-test-binaries-gammaloop-integration-tests-b8cda0d438c96d4f-deps] |
  408. 184.91 s [gammaloop-crate-test-binaries-gammaloop-integration-tests-b8cda0d438c96d4f-deps] 568 | event.cut_info.lmb_channel_id,
  409. 184.91 s [gammaloop-crate-test-binaries-gammaloop-integration-tests-b8cda0d438c96d4f-deps] | ^^^^^^^^^^^^^^ unknown field
  410. 184.91 s [gammaloop-crate-test-binaries-gammaloop-integration-tests-b8cda0d438c96d4f-deps] |
  411. 184.91 s [gammaloop-crate-test-binaries-gammaloop-integration-tests-b8cda0d438c96d4f-deps] = note: available fields are: `particle_pdgs`, `cut_id`, `graph_id`, `graph_group_id`, `orientation_id` ... and 2 others
  412. 184.91 s [gammaloop-crate-test-binaries-gammaloop-integration-tests-b8cda0d438c96d4f-deps]
  413. 184.91 s [gammaloop-crate-test-binaries-gammaloop-integration-tests-b8cda0d438c96d4f-deps] error[E0609]: no field `lmb_channel_id` on type `CutInfo`
  414. 184.91 s [gammaloop-crate-test-binaries-gammaloop-integration-tests-b8cda0d438c96d4f-deps] --> tests/tests/test_runs/utils.rs:580:36
  415. 184.91 s [gammaloop-crate-test-binaries-gammaloop-integration-tests-b8cda0d438c96d4f-deps] |
  416. 184.91 s [gammaloop-crate-test-binaries-gammaloop-integration-tests-b8cda0d438c96d4f-deps] 580 | event.cut_info.lmb_channel_id,
  417. 184.91 s [gammaloop-crate-test-binaries-gammaloop-integration-tests-b8cda0d438c96d4f-deps] | ^^^^^^^^^^^^^^ unknown field
  418. 184.91 s [gammaloop-crate-test-binaries-gammaloop-integration-tests-b8cda0d438c96d4f-deps] |
  419. 184.91 s [gammaloop-crate-test-binaries-gammaloop-integration-tests-b8cda0d438c96d4f-deps] = note: available fields are: `particle_pdgs`, `cut_id`, `graph_id`, `graph_group_id`, `orientation_id` ... and 2 others
  420. 184.91 s [gammaloop-crate-test-binaries-gammaloop-integration-tests-b8cda0d438c96d4f-deps]
  421. 185.74 s [gammaloop-crate-test-binaries-gammaloop-integration-tests-b8cda0d438c96d4f-deps] error: could not compile `gammaloop-integration-tests` (test "test_runs") due to 2 previous errors
  422. 249.47 s Progress: 6 of 8 built (1 failed), 82 of 82 downloaded from cache
  423. 249.47 s Failed to build gammaloop-crate-test-binaries-gammaloop-integration-tests-b8cda0d438c96d4f-deps after 1m08s
  424. 249.47 s error: Cannot build '/nix/store/87hq7ppbbyjsyasszv0zcc1zv7d81635-gammaloop-crate-test-binaries-gammaloop-integration-tests-b8cda0d438c96d4f-deps-0.1.0.drv'.
  425. 249.47 s Reason: builder failed with exit code 101.
  426. 249.47 s Output paths:
  427. 249.47 s /nix/store/8k7s2i9d6dyh8kk6s8dp9rn2f63qcf5n-gammaloop-crate-test-binaries-gammaloop-integration-tests-b8cda0d438c96d4f-deps-0.1.0
  428. 249.47 s Last 115 log lines:
  429. 249.47 s > Running phase: unpackPhase
  430. 249.47 s > unpacking source archive /nix/store/a2mf5ss32qm0vv8qxhcf041bxajmsxnq-source
  431. 249.47 s > source root is source
  432. 249.47 s > Running phase: patchPhase
  433. 249.47 s > Executing configureCargoCommonVars
  434. 249.47 s > copying cargo artifacts from /nix/store/crwvzla71cgag15sf2ldrx93yxi308jj-gammaloop-crate-test-binaries-gammaloop-integration-tests-b8cda0d438c96d4f-inputs/target to target
  435. 249.47 s > will deep copy artifacts (instead of symlinking) as requested
  436. 249.47 s > Running phase: updateAutotoolsGnuConfigScriptsPhase
  437. 249.47 s > Running phase: configurePhase
  438. 249.47 s > will append /build/source/.cargo-home/config.toml with contents of /nix/store/5drf77x6km4ky7gwlrzdx9bbd6fz09g3-vendor-cargo-deps/config.toml
  439. 249.47 s > default configurePhase, nothing to do
  440. 249.47 s > Running phase: buildPhase
  441. 249.47 s > +++ command cargo --version
  442. 249.47 s > cargo 1.97.0 (c980f4866 2026-06-30)
  443. 249.47 s > +++ command cargo test --profile ci-optim --no-run --offline -p gammaloop-integration-tests
  444. 249.47 s > Compiling gammaloop-integration-tests v0.1.0 (/build/source/tests)
  445. 249.47 s > error[E0560]: struct `CutInfo` has no field named `lmb_channel_id`
  446. 249.47 s > --> tests/tests/test_differential.rs:86:13
  447. 249.47 s > |
  448. 249.47 s > 86 | lmb_channel_id: None,
  449. 249.47 s > | ^^^^^^^^^^^^^^ `CutInfo` does not have this field
  450. 249.47 s > |
  451. 249.47 s > = note: available fields are: `sampling_channel_id`, `sampling_channel_edge_ids`
  452. 249.47 s >
  453. 249.47 s > error[E0560]: struct `CutInfo` has no field named `lmb_channel_edge_ids`
  454. 249.47 s > --> tests/tests/test_differential.rs:87:13
  455. 249.47 s > |
  456. 249.47 s > 87 | lmb_channel_edge_ids: None,
  457. 249.47 s > | ^^^^^^^^^^^^^^^^^^^^ `CutInfo` does not have this field
  458. 249.47 s > |
  459. 249.47 s > = note: available fields are: `sampling_channel_id`, `sampling_channel_edge_ids`
  460. 249.47 s >
  461. 249.47 s > error[E0063]: missing field `reference_moments` in initializer of `GraphEvaluationResult<_>`
  462. 249.47 s > --> tests/tests/test_differential.rs:532:19
  463. 249.47 s > |
  464. 249.47 s > 532 | let mut lhs = GraphEvaluationResult {
  465. 249.47 s > | ^^^^^^^^^^^^^^^^^^^^^ missing `reference_moments`
  466. 249.47 s >
  467. 249.47 s > error[E0063]: missing field `reference_moments` in initializer of `GraphEvaluationResult<_>`
  468. 249.47 s > --> tests/tests/test_differential.rs:539:15
  469. 249.47 s > |
  470. 249.47 s > 539 | let rhs = GraphEvaluationResult {
  471. 249.47 s > | ^^^^^^^^^^^^^^^^^^^^^ missing `reference_moments`
  472. 249.47 s >
  473. 249.47 s > error[E0609]: no field `lmb_channel_edge_ids` on type `CutInfo`
  474. 249.47 s > --> tests/tests/test_evaluation_api.rs:311:10
  475. 249.47 s > |
  476. 249.47 s > 311 | .lmb_channel_edge_ids
  477. 249.47 s > | ^^^^^^^^^^^^^^^^^^^^ unknown field
  478. 249.47 s > |
  479. 249.47 s > = note: available fields are: `particle_pdgs`, `cut_id`, `graph_id`, `graph_group_id`, `orientation_id` ... and 2 others
  480. 249.47 s >
  481. 249.47 s > Some errors have detailed explanations: E0063, E0560.
  482. 249.47 s > For more information about an error, try `rustc --explain E0063`.
  483. 249.47 s > error: could not compile `gammaloop-integration-tests` (test "test_differential") due to 4 previous errors
  484. 249.47 s > warning: build failed, waiting for other jobs to finish...
  485. 249.47 s > error[E0609]: no field `lmb_channel_edge_ids` on type `CutInfo`
  486. 249.47 s > --> tests/tests/test_evaluation_api.rs:591:26
  487. 249.47 s > |
  488. 249.47 s > 591 | .lmb_channel_edge_ids
  489. 249.47 s > | ^^^^^^^^^^^^^^^^^^^^ unknown field
  490. 249.47 s > |
  491. 249.47 s > = note: available fields are: `particle_pdgs`, `cut_id`, `graph_id`, `graph_group_id`, `orientation_id` ... and 2 others
  492. 249.47 s >
  493. 249.47 s > error[E0609]: no field `lmb_channel_edge_ids` on type `CutInfo`
  494. 249.47 s > --> tests/tests/test_evaluation_api.rs:1177:18
  495. 249.47 s > |
  496. 249.47 s > 1177 | .lmb_channel_edge_ids
  497. 249.47 s > | ^^^^^^^^^^^^^^^^^^^^ unknown field
  498. 249.47 s > |
  499. 249.47 s > = note: available fields are: `particle_pdgs`, `cut_id`, `graph_id`, `graph_group_id`, `orientation_id` ... and 2 others
  500. 249.47 s >
  501. 249.47 s > error[E0609]: no field `lmb_channel_edge_ids` on type `CutInfo`
  502. 249.47 s > --> tests/tests/test_evaluation_api.rs:1222:22
  503. 249.47 s > |
  504. 249.47 s > 1222 | .lmb_channel_edge_ids
  505. 249.47 s > | ^^^^^^^^^^^^^^^^^^^^ unknown field
  506. 249.47 s > |
  507. 249.47 s > = note: available fields are: `particle_pdgs`, `cut_id`, `graph_id`, `graph_group_id`, `orientation_id` ... and 2 others
  508. 249.47 s >
  509. 249.47 s > error[E0609]: no field `lmb_channel_edge_ids` on type `CutInfo`
  510. 249.47 s > --> tests/tests/test_evaluation_api.rs:1281:14
  511. 249.47 s > |
  512. 249.47 s > 1281 | .lmb_channel_edge_ids
  513. 249.47 s > | ^^^^^^^^^^^^^^^^^^^^ unknown field
  514. 249.47 s > |
  515. 249.47 s > = note: available fields are: `particle_pdgs`, `cut_id`, `graph_id`, `graph_group_id`, `orientation_id` ... and 2 others
  516. 249.47 s >
  517. 249.47 s > error[E0609]: no field `lmb_channel_edge_ids` on type `CutInfo`
  518. 249.47 s > --> tests/tests/test_evaluation_api.rs:1428:18
  519. 249.47 s > |
  520. 249.47 s > 1428 | .lmb_channel_edge_ids
  521. 249.47 s > | ^^^^^^^^^^^^^^^^^^^^ unknown field
  522. 249.47 s > |
  523. 249.47 s > = note: available fields are: `particle_pdgs`, `cut_id`, `graph_id`, `graph_group_id`, `orientation_id` ... and 2 others
  524. 249.47 s >
  525. 249.47 s > For more information about this error, try `rustc --explain E0609`.
  526. 249.47 s > error: could not compile `gammaloop-integration-tests` (test "test_evaluation_api") due to 6 previous errors
  527. 249.47 s > error[E0609]: no field `lmb_channel_id` on type `CutInfo`
  528. 249.47 s > --> tests/tests/test_runs/utils.rs:568:36
  529. 249.47 s > |
  530. 249.47 s > 568 | event.cut_info.lmb_channel_id,
  531. 249.47 s > | ^^^^^^^^^^^^^^ unknown field
  532. 249.47 s > |
  533. 249.47 s > = note: available fields are: `particle_pdgs`, `cut_id`, `graph_id`, `graph_group_id`, `orientation_id` ... and 2 others
  534. 249.47 s >
  535. 249.47 s > error[E0609]: no field `lmb_channel_id` on type `CutInfo`
  536. 249.47 s > --> tests/tests/test_runs/utils.rs:580:36
  537. 249.47 s > |
  538. 249.47 s > 580 | event.cut_info.lmb_channel_id,
  539. 249.47 s > | ^^^^^^^^^^^^^^ unknown field
  540. 249.47 s > |
  541. 249.47 s > = note: available fields are: `particle_pdgs`, `cut_id`, `graph_id`, `graph_group_id`, `orientation_id` ... and 2 others
  542. 249.47 s >
  543. 249.47 s > error: could not compile `gammaloop-integration-tests` (test "test_runs") due to 2 previous errors
  544. 249.47 s For full logs, run:
  545. 249.47 s nix log /nix/store/87hq7ppbbyjsyasszv0zcc1zv7d81635-gammaloop-crate-test-binaries-gammaloop-integration-tests-b8cda0d438c96d4f-deps-0.1.0.drv
  546. 249.47 s error: Cannot build '/nix/store/lm6y269bqrdbaw9nlnfib2x02cf702w3-nix-ci-artifact-barrier-crate-test-binaries-gammaloop-integration-tests.drv'.
  547. 249.47 s Reason: 1 dependency failed.
  548. 249.47 s Output paths:
  549. 249.47 s /nix/store/clbszfvrq0b59j8j7yx83vr1vs7l8rbq-nix-ci-artifact-barrier-crate-test-binaries-gammaloop-integration-tests
  550. 249.48 s Build failed due to failed dependency
  551. 249.52 s Build failed.