build checks.x86_64-linux.gammaloop-check
0.00 s
$ /nix/store/9ypz3flqsrl5xl495mm8h645gadjsxi1-coreutils-9.11/bin/timeout --kill-after=15s 7200s /nix/store/23zk8sgzamrbmj1fday15szf7f2279s8-nix-2.34.7/bin/nix --extra-experimental-features nix-command --extra-experimental-features flakes --log-format internal-json build --no-link --print-out-paths git+https://github.com/alphal00p/gammaloop?ref=advanced_sampling&rev=ad713af8ba0173320df0aef4e53935ec4cf8a238&shallow=1#checks.x86_64-linux.gammaloop-check --print-build-logs
2.49 s
3.02 s
Building /nix/store/2f1j2lkyg12g36flfbgvv1q9204gpqa0-gammaloop-workspace-check-0.1.0.drv
3.12 s
[gammaloop-workspace-check] Phase: unpackPhase
3.13 s
[gammaloop-workspace-check] unpacking source archive /nix/store/s2z31bfagqssyfp9l6l2s0lp69bdgr0x-source
3.37 s
[gammaloop-workspace-check] source root is source
3.41 s
[gammaloop-workspace-check] Phase: patchPhase
3.42 s
[gammaloop-workspace-check] Executing configureCargoCommonVars
3.42 s
[gammaloop-workspace-check] decompressing cargo artifacts from /nix/store/50vpxlcgfxf2d57i27v3d10zjwxxbm2r-gammaloop-workspace-deps-deps-0.1.0/target.tar.zst to target
4.67 s
[gammaloop-workspace-check] Phase: updateAutotoolsGnuConfigScriptsPhase
4.71 s
[gammaloop-workspace-check] Phase: configurePhase
4.71 s
[gammaloop-workspace-check] will append /build/source/.cargo-home/config.toml with contents of /nix/store/5drf77x6km4ky7gwlrzdx9bbd6fz09g3-vendor-cargo-deps/config.toml
4.71 s
[gammaloop-workspace-check] default configurePhase, nothing to do
4.72 s
[gammaloop-workspace-check] Phase: buildPhase
4.72 s
[gammaloop-workspace-check] +++ command cargo --version
4.72 s
[gammaloop-workspace-check] cargo 1.97.0 (c980f4866 2026-06-30)
4.75 s
[gammaloop-workspace-check] +++ command cargo check --profile ci-optim --locked --workspace --features gammaloop-tracing-filter/clap,gammaloop-tracing-filter/symbolica,idenso/bincode,idenso/reference-cases,linnet/bincode,linnet/drawing,linnet/rkyv,linnet/serde,linnet/symbolica,spenso-macros/shadowing,spenso/shadowing,symbolica/tracing_max_level_info,three-dimensional-reps/display,three-dimensional-reps/eval,three-dimensional-reps/serde --all-targets
5.23 s
[gammaloop-workspace-check] Checking cfg-if v1.0.4
5.23 s
[gammaloop-workspace-check] Checking memchr v2.8.0
5.23 s
[gammaloop-workspace-check] Checking once_cell v1.21.4
5.24 s
[gammaloop-workspace-check] Checking either v1.15.0
5.25 s
[gammaloop-workspace-check] Checking serde_core v1.0.228
5.25 s
[gammaloop-workspace-check] Checking libc v0.2.186
5.25 s
[gammaloop-workspace-check] Checking libm v0.2.16
5.26 s
[gammaloop-workspace-check] Checking itoa v1.0.18
5.26 s
[gammaloop-workspace-check] Checking log v0.4.29
5.26 s
[gammaloop-workspace-check] Checking regex-syntax v0.8.10
5.27 s
[gammaloop-workspace-check] Checking zerocopy v0.8.48
5.27 s
[gammaloop-workspace-check] Checking crossbeam-utils v0.8.21
5.28 s
[gammaloop-workspace-check] Checking equivalent v1.0.2
5.29 s
[gammaloop-workspace-check] Checking zmij v1.0.21
5.29 s
[gammaloop-workspace-check] Checking lazy_static v1.5.0
5.29 s
[gammaloop-workspace-check] Checking bytemuck v1.25.0
5.29 s
[gammaloop-workspace-check] Compiling target-lexicon v0.13.5
5.32 s
[gammaloop-workspace-check] Checking arrayvec v0.7.6
5.34 s
[gammaloop-workspace-check] Checking powerfmt v0.2.0
5.35 s
[gammaloop-workspace-check] Checking num-conv v0.2.1
5.38 s
[gammaloop-workspace-check] Checking num_threads v0.1.7
5.39 s
[gammaloop-workspace-check] Checking pin-project-lite v0.2.17
5.41 s
[gammaloop-workspace-check] Checking itertools v0.14.0
5.43 s
[gammaloop-workspace-check] Checking time-core v0.1.8
5.44 s
[gammaloop-workspace-check] Checking tracing-core v0.1.36
5.46 s
[gammaloop-workspace-check] Checking deranged v0.5.8
5.46 s
[gammaloop-workspace-check] Checking safe_arch v0.7.4
5.47 s
[gammaloop-workspace-check] Checking foldhash v0.2.0
5.48 s
[gammaloop-workspace-check] Checking allocator-api2 v0.2.21
5.49 s
[gammaloop-workspace-check] Checking const-random v0.1.18
5.53 s
[gammaloop-workspace-check] Checking nu-ansi-term v0.50.3
5.55 s
[gammaloop-workspace-check] Checking static_assertions v1.1.0
5.59 s
[gammaloop-workspace-check] Checking unty v0.0.4
5.62 s
[gammaloop-workspace-check] Checking winnow v1.0.2
5.64 s
[gammaloop-workspace-check] Checking safe_arch v1.0.0
5.66 s
[gammaloop-workspace-check] Checking aho-corasick v1.1.4
5.67 s
[gammaloop-workspace-check] Checking crossbeam-epoch v0.9.18
5.72 s
[gammaloop-workspace-check] Checking wide v0.7.33
5.74 s
[gammaloop-workspace-check] Checking sharded-slab v0.1.7
5.74 s
[gammaloop-workspace-check] Checking tracing v0.1.44
5.79 s
[gammaloop-workspace-check] Checking hashbrown v0.16.1
5.87 s
[gammaloop-workspace-check] Checking tracing-log v0.2.0
5.98 s
[gammaloop-workspace-check] Checking thread_local v1.1.9
6.02 s
[gammaloop-workspace-check] Checking az v1.3.0
6.06 s
[gammaloop-workspace-check] Checking crossbeam-deque v0.8.6
6.17 s
[gammaloop-workspace-check] Checking indenter v0.3.4
6.21 s
[gammaloop-workspace-check] Checking rayon-core v1.13.0
6.22 s
[gammaloop-workspace-check] Checking toml_writer v1.1.1+spec-1.1.0
6.23 s
[gammaloop-workspace-check] Checking wide v1.3.0
6.27 s
[gammaloop-workspace-check] Checking num-traits v0.2.19
6.35 s
[gammaloop-workspace-check] Compiling phf_shared v0.11.3
6.38 s
[gammaloop-workspace-check] Checking anyhow v1.0.102
6.46 s
[gammaloop-workspace-check] Checking utf8parse v0.2.2
6.47 s
[gammaloop-workspace-check] Checking getrandom v0.3.4
6.50 s
[gammaloop-workspace-check] Checking time v0.3.47
6.54 s
[gammaloop-workspace-check] Checking gmp-mpfr-sys v1.7.1
6.56 s
[gammaloop-workspace-check] Checking dyn-clone v1.0.20
6.59 s
[gammaloop-workspace-check] Checking toml_parser v1.1.2+spec-1.1.0
6.60 s
[gammaloop-workspace-check] Checking rayon v1.12.0
6.61 s
[gammaloop-workspace-check] Checking rand_core v0.9.5
6.64 s
[gammaloop-workspace-check] Checking alloc-no-stdlib v2.0.4
6.65 s
[gammaloop-workspace-check] Checking rawpointer v0.2.1
6.73 s
[gammaloop-workspace-check] Checking alloc-stdlib v0.2.2
6.74 s
[gammaloop-workspace-check] Checking matrixmultiply v0.3.10
6.77 s
[gammaloop-workspace-check] Checking anstyle-parse v1.0.0
6.78 s
[gammaloop-workspace-check] Checking is_terminal_polyfill v1.70.2
6.79 s
[gammaloop-workspace-check] Checking colorchoice v1.0.5
6.84 s
[gammaloop-workspace-check] Checking anstyle-query v1.1.5
6.84 s
[gammaloop-workspace-check] Checking colored v3.1.1
6.86 s
[gammaloop-workspace-check] Checking regex-automata v0.4.14
6.88 s
[gammaloop-workspace-check] Checking anstyle v1.0.14
6.93 s
[gammaloop-workspace-check] Compiling phf_generator v0.11.3
6.99 s
[gammaloop-workspace-check] Checking eyre v0.6.12
7.02 s
[gammaloop-workspace-check] Checking unicode-width v0.2.2
7.06 s
[gammaloop-workspace-check] Checking approx v0.5.1
7.09 s
[gammaloop-workspace-check] Compiling pyo3-build-config v0.28.3
7.15 s
[gammaloop-workspace-check] Checking num-integer v0.1.46
7.19 s
[gammaloop-workspace-check] Checking bitflags v1.3.2
7.20 s
[gammaloop-workspace-check] Compiling phf_codegen v0.11.3
7.20 s
[gammaloop-workspace-check] Checking anstream v1.0.0
7.20 s
[gammaloop-workspace-check] Checking brotli-decompressor v5.0.0
7.24 s
[gammaloop-workspace-check] Checking wasmtime-jit-icache-coherence v34.0.2
7.25 s
[gammaloop-workspace-check] Checking region v3.0.2
7.29 s
[gammaloop-workspace-check] Checking hugepage-rs v0.1.1
7.34 s
[gammaloop-workspace-check] Checking serde v1.0.228
7.35 s
[gammaloop-workspace-check] Checking serde_json v1.0.149
7.38 s
[gammaloop-workspace-check] Checking bitflags v2.11.1
7.38 s
[gammaloop-workspace-check] Checking serde_spanned v1.1.1
7.39 s
[gammaloop-workspace-check] Checking toml_datetime v1.1.1+spec-1.1.0
7.40 s
[gammaloop-workspace-check] Checking spec_math v0.1.6
7.43 s
[gammaloop-workspace-check] Checking inventory v0.3.24
7.47 s
[gammaloop-workspace-check] Checking thiserror v2.0.18
7.49 s
[gammaloop-workspace-check] Compiling getopts v0.2.24
7.49 s
[gammaloop-workspace-check] Checking libloading v0.9.0
7.51 s
[gammaloop-workspace-check] Checking bytes v1.11.1
7.56 s
[gammaloop-workspace-check] Checking byteorder v1.5.0
7.58 s
[gammaloop-workspace-check] Checking self_cell v1.2.2
7.59 s
[gammaloop-workspace-check] Checking toml v1.1.2+spec-1.1.0
7.66 s
[gammaloop-workspace-check] Checking tinyjson v2.5.1
7.67 s
[gammaloop-workspace-check] Checking append-only-vec v0.1.8
7.87 s
[gammaloop-workspace-check] Compiling unicode_names2_generator v1.3.0
7.95 s
[gammaloop-workspace-check] Compiling unic-char-range v0.9.0
7.97 s
[gammaloop-workspace-check] Compiling unic-common v0.9.0
7.97 s
[gammaloop-workspace-check] Checking linux-raw-sys v0.12.1
7.98 s
[gammaloop-workspace-check] Checking smallvec v1.15.1
8.04 s
[gammaloop-workspace-check] Checking num-complex v0.4.6
8.05 s
[gammaloop-workspace-check] Checking tracing-serde v0.2.0
8.12 s
[gammaloop-workspace-check] Checking bincode v2.0.1
8.16 s
[gammaloop-workspace-check] Checking smartstring v1.0.1
8.20 s
[gammaloop-workspace-check] Compiling unic-char-property v0.9.0
8.30 s
[gammaloop-workspace-check] Compiling unic-ucd-version v0.9.0
8.35 s
[gammaloop-workspace-check] Checking rustix v1.1.4
8.36 s
[gammaloop-workspace-check] Compiling is-macro v0.3.7
8.37 s
[gammaloop-workspace-check] Compiling rustpython-parser-vendored v0.4.0
8.51 s
[gammaloop-workspace-check] Checking iana-time-zone v0.1.65
8.53 s
[gammaloop-workspace-check] Compiling rustpython-parser v0.4.0
8.61 s
[gammaloop-workspace-check] Compiling phf v0.11.3
8.63 s
[gammaloop-workspace-check] Checking brotli v8.0.2
8.68 s
[gammaloop-workspace-check] Checking simba v0.9.1
8.77 s
[gammaloop-workspace-check] Checking chrono v0.4.44
9.09 s
[gammaloop-workspace-check] Checking rustc-hash v2.1.2
9.10 s
[gammaloop-workspace-check] Checking ndarray v0.17.2
9.23 s
[gammaloop-workspace-check] Compiling unic-ucd-ident v0.9.0
9.26 s
[gammaloop-workspace-check] Compiling unic-emoji-char v0.9.0
9.28 s
[gammaloop-workspace-check] Compiling lalrpop-util v0.20.2
9.43 s
[gammaloop-workspace-check] Compiling rustc-hash v1.1.0
9.59 s
[gammaloop-workspace-check] Checking rug v1.30.0
9.62 s
[gammaloop-workspace-check] Compiling symbolica v2.2.0 (https://github.com/alphal00p/symbolica?rev=a277a8dadbaae5a8d6605f2f381991a601e1f345#a277a8da)
9.63 s
[gammaloop-workspace-check] Checking unicode-segmentation v1.13.2
9.71 s
[gammaloop-workspace-check] Checking typenum v1.20.0
9.86 s
[gammaloop-workspace-check] Checking getrandom v0.2.17
10.10 s
[gammaloop-workspace-check] Checking scopeguard v1.2.0
10.12 s
[gammaloop-workspace-check] Checking ppv-lite86 v0.2.21
10.17 s
[gammaloop-workspace-check] Checking ahash v0.8.12
10.18 s
[gammaloop-workspace-check] Checking lock_api v0.4.14
10.57 s
[gammaloop-workspace-check] Checking parking_lot_core v0.9.12
10.69 s
[gammaloop-workspace-check] Checking unicode-ident v1.0.24
10.80 s
[gammaloop-workspace-check] Checking hashbrown v0.17.0
10.89 s
[gammaloop-workspace-check] Checking rand_chacha v0.9.0
10.95 s
[gammaloop-workspace-check] Checking parking_lot v0.12.5
10.96 s
[gammaloop-workspace-check] Checking errno v0.3.14
11.05 s
[gammaloop-workspace-check] Checking clap_lex v1.1.0
11.14 s
[gammaloop-workspace-check] Checking terminal_size v0.4.4
11.16 s
[gammaloop-workspace-check] Checking unicase v2.9.0
11.22 s
[gammaloop-workspace-check] Checking strsim v0.11.1
11.34 s
[gammaloop-workspace-check] Checking signal-hook-registry v1.4.8
11.41 s
[gammaloop-workspace-check] Checking generic-array v0.14.7
11.43 s
[gammaloop-workspace-check] Checking rand v0.9.4
11.47 s
[gammaloop-workspace-check] Checking vte v0.14.1
11.47 s
[gammaloop-workspace-check] Checking same-file v1.0.6
11.50 s
[gammaloop-workspace-check] Checking clap_builder v4.6.0
11.55 s
[gammaloop-workspace-check] Checking walkdir v2.5.0
11.73 s
[gammaloop-workspace-check] Checking half v2.7.1
11.75 s
[gammaloop-workspace-check] Checking signal-hook v0.3.18
11.77 s
[gammaloop-workspace-check] Checking mio v1.2.0
11.93 s
[gammaloop-workspace-check] Checking indexmap v2.14.0
11.95 s
[gammaloop-workspace-check] Checking minimal-lexical v0.2.1
12.02 s
[gammaloop-workspace-check] Checking symjit v2.21.0
12.12 s
[gammaloop-workspace-check] Checking ciborium-io v0.2.2
12.14 s
[gammaloop-workspace-check] Checking matchers v0.2.0
12.21 s
[gammaloop-workspace-check] Checking regex v1.12.3
12.22 s
[gammaloop-workspace-check] Checking ciborium-ll v0.2.2
12.27 s
[gammaloop-workspace-check] Checking tracing-subscriber v0.3.23
12.49 s
[gammaloop-workspace-check] Checking nom v7.1.3
12.50 s
[gammaloop-workspace-check] Checking signal-hook-mio v0.2.5
12.58 s
[gammaloop-workspace-check] Checking derive_more v2.1.1
12.68 s
[gammaloop-workspace-check] Checking num-bigint v0.4.6
12.73 s
[gammaloop-workspace-check] Checking console v0.16.3
12.86 s
[gammaloop-workspace-check] Checking block-buffer v0.10.4
13.03 s
[gammaloop-workspace-check] Checking crypto-common v0.1.7
13.19 s
[gammaloop-workspace-check] Checking digest v0.10.7
13.33 s
[gammaloop-workspace-check] Checking bstr v1.12.1
13.46 s
[gammaloop-workspace-check] Checking winnow v0.7.15
13.51 s
[gammaloop-workspace-check] Checking linux-raw-sys v0.4.15
13.55 s
[gammaloop-workspace-check] Checking cpufeatures v0.2.17
13.62 s
[gammaloop-workspace-check] Checking sha2 v0.10.9
13.93 s
[gammaloop-workspace-check] Checking ciborium v0.2.2
14.09 s
[gammaloop-workspace-check] Checking getrandom v0.4.2
14.19 s
[gammaloop-workspace-check] Checking rustix v0.38.44
14.29 s
[gammaloop-workspace-check] Checking rand_core v0.6.4
14.70 s
[gammaloop-workspace-check] Checking fastrand v2.4.1
14.83 s
[gammaloop-workspace-check] Checking globset v0.4.18
14.96 s
[gammaloop-workspace-check] Checking plotters-backend v0.3.7
14.98 s
[gammaloop-workspace-check] Checking clap v4.6.1
15.05 s
[gammaloop-workspace-check] Checking fnv v1.0.7
15.07 s
[gammaloop-workspace-check] Checking tempfile v3.27.0
15.09 s
[gammaloop-workspace-check] Checking crossterm v0.28.1
15.11 s
[gammaloop-workspace-check] Checking toml_datetime v0.6.11
15.12 s
[gammaloop-workspace-check] Checking serde_spanned v0.6.9
15.23 s
[gammaloop-workspace-check] Checking ansitok v0.3.0
15.28 s
[gammaloop-workspace-check] Checking itertools v0.10.5
15.39 s
[gammaloop-workspace-check] Checking plotters-svg v0.3.7
15.40 s
[gammaloop-workspace-check] Checking rust-embed-utils v8.11.0
15.42 s
[gammaloop-workspace-check] Checking cast v0.3.0
15.50 s
[gammaloop-workspace-check] Checking toml_write v0.1.2
15.55 s
[gammaloop-workspace-check] Checking tap v1.0.1
15.64 s
[gammaloop-workspace-check] Checking rand_chacha v0.3.1
15.68 s
[gammaloop-workspace-check] Checking wyz v0.5.1
15.71 s
[gammaloop-workspace-check] Compiling unicode_names2 v1.3.0
15.73 s
[gammaloop-workspace-check] Checking plotters v0.3.7
15.77 s
[gammaloop-workspace-check] Checking radium v0.7.0
16.14 s
[gammaloop-workspace-check] Checking typeid v1.0.3
16.17 s
[gammaloop-workspace-check] Checking similar v2.7.0
16.18 s
[gammaloop-workspace-check] Checking ansi-str v0.9.0
16.25 s
[gammaloop-workspace-check] Checking tinytemplate v1.2.1
16.27 s
[gammaloop-workspace-check] Checking is-terminal v0.4.17
16.39 s
[gammaloop-workspace-check] Checking oorandom v11.1.5
16.47 s
[gammaloop-workspace-check] Checking xprec v0.2.2
16.54 s
[gammaloop-workspace-check] Checking funty v2.0.0
16.78 s
[gammaloop-workspace-check] Checking anes v0.1.6
17.02 s
[gammaloop-workspace-check] Checking bytecount v0.6.9
17.16 s
[gammaloop-workspace-check] Checking rand v0.8.6
17.24 s
[gammaloop-workspace-check] Checking ron v0.12.1
17.26 s
[gammaloop-workspace-check] Checking criterion-plot v0.5.0
17.35 s
[gammaloop-workspace-check] Checking papergrid v0.17.0
17.47 s
[gammaloop-workspace-check] Checking testing_table v0.3.0
17.58 s
[gammaloop-workspace-check] Checking toml_edit v0.25.11+spec-1.1.0
17.72 s
[gammaloop-workspace-check] Checking env_filter v1.0.1
17.79 s
[gammaloop-workspace-check] Checking toml_edit v0.22.27
18.01 s
[gammaloop-workspace-check] Checking uncased v0.9.10
18.09 s
[gammaloop-workspace-check] Checking jiff v0.2.24
18.12 s
[gammaloop-workspace-check] Checking ptr_meta v0.1.4
18.25 s
[gammaloop-workspace-check] Checking criterion v0.5.1
18.30 s
[gammaloop-workspace-check] Checking simdutf8 v0.1.5
18.34 s
[gammaloop-workspace-check] Checking ucd-trie v0.1.7
18.36 s
[gammaloop-workspace-check] Checking bitvec v1.0.1
18.64 s
[gammaloop-workspace-check] Checking ahash v0.7.8
18.72 s
[gammaloop-workspace-check] Checking pest v2.8.6
18.93 s
[gammaloop-workspace-check] Checking bytecheck v0.6.12
19.22 s
[gammaloop-workspace-check] Checking hashbrown v0.12.3
19.68 s
[gammaloop-workspace-check] Checking approx v0.4.0
19.92 s
[gammaloop-workspace-check] Checking seahash v4.1.0
19.95 s
[gammaloop-workspace-check] Checking rend v0.4.2
20.12 s
[gammaloop-workspace-check] Checking cgmath v0.18.0
20.42 s
[gammaloop-workspace-check] Checking insta v1.47.2
20.66 s
[gammaloop-workspace-check] Checking num-rational v0.4.2
20.81 s
[gammaloop-workspace-check] Checking tabled v0.20.0
21.59 s
[gammaloop-workspace-check] Checking num-iter v0.1.45
21.75 s
[gammaloop-workspace-check] Checking ref-ops v0.2.5
21.82 s
[gammaloop-workspace-check] Checking num v0.4.3
21.94 s
[gammaloop-workspace-check] Checking rand_xoshiro v0.6.0
21.98 s
[gammaloop-workspace-check] Checking features v0.10.0
22.07 s
[gammaloop-workspace-check] Checking gat-lending-iterator v0.1.8
22.15 s
[gammaloop-workspace-check] Checking constcat v0.5.1
22.23 s
[gammaloop-workspace-check] Checking colored v2.2.0
22.52 s
[gammaloop-workspace-check] Checking constant_time_eq v0.4.2
22.62 s
[gammaloop-workspace-check] Checking cpufeatures v0.3.0
22.71 s
[gammaloop-workspace-check] Checking arrayref v0.3.9
22.73 s
[gammaloop-workspace-check] Checking toml v0.8.23
22.80 s
[gammaloop-workspace-check] Checking blake3 v1.8.5
22.83 s
[gammaloop-workspace-check] Checking base64 v0.22.1
22.96 s
[gammaloop-workspace-check] Compiling pyo3-ffi v0.28.3
22.99 s
[gammaloop-workspace-check] Compiling pyo3-macros-backend v0.28.3
23.00 s
[gammaloop-workspace-check] Compiling pyo3 v0.28.3
23.40 s
[gammaloop-workspace-check] Compiling numpy v0.28.0
23.76 s
[gammaloop-workspace-check] Checking dot-parser v0.5.1
23.88 s
[gammaloop-workspace-check] Checking siphasher v1.0.2
23.92 s
[gammaloop-workspace-check] Checking joinery v2.1.0
23.94 s
[gammaloop-workspace-check] Checking subprocess v0.2.15
24.13 s
[gammaloop-workspace-check] Checking figment v0.10.19
24.20 s
[gammaloop-workspace-check] Checking rust_lisp v0.18.0
24.28 s
[gammaloop-workspace-check] Checking titlecase v2.2.1
24.33 s
[gammaloop-workspace-check] Checking phf_shared v0.13.1
24.42 s
[gammaloop-workspace-check] Compiling vakint v0.1.2 (/build/source/crates/vakint)
24.81 s
[gammaloop-workspace-check] Checking version-compare v0.2.1
24.87 s
[gammaloop-workspace-check] Checking phf v0.13.1
24.93 s
[gammaloop-workspace-check] Checking xpct v0.5.1
25.16 s
[gammaloop-workspace-check] Checking ryu v1.0.23
25.20 s
[gammaloop-workspace-check] Checking castaway v0.2.4
25.22 s
[gammaloop-workspace-check] Checking toml_datetime v0.7.5+spec-1.1.0
25.34 s
[gammaloop-workspace-check] Checking strum v0.27.2
25.41 s
[gammaloop-workspace-check] Checking compact_str v0.9.0
25.49 s
[gammaloop-workspace-check] Checking unicode-truncate v2.0.1
25.53 s
[gammaloop-workspace-check] Checking kasuari v0.4.12
25.68 s
[gammaloop-workspace-check] Checking lru v0.16.4
25.71 s
[gammaloop-workspace-check] Checking vte v0.15.0
25.84 s
[gammaloop-workspace-check] Checking toml v0.9.12+spec-1.1.0
25.86 s
[gammaloop-workspace-check] Checking vt100 v0.16.2
25.87 s
[gammaloop-workspace-check] Checking portable-atomic v1.13.1
25.89 s
[gammaloop-workspace-check] Checking string-template-plus v0.4.3
26.13 s
[gammaloop-workspace-check] Checking unit-prefix v0.5.2
26.21 s
[gammaloop-workspace-check] Checking rand_distr v0.4.3
26.25 s
[gammaloop-workspace-check] Checking simba v0.6.0
26.34 s
[gammaloop-workspace-check] Checking ratatui-core v0.1.0
26.42 s
[gammaloop-workspace-check] Checking line-clipping v0.3.7
26.48 s
[gammaloop-workspace-check] Compiling three-dimensional-reps v0.1.0 (/build/source/crates/three-dimensional-reps)
26.70 s
[gammaloop-workspace-check] Checking adler2 v2.0.1
26.71 s
[gammaloop-workspace-check] Checking gimli v0.32.3
26.81 s
[gammaloop-workspace-check] Checking thiserror v1.0.69
26.87 s
[gammaloop-workspace-check] Checking derive_builder v0.11.2
26.89 s
[gammaloop-workspace-check] Checking miniz_oxide v0.8.9
26.95 s
[gammaloop-workspace-check] Checking owo-colors v4.3.0
27.00 s
[gammaloop-workspace-check] Checking indicatif v0.18.4
27.02 s
[gammaloop-workspace-check] Checking object v0.37.3
27.05 s
[gammaloop-workspace-check] Checking crossterm v0.29.0
27.36 s
[gammaloop-workspace-check] Checking tracing-error v0.2.1
27.46 s
[gammaloop-workspace-check] Checking typed-index-collections v3.5.0
27.68 s
[gammaloop-workspace-check] Checking serde-big-array v0.5.1
27.78 s
[gammaloop-workspace-check] Checking amd v0.2.2
27.81 s
[gammaloop-workspace-check] Compiling rustpython-parser-core v0.4.0
27.96 s
[gammaloop-workspace-check] Checking itertools v0.11.0
28.04 s
[gammaloop-workspace-check] Compiling gammaloop-tracing-filter-macros v0.1.0 (/build/source/crates/gammaloop-tracing-filter-macros)
28.16 s
[gammaloop-workspace-check] Compiling rustpython-ast v0.4.0
28.26 s
[gammaloop-workspace-check] Checking rustc-demangle v0.1.27
28.36 s
[gammaloop-workspace-check] Checking env_logger v0.11.10
28.42 s
[gammaloop-workspace-check] Checking option-ext v0.2.0
28.45 s
[gammaloop-workspace-check] Checking ref-cast v1.0.25
28.49 s
[gammaloop-workspace-check] Checking dirs-sys v0.5.0
28.55 s
[gammaloop-workspace-check] Checking nix v0.31.2
28.62 s
[gammaloop-workspace-check] Checking integer-sqrt v0.1.5
28.71 s
[gammaloop-workspace-check] Checking brotli-decompressor v4.0.3
28.81 s
[gammaloop-workspace-check] Checking crossbeam-channel v0.5.15
28.86 s
[gammaloop-workspace-check] Checking ratatui-widgets v0.3.0
28.88 s
[gammaloop-workspace-check] Checking color-spantrace v0.3.0
28.90 s
[gammaloop-workspace-check] Checking ratatui-crossterm v0.1.0
28.92 s
[gammaloop-workspace-check] Checking itertools v0.12.1
29.15 s
[gammaloop-workspace-check] Checking unsafe-libyaml v0.2.11
29.16 s
[gammaloop-workspace-check] Checking symlink v0.1.0
29.17 s
[gammaloop-workspace-check] Compiling gammalooprs v0.3.4 (/build/source/crates/gammalooprs)
29.24 s
[gammaloop-workspace-check] Checking include_dir v0.7.4
29.33 s
[gammaloop-workspace-check] Checking dirs v6.0.0
29.37 s
[gammaloop-workspace-check] Checking pathfinding v4.15.0
29.53 s
[gammaloop-workspace-check] Checking tracing-appender v0.2.5
29.69 s
[gammaloop-workspace-check] Checking schemars v1.2.1
29.72 s
[gammaloop-workspace-check] Checking ctrlc v3.5.2
29.77 s
[gammaloop-workspace-check] Checking slotmap v1.1.1
29.81 s
[gammaloop-workspace-check] Checking tracing-indicatif v0.3.14
29.86 s
[gammaloop-workspace-check] Checking json5 v0.4.1
29.92 s
[gammaloop-workspace-check] Checking brotli v7.0.0
30.12 s
[gammaloop-workspace-check] Checking vectorize v0.2.0
30.14 s
[gammaloop-workspace-check] Checking rkyv v0.7.46
30.15 s
[gammaloop-workspace-check] Checking clarabel v0.11.1
30.18 s
[gammaloop-workspace-check] Checking ringbuffer v0.16.0
30.41 s
[gammaloop-workspace-check] Checking serde_yaml v0.9.34+deprecated
30.52 s
[gammaloop-workspace-check] Checking base62 v2.2.4
30.71 s
[gammaloop-workspace-check] Checking rust-embed v8.11.0
30.80 s
[gammaloop-workspace-check] Checking clap_complete v4.6.3
30.81 s
[gammaloop-workspace-check] Checking addr2line v0.25.1
30.82 s
[gammaloop-workspace-check] Checking strip-ansi-escapes v0.2.1
30.83 s
[gammaloop-workspace-check] Checking ratatui-macros v0.7.0
30.86 s
[gammaloop-workspace-check] Checking fd-lock v4.0.4
30.92 s
[gammaloop-workspace-check] Checking ratatui v0.30.0
30.95 s
[gammaloop-workspace-check] Compiling gammaloop-api v0.1.0 (/build/source/crates/gammaloop-api)
30.97 s
[gammaloop-workspace-check] Checking itertools v0.13.0
31.07 s
[gammaloop-workspace-check] Checking strum v0.26.3
31.12 s
[gammaloop-workspace-check] Checking clap_complete_nushell v4.6.0
31.15 s
[gammaloop-workspace-check] Checking sysinfo v0.33.1
31.23 s
[gammaloop-workspace-check] Checking shlex v1.3.0
31.38 s
[gammaloop-workspace-check] Checking slab v0.4.12
31.39 s
[gammaloop-workspace-check] Checking futures-core v0.3.32
31.50 s
[gammaloop-workspace-check] Checking futures-task v0.3.32
31.54 s
[gammaloop-workspace-check] Checking sdd v3.0.10
31.59 s
[gammaloop-workspace-check] Compiling gammaloop-integration-tests v0.1.0 (/build/source/tests)
31.62 s
[gammaloop-workspace-check] Compiling test-log-core v0.2.20
31.66 s
[gammaloop-workspace-check] Compiling rustc_version v0.4.1
31.67 s
[gammaloop-workspace-check] Checking futures-util v0.3.32
31.75 s
[gammaloop-workspace-check] Checking scc v2.4.0
31.83 s
[gammaloop-workspace-check] Checking which v8.0.2
32.05 s
[gammaloop-workspace-check] Checking bincode v1.3.3
32.49 s
[gammaloop-workspace-check] Compiling gungraun-macros v0.8.0
32.50 s
[gammaloop-workspace-check] Compiling gungraun-runner v0.18.2
32.64 s
[gammaloop-workspace-check] Checking reedline v0.42.0
33.00 s
[gammaloop-workspace-check] Checking proc-macro2 v1.0.106
33.03 s
[gammaloop-workspace-check] Compiling numerica v2.2.0 (https://github.com/alphal00p/symbolica?rev=a277a8dadbaae5a8d6605f2f381991a601e1f345#a277a8da)
33.21 s
[gammaloop-workspace-check] Checking backtrace v0.3.76
33.28 s
[gammaloop-workspace-check] Checking maplit v1.0.2
33.32 s
[gammaloop-workspace-check] Checking base64 v0.21.7
33.68 s
[gammaloop-workspace-check] Checking color-eyre v0.6.5
33.70 s
[gammaloop-workspace-check] Checking quote v1.0.45
33.73 s
[gammaloop-workspace-check] Checking nalgebra v0.29.0
33.82 s
[gammaloop-workspace-check] Checking ron v0.8.1
34.29 s
[gammaloop-workspace-check] Compiling iai-callgrind-runner v0.14.2
34.51 s
[gammaloop-workspace-check] Checking kurbo v0.13.0
34.83 s
[gammaloop-workspace-check] Checking futures-executor v0.3.32
35.06 s
[gammaloop-workspace-check] Checking wait-timeout v0.2.1
35.17 s
[gammaloop-workspace-check] Checking serial_test v3.4.0
35.30 s
[gammaloop-workspace-check] Checking bit-vec v0.8.0
35.35 s
[gammaloop-workspace-check] Compiling test-log-macros v0.2.20
35.49 s
[gammaloop-workspace-check] Compiling iai-callgrind v0.14.2
35.60 s
[gammaloop-workspace-check] Checking quick-error v1.2.3
35.73 s
[gammaloop-workspace-check] Checking rusty-fork v0.3.1
35.95 s
[gammaloop-workspace-check] Checking bit-set v0.8.0
36.18 s
[gammaloop-workspace-check] Checking syn v2.0.117
36.28 s
[gammaloop-workspace-check] Compiling iai-callgrind-macros v0.5.1
36.56 s
[gammaloop-workspace-check] Checking rand_xorshift v0.4.0
36.78 s
[gammaloop-workspace-check] Checking console v0.15.11
36.95 s
[gammaloop-workspace-check] Checking unarray v0.1.4
37.14 s
[gammaloop-workspace-check] Checking pathdiff v0.2.3
37.36 s
[gammaloop-workspace-check] Checking proptest v1.11.0
37.81 s
[gammaloop-workspace-check] Checking similar-asserts v1.7.0
38.24 s
[gammaloop-workspace-check] Checking clinnet v0.1.8 (/build/source/crates/clinnet)
38.75 s
[gammaloop-workspace-check] Checking kurvst v0.1.0 (/build/source/crates/kurvst)
42.49 s
[gammaloop-workspace-check] Checking test-log v0.2.20
45.57 s
[gammaloop-workspace-check] Compiling graphica v2.1.0 (https://github.com/alphal00p/symbolica?rev=a277a8dadbaae5a8d6605f2f381991a601e1f345#a277a8da)
53.53 s
[gammaloop-workspace-check] Checking statrs v0.16.1
56.64 s
[gammaloop-workspace-check] Checking gungraun v0.18.2
57.30 s
[gammaloop-workspace-check] Checking momtrop v0.3.0
67.37 s
[gammaloop-workspace-check] Compiling pyo3-macros v0.28.3
68.78 s
[gammaloop-workspace-check] Compiling pyo3-stub-gen-derive v0.17.2
80.69 s
[gammaloop-workspace-check] Checking pyo3-stub-gen v0.17.2
91.22 s
[gammaloop-workspace-check] Checking symbolica-utils v0.1.0 (/build/source/crates/symbolica-utils)
91.22 s
[gammaloop-workspace-check] Checking spenso-macros v0.3.2 (/build/source/crates/spenso-macros)
391.84 s
[gammaloop-workspace-check] Compiling gammaloop-workspace-hack v0.1.0 (/build/source/crates/gammaloop-workspace-hack)
392.06 s
[gammaloop-workspace-check] Checking linnet v0.17.0 (/build/source/crates/linnet)
395.50 s
[gammaloop-workspace-check] Checking spenso v0.6.0 (/build/source/crates/spenso)
395.76 s
[gammaloop-workspace-check] Checking linnet-py v0.1.0 (/build/source/crates/linnet-py)
395.76 s
[gammaloop-workspace-check] Checking linnest v0.1.0 (/build/source/crates/linnest)
402.53 s
[gammaloop-workspace-check] Checking idenso v0.3.0 (/build/source/crates/idenso)
402.54 s
[gammaloop-workspace-check] Checking gammaloop-tracing-filter v0.1.0 (/build/source/crates/gammaloop-tracing-filter)
406.08 s
[gammaloop-workspace-check] Checking spenso-hep-lib v0.1.7 (/build/source/crates/spenso-hep-lib)
406.68 s
[gammaloop-workspace-check] Checking spynso3 v0.1.2 (/build/source/crates/spynso3)
462.83 s
[gammaloop-workspace-check] error[E0560] : struct `CutInfo` has no field named `lmb_channel_id`
462.83 s
[gammaloop-workspace-check] --> tests/tests/test_differential.rs:86:13
462.83 s
[gammaloop-workspace-check] |
462.83 s
[gammaloop-workspace-check] 86 | lmb_channel_id: None,
462.83 s
[gammaloop-workspace-check] | ^^^^^^^^^^^^^^ `CutInfo` does not have this field
462.83 s
[gammaloop-workspace-check] |
462.83 s
[gammaloop-workspace-check] = note : available fields are: `sampling_channel_id`, `sampling_channel_edge_ids`
462.83 s
[gammaloop-workspace-check]
462.83 s
[gammaloop-workspace-check] error[E0560] : struct `CutInfo` has no field named `lmb_channel_edge_ids`
462.83 s
[gammaloop-workspace-check] --> tests/tests/test_differential.rs:87:13
462.83 s
[gammaloop-workspace-check] |
462.83 s
[gammaloop-workspace-check] 87 | lmb_channel_edge_ids: None,
462.83 s
[gammaloop-workspace-check] | ^^^^^^^^^^^^^^^^^^^^ `CutInfo` does not have this field
462.83 s
[gammaloop-workspace-check] |
462.83 s
[gammaloop-workspace-check] = note : available fields are: `sampling_channel_id`, `sampling_channel_edge_ids`
462.83 s
[gammaloop-workspace-check]
462.94 s
[gammaloop-workspace-check] error[E0063] : missing field `reference_moments` in initializer of `GraphEvaluationResult<_>`
462.94 s
[gammaloop-workspace-check] --> tests/tests/test_differential.rs:532:19
462.94 s
[gammaloop-workspace-check] |
462.94 s
[gammaloop-workspace-check] 532 | let mut lhs = GraphEvaluationResult {
462.94 s
[gammaloop-workspace-check] | ^^^^^^^^^^^^^^^^^^^^^ missing `reference_moments`
462.94 s
[gammaloop-workspace-check]
462.94 s
[gammaloop-workspace-check] error[E0063] : missing field `reference_moments` in initializer of `GraphEvaluationResult<_>`
462.94 s
[gammaloop-workspace-check] --> tests/tests/test_differential.rs:539:15
462.94 s
[gammaloop-workspace-check] |
462.94 s
[gammaloop-workspace-check] 539 | let rhs = GraphEvaluationResult {
462.94 s
[gammaloop-workspace-check] | ^^^^^^^^^^^^^^^^^^^^^ missing `reference_moments`
462.94 s
[gammaloop-workspace-check]
463.12 s
[gammaloop-workspace-check] error[E0609] : no field `lmb_channel_edge_ids` on type `CutInfo`
463.12 s
[gammaloop-workspace-check] --> tests/tests/test_evaluation_api.rs:311:10
463.12 s
[gammaloop-workspace-check] |
463.12 s
[gammaloop-workspace-check] 311 | .lmb_channel_edge_ids
463.12 s
[gammaloop-workspace-check] | ^^^^^^^^^^^^^^^^^^^^ unknown field
463.12 s
[gammaloop-workspace-check] |
463.12 s
[gammaloop-workspace-check] = note : available fields are: `particle_pdgs`, `cut_id`, `graph_id`, `graph_group_id`, `orientation_id` ... and 2 others
463.12 s
[gammaloop-workspace-check]
463.20 s
[gammaloop-workspace-check] error[E0609] : no field `lmb_channel_edge_ids` on type `CutInfo`
463.20 s
[gammaloop-workspace-check] --> tests/tests/test_evaluation_api.rs:591:26
463.20 s
[gammaloop-workspace-check] |
463.20 s
[gammaloop-workspace-check] 591 | .lmb_channel_edge_ids
463.20 s
[gammaloop-workspace-check] | ^^^^^^^^^^^^^^^^^^^^ unknown field
463.20 s
[gammaloop-workspace-check] |
463.20 s
[gammaloop-workspace-check] = note : available fields are: `particle_pdgs`, `cut_id`, `graph_id`, `graph_group_id`, `orientation_id` ... and 2 others
463.20 s
[gammaloop-workspace-check]
463.20 s
[gammaloop-workspace-check] Some errors have detailed explanations: E0063, E0560.
463.20 s
[gammaloop-workspace-check] For more information about an error, try `rustc --explain E0063`.
463.22 s
[gammaloop-workspace-check] error : could not compile `gammaloop-integration-tests` (test "test_differential") due to 4 previous errors
463.22 s
[gammaloop-workspace-check] warning : build failed, waiting for other jobs to finish...
463.28 s
[gammaloop-workspace-check] error[E0609] : no field `lmb_channel_edge_ids` on type `CutInfo`
463.28 s
[gammaloop-workspace-check] --> tests/tests/test_evaluation_api.rs:1177:18
463.28 s
[gammaloop-workspace-check] |
463.28 s
[gammaloop-workspace-check] 1177 | .lmb_channel_edge_ids
463.28 s
[gammaloop-workspace-check] | ^^^^^^^^^^^^^^^^^^^^ unknown field
463.28 s
[gammaloop-workspace-check] |
463.28 s
[gammaloop-workspace-check] = note : available fields are: `particle_pdgs`, `cut_id`, `graph_id`, `graph_group_id`, `orientation_id` ... and 2 others
463.28 s
[gammaloop-workspace-check]
463.59 s
[gammaloop-workspace-check] error[E0609] : no field `lmb_channel_edge_ids` on type `CutInfo`
463.59 s
[gammaloop-workspace-check] --> tests/tests/test_evaluation_api.rs:1222:22
463.59 s
[gammaloop-workspace-check] |
463.59 s
[gammaloop-workspace-check] 1222 | .lmb_channel_edge_ids
463.59 s
[gammaloop-workspace-check] | ^^^^^^^^^^^^^^^^^^^^ unknown field
463.59 s
[gammaloop-workspace-check] |
463.59 s
[gammaloop-workspace-check] = note : available fields are: `particle_pdgs`, `cut_id`, `graph_id`, `graph_group_id`, `orientation_id` ... and 2 others
463.59 s
[gammaloop-workspace-check]
463.59 s
[gammaloop-workspace-check] error[E0609] : no field `lmb_channel_edge_ids` on type `CutInfo`
463.59 s
[gammaloop-workspace-check] --> tests/tests/test_evaluation_api.rs:1281:14
463.59 s
[gammaloop-workspace-check] |
463.59 s
[gammaloop-workspace-check] 1281 | .lmb_channel_edge_ids
463.59 s
[gammaloop-workspace-check] | ^^^^^^^^^^^^^^^^^^^^ unknown field
463.59 s
[gammaloop-workspace-check] |
463.59 s
[gammaloop-workspace-check] = note : available fields are: `particle_pdgs`, `cut_id`, `graph_id`, `graph_group_id`, `orientation_id` ... and 2 others
463.59 s
[gammaloop-workspace-check]
463.70 s
[gammaloop-workspace-check] error[E0609] : no field `lmb_channel_edge_ids` on type `CutInfo`
463.70 s
[gammaloop-workspace-check] --> tests/tests/test_evaluation_api.rs:1428:18
463.70 s
[gammaloop-workspace-check] |
463.70 s
[gammaloop-workspace-check] 1428 | .lmb_channel_edge_ids
463.70 s
[gammaloop-workspace-check] | ^^^^^^^^^^^^^^^^^^^^ unknown field
463.70 s
[gammaloop-workspace-check] |
463.70 s
[gammaloop-workspace-check] = note : available fields are: `particle_pdgs`, `cut_id`, `graph_id`, `graph_group_id`, `orientation_id` ... and 2 others
463.70 s
[gammaloop-workspace-check]
463.88 s
[gammaloop-workspace-check] For more information about this error, try `rustc --explain E0609`.
463.90 s
[gammaloop-workspace-check] error : could not compile `gammaloop-integration-tests` (test "test_evaluation_api") due to 6 previous errors
464.78 s
[gammaloop-workspace-check] error[E0609] : no field `lmb_channel_id` on type `CutInfo`
464.78 s
[gammaloop-workspace-check] --> tests/tests/test_runs/utils.rs:568:36
464.78 s
[gammaloop-workspace-check] |
464.78 s
[gammaloop-workspace-check] 568 | event.cut_info.lmb_channel_id,
464.78 s
[gammaloop-workspace-check] | ^^^^^^^^^^^^^^ unknown field
464.78 s
[gammaloop-workspace-check] |
464.78 s
[gammaloop-workspace-check] = note : available fields are: `particle_pdgs`, `cut_id`, `graph_id`, `graph_group_id`, `orientation_id` ... and 2 others
464.78 s
[gammaloop-workspace-check]
464.78 s
[gammaloop-workspace-check] error[E0609] : no field `lmb_channel_id` on type `CutInfo`
464.78 s
[gammaloop-workspace-check] --> tests/tests/test_runs/utils.rs:580:36
464.78 s
[gammaloop-workspace-check] |
464.78 s
[gammaloop-workspace-check] 580 | event.cut_info.lmb_channel_id,
464.78 s
[gammaloop-workspace-check] | ^^^^^^^^^^^^^^ unknown field
464.78 s
[gammaloop-workspace-check] |
464.78 s
[gammaloop-workspace-check] = note : available fields are: `particle_pdgs`, `cut_id`, `graph_id`, `graph_group_id`, `orientation_id` ... and 2 others
464.78 s
[gammaloop-workspace-check]
465.97 s
[gammaloop-workspace-check] error : could not compile `gammaloop-integration-tests` (test "test_runs") due to 2 previous errors
466.71 s
Progress: 0 of 1 built (1 failed)
466.71 s
Failed to build gammaloop-workspace-check after 7m43s
466.73 s
Cannot build ' /nix/store/2f1j2lkyg12g36flfbgvv1q9204gpqa0-gammaloop-workspace-check-0.1.0.drv '.
466.73 s
Reason: builder failed with exit code 101 .
466.73 s
Output paths:
466.73 s
/nix/store/8ijafqa7ipzzclcid7n6jgdwkfr2bh7s-gammaloop-workspace-check-0.1.0
466.73 s
Last 524 log lines:
466.73 s
> Running phase: unpackPhase
466.73 s
> unpacking source archive /nix/store/s2z31bfagqssyfp9l6l2s0lp69bdgr0x-source
466.73 s
> source root is source
466.73 s
> Running phase: patchPhase
466.73 s
> Executing configureCargoCommonVars
466.73 s
> decompressing cargo artifacts from /nix/store/50vpxlcgfxf2d57i27v3d10zjwxxbm2r-gammaloop-workspace-deps-deps-0.1.0/target.tar.zst to target
466.73 s
> Running phase: updateAutotoolsGnuConfigScriptsPhase
466.73 s
> Running phase: configurePhase
466.73 s
> will append /build/source/.cargo-home/config.toml with contents of /nix/store/5drf77x6km4ky7gwlrzdx9bbd6fz09g3-vendor-cargo-deps/config.toml
466.73 s
> default configurePhase, nothing to do
466.73 s
> Running phase: buildPhase
466.73 s
> +++ command cargo --version
466.73 s
> cargo 1.97.0 (c980f4866 2026-06-30)
466.73 s
> +++ command cargo check --profile ci-optim --locked --workspace --features gammaloop-tracing-filter/clap,gammaloop-tracing-filter/symbolica,idenso/bincode,idenso/reference-cases,linnet/bincode,linnet/drawing,linnet/rkyv,linnet/serde,linnet/symbolica,spenso-macros/shadowing,spenso/shadowing,symbolica/tracing_max_level_info,three-dimensional-reps/display,three-dimensional-reps/eval,three-dimensional-reps/serde --all-targets
466.73 s
> Checking cfg-if v1.0.4
466.73 s
> Checking memchr v2.8.0
466.73 s
> Checking once_cell v1.21.4
466.73 s
> Checking either v1.15.0
466.73 s
> Checking serde_core v1.0.228
466.73 s
> Checking libc v0.2.186
466.73 s
> Checking libm v0.2.16
466.73 s
> Checking itoa v1.0.18
466.73 s
> Checking log v0.4.29
466.73 s
> Checking regex-syntax v0.8.10
466.73 s
> Checking zerocopy v0.8.48
466.73 s
> Checking crossbeam-utils v0.8.21
466.73 s
> Checking equivalent v1.0.2
466.73 s
> Checking zmij v1.0.21
466.73 s
> Checking lazy_static v1.5.0
466.73 s
> Checking bytemuck v1.25.0
466.73 s
> Compiling target-lexicon v0.13.5
466.73 s
> Checking arrayvec v0.7.6
466.73 s
> Checking powerfmt v0.2.0
466.73 s
> Checking num-conv v0.2.1
466.73 s
> Checking num_threads v0.1.7
466.73 s
> Checking pin-project-lite v0.2.17
466.73 s
> Checking itertools v0.14.0
466.73 s
> Checking time-core v0.1.8
466.73 s
> Checking tracing-core v0.1.36
466.73 s
> Checking deranged v0.5.8
466.73 s
> Checking safe_arch v0.7.4
466.73 s
> Checking foldhash v0.2.0
466.73 s
> Checking allocator-api2 v0.2.21
466.73 s
> Checking const-random v0.1.18
466.73 s
> Checking nu-ansi-term v0.50.3
466.73 s
> Checking static_assertions v1.1.0
466.73 s
> Checking unty v0.0.4
466.73 s
> Checking winnow v1.0.2
466.73 s
> Checking safe_arch v1.0.0
466.73 s
> Checking aho-corasick v1.1.4
466.73 s
> Checking crossbeam-epoch v0.9.18
466.73 s
> Checking wide v0.7.33
466.73 s
> Checking sharded-slab v0.1.7
466.73 s
> Checking tracing v0.1.44
466.73 s
> Checking hashbrown v0.16.1
466.73 s
> Checking tracing-log v0.2.0
466.73 s
> Checking thread_local v1.1.9
466.73 s
> Checking az v1.3.0
466.73 s
> Checking crossbeam-deque v0.8.6
466.73 s
> Checking indenter v0.3.4
466.73 s
> Checking rayon-core v1.13.0
466.73 s
> Checking toml_writer v1.1.1+spec-1.1.0
466.73 s
> Checking wide v1.3.0
466.73 s
> Checking num-traits v0.2.19
466.73 s
> Compiling phf_shared v0.11.3
466.73 s
> Checking anyhow v1.0.102
466.73 s
> Checking utf8parse v0.2.2
466.73 s
> Checking getrandom v0.3.4
466.73 s
> Checking time v0.3.47
466.73 s
> Checking gmp-mpfr-sys v1.7.1
466.73 s
> Checking dyn-clone v1.0.20
466.73 s
> Checking toml_parser v1.1.2+spec-1.1.0
466.73 s
> Checking rayon v1.12.0
466.73 s
> Checking rand_core v0.9.5
466.73 s
> Checking alloc-no-stdlib v2.0.4
466.73 s
> Checking rawpointer v0.2.1
466.73 s
> Checking alloc-stdlib v0.2.2
466.73 s
> Checking matrixmultiply v0.3.10
466.73 s
> Checking anstyle-parse v1.0.0
466.73 s
> Checking is_terminal_polyfill v1.70.2
466.73 s
> Checking colorchoice v1.0.5
466.73 s
> Checking anstyle-query v1.1.5
466.73 s
> Checking colored v3.1.1
466.73 s
> Checking regex-automata v0.4.14
466.73 s
> Checking anstyle v1.0.14
466.73 s
> Compiling phf_generator v0.11.3
466.73 s
> Checking eyre v0.6.12
466.73 s
> Checking unicode-width v0.2.2
466.73 s
> Checking approx v0.5.1
466.73 s
> Compiling pyo3-build-config v0.28.3
466.73 s
> Checking num-integer v0.1.46
466.73 s
> Checking bitflags v1.3.2
466.73 s
> Compiling phf_codegen v0.11.3
466.73 s
> Checking anstream v1.0.0
466.73 s
> Checking brotli-decompressor v5.0.0
466.73 s
> Checking wasmtime-jit-icache-coherence v34.0.2
466.73 s
> Checking region v3.0.2
466.73 s
> Checking hugepage-rs v0.1.1
466.73 s
> Checking serde v1.0.228
466.73 s
> Checking serde_json v1.0.149
466.73 s
> Checking bitflags v2.11.1
466.73 s
> Checking serde_spanned v1.1.1
466.73 s
> Checking toml_datetime v1.1.1+spec-1.1.0
466.73 s
> Checking spec_math v0.1.6
466.73 s
> Checking inventory v0.3.24
466.73 s
> Checking thiserror v2.0.18
466.73 s
> Compiling getopts v0.2.24
466.73 s
> Checking libloading v0.9.0
466.73 s
> Checking bytes v1.11.1
466.73 s
> Checking byteorder v1.5.0
466.73 s
> Checking self_cell v1.2.2
466.73 s
> Checking toml v1.1.2+spec-1.1.0
466.73 s
> Checking tinyjson v2.5.1
466.73 s
> Checking append-only-vec v0.1.8
466.73 s
> Compiling unicode_names2_generator v1.3.0
466.73 s
> Compiling unic-char-range v0.9.0
466.73 s
> Compiling unic-common v0.9.0
466.73 s
> Checking linux-raw-sys v0.12.1
466.73 s
> Checking smallvec v1.15.1
466.73 s
> Checking num-complex v0.4.6
466.73 s
> Checking tracing-serde v0.2.0
466.73 s
> Checking bincode v2.0.1
466.73 s
> Checking smartstring v1.0.1
466.73 s
> Compiling unic-char-property v0.9.0
466.73 s
> Compiling unic-ucd-version v0.9.0
466.73 s
> Checking rustix v1.1.4
466.73 s
> Compiling is-macro v0.3.7
466.73 s
> Compiling rustpython-parser-vendored v0.4.0
466.73 s
> Checking iana-time-zone v0.1.65
466.73 s
> Compiling rustpython-parser v0.4.0
466.73 s
> Compiling phf v0.11.3
466.73 s
> Checking brotli v8.0.2
466.73 s
> Checking simba v0.9.1
466.73 s
> Checking chrono v0.4.44
466.73 s
> Checking rustc-hash v2.1.2
466.73 s
> Checking ndarray v0.17.2
466.73 s
> Compiling unic-ucd-ident v0.9.0
466.73 s
> Compiling unic-emoji-char v0.9.0
466.73 s
> Compiling lalrpop-util v0.20.2
466.73 s
> Compiling rustc-hash v1.1.0
466.73 s
> Checking rug v1.30.0
466.73 s
> Compiling symbolica v2.2.0 (https://github.com/alphal00p/symbolica?rev=a277a8dadbaae5a8d6605f2f381991a601e1f345#a277a8da)
466.73 s
> Checking unicode-segmentation v1.13.2
466.73 s
> Checking typenum v1.20.0
466.73 s
> Checking getrandom v0.2.17
466.73 s
> Checking scopeguard v1.2.0
466.73 s
> Checking ppv-lite86 v0.2.21
466.73 s
> Checking ahash v0.8.12
466.73 s
> Checking lock_api v0.4.14
466.73 s
> Checking parking_lot_core v0.9.12
466.73 s
> Checking unicode-ident v1.0.24
466.73 s
> Checking hashbrown v0.17.0
466.73 s
> Checking rand_chacha v0.9.0
466.73 s
> Checking parking_lot v0.12.5
466.73 s
> Checking errno v0.3.14
466.73 s
> Checking clap_lex v1.1.0
466.73 s
> Checking terminal_size v0.4.4
466.73 s
> Checking unicase v2.9.0
466.73 s
> Checking strsim v0.11.1
466.73 s
> Checking signal-hook-registry v1.4.8
466.73 s
> Checking generic-array v0.14.7
466.73 s
> Checking rand v0.9.4
466.73 s
> Checking vte v0.14.1
466.73 s
> Checking same-file v1.0.6
466.73 s
> Checking clap_builder v4.6.0
466.73 s
> Checking walkdir v2.5.0
466.73 s
> Checking half v2.7.1
466.73 s
> Checking signal-hook v0.3.18
466.73 s
> Checking mio v1.2.0
466.73 s
> Checking indexmap v2.14.0
466.73 s
> Checking minimal-lexical v0.2.1
466.73 s
> Checking symjit v2.21.0
466.73 s
> Checking ciborium-io v0.2.2
466.73 s
> Checking matchers v0.2.0
466.73 s
> Checking regex v1.12.3
466.73 s
> Checking ciborium-ll v0.2.2
466.73 s
> Checking tracing-subscriber v0.3.23
466.73 s
> Checking nom v7.1.3
466.73 s
> Checking signal-hook-mio v0.2.5
466.73 s
> Checking derive_more v2.1.1
466.73 s
> Checking num-bigint v0.4.6
466.73 s
> Checking console v0.16.3
466.73 s
> Checking block-buffer v0.10.4
466.73 s
> Checking crypto-common v0.1.7
466.73 s
> Checking digest v0.10.7
466.73 s
> Checking bstr v1.12.1
466.73 s
> Checking winnow v0.7.15
466.73 s
> Checking linux-raw-sys v0.4.15
466.73 s
> Checking cpufeatures v0.2.17
466.73 s
> Checking sha2 v0.10.9
466.73 s
> Checking ciborium v0.2.2
466.73 s
> Checking getrandom v0.4.2
466.73 s
> Checking rustix v0.38.44
466.73 s
> Checking rand_core v0.6.4
466.73 s
> Checking fastrand v2.4.1
466.73 s
> Checking globset v0.4.18
466.73 s
> Checking plotters-backend v0.3.7
466.73 s
> Checking clap v4.6.1
466.73 s
> Checking fnv v1.0.7
466.73 s
> Checking tempfile v3.27.0
466.73 s
> Checking crossterm v0.28.1
466.73 s
> Checking toml_datetime v0.6.11
466.73 s
> Checking serde_spanned v0.6.9
466.73 s
> Checking ansitok v0.3.0
466.73 s
> Checking itertools v0.10.5
466.73 s
> Checking plotters-svg v0.3.7
466.73 s
> Checking rust-embed-utils v8.11.0
466.73 s
> Checking cast v0.3.0
466.73 s
> Checking toml_write v0.1.2
466.73 s
> Checking tap v1.0.1
466.73 s
> Checking rand_chacha v0.3.1
466.73 s
> Checking wyz v0.5.1
466.73 s
> Compiling unicode_names2 v1.3.0
466.73 s
> Checking plotters v0.3.7
466.73 s
> Checking radium v0.7.0
466.73 s
> Checking typeid v1.0.3
466.73 s
> Checking similar v2.7.0
466.73 s
> Checking ansi-str v0.9.0
466.73 s
> Checking tinytemplate v1.2.1
466.73 s
> Checking is-terminal v0.4.17
466.73 s
> Checking oorandom v11.1.5
466.73 s
> Checking xprec v0.2.2
466.73 s
> Checking funty v2.0.0
466.73 s
> Checking anes v0.1.6
466.73 s
> Checking bytecount v0.6.9
466.73 s
> Checking rand v0.8.6
466.73 s
> Checking ron v0.12.1
466.73 s
> Checking criterion-plot v0.5.0
466.73 s
> Checking papergrid v0.17.0
466.73 s
> Checking testing_table v0.3.0
466.73 s
> Checking toml_edit v0.25.11+spec-1.1.0
466.73 s
> Checking env_filter v1.0.1
466.73 s
> Checking toml_edit v0.22.27
466.73 s
> Checking uncased v0.9.10
466.73 s
> Checking jiff v0.2.24
466.73 s
> Checking ptr_meta v0.1.4
466.73 s
> Checking criterion v0.5.1
466.73 s
> Checking simdutf8 v0.1.5
466.73 s
> Checking ucd-trie v0.1.7
466.73 s
> Checking bitvec v1.0.1
466.73 s
> Checking ahash v0.7.8
466.73 s
> Checking pest v2.8.6
466.73 s
> Checking bytecheck v0.6.12
466.73 s
> Checking hashbrown v0.12.3
466.73 s
> Checking approx v0.4.0
466.73 s
> Checking seahash v4.1.0
466.73 s
> Checking rend v0.4.2
466.73 s
> Checking cgmath v0.18.0
466.73 s
> Checking insta v1.47.2
466.73 s
> Checking num-rational v0.4.2
466.73 s
> Checking tabled v0.20.0
466.73 s
> Checking num-iter v0.1.45
466.73 s
> Checking ref-ops v0.2.5
466.73 s
> Checking num v0.4.3
466.73 s
> Checking rand_xoshiro v0.6.0
466.73 s
> Checking features v0.10.0
466.73 s
> Checking gat-lending-iterator v0.1.8
466.73 s
> Checking constcat v0.5.1
466.73 s
> Checking colored v2.2.0
466.73 s
> Checking constant_time_eq v0.4.2
466.73 s
> Checking cpufeatures v0.3.0
466.73 s
> Checking arrayref v0.3.9
466.73 s
> Checking toml v0.8.23
466.73 s
> Checking blake3 v1.8.5
466.73 s
> Checking base64 v0.22.1
466.73 s
> Compiling pyo3-ffi v0.28.3
466.73 s
> Compiling pyo3-macros-backend v0.28.3
466.73 s
> Compiling pyo3 v0.28.3
466.73 s
> Compiling numpy v0.28.0
466.73 s
> Checking dot-parser v0.5.1
466.73 s
> Checking siphasher v1.0.2
466.73 s
> Checking joinery v2.1.0
466.73 s
> Checking subprocess v0.2.15
466.73 s
> Checking figment v0.10.19
466.73 s
> Checking rust_lisp v0.18.0
466.73 s
> Checking titlecase v2.2.1
466.73 s
> Checking phf_shared v0.13.1
466.73 s
> Compiling vakint v0.1.2 (/build/source/crates/vakint)
466.73 s
> Checking version-compare v0.2.1
466.73 s
> Checking phf v0.13.1
466.73 s
> Checking xpct v0.5.1
466.73 s
> Checking ryu v1.0.23
466.73 s
> Checking castaway v0.2.4
466.73 s
> Checking toml_datetime v0.7.5+spec-1.1.0
466.73 s
> Checking strum v0.27.2
466.73 s
> Checking compact_str v0.9.0
466.73 s
> Checking unicode-truncate v2.0.1
466.73 s
> Checking kasuari v0.4.12
466.73 s
> Checking lru v0.16.4
466.73 s
> Checking vte v0.15.0
466.73 s
> Checking toml v0.9.12+spec-1.1.0
466.73 s
> Checking vt100 v0.16.2
466.73 s
> Checking portable-atomic v1.13.1
466.73 s
> Checking string-template-plus v0.4.3
466.73 s
> Checking unit-prefix v0.5.2
466.73 s
> Checking rand_distr v0.4.3
466.73 s
> Checking simba v0.6.0
466.73 s
> Checking ratatui-core v0.1.0
466.73 s
> Checking line-clipping v0.3.7
466.73 s
> Compiling three-dimensional-reps v0.1.0 (/build/source/crates/three-dimensional-reps)
466.73 s
> Checking adler2 v2.0.1
466.73 s
> Checking gimli v0.32.3
466.73 s
> Checking thiserror v1.0.69
466.73 s
> Checking derive_builder v0.11.2
466.73 s
> Checking miniz_oxide v0.8.9
466.73 s
> Checking owo-colors v4.3.0
466.73 s
> Checking indicatif v0.18.4
466.73 s
> Checking object v0.37.3
466.73 s
> Checking crossterm v0.29.0
466.73 s
> Checking tracing-error v0.2.1
466.73 s
> Checking typed-index-collections v3.5.0
466.73 s
> Checking serde-big-array v0.5.1
466.73 s
> Checking amd v0.2.2
466.73 s
> Compiling rustpython-parser-core v0.4.0
466.73 s
> Checking itertools v0.11.0
466.73 s
> Compiling gammaloop-tracing-filter-macros v0.1.0 (/build/source/crates/gammaloop-tracing-filter-macros)
466.73 s
> Compiling rustpython-ast v0.4.0
466.73 s
> Checking rustc-demangle v0.1.27
466.73 s
> Checking env_logger v0.11.10
466.73 s
> Checking option-ext v0.2.0
466.73 s
> Checking ref-cast v1.0.25
466.73 s
> Checking dirs-sys v0.5.0
466.73 s
> Checking nix v0.31.2
466.73 s
> Checking integer-sqrt v0.1.5
466.73 s
> Checking brotli-decompressor v4.0.3
466.73 s
> Checking crossbeam-channel v0.5.15
466.73 s
> Checking ratatui-widgets v0.3.0
466.73 s
> Checking color-spantrace v0.3.0
466.73 s
> Checking ratatui-crossterm v0.1.0
466.73 s
> Checking itertools v0.12.1
466.73 s
> Checking unsafe-libyaml v0.2.11
466.73 s
> Checking symlink v0.1.0
466.73 s
> Compiling gammalooprs v0.3.4 (/build/source/crates/gammalooprs)
466.73 s
> Checking include_dir v0.7.4
466.73 s
> Checking dirs v6.0.0
466.73 s
> Checking pathfinding v4.15.0
466.73 s
> Checking tracing-appender v0.2.5
466.73 s
> Checking schemars v1.2.1
466.73 s
> Checking ctrlc v3.5.2
466.73 s
> Checking slotmap v1.1.1
466.73 s
> Checking tracing-indicatif v0.3.14
466.73 s
> Checking json5 v0.4.1
466.73 s
> Checking brotli v7.0.0
466.73 s
> Checking vectorize v0.2.0
466.73 s
> Checking rkyv v0.7.46
466.73 s
> Checking clarabel v0.11.1
466.73 s
> Checking ringbuffer v0.16.0
466.73 s
> Checking serde_yaml v0.9.34+deprecated
466.73 s
> Checking base62 v2.2.4
466.73 s
> Checking rust-embed v8.11.0
466.73 s
> Checking clap_complete v4.6.3
466.73 s
> Checking addr2line v0.25.1
466.73 s
> Checking strip-ansi-escapes v0.2.1
466.73 s
> Checking ratatui-macros v0.7.0
466.73 s
> Checking fd-lock v4.0.4
466.73 s
> Checking ratatui v0.30.0
466.73 s
> Compiling gammaloop-api v0.1.0 (/build/source/crates/gammaloop-api)
466.73 s
> Checking itertools v0.13.0
466.73 s
> Checking strum v0.26.3
466.73 s
> Checking clap_complete_nushell v4.6.0
466.73 s
> Checking sysinfo v0.33.1
466.73 s
> Checking shlex v1.3.0
466.73 s
> Checking slab v0.4.12
466.73 s
> Checking futures-core v0.3.32
466.73 s
> Checking futures-task v0.3.32
466.73 s
> Checking sdd v3.0.10
466.73 s
> Compiling gammaloop-integration-tests v0.1.0 (/build/source/tests)
466.73 s
> Compiling test-log-core v0.2.20
466.73 s
> Compiling rustc_version v0.4.1
466.73 s
> Checking futures-util v0.3.32
466.73 s
> Checking scc v2.4.0
466.73 s
> Checking which v8.0.2
466.73 s
> Checking bincode v1.3.3
466.73 s
> Compiling gungraun-macros v0.8.0
466.73 s
> Compiling gungraun-runner v0.18.2
466.73 s
> Checking reedline v0.42.0
466.73 s
> Checking proc-macro2 v1.0.106
466.73 s
> Compiling numerica v2.2.0 (https://github.com/alphal00p/symbolica?rev=a277a8dadbaae5a8d6605f2f381991a601e1f345#a277a8da)
466.73 s
> Checking backtrace v0.3.76
466.73 s
> Checking maplit v1.0.2
466.73 s
> Checking base64 v0.21.7
466.73 s
> Checking color-eyre v0.6.5
466.73 s
> Checking quote v1.0.45
466.73 s
> Checking nalgebra v0.29.0
466.73 s
> Checking ron v0.8.1
466.73 s
> Compiling iai-callgrind-runner v0.14.2
466.73 s
> Checking kurbo v0.13.0
466.73 s
> Checking futures-executor v0.3.32
466.73 s
> Checking wait-timeout v0.2.1
466.73 s
> Checking serial_test v3.4.0
466.73 s
> Checking bit-vec v0.8.0
466.73 s
> Compiling test-log-macros v0.2.20
466.73 s
> Compiling iai-callgrind v0.14.2
466.73 s
> Checking quick-error v1.2.3
466.73 s
> Checking rusty-fork v0.3.1
466.73 s
> Checking bit-set v0.8.0
466.73 s
> Checking syn v2.0.117
466.73 s
> Compiling iai-callgrind-macros v0.5.1
466.73 s
> Checking rand_xorshift v0.4.0
466.73 s
> Checking console v0.15.11
466.73 s
> Checking unarray v0.1.4
466.73 s
> Checking pathdiff v0.2.3
466.73 s
> Checking proptest v1.11.0
466.73 s
> Checking similar-asserts v1.7.0
466.73 s
> Checking clinnet v0.1.8 (/build/source/crates/clinnet)
466.73 s
> Checking kurvst v0.1.0 (/build/source/crates/kurvst)
466.73 s
> Checking test-log v0.2.20
466.73 s
> Compiling graphica v2.1.0 (https://github.com/alphal00p/symbolica?rev=a277a8dadbaae5a8d6605f2f381991a601e1f345#a277a8da)
466.73 s
> Checking statrs v0.16.1
466.73 s
> Checking gungraun v0.18.2
466.73 s
> Checking momtrop v0.3.0
466.73 s
> Compiling pyo3-macros v0.28.3
466.73 s
> Compiling pyo3-stub-gen-derive v0.17.2
466.73 s
> Checking pyo3-stub-gen v0.17.2
466.73 s
> Checking symbolica-utils v0.1.0 (/build/source/crates/symbolica-utils)
466.73 s
> Checking spenso-macros v0.3.2 (/build/source/crates/spenso-macros)
466.73 s
> Compiling gammaloop-workspace-hack v0.1.0 (/build/source/crates/gammaloop-workspace-hack)
466.73 s
> Checking linnet v0.17.0 (/build/source/crates/linnet)
466.73 s
> Checking spenso v0.6.0 (/build/source/crates/spenso)
466.73 s
> Checking linnet-py v0.1.0 (/build/source/crates/linnet-py)
466.73 s
> Checking linnest v0.1.0 (/build/source/crates/linnest)
466.73 s
> Checking idenso v0.3.0 (/build/source/crates/idenso)
466.73 s
> Checking gammaloop-tracing-filter v0.1.0 (/build/source/crates/gammaloop-tracing-filter)
466.73 s
> Checking spenso-hep-lib v0.1.7 (/build/source/crates/spenso-hep-lib)
466.73 s
> Checking spynso3 v0.1.2 (/build/source/crates/spynso3)
466.73 s
> error[E0560] : struct `CutInfo` has no field named `lmb_channel_id`
466.73 s
> --> tests/tests/test_differential.rs:86:13
466.73 s
> |
466.73 s
> 86 | lmb_channel_id: None,
466.73 s
> | ^^^^^^^^^^^^^^ `CutInfo` does not have this field
466.73 s
> |
466.73 s
> = note : available fields are: `sampling_channel_id`, `sampling_channel_edge_ids`
466.73 s
>
466.73 s
> error[E0560] : struct `CutInfo` has no field named `lmb_channel_edge_ids`
466.73 s
> --> tests/tests/test_differential.rs:87:13
466.73 s
> |
466.73 s
> 87 | lmb_channel_edge_ids: None,
466.73 s
> | ^^^^^^^^^^^^^^^^^^^^ `CutInfo` does not have this field
466.73 s
> |
466.73 s
> = note : available fields are: `sampling_channel_id`, `sampling_channel_edge_ids`
466.73 s
>
466.73 s
> error[E0063] : missing field `reference_moments` in initializer of `GraphEvaluationResult<_>`
466.73 s
> --> tests/tests/test_differential.rs:532:19
466.73 s
> |
466.73 s
> 532 | let mut lhs = GraphEvaluationResult {
466.73 s
> | ^^^^^^^^^^^^^^^^^^^^^ missing `reference_moments`
466.73 s
>
466.73 s
> error[E0063] : missing field `reference_moments` in initializer of `GraphEvaluationResult<_>`
466.73 s
> --> tests/tests/test_differential.rs:539:15
466.73 s
> |
466.73 s
> 539 | let rhs = GraphEvaluationResult {
466.73 s
> | ^^^^^^^^^^^^^^^^^^^^^ missing `reference_moments`
466.73 s
>
466.73 s
> error[E0609] : no field `lmb_channel_edge_ids` on type `CutInfo`
466.73 s
> --> tests/tests/test_evaluation_api.rs:311:10
466.73 s
> |
466.73 s
> 311 | .lmb_channel_edge_ids
466.73 s
> | ^^^^^^^^^^^^^^^^^^^^ unknown field
466.73 s
> |
466.73 s
> = note : available fields are: `particle_pdgs`, `cut_id`, `graph_id`, `graph_group_id`, `orientation_id` ... and 2 others
466.73 s
>
466.73 s
> error[E0609] : no field `lmb_channel_edge_ids` on type `CutInfo`
466.73 s
> --> tests/tests/test_evaluation_api.rs:591:26
466.73 s
> |
466.73 s
> 591 | .lmb_channel_edge_ids
466.73 s
> | ^^^^^^^^^^^^^^^^^^^^ unknown field
466.73 s
> |
466.73 s
> = note : available fields are: `particle_pdgs`, `cut_id`, `graph_id`, `graph_group_id`, `orientation_id` ... and 2 others
466.73 s
>
466.73 s
> Some errors have detailed explanations: E0063, E0560.
466.73 s
> For more information about an error, try `rustc --explain E0063`.
466.73 s
> error : could not compile `gammaloop-integration-tests` (test "test_differential") due to 4 previous errors
466.73 s
> warning : build failed, waiting for other jobs to finish...
466.73 s
> error[E0609] : no field `lmb_channel_edge_ids` on type `CutInfo`
466.73 s
> --> tests/tests/test_evaluation_api.rs:1177:18
466.73 s
> |
466.73 s
> 1177 | .lmb_channel_edge_ids
466.73 s
> | ^^^^^^^^^^^^^^^^^^^^ unknown field
466.73 s
> |
466.73 s
> = note : available fields are: `particle_pdgs`, `cut_id`, `graph_id`, `graph_group_id`, `orientation_id` ... and 2 others
466.73 s
>
466.73 s
> error[E0609] : no field `lmb_channel_edge_ids` on type `CutInfo`
466.73 s
> --> tests/tests/test_evaluation_api.rs:1222:22
466.73 s
> |
466.73 s
> 1222 | .lmb_channel_edge_ids
466.73 s
> | ^^^^^^^^^^^^^^^^^^^^ unknown field
466.73 s
> |
466.73 s
> = note : available fields are: `particle_pdgs`, `cut_id`, `graph_id`, `graph_group_id`, `orientation_id` ... and 2 others
466.73 s
>
466.73 s
> error[E0609] : no field `lmb_channel_edge_ids` on type `CutInfo`
466.73 s
> --> tests/tests/test_evaluation_api.rs:1281:14
466.73 s
> |
466.73 s
> 1281 | .lmb_channel_edge_ids
466.73 s
> | ^^^^^^^^^^^^^^^^^^^^ unknown field
466.73 s
> |
466.73 s
> = note : available fields are: `particle_pdgs`, `cut_id`, `graph_id`, `graph_group_id`, `orientation_id` ... and 2 others
466.73 s
>
466.73 s
> error[E0609] : no field `lmb_channel_edge_ids` on type `CutInfo`
466.73 s
> --> tests/tests/test_evaluation_api.rs:1428:18
466.73 s
> |
466.73 s
> 1428 | .lmb_channel_edge_ids
466.73 s
> | ^^^^^^^^^^^^^^^^^^^^ unknown field
466.73 s
> |
466.73 s
> = note : available fields are: `particle_pdgs`, `cut_id`, `graph_id`, `graph_group_id`, `orientation_id` ... and 2 others
466.73 s
>
466.73 s
> For more information about this error, try `rustc --explain E0609`.
466.73 s
> error : could not compile `gammaloop-integration-tests` (test "test_evaluation_api") due to 6 previous errors
466.73 s
> error[E0609] : no field `lmb_channel_id` on type `CutInfo`
466.73 s
> --> tests/tests/test_runs/utils.rs:568:36
466.73 s
> |
466.73 s
> 568 | event.cut_info.lmb_channel_id,
466.73 s
> | ^^^^^^^^^^^^^^ unknown field
466.73 s
> |
466.73 s
> = note : available fields are: `particle_pdgs`, `cut_id`, `graph_id`, `graph_group_id`, `orientation_id` ... and 2 others
466.73 s
>
466.73 s
> error[E0609] : no field `lmb_channel_id` on type `CutInfo`
466.73 s
> --> tests/tests/test_runs/utils.rs:580:36
466.73 s
> |
466.73 s
> 580 | event.cut_info.lmb_channel_id,
466.73 s
> | ^^^^^^^^^^^^^^ unknown field
466.73 s
> |
466.73 s
> = note : available fields are: `particle_pdgs`, `cut_id`, `graph_id`, `graph_group_id`, `orientation_id` ... and 2 others
466.73 s
>
466.73 s
> error : could not compile `gammaloop-integration-tests` (test "test_runs") due to 2 previous errors
466.73 s
For full logs, run:
466.73 s
nix log /nix/store/2f1j2lkyg12g36flfbgvv1q9204gpqa0-gammaloop-workspace-check-0.1.0.drv
466.94 s
Build failed.