1. 0.00 s $ /nix/store/9ypz3flqsrl5xl495mm8h645gadjsxi1-coreutils-9.11/bin/timeout --kill-after=15s 7200s /nix/store/23zk8sgzamrbmj1fday15szf7f2279s8-nix-2.34.7/bin/nix --extra-experimental-features nix-command --extra-experimental-features flakes --log-format internal-json build --no-link --print-out-paths git+https://github.com/alphal00p/gammaloop?ref=advanced_sampling&rev=ad713af8ba0173320df0aef4e53935ec4cf8a238&shallow=1#checks.x86_64-linux.gammaloop-check --print-build-logs
  2. 2.49 s
  3. 3.02 s Building /nix/store/2f1j2lkyg12g36flfbgvv1q9204gpqa0-gammaloop-workspace-check-0.1.0.drv
  4. 3.12 s [gammaloop-workspace-check] Phase: unpackPhase
  5. 3.13 s [gammaloop-workspace-check] unpacking source archive /nix/store/s2z31bfagqssyfp9l6l2s0lp69bdgr0x-source
  6. 3.37 s [gammaloop-workspace-check] source root is source
  7. 3.41 s [gammaloop-workspace-check] Phase: patchPhase
  8. 3.42 s [gammaloop-workspace-check] Executing configureCargoCommonVars
  9. 3.42 s [gammaloop-workspace-check] decompressing cargo artifacts from /nix/store/50vpxlcgfxf2d57i27v3d10zjwxxbm2r-gammaloop-workspace-deps-deps-0.1.0/target.tar.zst to target
  10. 4.67 s [gammaloop-workspace-check] Phase: updateAutotoolsGnuConfigScriptsPhase
  11. 4.71 s [gammaloop-workspace-check] Phase: configurePhase
  12. 4.71 s [gammaloop-workspace-check] will append /build/source/.cargo-home/config.toml with contents of /nix/store/5drf77x6km4ky7gwlrzdx9bbd6fz09g3-vendor-cargo-deps/config.toml
  13. 4.71 s [gammaloop-workspace-check] default configurePhase, nothing to do
  14. 4.72 s [gammaloop-workspace-check] Phase: buildPhase
  15. 4.72 s [gammaloop-workspace-check] +++ command cargo --version
  16. 4.72 s [gammaloop-workspace-check] cargo 1.97.0 (c980f4866 2026-06-30)
  17. 4.75 s [gammaloop-workspace-check] +++ command cargo check --profile ci-optim --locked --workspace --features gammaloop-tracing-filter/clap,gammaloop-tracing-filter/symbolica,idenso/bincode,idenso/reference-cases,linnet/bincode,linnet/drawing,linnet/rkyv,linnet/serde,linnet/symbolica,spenso-macros/shadowing,spenso/shadowing,symbolica/tracing_max_level_info,three-dimensional-reps/display,three-dimensional-reps/eval,three-dimensional-reps/serde --all-targets
  18. 5.23 s [gammaloop-workspace-check] Checking cfg-if v1.0.4
  19. 5.23 s [gammaloop-workspace-check] Checking memchr v2.8.0
  20. 5.23 s [gammaloop-workspace-check] Checking once_cell v1.21.4
  21. 5.24 s [gammaloop-workspace-check] Checking either v1.15.0
  22. 5.25 s [gammaloop-workspace-check] Checking serde_core v1.0.228
  23. 5.25 s [gammaloop-workspace-check] Checking libc v0.2.186
  24. 5.25 s [gammaloop-workspace-check] Checking libm v0.2.16
  25. 5.26 s [gammaloop-workspace-check] Checking itoa v1.0.18
  26. 5.26 s [gammaloop-workspace-check] Checking log v0.4.29
  27. 5.26 s [gammaloop-workspace-check] Checking regex-syntax v0.8.10
  28. 5.27 s [gammaloop-workspace-check] Checking zerocopy v0.8.48
  29. 5.27 s [gammaloop-workspace-check] Checking crossbeam-utils v0.8.21
  30. 5.28 s [gammaloop-workspace-check] Checking equivalent v1.0.2
  31. 5.29 s [gammaloop-workspace-check] Checking zmij v1.0.21
  32. 5.29 s [gammaloop-workspace-check] Checking lazy_static v1.5.0
  33. 5.29 s [gammaloop-workspace-check] Checking bytemuck v1.25.0
  34. 5.29 s [gammaloop-workspace-check] Compiling target-lexicon v0.13.5
  35. 5.32 s [gammaloop-workspace-check] Checking arrayvec v0.7.6
  36. 5.34 s [gammaloop-workspace-check] Checking powerfmt v0.2.0
  37. 5.35 s [gammaloop-workspace-check] Checking num-conv v0.2.1
  38. 5.38 s [gammaloop-workspace-check] Checking num_threads v0.1.7
  39. 5.39 s [gammaloop-workspace-check] Checking pin-project-lite v0.2.17
  40. 5.41 s [gammaloop-workspace-check] Checking itertools v0.14.0
  41. 5.43 s [gammaloop-workspace-check] Checking time-core v0.1.8
  42. 5.44 s [gammaloop-workspace-check] Checking tracing-core v0.1.36
  43. 5.46 s [gammaloop-workspace-check] Checking deranged v0.5.8
  44. 5.46 s [gammaloop-workspace-check] Checking safe_arch v0.7.4
  45. 5.47 s [gammaloop-workspace-check] Checking foldhash v0.2.0
  46. 5.48 s [gammaloop-workspace-check] Checking allocator-api2 v0.2.21
  47. 5.49 s [gammaloop-workspace-check] Checking const-random v0.1.18
  48. 5.53 s [gammaloop-workspace-check] Checking nu-ansi-term v0.50.3
  49. 5.55 s [gammaloop-workspace-check] Checking static_assertions v1.1.0
  50. 5.59 s [gammaloop-workspace-check] Checking unty v0.0.4
  51. 5.62 s [gammaloop-workspace-check] Checking winnow v1.0.2
  52. 5.64 s [gammaloop-workspace-check] Checking safe_arch v1.0.0
  53. 5.66 s [gammaloop-workspace-check] Checking aho-corasick v1.1.4
  54. 5.67 s [gammaloop-workspace-check] Checking crossbeam-epoch v0.9.18
  55. 5.72 s [gammaloop-workspace-check] Checking wide v0.7.33
  56. 5.74 s [gammaloop-workspace-check] Checking sharded-slab v0.1.7
  57. 5.74 s [gammaloop-workspace-check] Checking tracing v0.1.44
  58. 5.79 s [gammaloop-workspace-check] Checking hashbrown v0.16.1
  59. 5.87 s [gammaloop-workspace-check] Checking tracing-log v0.2.0
  60. 5.98 s [gammaloop-workspace-check] Checking thread_local v1.1.9
  61. 6.02 s [gammaloop-workspace-check] Checking az v1.3.0
  62. 6.06 s [gammaloop-workspace-check] Checking crossbeam-deque v0.8.6
  63. 6.17 s [gammaloop-workspace-check] Checking indenter v0.3.4
  64. 6.21 s [gammaloop-workspace-check] Checking rayon-core v1.13.0
  65. 6.22 s [gammaloop-workspace-check] Checking toml_writer v1.1.1+spec-1.1.0
  66. 6.23 s [gammaloop-workspace-check] Checking wide v1.3.0
  67. 6.27 s [gammaloop-workspace-check] Checking num-traits v0.2.19
  68. 6.35 s [gammaloop-workspace-check] Compiling phf_shared v0.11.3
  69. 6.38 s [gammaloop-workspace-check] Checking anyhow v1.0.102
  70. 6.46 s [gammaloop-workspace-check] Checking utf8parse v0.2.2
  71. 6.47 s [gammaloop-workspace-check] Checking getrandom v0.3.4
  72. 6.50 s [gammaloop-workspace-check] Checking time v0.3.47
  73. 6.54 s [gammaloop-workspace-check] Checking gmp-mpfr-sys v1.7.1
  74. 6.56 s [gammaloop-workspace-check] Checking dyn-clone v1.0.20
  75. 6.59 s [gammaloop-workspace-check] Checking toml_parser v1.1.2+spec-1.1.0
  76. 6.60 s [gammaloop-workspace-check] Checking rayon v1.12.0
  77. 6.61 s [gammaloop-workspace-check] Checking rand_core v0.9.5
  78. 6.64 s [gammaloop-workspace-check] Checking alloc-no-stdlib v2.0.4
  79. 6.65 s [gammaloop-workspace-check] Checking rawpointer v0.2.1
  80. 6.73 s [gammaloop-workspace-check] Checking alloc-stdlib v0.2.2
  81. 6.74 s [gammaloop-workspace-check] Checking matrixmultiply v0.3.10
  82. 6.77 s [gammaloop-workspace-check] Checking anstyle-parse v1.0.0
  83. 6.78 s [gammaloop-workspace-check] Checking is_terminal_polyfill v1.70.2
  84. 6.79 s [gammaloop-workspace-check] Checking colorchoice v1.0.5
  85. 6.84 s [gammaloop-workspace-check] Checking anstyle-query v1.1.5
  86. 6.84 s [gammaloop-workspace-check] Checking colored v3.1.1
  87. 6.86 s [gammaloop-workspace-check] Checking regex-automata v0.4.14
  88. 6.88 s [gammaloop-workspace-check] Checking anstyle v1.0.14
  89. 6.93 s [gammaloop-workspace-check] Compiling phf_generator v0.11.3
  90. 6.99 s [gammaloop-workspace-check] Checking eyre v0.6.12
  91. 7.02 s [gammaloop-workspace-check] Checking unicode-width v0.2.2
  92. 7.06 s [gammaloop-workspace-check] Checking approx v0.5.1
  93. 7.09 s [gammaloop-workspace-check] Compiling pyo3-build-config v0.28.3
  94. 7.15 s [gammaloop-workspace-check] Checking num-integer v0.1.46
  95. 7.19 s [gammaloop-workspace-check] Checking bitflags v1.3.2
  96. 7.20 s [gammaloop-workspace-check] Compiling phf_codegen v0.11.3
  97. 7.20 s [gammaloop-workspace-check] Checking anstream v1.0.0
  98. 7.20 s [gammaloop-workspace-check] Checking brotli-decompressor v5.0.0
  99. 7.24 s [gammaloop-workspace-check] Checking wasmtime-jit-icache-coherence v34.0.2
  100. 7.25 s [gammaloop-workspace-check] Checking region v3.0.2
  101. 7.29 s [gammaloop-workspace-check] Checking hugepage-rs v0.1.1
  102. 7.34 s [gammaloop-workspace-check] Checking serde v1.0.228
  103. 7.35 s [gammaloop-workspace-check] Checking serde_json v1.0.149
  104. 7.38 s [gammaloop-workspace-check] Checking bitflags v2.11.1
  105. 7.38 s [gammaloop-workspace-check] Checking serde_spanned v1.1.1
  106. 7.39 s [gammaloop-workspace-check] Checking toml_datetime v1.1.1+spec-1.1.0
  107. 7.40 s [gammaloop-workspace-check] Checking spec_math v0.1.6
  108. 7.43 s [gammaloop-workspace-check] Checking inventory v0.3.24
  109. 7.47 s [gammaloop-workspace-check] Checking thiserror v2.0.18
  110. 7.49 s [gammaloop-workspace-check] Compiling getopts v0.2.24
  111. 7.49 s [gammaloop-workspace-check] Checking libloading v0.9.0
  112. 7.51 s [gammaloop-workspace-check] Checking bytes v1.11.1
  113. 7.56 s [gammaloop-workspace-check] Checking byteorder v1.5.0
  114. 7.58 s [gammaloop-workspace-check] Checking self_cell v1.2.2
  115. 7.59 s [gammaloop-workspace-check] Checking toml v1.1.2+spec-1.1.0
  116. 7.66 s [gammaloop-workspace-check] Checking tinyjson v2.5.1
  117. 7.67 s [gammaloop-workspace-check] Checking append-only-vec v0.1.8
  118. 7.87 s [gammaloop-workspace-check] Compiling unicode_names2_generator v1.3.0
  119. 7.95 s [gammaloop-workspace-check] Compiling unic-char-range v0.9.0
  120. 7.97 s [gammaloop-workspace-check] Compiling unic-common v0.9.0
  121. 7.97 s [gammaloop-workspace-check] Checking linux-raw-sys v0.12.1
  122. 7.98 s [gammaloop-workspace-check] Checking smallvec v1.15.1
  123. 8.04 s [gammaloop-workspace-check] Checking num-complex v0.4.6
  124. 8.05 s [gammaloop-workspace-check] Checking tracing-serde v0.2.0
  125. 8.12 s [gammaloop-workspace-check] Checking bincode v2.0.1
  126. 8.16 s [gammaloop-workspace-check] Checking smartstring v1.0.1
  127. 8.20 s [gammaloop-workspace-check] Compiling unic-char-property v0.9.0
  128. 8.30 s [gammaloop-workspace-check] Compiling unic-ucd-version v0.9.0
  129. 8.35 s [gammaloop-workspace-check] Checking rustix v1.1.4
  130. 8.36 s [gammaloop-workspace-check] Compiling is-macro v0.3.7
  131. 8.37 s [gammaloop-workspace-check] Compiling rustpython-parser-vendored v0.4.0
  132. 8.51 s [gammaloop-workspace-check] Checking iana-time-zone v0.1.65
  133. 8.53 s [gammaloop-workspace-check] Compiling rustpython-parser v0.4.0
  134. 8.61 s [gammaloop-workspace-check] Compiling phf v0.11.3
  135. 8.63 s [gammaloop-workspace-check] Checking brotli v8.0.2
  136. 8.68 s [gammaloop-workspace-check] Checking simba v0.9.1
  137. 8.77 s [gammaloop-workspace-check] Checking chrono v0.4.44
  138. 9.09 s [gammaloop-workspace-check] Checking rustc-hash v2.1.2
  139. 9.10 s [gammaloop-workspace-check] Checking ndarray v0.17.2
  140. 9.23 s [gammaloop-workspace-check] Compiling unic-ucd-ident v0.9.0
  141. 9.26 s [gammaloop-workspace-check] Compiling unic-emoji-char v0.9.0
  142. 9.28 s [gammaloop-workspace-check] Compiling lalrpop-util v0.20.2
  143. 9.43 s [gammaloop-workspace-check] Compiling rustc-hash v1.1.0
  144. 9.59 s [gammaloop-workspace-check] Checking rug v1.30.0
  145. 9.62 s [gammaloop-workspace-check] Compiling symbolica v2.2.0 (https://github.com/alphal00p/symbolica?rev=a277a8dadbaae5a8d6605f2f381991a601e1f345#a277a8da)
  146. 9.63 s [gammaloop-workspace-check] Checking unicode-segmentation v1.13.2
  147. 9.71 s [gammaloop-workspace-check] Checking typenum v1.20.0
  148. 9.86 s [gammaloop-workspace-check] Checking getrandom v0.2.17
  149. 10.10 s [gammaloop-workspace-check] Checking scopeguard v1.2.0
  150. 10.12 s [gammaloop-workspace-check] Checking ppv-lite86 v0.2.21
  151. 10.17 s [gammaloop-workspace-check] Checking ahash v0.8.12
  152. 10.18 s [gammaloop-workspace-check] Checking lock_api v0.4.14
  153. 10.57 s [gammaloop-workspace-check] Checking parking_lot_core v0.9.12
  154. 10.69 s [gammaloop-workspace-check] Checking unicode-ident v1.0.24
  155. 10.80 s [gammaloop-workspace-check] Checking hashbrown v0.17.0
  156. 10.89 s [gammaloop-workspace-check] Checking rand_chacha v0.9.0
  157. 10.95 s [gammaloop-workspace-check] Checking parking_lot v0.12.5
  158. 10.96 s [gammaloop-workspace-check] Checking errno v0.3.14
  159. 11.05 s [gammaloop-workspace-check] Checking clap_lex v1.1.0
  160. 11.14 s [gammaloop-workspace-check] Checking terminal_size v0.4.4
  161. 11.16 s [gammaloop-workspace-check] Checking unicase v2.9.0
  162. 11.22 s [gammaloop-workspace-check] Checking strsim v0.11.1
  163. 11.34 s [gammaloop-workspace-check] Checking signal-hook-registry v1.4.8
  164. 11.41 s [gammaloop-workspace-check] Checking generic-array v0.14.7
  165. 11.43 s [gammaloop-workspace-check] Checking rand v0.9.4
  166. 11.47 s [gammaloop-workspace-check] Checking vte v0.14.1
  167. 11.47 s [gammaloop-workspace-check] Checking same-file v1.0.6
  168. 11.50 s [gammaloop-workspace-check] Checking clap_builder v4.6.0
  169. 11.55 s [gammaloop-workspace-check] Checking walkdir v2.5.0
  170. 11.73 s [gammaloop-workspace-check] Checking half v2.7.1
  171. 11.75 s [gammaloop-workspace-check] Checking signal-hook v0.3.18
  172. 11.77 s [gammaloop-workspace-check] Checking mio v1.2.0
  173. 11.93 s [gammaloop-workspace-check] Checking indexmap v2.14.0
  174. 11.95 s [gammaloop-workspace-check] Checking minimal-lexical v0.2.1
  175. 12.02 s [gammaloop-workspace-check] Checking symjit v2.21.0
  176. 12.12 s [gammaloop-workspace-check] Checking ciborium-io v0.2.2
  177. 12.14 s [gammaloop-workspace-check] Checking matchers v0.2.0
  178. 12.21 s [gammaloop-workspace-check] Checking regex v1.12.3
  179. 12.22 s [gammaloop-workspace-check] Checking ciborium-ll v0.2.2
  180. 12.27 s [gammaloop-workspace-check] Checking tracing-subscriber v0.3.23
  181. 12.49 s [gammaloop-workspace-check] Checking nom v7.1.3
  182. 12.50 s [gammaloop-workspace-check] Checking signal-hook-mio v0.2.5
  183. 12.58 s [gammaloop-workspace-check] Checking derive_more v2.1.1
  184. 12.68 s [gammaloop-workspace-check] Checking num-bigint v0.4.6
  185. 12.73 s [gammaloop-workspace-check] Checking console v0.16.3
  186. 12.86 s [gammaloop-workspace-check] Checking block-buffer v0.10.4
  187. 13.03 s [gammaloop-workspace-check] Checking crypto-common v0.1.7
  188. 13.19 s [gammaloop-workspace-check] Checking digest v0.10.7
  189. 13.33 s [gammaloop-workspace-check] Checking bstr v1.12.1
  190. 13.46 s [gammaloop-workspace-check] Checking winnow v0.7.15
  191. 13.51 s [gammaloop-workspace-check] Checking linux-raw-sys v0.4.15
  192. 13.55 s [gammaloop-workspace-check] Checking cpufeatures v0.2.17
  193. 13.62 s [gammaloop-workspace-check] Checking sha2 v0.10.9
  194. 13.93 s [gammaloop-workspace-check] Checking ciborium v0.2.2
  195. 14.09 s [gammaloop-workspace-check] Checking getrandom v0.4.2
  196. 14.19 s [gammaloop-workspace-check] Checking rustix v0.38.44
  197. 14.29 s [gammaloop-workspace-check] Checking rand_core v0.6.4
  198. 14.70 s [gammaloop-workspace-check] Checking fastrand v2.4.1
  199. 14.83 s [gammaloop-workspace-check] Checking globset v0.4.18
  200. 14.96 s [gammaloop-workspace-check] Checking plotters-backend v0.3.7
  201. 14.98 s [gammaloop-workspace-check] Checking clap v4.6.1
  202. 15.05 s [gammaloop-workspace-check] Checking fnv v1.0.7
  203. 15.07 s [gammaloop-workspace-check] Checking tempfile v3.27.0
  204. 15.09 s [gammaloop-workspace-check] Checking crossterm v0.28.1
  205. 15.11 s [gammaloop-workspace-check] Checking toml_datetime v0.6.11
  206. 15.12 s [gammaloop-workspace-check] Checking serde_spanned v0.6.9
  207. 15.23 s [gammaloop-workspace-check] Checking ansitok v0.3.0
  208. 15.28 s [gammaloop-workspace-check] Checking itertools v0.10.5
  209. 15.39 s [gammaloop-workspace-check] Checking plotters-svg v0.3.7
  210. 15.40 s [gammaloop-workspace-check] Checking rust-embed-utils v8.11.0
  211. 15.42 s [gammaloop-workspace-check] Checking cast v0.3.0
  212. 15.50 s [gammaloop-workspace-check] Checking toml_write v0.1.2
  213. 15.55 s [gammaloop-workspace-check] Checking tap v1.0.1
  214. 15.64 s [gammaloop-workspace-check] Checking rand_chacha v0.3.1
  215. 15.68 s [gammaloop-workspace-check] Checking wyz v0.5.1
  216. 15.71 s [gammaloop-workspace-check] Compiling unicode_names2 v1.3.0
  217. 15.73 s [gammaloop-workspace-check] Checking plotters v0.3.7
  218. 15.77 s [gammaloop-workspace-check] Checking radium v0.7.0
  219. 16.14 s [gammaloop-workspace-check] Checking typeid v1.0.3
  220. 16.17 s [gammaloop-workspace-check] Checking similar v2.7.0
  221. 16.18 s [gammaloop-workspace-check] Checking ansi-str v0.9.0
  222. 16.25 s [gammaloop-workspace-check] Checking tinytemplate v1.2.1
  223. 16.27 s [gammaloop-workspace-check] Checking is-terminal v0.4.17
  224. 16.39 s [gammaloop-workspace-check] Checking oorandom v11.1.5
  225. 16.47 s [gammaloop-workspace-check] Checking xprec v0.2.2
  226. 16.54 s [gammaloop-workspace-check] Checking funty v2.0.0
  227. 16.78 s [gammaloop-workspace-check] Checking anes v0.1.6
  228. 17.02 s [gammaloop-workspace-check] Checking bytecount v0.6.9
  229. 17.16 s [gammaloop-workspace-check] Checking rand v0.8.6
  230. 17.24 s [gammaloop-workspace-check] Checking ron v0.12.1
  231. 17.26 s [gammaloop-workspace-check] Checking criterion-plot v0.5.0
  232. 17.35 s [gammaloop-workspace-check] Checking papergrid v0.17.0
  233. 17.47 s [gammaloop-workspace-check] Checking testing_table v0.3.0
  234. 17.58 s [gammaloop-workspace-check] Checking toml_edit v0.25.11+spec-1.1.0
  235. 17.72 s [gammaloop-workspace-check] Checking env_filter v1.0.1
  236. 17.79 s [gammaloop-workspace-check] Checking toml_edit v0.22.27
  237. 18.01 s [gammaloop-workspace-check] Checking uncased v0.9.10
  238. 18.09 s [gammaloop-workspace-check] Checking jiff v0.2.24
  239. 18.12 s [gammaloop-workspace-check] Checking ptr_meta v0.1.4
  240. 18.25 s [gammaloop-workspace-check] Checking criterion v0.5.1
  241. 18.30 s [gammaloop-workspace-check] Checking simdutf8 v0.1.5
  242. 18.34 s [gammaloop-workspace-check] Checking ucd-trie v0.1.7
  243. 18.36 s [gammaloop-workspace-check] Checking bitvec v1.0.1
  244. 18.64 s [gammaloop-workspace-check] Checking ahash v0.7.8
  245. 18.72 s [gammaloop-workspace-check] Checking pest v2.8.6
  246. 18.93 s [gammaloop-workspace-check] Checking bytecheck v0.6.12
  247. 19.22 s [gammaloop-workspace-check] Checking hashbrown v0.12.3
  248. 19.68 s [gammaloop-workspace-check] Checking approx v0.4.0
  249. 19.92 s [gammaloop-workspace-check] Checking seahash v4.1.0
  250. 19.95 s [gammaloop-workspace-check] Checking rend v0.4.2
  251. 20.12 s [gammaloop-workspace-check] Checking cgmath v0.18.0
  252. 20.42 s [gammaloop-workspace-check] Checking insta v1.47.2
  253. 20.66 s [gammaloop-workspace-check] Checking num-rational v0.4.2
  254. 20.81 s [gammaloop-workspace-check] Checking tabled v0.20.0
  255. 21.59 s [gammaloop-workspace-check] Checking num-iter v0.1.45
  256. 21.75 s [gammaloop-workspace-check] Checking ref-ops v0.2.5
  257. 21.82 s [gammaloop-workspace-check] Checking num v0.4.3
  258. 21.94 s [gammaloop-workspace-check] Checking rand_xoshiro v0.6.0
  259. 21.98 s [gammaloop-workspace-check] Checking features v0.10.0
  260. 22.07 s [gammaloop-workspace-check] Checking gat-lending-iterator v0.1.8
  261. 22.15 s [gammaloop-workspace-check] Checking constcat v0.5.1
  262. 22.23 s [gammaloop-workspace-check] Checking colored v2.2.0
  263. 22.52 s [gammaloop-workspace-check] Checking constant_time_eq v0.4.2
  264. 22.62 s [gammaloop-workspace-check] Checking cpufeatures v0.3.0
  265. 22.71 s [gammaloop-workspace-check] Checking arrayref v0.3.9
  266. 22.73 s [gammaloop-workspace-check] Checking toml v0.8.23
  267. 22.80 s [gammaloop-workspace-check] Checking blake3 v1.8.5
  268. 22.83 s [gammaloop-workspace-check] Checking base64 v0.22.1
  269. 22.96 s [gammaloop-workspace-check] Compiling pyo3-ffi v0.28.3
  270. 22.99 s [gammaloop-workspace-check] Compiling pyo3-macros-backend v0.28.3
  271. 23.00 s [gammaloop-workspace-check] Compiling pyo3 v0.28.3
  272. 23.40 s [gammaloop-workspace-check] Compiling numpy v0.28.0
  273. 23.76 s [gammaloop-workspace-check] Checking dot-parser v0.5.1
  274. 23.88 s [gammaloop-workspace-check] Checking siphasher v1.0.2
  275. 23.92 s [gammaloop-workspace-check] Checking joinery v2.1.0
  276. 23.94 s [gammaloop-workspace-check] Checking subprocess v0.2.15
  277. 24.13 s [gammaloop-workspace-check] Checking figment v0.10.19
  278. 24.20 s [gammaloop-workspace-check] Checking rust_lisp v0.18.0
  279. 24.28 s [gammaloop-workspace-check] Checking titlecase v2.2.1
  280. 24.33 s [gammaloop-workspace-check] Checking phf_shared v0.13.1
  281. 24.42 s [gammaloop-workspace-check] Compiling vakint v0.1.2 (/build/source/crates/vakint)
  282. 24.81 s [gammaloop-workspace-check] Checking version-compare v0.2.1
  283. 24.87 s [gammaloop-workspace-check] Checking phf v0.13.1
  284. 24.93 s [gammaloop-workspace-check] Checking xpct v0.5.1
  285. 25.16 s [gammaloop-workspace-check] Checking ryu v1.0.23
  286. 25.20 s [gammaloop-workspace-check] Checking castaway v0.2.4
  287. 25.22 s [gammaloop-workspace-check] Checking toml_datetime v0.7.5+spec-1.1.0
  288. 25.34 s [gammaloop-workspace-check] Checking strum v0.27.2
  289. 25.41 s [gammaloop-workspace-check] Checking compact_str v0.9.0
  290. 25.49 s [gammaloop-workspace-check] Checking unicode-truncate v2.0.1
  291. 25.53 s [gammaloop-workspace-check] Checking kasuari v0.4.12
  292. 25.68 s [gammaloop-workspace-check] Checking lru v0.16.4
  293. 25.71 s [gammaloop-workspace-check] Checking vte v0.15.0
  294. 25.84 s [gammaloop-workspace-check] Checking toml v0.9.12+spec-1.1.0
  295. 25.86 s [gammaloop-workspace-check] Checking vt100 v0.16.2
  296. 25.87 s [gammaloop-workspace-check] Checking portable-atomic v1.13.1
  297. 25.89 s [gammaloop-workspace-check] Checking string-template-plus v0.4.3
  298. 26.13 s [gammaloop-workspace-check] Checking unit-prefix v0.5.2
  299. 26.21 s [gammaloop-workspace-check] Checking rand_distr v0.4.3
  300. 26.25 s [gammaloop-workspace-check] Checking simba v0.6.0
  301. 26.34 s [gammaloop-workspace-check] Checking ratatui-core v0.1.0
  302. 26.42 s [gammaloop-workspace-check] Checking line-clipping v0.3.7
  303. 26.48 s [gammaloop-workspace-check] Compiling three-dimensional-reps v0.1.0 (/build/source/crates/three-dimensional-reps)
  304. 26.70 s [gammaloop-workspace-check] Checking adler2 v2.0.1
  305. 26.71 s [gammaloop-workspace-check] Checking gimli v0.32.3
  306. 26.81 s [gammaloop-workspace-check] Checking thiserror v1.0.69
  307. 26.87 s [gammaloop-workspace-check] Checking derive_builder v0.11.2
  308. 26.89 s [gammaloop-workspace-check] Checking miniz_oxide v0.8.9
  309. 26.95 s [gammaloop-workspace-check] Checking owo-colors v4.3.0
  310. 27.00 s [gammaloop-workspace-check] Checking indicatif v0.18.4
  311. 27.02 s [gammaloop-workspace-check] Checking object v0.37.3
  312. 27.05 s [gammaloop-workspace-check] Checking crossterm v0.29.0
  313. 27.36 s [gammaloop-workspace-check] Checking tracing-error v0.2.1
  314. 27.46 s [gammaloop-workspace-check] Checking typed-index-collections v3.5.0
  315. 27.68 s [gammaloop-workspace-check] Checking serde-big-array v0.5.1
  316. 27.78 s [gammaloop-workspace-check] Checking amd v0.2.2
  317. 27.81 s [gammaloop-workspace-check] Compiling rustpython-parser-core v0.4.0
  318. 27.96 s [gammaloop-workspace-check] Checking itertools v0.11.0
  319. 28.04 s [gammaloop-workspace-check] Compiling gammaloop-tracing-filter-macros v0.1.0 (/build/source/crates/gammaloop-tracing-filter-macros)
  320. 28.16 s [gammaloop-workspace-check] Compiling rustpython-ast v0.4.0
  321. 28.26 s [gammaloop-workspace-check] Checking rustc-demangle v0.1.27
  322. 28.36 s [gammaloop-workspace-check] Checking env_logger v0.11.10
  323. 28.42 s [gammaloop-workspace-check] Checking option-ext v0.2.0
  324. 28.45 s [gammaloop-workspace-check] Checking ref-cast v1.0.25
  325. 28.49 s [gammaloop-workspace-check] Checking dirs-sys v0.5.0
  326. 28.55 s [gammaloop-workspace-check] Checking nix v0.31.2
  327. 28.62 s [gammaloop-workspace-check] Checking integer-sqrt v0.1.5
  328. 28.71 s [gammaloop-workspace-check] Checking brotli-decompressor v4.0.3
  329. 28.81 s [gammaloop-workspace-check] Checking crossbeam-channel v0.5.15
  330. 28.86 s [gammaloop-workspace-check] Checking ratatui-widgets v0.3.0
  331. 28.88 s [gammaloop-workspace-check] Checking color-spantrace v0.3.0
  332. 28.90 s [gammaloop-workspace-check] Checking ratatui-crossterm v0.1.0
  333. 28.92 s [gammaloop-workspace-check] Checking itertools v0.12.1
  334. 29.15 s [gammaloop-workspace-check] Checking unsafe-libyaml v0.2.11
  335. 29.16 s [gammaloop-workspace-check] Checking symlink v0.1.0
  336. 29.17 s [gammaloop-workspace-check] Compiling gammalooprs v0.3.4 (/build/source/crates/gammalooprs)
  337. 29.24 s [gammaloop-workspace-check] Checking include_dir v0.7.4
  338. 29.33 s [gammaloop-workspace-check] Checking dirs v6.0.0
  339. 29.37 s [gammaloop-workspace-check] Checking pathfinding v4.15.0
  340. 29.53 s [gammaloop-workspace-check] Checking tracing-appender v0.2.5
  341. 29.69 s [gammaloop-workspace-check] Checking schemars v1.2.1
  342. 29.72 s [gammaloop-workspace-check] Checking ctrlc v3.5.2
  343. 29.77 s [gammaloop-workspace-check] Checking slotmap v1.1.1
  344. 29.81 s [gammaloop-workspace-check] Checking tracing-indicatif v0.3.14
  345. 29.86 s [gammaloop-workspace-check] Checking json5 v0.4.1
  346. 29.92 s [gammaloop-workspace-check] Checking brotli v7.0.0
  347. 30.12 s [gammaloop-workspace-check] Checking vectorize v0.2.0
  348. 30.14 s [gammaloop-workspace-check] Checking rkyv v0.7.46
  349. 30.15 s [gammaloop-workspace-check] Checking clarabel v0.11.1
  350. 30.18 s [gammaloop-workspace-check] Checking ringbuffer v0.16.0
  351. 30.41 s [gammaloop-workspace-check] Checking serde_yaml v0.9.34+deprecated
  352. 30.52 s [gammaloop-workspace-check] Checking base62 v2.2.4
  353. 30.71 s [gammaloop-workspace-check] Checking rust-embed v8.11.0
  354. 30.80 s [gammaloop-workspace-check] Checking clap_complete v4.6.3
  355. 30.81 s [gammaloop-workspace-check] Checking addr2line v0.25.1
  356. 30.82 s [gammaloop-workspace-check] Checking strip-ansi-escapes v0.2.1
  357. 30.83 s [gammaloop-workspace-check] Checking ratatui-macros v0.7.0
  358. 30.86 s [gammaloop-workspace-check] Checking fd-lock v4.0.4
  359. 30.92 s [gammaloop-workspace-check] Checking ratatui v0.30.0
  360. 30.95 s [gammaloop-workspace-check] Compiling gammaloop-api v0.1.0 (/build/source/crates/gammaloop-api)
  361. 30.97 s [gammaloop-workspace-check] Checking itertools v0.13.0
  362. 31.07 s [gammaloop-workspace-check] Checking strum v0.26.3
  363. 31.12 s [gammaloop-workspace-check] Checking clap_complete_nushell v4.6.0
  364. 31.15 s [gammaloop-workspace-check] Checking sysinfo v0.33.1
  365. 31.23 s [gammaloop-workspace-check] Checking shlex v1.3.0
  366. 31.38 s [gammaloop-workspace-check] Checking slab v0.4.12
  367. 31.39 s [gammaloop-workspace-check] Checking futures-core v0.3.32
  368. 31.50 s [gammaloop-workspace-check] Checking futures-task v0.3.32
  369. 31.54 s [gammaloop-workspace-check] Checking sdd v3.0.10
  370. 31.59 s [gammaloop-workspace-check] Compiling gammaloop-integration-tests v0.1.0 (/build/source/tests)
  371. 31.62 s [gammaloop-workspace-check] Compiling test-log-core v0.2.20
  372. 31.66 s [gammaloop-workspace-check] Compiling rustc_version v0.4.1
  373. 31.67 s [gammaloop-workspace-check] Checking futures-util v0.3.32
  374. 31.75 s [gammaloop-workspace-check] Checking scc v2.4.0
  375. 31.83 s [gammaloop-workspace-check] Checking which v8.0.2
  376. 32.05 s [gammaloop-workspace-check] Checking bincode v1.3.3
  377. 32.49 s [gammaloop-workspace-check] Compiling gungraun-macros v0.8.0
  378. 32.50 s [gammaloop-workspace-check] Compiling gungraun-runner v0.18.2
  379. 32.64 s [gammaloop-workspace-check] Checking reedline v0.42.0
  380. 33.00 s [gammaloop-workspace-check] Checking proc-macro2 v1.0.106
  381. 33.03 s [gammaloop-workspace-check] Compiling numerica v2.2.0 (https://github.com/alphal00p/symbolica?rev=a277a8dadbaae5a8d6605f2f381991a601e1f345#a277a8da)
  382. 33.21 s [gammaloop-workspace-check] Checking backtrace v0.3.76
  383. 33.28 s [gammaloop-workspace-check] Checking maplit v1.0.2
  384. 33.32 s [gammaloop-workspace-check] Checking base64 v0.21.7
  385. 33.68 s [gammaloop-workspace-check] Checking color-eyre v0.6.5
  386. 33.70 s [gammaloop-workspace-check] Checking quote v1.0.45
  387. 33.73 s [gammaloop-workspace-check] Checking nalgebra v0.29.0
  388. 33.82 s [gammaloop-workspace-check] Checking ron v0.8.1
  389. 34.29 s [gammaloop-workspace-check] Compiling iai-callgrind-runner v0.14.2
  390. 34.51 s [gammaloop-workspace-check] Checking kurbo v0.13.0
  391. 34.83 s [gammaloop-workspace-check] Checking futures-executor v0.3.32
  392. 35.06 s [gammaloop-workspace-check] Checking wait-timeout v0.2.1
  393. 35.17 s [gammaloop-workspace-check] Checking serial_test v3.4.0
  394. 35.30 s [gammaloop-workspace-check] Checking bit-vec v0.8.0
  395. 35.35 s [gammaloop-workspace-check] Compiling test-log-macros v0.2.20
  396. 35.49 s [gammaloop-workspace-check] Compiling iai-callgrind v0.14.2
  397. 35.60 s [gammaloop-workspace-check] Checking quick-error v1.2.3
  398. 35.73 s [gammaloop-workspace-check] Checking rusty-fork v0.3.1
  399. 35.95 s [gammaloop-workspace-check] Checking bit-set v0.8.0
  400. 36.18 s [gammaloop-workspace-check] Checking syn v2.0.117
  401. 36.28 s [gammaloop-workspace-check] Compiling iai-callgrind-macros v0.5.1
  402. 36.56 s [gammaloop-workspace-check] Checking rand_xorshift v0.4.0
  403. 36.78 s [gammaloop-workspace-check] Checking console v0.15.11
  404. 36.95 s [gammaloop-workspace-check] Checking unarray v0.1.4
  405. 37.14 s [gammaloop-workspace-check] Checking pathdiff v0.2.3
  406. 37.36 s [gammaloop-workspace-check] Checking proptest v1.11.0
  407. 37.81 s [gammaloop-workspace-check] Checking similar-asserts v1.7.0
  408. 38.24 s [gammaloop-workspace-check] Checking clinnet v0.1.8 (/build/source/crates/clinnet)
  409. 38.75 s [gammaloop-workspace-check] Checking kurvst v0.1.0 (/build/source/crates/kurvst)
  410. 42.49 s [gammaloop-workspace-check] Checking test-log v0.2.20
  411. 45.57 s [gammaloop-workspace-check] Compiling graphica v2.1.0 (https://github.com/alphal00p/symbolica?rev=a277a8dadbaae5a8d6605f2f381991a601e1f345#a277a8da)
  412. 53.53 s [gammaloop-workspace-check] Checking statrs v0.16.1
  413. 56.64 s [gammaloop-workspace-check] Checking gungraun v0.18.2
  414. 57.30 s [gammaloop-workspace-check] Checking momtrop v0.3.0
  415. 67.37 s [gammaloop-workspace-check] Compiling pyo3-macros v0.28.3
  416. 68.78 s [gammaloop-workspace-check] Compiling pyo3-stub-gen-derive v0.17.2
  417. 80.69 s [gammaloop-workspace-check] Checking pyo3-stub-gen v0.17.2
  418. 91.22 s [gammaloop-workspace-check] Checking symbolica-utils v0.1.0 (/build/source/crates/symbolica-utils)
  419. 91.22 s [gammaloop-workspace-check] Checking spenso-macros v0.3.2 (/build/source/crates/spenso-macros)
  420. 391.84 s [gammaloop-workspace-check] Compiling gammaloop-workspace-hack v0.1.0 (/build/source/crates/gammaloop-workspace-hack)
  421. 392.06 s [gammaloop-workspace-check] Checking linnet v0.17.0 (/build/source/crates/linnet)
  422. 395.50 s [gammaloop-workspace-check] Checking spenso v0.6.0 (/build/source/crates/spenso)
  423. 395.76 s [gammaloop-workspace-check] Checking linnet-py v0.1.0 (/build/source/crates/linnet-py)
  424. 395.76 s [gammaloop-workspace-check] Checking linnest v0.1.0 (/build/source/crates/linnest)
  425. 402.53 s [gammaloop-workspace-check] Checking idenso v0.3.0 (/build/source/crates/idenso)
  426. 402.54 s [gammaloop-workspace-check] Checking gammaloop-tracing-filter v0.1.0 (/build/source/crates/gammaloop-tracing-filter)
  427. 406.08 s [gammaloop-workspace-check] Checking spenso-hep-lib v0.1.7 (/build/source/crates/spenso-hep-lib)
  428. 406.68 s [gammaloop-workspace-check] Checking spynso3 v0.1.2 (/build/source/crates/spynso3)
  429. 462.83 s [gammaloop-workspace-check] error[E0560]: struct `CutInfo` has no field named `lmb_channel_id`
  430. 462.83 s [gammaloop-workspace-check] --> tests/tests/test_differential.rs:86:13
  431. 462.83 s [gammaloop-workspace-check] |
  432. 462.83 s [gammaloop-workspace-check] 86 | lmb_channel_id: None,
  433. 462.83 s [gammaloop-workspace-check] | ^^^^^^^^^^^^^^ `CutInfo` does not have this field
  434. 462.83 s [gammaloop-workspace-check] |
  435. 462.83 s [gammaloop-workspace-check] = note: available fields are: `sampling_channel_id`, `sampling_channel_edge_ids`
  436. 462.83 s [gammaloop-workspace-check]
  437. 462.83 s [gammaloop-workspace-check] error[E0560]: struct `CutInfo` has no field named `lmb_channel_edge_ids`
  438. 462.83 s [gammaloop-workspace-check] --> tests/tests/test_differential.rs:87:13
  439. 462.83 s [gammaloop-workspace-check] |
  440. 462.83 s [gammaloop-workspace-check] 87 | lmb_channel_edge_ids: None,
  441. 462.83 s [gammaloop-workspace-check] | ^^^^^^^^^^^^^^^^^^^^ `CutInfo` does not have this field
  442. 462.83 s [gammaloop-workspace-check] |
  443. 462.83 s [gammaloop-workspace-check] = note: available fields are: `sampling_channel_id`, `sampling_channel_edge_ids`
  444. 462.83 s [gammaloop-workspace-check]
  445. 462.94 s [gammaloop-workspace-check] error[E0063]: missing field `reference_moments` in initializer of `GraphEvaluationResult<_>`
  446. 462.94 s [gammaloop-workspace-check] --> tests/tests/test_differential.rs:532:19
  447. 462.94 s [gammaloop-workspace-check] |
  448. 462.94 s [gammaloop-workspace-check] 532 | let mut lhs = GraphEvaluationResult {
  449. 462.94 s [gammaloop-workspace-check] | ^^^^^^^^^^^^^^^^^^^^^ missing `reference_moments`
  450. 462.94 s [gammaloop-workspace-check]
  451. 462.94 s [gammaloop-workspace-check] error[E0063]: missing field `reference_moments` in initializer of `GraphEvaluationResult<_>`
  452. 462.94 s [gammaloop-workspace-check] --> tests/tests/test_differential.rs:539:15
  453. 462.94 s [gammaloop-workspace-check] |
  454. 462.94 s [gammaloop-workspace-check] 539 | let rhs = GraphEvaluationResult {
  455. 462.94 s [gammaloop-workspace-check] | ^^^^^^^^^^^^^^^^^^^^^ missing `reference_moments`
  456. 462.94 s [gammaloop-workspace-check]
  457. 463.12 s [gammaloop-workspace-check] error[E0609]: no field `lmb_channel_edge_ids` on type `CutInfo`
  458. 463.12 s [gammaloop-workspace-check] --> tests/tests/test_evaluation_api.rs:311:10
  459. 463.12 s [gammaloop-workspace-check] |
  460. 463.12 s [gammaloop-workspace-check] 311 | .lmb_channel_edge_ids
  461. 463.12 s [gammaloop-workspace-check] | ^^^^^^^^^^^^^^^^^^^^ unknown field
  462. 463.12 s [gammaloop-workspace-check] |
  463. 463.12 s [gammaloop-workspace-check] = note: available fields are: `particle_pdgs`, `cut_id`, `graph_id`, `graph_group_id`, `orientation_id` ... and 2 others
  464. 463.12 s [gammaloop-workspace-check]
  465. 463.20 s [gammaloop-workspace-check] error[E0609]: no field `lmb_channel_edge_ids` on type `CutInfo`
  466. 463.20 s [gammaloop-workspace-check] --> tests/tests/test_evaluation_api.rs:591:26
  467. 463.20 s [gammaloop-workspace-check] |
  468. 463.20 s [gammaloop-workspace-check] 591 | .lmb_channel_edge_ids
  469. 463.20 s [gammaloop-workspace-check] | ^^^^^^^^^^^^^^^^^^^^ unknown field
  470. 463.20 s [gammaloop-workspace-check] |
  471. 463.20 s [gammaloop-workspace-check] = note: available fields are: `particle_pdgs`, `cut_id`, `graph_id`, `graph_group_id`, `orientation_id` ... and 2 others
  472. 463.20 s [gammaloop-workspace-check]
  473. 463.20 s [gammaloop-workspace-check] Some errors have detailed explanations: E0063, E0560.
  474. 463.20 s [gammaloop-workspace-check] For more information about an error, try `rustc --explain E0063`.
  475. 463.22 s [gammaloop-workspace-check] error: could not compile `gammaloop-integration-tests` (test "test_differential") due to 4 previous errors
  476. 463.22 s [gammaloop-workspace-check] warning: build failed, waiting for other jobs to finish...
  477. 463.28 s [gammaloop-workspace-check] error[E0609]: no field `lmb_channel_edge_ids` on type `CutInfo`
  478. 463.28 s [gammaloop-workspace-check] --> tests/tests/test_evaluation_api.rs:1177:18
  479. 463.28 s [gammaloop-workspace-check] |
  480. 463.28 s [gammaloop-workspace-check] 1177 | .lmb_channel_edge_ids
  481. 463.28 s [gammaloop-workspace-check] | ^^^^^^^^^^^^^^^^^^^^ unknown field
  482. 463.28 s [gammaloop-workspace-check] |
  483. 463.28 s [gammaloop-workspace-check] = note: available fields are: `particle_pdgs`, `cut_id`, `graph_id`, `graph_group_id`, `orientation_id` ... and 2 others
  484. 463.28 s [gammaloop-workspace-check]
  485. 463.59 s [gammaloop-workspace-check] error[E0609]: no field `lmb_channel_edge_ids` on type `CutInfo`
  486. 463.59 s [gammaloop-workspace-check] --> tests/tests/test_evaluation_api.rs:1222:22
  487. 463.59 s [gammaloop-workspace-check] |
  488. 463.59 s [gammaloop-workspace-check] 1222 | .lmb_channel_edge_ids
  489. 463.59 s [gammaloop-workspace-check] | ^^^^^^^^^^^^^^^^^^^^ unknown field
  490. 463.59 s [gammaloop-workspace-check] |
  491. 463.59 s [gammaloop-workspace-check] = note: available fields are: `particle_pdgs`, `cut_id`, `graph_id`, `graph_group_id`, `orientation_id` ... and 2 others
  492. 463.59 s [gammaloop-workspace-check]
  493. 463.59 s [gammaloop-workspace-check] error[E0609]: no field `lmb_channel_edge_ids` on type `CutInfo`
  494. 463.59 s [gammaloop-workspace-check] --> tests/tests/test_evaluation_api.rs:1281:14
  495. 463.59 s [gammaloop-workspace-check] |
  496. 463.59 s [gammaloop-workspace-check] 1281 | .lmb_channel_edge_ids
  497. 463.59 s [gammaloop-workspace-check] | ^^^^^^^^^^^^^^^^^^^^ unknown field
  498. 463.59 s [gammaloop-workspace-check] |
  499. 463.59 s [gammaloop-workspace-check] = note: available fields are: `particle_pdgs`, `cut_id`, `graph_id`, `graph_group_id`, `orientation_id` ... and 2 others
  500. 463.59 s [gammaloop-workspace-check]
  501. 463.70 s [gammaloop-workspace-check] error[E0609]: no field `lmb_channel_edge_ids` on type `CutInfo`
  502. 463.70 s [gammaloop-workspace-check] --> tests/tests/test_evaluation_api.rs:1428:18
  503. 463.70 s [gammaloop-workspace-check] |
  504. 463.70 s [gammaloop-workspace-check] 1428 | .lmb_channel_edge_ids
  505. 463.70 s [gammaloop-workspace-check] | ^^^^^^^^^^^^^^^^^^^^ unknown field
  506. 463.70 s [gammaloop-workspace-check] |
  507. 463.70 s [gammaloop-workspace-check] = note: available fields are: `particle_pdgs`, `cut_id`, `graph_id`, `graph_group_id`, `orientation_id` ... and 2 others
  508. 463.70 s [gammaloop-workspace-check]
  509. 463.88 s [gammaloop-workspace-check] For more information about this error, try `rustc --explain E0609`.
  510. 463.90 s [gammaloop-workspace-check] error: could not compile `gammaloop-integration-tests` (test "test_evaluation_api") due to 6 previous errors
  511. 464.78 s [gammaloop-workspace-check] error[E0609]: no field `lmb_channel_id` on type `CutInfo`
  512. 464.78 s [gammaloop-workspace-check] --> tests/tests/test_runs/utils.rs:568:36
  513. 464.78 s [gammaloop-workspace-check] |
  514. 464.78 s [gammaloop-workspace-check] 568 | event.cut_info.lmb_channel_id,
  515. 464.78 s [gammaloop-workspace-check] | ^^^^^^^^^^^^^^ unknown field
  516. 464.78 s [gammaloop-workspace-check] |
  517. 464.78 s [gammaloop-workspace-check] = note: available fields are: `particle_pdgs`, `cut_id`, `graph_id`, `graph_group_id`, `orientation_id` ... and 2 others
  518. 464.78 s [gammaloop-workspace-check]
  519. 464.78 s [gammaloop-workspace-check] error[E0609]: no field `lmb_channel_id` on type `CutInfo`
  520. 464.78 s [gammaloop-workspace-check] --> tests/tests/test_runs/utils.rs:580:36
  521. 464.78 s [gammaloop-workspace-check] |
  522. 464.78 s [gammaloop-workspace-check] 580 | event.cut_info.lmb_channel_id,
  523. 464.78 s [gammaloop-workspace-check] | ^^^^^^^^^^^^^^ unknown field
  524. 464.78 s [gammaloop-workspace-check] |
  525. 464.78 s [gammaloop-workspace-check] = note: available fields are: `particle_pdgs`, `cut_id`, `graph_id`, `graph_group_id`, `orientation_id` ... and 2 others
  526. 464.78 s [gammaloop-workspace-check]
  527. 465.97 s [gammaloop-workspace-check] error: could not compile `gammaloop-integration-tests` (test "test_runs") due to 2 previous errors
  528. 466.71 s Progress: 0 of 1 built (1 failed)
  529. 466.71 s Failed to build gammaloop-workspace-check after 7m43s
  530. 466.73 s Cannot build '/nix/store/2f1j2lkyg12g36flfbgvv1q9204gpqa0-gammaloop-workspace-check-0.1.0.drv'.
  531. 466.73 s Reason: builder failed with exit code 101.
  532. 466.73 s Output paths:
  533. 466.73 s /nix/store/8ijafqa7ipzzclcid7n6jgdwkfr2bh7s-gammaloop-workspace-check-0.1.0
  534. 466.73 s Last 524 log lines:
  535. 466.73 s > Running phase: unpackPhase
  536. 466.73 s > unpacking source archive /nix/store/s2z31bfagqssyfp9l6l2s0lp69bdgr0x-source
  537. 466.73 s > source root is source
  538. 466.73 s > Running phase: patchPhase
  539. 466.73 s > Executing configureCargoCommonVars
  540. 466.73 s > decompressing cargo artifacts from /nix/store/50vpxlcgfxf2d57i27v3d10zjwxxbm2r-gammaloop-workspace-deps-deps-0.1.0/target.tar.zst to target
  541. 466.73 s > Running phase: updateAutotoolsGnuConfigScriptsPhase
  542. 466.73 s > Running phase: configurePhase
  543. 466.73 s > will append /build/source/.cargo-home/config.toml with contents of /nix/store/5drf77x6km4ky7gwlrzdx9bbd6fz09g3-vendor-cargo-deps/config.toml
  544. 466.73 s > default configurePhase, nothing to do
  545. 466.73 s > Running phase: buildPhase
  546. 466.73 s > +++ command cargo --version
  547. 466.73 s > cargo 1.97.0 (c980f4866 2026-06-30)
  548. 466.73 s > +++ command cargo check --profile ci-optim --locked --workspace --features gammaloop-tracing-filter/clap,gammaloop-tracing-filter/symbolica,idenso/bincode,idenso/reference-cases,linnet/bincode,linnet/drawing,linnet/rkyv,linnet/serde,linnet/symbolica,spenso-macros/shadowing,spenso/shadowing,symbolica/tracing_max_level_info,three-dimensional-reps/display,three-dimensional-reps/eval,three-dimensional-reps/serde --all-targets
  549. 466.73 s > Checking cfg-if v1.0.4
  550. 466.73 s > Checking memchr v2.8.0
  551. 466.73 s > Checking once_cell v1.21.4
  552. 466.73 s > Checking either v1.15.0
  553. 466.73 s > Checking serde_core v1.0.228
  554. 466.73 s > Checking libc v0.2.186
  555. 466.73 s > Checking libm v0.2.16
  556. 466.73 s > Checking itoa v1.0.18
  557. 466.73 s > Checking log v0.4.29
  558. 466.73 s > Checking regex-syntax v0.8.10
  559. 466.73 s > Checking zerocopy v0.8.48
  560. 466.73 s > Checking crossbeam-utils v0.8.21
  561. 466.73 s > Checking equivalent v1.0.2
  562. 466.73 s > Checking zmij v1.0.21
  563. 466.73 s > Checking lazy_static v1.5.0
  564. 466.73 s > Checking bytemuck v1.25.0
  565. 466.73 s > Compiling target-lexicon v0.13.5
  566. 466.73 s > Checking arrayvec v0.7.6
  567. 466.73 s > Checking powerfmt v0.2.0
  568. 466.73 s > Checking num-conv v0.2.1
  569. 466.73 s > Checking num_threads v0.1.7
  570. 466.73 s > Checking pin-project-lite v0.2.17
  571. 466.73 s > Checking itertools v0.14.0
  572. 466.73 s > Checking time-core v0.1.8
  573. 466.73 s > Checking tracing-core v0.1.36
  574. 466.73 s > Checking deranged v0.5.8
  575. 466.73 s > Checking safe_arch v0.7.4
  576. 466.73 s > Checking foldhash v0.2.0
  577. 466.73 s > Checking allocator-api2 v0.2.21
  578. 466.73 s > Checking const-random v0.1.18
  579. 466.73 s > Checking nu-ansi-term v0.50.3
  580. 466.73 s > Checking static_assertions v1.1.0
  581. 466.73 s > Checking unty v0.0.4
  582. 466.73 s > Checking winnow v1.0.2
  583. 466.73 s > Checking safe_arch v1.0.0
  584. 466.73 s > Checking aho-corasick v1.1.4
  585. 466.73 s > Checking crossbeam-epoch v0.9.18
  586. 466.73 s > Checking wide v0.7.33
  587. 466.73 s > Checking sharded-slab v0.1.7
  588. 466.73 s > Checking tracing v0.1.44
  589. 466.73 s > Checking hashbrown v0.16.1
  590. 466.73 s > Checking tracing-log v0.2.0
  591. 466.73 s > Checking thread_local v1.1.9
  592. 466.73 s > Checking az v1.3.0
  593. 466.73 s > Checking crossbeam-deque v0.8.6
  594. 466.73 s > Checking indenter v0.3.4
  595. 466.73 s > Checking rayon-core v1.13.0
  596. 466.73 s > Checking toml_writer v1.1.1+spec-1.1.0
  597. 466.73 s > Checking wide v1.3.0
  598. 466.73 s > Checking num-traits v0.2.19
  599. 466.73 s > Compiling phf_shared v0.11.3
  600. 466.73 s > Checking anyhow v1.0.102
  601. 466.73 s > Checking utf8parse v0.2.2
  602. 466.73 s > Checking getrandom v0.3.4
  603. 466.73 s > Checking time v0.3.47
  604. 466.73 s > Checking gmp-mpfr-sys v1.7.1
  605. 466.73 s > Checking dyn-clone v1.0.20
  606. 466.73 s > Checking toml_parser v1.1.2+spec-1.1.0
  607. 466.73 s > Checking rayon v1.12.0
  608. 466.73 s > Checking rand_core v0.9.5
  609. 466.73 s > Checking alloc-no-stdlib v2.0.4
  610. 466.73 s > Checking rawpointer v0.2.1
  611. 466.73 s > Checking alloc-stdlib v0.2.2
  612. 466.73 s > Checking matrixmultiply v0.3.10
  613. 466.73 s > Checking anstyle-parse v1.0.0
  614. 466.73 s > Checking is_terminal_polyfill v1.70.2
  615. 466.73 s > Checking colorchoice v1.0.5
  616. 466.73 s > Checking anstyle-query v1.1.5
  617. 466.73 s > Checking colored v3.1.1
  618. 466.73 s > Checking regex-automata v0.4.14
  619. 466.73 s > Checking anstyle v1.0.14
  620. 466.73 s > Compiling phf_generator v0.11.3
  621. 466.73 s > Checking eyre v0.6.12
  622. 466.73 s > Checking unicode-width v0.2.2
  623. 466.73 s > Checking approx v0.5.1
  624. 466.73 s > Compiling pyo3-build-config v0.28.3
  625. 466.73 s > Checking num-integer v0.1.46
  626. 466.73 s > Checking bitflags v1.3.2
  627. 466.73 s > Compiling phf_codegen v0.11.3
  628. 466.73 s > Checking anstream v1.0.0
  629. 466.73 s > Checking brotli-decompressor v5.0.0
  630. 466.73 s > Checking wasmtime-jit-icache-coherence v34.0.2
  631. 466.73 s > Checking region v3.0.2
  632. 466.73 s > Checking hugepage-rs v0.1.1
  633. 466.73 s > Checking serde v1.0.228
  634. 466.73 s > Checking serde_json v1.0.149
  635. 466.73 s > Checking bitflags v2.11.1
  636. 466.73 s > Checking serde_spanned v1.1.1
  637. 466.73 s > Checking toml_datetime v1.1.1+spec-1.1.0
  638. 466.73 s > Checking spec_math v0.1.6
  639. 466.73 s > Checking inventory v0.3.24
  640. 466.73 s > Checking thiserror v2.0.18
  641. 466.73 s > Compiling getopts v0.2.24
  642. 466.73 s > Checking libloading v0.9.0
  643. 466.73 s > Checking bytes v1.11.1
  644. 466.73 s > Checking byteorder v1.5.0
  645. 466.73 s > Checking self_cell v1.2.2
  646. 466.73 s > Checking toml v1.1.2+spec-1.1.0
  647. 466.73 s > Checking tinyjson v2.5.1
  648. 466.73 s > Checking append-only-vec v0.1.8
  649. 466.73 s > Compiling unicode_names2_generator v1.3.0
  650. 466.73 s > Compiling unic-char-range v0.9.0
  651. 466.73 s > Compiling unic-common v0.9.0
  652. 466.73 s > Checking linux-raw-sys v0.12.1
  653. 466.73 s > Checking smallvec v1.15.1
  654. 466.73 s > Checking num-complex v0.4.6
  655. 466.73 s > Checking tracing-serde v0.2.0
  656. 466.73 s > Checking bincode v2.0.1
  657. 466.73 s > Checking smartstring v1.0.1
  658. 466.73 s > Compiling unic-char-property v0.9.0
  659. 466.73 s > Compiling unic-ucd-version v0.9.0
  660. 466.73 s > Checking rustix v1.1.4
  661. 466.73 s > Compiling is-macro v0.3.7
  662. 466.73 s > Compiling rustpython-parser-vendored v0.4.0
  663. 466.73 s > Checking iana-time-zone v0.1.65
  664. 466.73 s > Compiling rustpython-parser v0.4.0
  665. 466.73 s > Compiling phf v0.11.3
  666. 466.73 s > Checking brotli v8.0.2
  667. 466.73 s > Checking simba v0.9.1
  668. 466.73 s > Checking chrono v0.4.44
  669. 466.73 s > Checking rustc-hash v2.1.2
  670. 466.73 s > Checking ndarray v0.17.2
  671. 466.73 s > Compiling unic-ucd-ident v0.9.0
  672. 466.73 s > Compiling unic-emoji-char v0.9.0
  673. 466.73 s > Compiling lalrpop-util v0.20.2
  674. 466.73 s > Compiling rustc-hash v1.1.0
  675. 466.73 s > Checking rug v1.30.0
  676. 466.73 s > Compiling symbolica v2.2.0 (https://github.com/alphal00p/symbolica?rev=a277a8dadbaae5a8d6605f2f381991a601e1f345#a277a8da)
  677. 466.73 s > Checking unicode-segmentation v1.13.2
  678. 466.73 s > Checking typenum v1.20.0
  679. 466.73 s > Checking getrandom v0.2.17
  680. 466.73 s > Checking scopeguard v1.2.0
  681. 466.73 s > Checking ppv-lite86 v0.2.21
  682. 466.73 s > Checking ahash v0.8.12
  683. 466.73 s > Checking lock_api v0.4.14
  684. 466.73 s > Checking parking_lot_core v0.9.12
  685. 466.73 s > Checking unicode-ident v1.0.24
  686. 466.73 s > Checking hashbrown v0.17.0
  687. 466.73 s > Checking rand_chacha v0.9.0
  688. 466.73 s > Checking parking_lot v0.12.5
  689. 466.73 s > Checking errno v0.3.14
  690. 466.73 s > Checking clap_lex v1.1.0
  691. 466.73 s > Checking terminal_size v0.4.4
  692. 466.73 s > Checking unicase v2.9.0
  693. 466.73 s > Checking strsim v0.11.1
  694. 466.73 s > Checking signal-hook-registry v1.4.8
  695. 466.73 s > Checking generic-array v0.14.7
  696. 466.73 s > Checking rand v0.9.4
  697. 466.73 s > Checking vte v0.14.1
  698. 466.73 s > Checking same-file v1.0.6
  699. 466.73 s > Checking clap_builder v4.6.0
  700. 466.73 s > Checking walkdir v2.5.0
  701. 466.73 s > Checking half v2.7.1
  702. 466.73 s > Checking signal-hook v0.3.18
  703. 466.73 s > Checking mio v1.2.0
  704. 466.73 s > Checking indexmap v2.14.0
  705. 466.73 s > Checking minimal-lexical v0.2.1
  706. 466.73 s > Checking symjit v2.21.0
  707. 466.73 s > Checking ciborium-io v0.2.2
  708. 466.73 s > Checking matchers v0.2.0
  709. 466.73 s > Checking regex v1.12.3
  710. 466.73 s > Checking ciborium-ll v0.2.2
  711. 466.73 s > Checking tracing-subscriber v0.3.23
  712. 466.73 s > Checking nom v7.1.3
  713. 466.73 s > Checking signal-hook-mio v0.2.5
  714. 466.73 s > Checking derive_more v2.1.1
  715. 466.73 s > Checking num-bigint v0.4.6
  716. 466.73 s > Checking console v0.16.3
  717. 466.73 s > Checking block-buffer v0.10.4
  718. 466.73 s > Checking crypto-common v0.1.7
  719. 466.73 s > Checking digest v0.10.7
  720. 466.73 s > Checking bstr v1.12.1
  721. 466.73 s > Checking winnow v0.7.15
  722. 466.73 s > Checking linux-raw-sys v0.4.15
  723. 466.73 s > Checking cpufeatures v0.2.17
  724. 466.73 s > Checking sha2 v0.10.9
  725. 466.73 s > Checking ciborium v0.2.2
  726. 466.73 s > Checking getrandom v0.4.2
  727. 466.73 s > Checking rustix v0.38.44
  728. 466.73 s > Checking rand_core v0.6.4
  729. 466.73 s > Checking fastrand v2.4.1
  730. 466.73 s > Checking globset v0.4.18
  731. 466.73 s > Checking plotters-backend v0.3.7
  732. 466.73 s > Checking clap v4.6.1
  733. 466.73 s > Checking fnv v1.0.7
  734. 466.73 s > Checking tempfile v3.27.0
  735. 466.73 s > Checking crossterm v0.28.1
  736. 466.73 s > Checking toml_datetime v0.6.11
  737. 466.73 s > Checking serde_spanned v0.6.9
  738. 466.73 s > Checking ansitok v0.3.0
  739. 466.73 s > Checking itertools v0.10.5
  740. 466.73 s > Checking plotters-svg v0.3.7
  741. 466.73 s > Checking rust-embed-utils v8.11.0
  742. 466.73 s > Checking cast v0.3.0
  743. 466.73 s > Checking toml_write v0.1.2
  744. 466.73 s > Checking tap v1.0.1
  745. 466.73 s > Checking rand_chacha v0.3.1
  746. 466.73 s > Checking wyz v0.5.1
  747. 466.73 s > Compiling unicode_names2 v1.3.0
  748. 466.73 s > Checking plotters v0.3.7
  749. 466.73 s > Checking radium v0.7.0
  750. 466.73 s > Checking typeid v1.0.3
  751. 466.73 s > Checking similar v2.7.0
  752. 466.73 s > Checking ansi-str v0.9.0
  753. 466.73 s > Checking tinytemplate v1.2.1
  754. 466.73 s > Checking is-terminal v0.4.17
  755. 466.73 s > Checking oorandom v11.1.5
  756. 466.73 s > Checking xprec v0.2.2
  757. 466.73 s > Checking funty v2.0.0
  758. 466.73 s > Checking anes v0.1.6
  759. 466.73 s > Checking bytecount v0.6.9
  760. 466.73 s > Checking rand v0.8.6
  761. 466.73 s > Checking ron v0.12.1
  762. 466.73 s > Checking criterion-plot v0.5.0
  763. 466.73 s > Checking papergrid v0.17.0
  764. 466.73 s > Checking testing_table v0.3.0
  765. 466.73 s > Checking toml_edit v0.25.11+spec-1.1.0
  766. 466.73 s > Checking env_filter v1.0.1
  767. 466.73 s > Checking toml_edit v0.22.27
  768. 466.73 s > Checking uncased v0.9.10
  769. 466.73 s > Checking jiff v0.2.24
  770. 466.73 s > Checking ptr_meta v0.1.4
  771. 466.73 s > Checking criterion v0.5.1
  772. 466.73 s > Checking simdutf8 v0.1.5
  773. 466.73 s > Checking ucd-trie v0.1.7
  774. 466.73 s > Checking bitvec v1.0.1
  775. 466.73 s > Checking ahash v0.7.8
  776. 466.73 s > Checking pest v2.8.6
  777. 466.73 s > Checking bytecheck v0.6.12
  778. 466.73 s > Checking hashbrown v0.12.3
  779. 466.73 s > Checking approx v0.4.0
  780. 466.73 s > Checking seahash v4.1.0
  781. 466.73 s > Checking rend v0.4.2
  782. 466.73 s > Checking cgmath v0.18.0
  783. 466.73 s > Checking insta v1.47.2
  784. 466.73 s > Checking num-rational v0.4.2
  785. 466.73 s > Checking tabled v0.20.0
  786. 466.73 s > Checking num-iter v0.1.45
  787. 466.73 s > Checking ref-ops v0.2.5
  788. 466.73 s > Checking num v0.4.3
  789. 466.73 s > Checking rand_xoshiro v0.6.0
  790. 466.73 s > Checking features v0.10.0
  791. 466.73 s > Checking gat-lending-iterator v0.1.8
  792. 466.73 s > Checking constcat v0.5.1
  793. 466.73 s > Checking colored v2.2.0
  794. 466.73 s > Checking constant_time_eq v0.4.2
  795. 466.73 s > Checking cpufeatures v0.3.0
  796. 466.73 s > Checking arrayref v0.3.9
  797. 466.73 s > Checking toml v0.8.23
  798. 466.73 s > Checking blake3 v1.8.5
  799. 466.73 s > Checking base64 v0.22.1
  800. 466.73 s > Compiling pyo3-ffi v0.28.3
  801. 466.73 s > Compiling pyo3-macros-backend v0.28.3
  802. 466.73 s > Compiling pyo3 v0.28.3
  803. 466.73 s > Compiling numpy v0.28.0
  804. 466.73 s > Checking dot-parser v0.5.1
  805. 466.73 s > Checking siphasher v1.0.2
  806. 466.73 s > Checking joinery v2.1.0
  807. 466.73 s > Checking subprocess v0.2.15
  808. 466.73 s > Checking figment v0.10.19
  809. 466.73 s > Checking rust_lisp v0.18.0
  810. 466.73 s > Checking titlecase v2.2.1
  811. 466.73 s > Checking phf_shared v0.13.1
  812. 466.73 s > Compiling vakint v0.1.2 (/build/source/crates/vakint)
  813. 466.73 s > Checking version-compare v0.2.1
  814. 466.73 s > Checking phf v0.13.1
  815. 466.73 s > Checking xpct v0.5.1
  816. 466.73 s > Checking ryu v1.0.23
  817. 466.73 s > Checking castaway v0.2.4
  818. 466.73 s > Checking toml_datetime v0.7.5+spec-1.1.0
  819. 466.73 s > Checking strum v0.27.2
  820. 466.73 s > Checking compact_str v0.9.0
  821. 466.73 s > Checking unicode-truncate v2.0.1
  822. 466.73 s > Checking kasuari v0.4.12
  823. 466.73 s > Checking lru v0.16.4
  824. 466.73 s > Checking vte v0.15.0
  825. 466.73 s > Checking toml v0.9.12+spec-1.1.0
  826. 466.73 s > Checking vt100 v0.16.2
  827. 466.73 s > Checking portable-atomic v1.13.1
  828. 466.73 s > Checking string-template-plus v0.4.3
  829. 466.73 s > Checking unit-prefix v0.5.2
  830. 466.73 s > Checking rand_distr v0.4.3
  831. 466.73 s > Checking simba v0.6.0
  832. 466.73 s > Checking ratatui-core v0.1.0
  833. 466.73 s > Checking line-clipping v0.3.7
  834. 466.73 s > Compiling three-dimensional-reps v0.1.0 (/build/source/crates/three-dimensional-reps)
  835. 466.73 s > Checking adler2 v2.0.1
  836. 466.73 s > Checking gimli v0.32.3
  837. 466.73 s > Checking thiserror v1.0.69
  838. 466.73 s > Checking derive_builder v0.11.2
  839. 466.73 s > Checking miniz_oxide v0.8.9
  840. 466.73 s > Checking owo-colors v4.3.0
  841. 466.73 s > Checking indicatif v0.18.4
  842. 466.73 s > Checking object v0.37.3
  843. 466.73 s > Checking crossterm v0.29.0
  844. 466.73 s > Checking tracing-error v0.2.1
  845. 466.73 s > Checking typed-index-collections v3.5.0
  846. 466.73 s > Checking serde-big-array v0.5.1
  847. 466.73 s > Checking amd v0.2.2
  848. 466.73 s > Compiling rustpython-parser-core v0.4.0
  849. 466.73 s > Checking itertools v0.11.0
  850. 466.73 s > Compiling gammaloop-tracing-filter-macros v0.1.0 (/build/source/crates/gammaloop-tracing-filter-macros)
  851. 466.73 s > Compiling rustpython-ast v0.4.0
  852. 466.73 s > Checking rustc-demangle v0.1.27
  853. 466.73 s > Checking env_logger v0.11.10
  854. 466.73 s > Checking option-ext v0.2.0
  855. 466.73 s > Checking ref-cast v1.0.25
  856. 466.73 s > Checking dirs-sys v0.5.0
  857. 466.73 s > Checking nix v0.31.2
  858. 466.73 s > Checking integer-sqrt v0.1.5
  859. 466.73 s > Checking brotli-decompressor v4.0.3
  860. 466.73 s > Checking crossbeam-channel v0.5.15
  861. 466.73 s > Checking ratatui-widgets v0.3.0
  862. 466.73 s > Checking color-spantrace v0.3.0
  863. 466.73 s > Checking ratatui-crossterm v0.1.0
  864. 466.73 s > Checking itertools v0.12.1
  865. 466.73 s > Checking unsafe-libyaml v0.2.11
  866. 466.73 s > Checking symlink v0.1.0
  867. 466.73 s > Compiling gammalooprs v0.3.4 (/build/source/crates/gammalooprs)
  868. 466.73 s > Checking include_dir v0.7.4
  869. 466.73 s > Checking dirs v6.0.0
  870. 466.73 s > Checking pathfinding v4.15.0
  871. 466.73 s > Checking tracing-appender v0.2.5
  872. 466.73 s > Checking schemars v1.2.1
  873. 466.73 s > Checking ctrlc v3.5.2
  874. 466.73 s > Checking slotmap v1.1.1
  875. 466.73 s > Checking tracing-indicatif v0.3.14
  876. 466.73 s > Checking json5 v0.4.1
  877. 466.73 s > Checking brotli v7.0.0
  878. 466.73 s > Checking vectorize v0.2.0
  879. 466.73 s > Checking rkyv v0.7.46
  880. 466.73 s > Checking clarabel v0.11.1
  881. 466.73 s > Checking ringbuffer v0.16.0
  882. 466.73 s > Checking serde_yaml v0.9.34+deprecated
  883. 466.73 s > Checking base62 v2.2.4
  884. 466.73 s > Checking rust-embed v8.11.0
  885. 466.73 s > Checking clap_complete v4.6.3
  886. 466.73 s > Checking addr2line v0.25.1
  887. 466.73 s > Checking strip-ansi-escapes v0.2.1
  888. 466.73 s > Checking ratatui-macros v0.7.0
  889. 466.73 s > Checking fd-lock v4.0.4
  890. 466.73 s > Checking ratatui v0.30.0
  891. 466.73 s > Compiling gammaloop-api v0.1.0 (/build/source/crates/gammaloop-api)
  892. 466.73 s > Checking itertools v0.13.0
  893. 466.73 s > Checking strum v0.26.3
  894. 466.73 s > Checking clap_complete_nushell v4.6.0
  895. 466.73 s > Checking sysinfo v0.33.1
  896. 466.73 s > Checking shlex v1.3.0
  897. 466.73 s > Checking slab v0.4.12
  898. 466.73 s > Checking futures-core v0.3.32
  899. 466.73 s > Checking futures-task v0.3.32
  900. 466.73 s > Checking sdd v3.0.10
  901. 466.73 s > Compiling gammaloop-integration-tests v0.1.0 (/build/source/tests)
  902. 466.73 s > Compiling test-log-core v0.2.20
  903. 466.73 s > Compiling rustc_version v0.4.1
  904. 466.73 s > Checking futures-util v0.3.32
  905. 466.73 s > Checking scc v2.4.0
  906. 466.73 s > Checking which v8.0.2
  907. 466.73 s > Checking bincode v1.3.3
  908. 466.73 s > Compiling gungraun-macros v0.8.0
  909. 466.73 s > Compiling gungraun-runner v0.18.2
  910. 466.73 s > Checking reedline v0.42.0
  911. 466.73 s > Checking proc-macro2 v1.0.106
  912. 466.73 s > Compiling numerica v2.2.0 (https://github.com/alphal00p/symbolica?rev=a277a8dadbaae5a8d6605f2f381991a601e1f345#a277a8da)
  913. 466.73 s > Checking backtrace v0.3.76
  914. 466.73 s > Checking maplit v1.0.2
  915. 466.73 s > Checking base64 v0.21.7
  916. 466.73 s > Checking color-eyre v0.6.5
  917. 466.73 s > Checking quote v1.0.45
  918. 466.73 s > Checking nalgebra v0.29.0
  919. 466.73 s > Checking ron v0.8.1
  920. 466.73 s > Compiling iai-callgrind-runner v0.14.2
  921. 466.73 s > Checking kurbo v0.13.0
  922. 466.73 s > Checking futures-executor v0.3.32
  923. 466.73 s > Checking wait-timeout v0.2.1
  924. 466.73 s > Checking serial_test v3.4.0
  925. 466.73 s > Checking bit-vec v0.8.0
  926. 466.73 s > Compiling test-log-macros v0.2.20
  927. 466.73 s > Compiling iai-callgrind v0.14.2
  928. 466.73 s > Checking quick-error v1.2.3
  929. 466.73 s > Checking rusty-fork v0.3.1
  930. 466.73 s > Checking bit-set v0.8.0
  931. 466.73 s > Checking syn v2.0.117
  932. 466.73 s > Compiling iai-callgrind-macros v0.5.1
  933. 466.73 s > Checking rand_xorshift v0.4.0
  934. 466.73 s > Checking console v0.15.11
  935. 466.73 s > Checking unarray v0.1.4
  936. 466.73 s > Checking pathdiff v0.2.3
  937. 466.73 s > Checking proptest v1.11.0
  938. 466.73 s > Checking similar-asserts v1.7.0
  939. 466.73 s > Checking clinnet v0.1.8 (/build/source/crates/clinnet)
  940. 466.73 s > Checking kurvst v0.1.0 (/build/source/crates/kurvst)
  941. 466.73 s > Checking test-log v0.2.20
  942. 466.73 s > Compiling graphica v2.1.0 (https://github.com/alphal00p/symbolica?rev=a277a8dadbaae5a8d6605f2f381991a601e1f345#a277a8da)
  943. 466.73 s > Checking statrs v0.16.1
  944. 466.73 s > Checking gungraun v0.18.2
  945. 466.73 s > Checking momtrop v0.3.0
  946. 466.73 s > Compiling pyo3-macros v0.28.3
  947. 466.73 s > Compiling pyo3-stub-gen-derive v0.17.2
  948. 466.73 s > Checking pyo3-stub-gen v0.17.2
  949. 466.73 s > Checking symbolica-utils v0.1.0 (/build/source/crates/symbolica-utils)
  950. 466.73 s > Checking spenso-macros v0.3.2 (/build/source/crates/spenso-macros)
  951. 466.73 s > Compiling gammaloop-workspace-hack v0.1.0 (/build/source/crates/gammaloop-workspace-hack)
  952. 466.73 s > Checking linnet v0.17.0 (/build/source/crates/linnet)
  953. 466.73 s > Checking spenso v0.6.0 (/build/source/crates/spenso)
  954. 466.73 s > Checking linnet-py v0.1.0 (/build/source/crates/linnet-py)
  955. 466.73 s > Checking linnest v0.1.0 (/build/source/crates/linnest)
  956. 466.73 s > Checking idenso v0.3.0 (/build/source/crates/idenso)
  957. 466.73 s > Checking gammaloop-tracing-filter v0.1.0 (/build/source/crates/gammaloop-tracing-filter)
  958. 466.73 s > Checking spenso-hep-lib v0.1.7 (/build/source/crates/spenso-hep-lib)
  959. 466.73 s > Checking spynso3 v0.1.2 (/build/source/crates/spynso3)
  960. 466.73 s > error[E0560]: struct `CutInfo` has no field named `lmb_channel_id`
  961. 466.73 s > --> tests/tests/test_differential.rs:86:13
  962. 466.73 s > |
  963. 466.73 s > 86 | lmb_channel_id: None,
  964. 466.73 s > | ^^^^^^^^^^^^^^ `CutInfo` does not have this field
  965. 466.73 s > |
  966. 466.73 s > = note: available fields are: `sampling_channel_id`, `sampling_channel_edge_ids`
  967. 466.73 s >
  968. 466.73 s > error[E0560]: struct `CutInfo` has no field named `lmb_channel_edge_ids`
  969. 466.73 s > --> tests/tests/test_differential.rs:87:13
  970. 466.73 s > |
  971. 466.73 s > 87 | lmb_channel_edge_ids: None,
  972. 466.73 s > | ^^^^^^^^^^^^^^^^^^^^ `CutInfo` does not have this field
  973. 466.73 s > |
  974. 466.73 s > = note: available fields are: `sampling_channel_id`, `sampling_channel_edge_ids`
  975. 466.73 s >
  976. 466.73 s > error[E0063]: missing field `reference_moments` in initializer of `GraphEvaluationResult<_>`
  977. 466.73 s > --> tests/tests/test_differential.rs:532:19
  978. 466.73 s > |
  979. 466.73 s > 532 | let mut lhs = GraphEvaluationResult {
  980. 466.73 s > | ^^^^^^^^^^^^^^^^^^^^^ missing `reference_moments`
  981. 466.73 s >
  982. 466.73 s > error[E0063]: missing field `reference_moments` in initializer of `GraphEvaluationResult<_>`
  983. 466.73 s > --> tests/tests/test_differential.rs:539:15
  984. 466.73 s > |
  985. 466.73 s > 539 | let rhs = GraphEvaluationResult {
  986. 466.73 s > | ^^^^^^^^^^^^^^^^^^^^^ missing `reference_moments`
  987. 466.73 s >
  988. 466.73 s > error[E0609]: no field `lmb_channel_edge_ids` on type `CutInfo`
  989. 466.73 s > --> tests/tests/test_evaluation_api.rs:311:10
  990. 466.73 s > |
  991. 466.73 s > 311 | .lmb_channel_edge_ids
  992. 466.73 s > | ^^^^^^^^^^^^^^^^^^^^ unknown field
  993. 466.73 s > |
  994. 466.73 s > = note: available fields are: `particle_pdgs`, `cut_id`, `graph_id`, `graph_group_id`, `orientation_id` ... and 2 others
  995. 466.73 s >
  996. 466.73 s > error[E0609]: no field `lmb_channel_edge_ids` on type `CutInfo`
  997. 466.73 s > --> tests/tests/test_evaluation_api.rs:591:26
  998. 466.73 s > |
  999. 466.73 s > 591 | .lmb_channel_edge_ids
  1000. 466.73 s > | ^^^^^^^^^^^^^^^^^^^^ unknown field
  1001. 466.73 s > |
  1002. 466.73 s > = note: available fields are: `particle_pdgs`, `cut_id`, `graph_id`, `graph_group_id`, `orientation_id` ... and 2 others
  1003. 466.73 s >
  1004. 466.73 s > Some errors have detailed explanations: E0063, E0560.
  1005. 466.73 s > For more information about an error, try `rustc --explain E0063`.
  1006. 466.73 s > error: could not compile `gammaloop-integration-tests` (test "test_differential") due to 4 previous errors
  1007. 466.73 s > warning: build failed, waiting for other jobs to finish...
  1008. 466.73 s > error[E0609]: no field `lmb_channel_edge_ids` on type `CutInfo`
  1009. 466.73 s > --> tests/tests/test_evaluation_api.rs:1177:18
  1010. 466.73 s > |
  1011. 466.73 s > 1177 | .lmb_channel_edge_ids
  1012. 466.73 s > | ^^^^^^^^^^^^^^^^^^^^ unknown field
  1013. 466.73 s > |
  1014. 466.73 s > = note: available fields are: `particle_pdgs`, `cut_id`, `graph_id`, `graph_group_id`, `orientation_id` ... and 2 others
  1015. 466.73 s >
  1016. 466.73 s > error[E0609]: no field `lmb_channel_edge_ids` on type `CutInfo`
  1017. 466.73 s > --> tests/tests/test_evaluation_api.rs:1222:22
  1018. 466.73 s > |
  1019. 466.73 s > 1222 | .lmb_channel_edge_ids
  1020. 466.73 s > | ^^^^^^^^^^^^^^^^^^^^ unknown field
  1021. 466.73 s > |
  1022. 466.73 s > = note: available fields are: `particle_pdgs`, `cut_id`, `graph_id`, `graph_group_id`, `orientation_id` ... and 2 others
  1023. 466.73 s >
  1024. 466.73 s > error[E0609]: no field `lmb_channel_edge_ids` on type `CutInfo`
  1025. 466.73 s > --> tests/tests/test_evaluation_api.rs:1281:14
  1026. 466.73 s > |
  1027. 466.73 s > 1281 | .lmb_channel_edge_ids
  1028. 466.73 s > | ^^^^^^^^^^^^^^^^^^^^ unknown field
  1029. 466.73 s > |
  1030. 466.73 s > = note: available fields are: `particle_pdgs`, `cut_id`, `graph_id`, `graph_group_id`, `orientation_id` ... and 2 others
  1031. 466.73 s >
  1032. 466.73 s > error[E0609]: no field `lmb_channel_edge_ids` on type `CutInfo`
  1033. 466.73 s > --> tests/tests/test_evaluation_api.rs:1428:18
  1034. 466.73 s > |
  1035. 466.73 s > 1428 | .lmb_channel_edge_ids
  1036. 466.73 s > | ^^^^^^^^^^^^^^^^^^^^ unknown field
  1037. 466.73 s > |
  1038. 466.73 s > = note: available fields are: `particle_pdgs`, `cut_id`, `graph_id`, `graph_group_id`, `orientation_id` ... and 2 others
  1039. 466.73 s >
  1040. 466.73 s > For more information about this error, try `rustc --explain E0609`.
  1041. 466.73 s > error: could not compile `gammaloop-integration-tests` (test "test_evaluation_api") due to 6 previous errors
  1042. 466.73 s > error[E0609]: no field `lmb_channel_id` on type `CutInfo`
  1043. 466.73 s > --> tests/tests/test_runs/utils.rs:568:36
  1044. 466.73 s > |
  1045. 466.73 s > 568 | event.cut_info.lmb_channel_id,
  1046. 466.73 s > | ^^^^^^^^^^^^^^ unknown field
  1047. 466.73 s > |
  1048. 466.73 s > = note: available fields are: `particle_pdgs`, `cut_id`, `graph_id`, `graph_group_id`, `orientation_id` ... and 2 others
  1049. 466.73 s >
  1050. 466.73 s > error[E0609]: no field `lmb_channel_id` on type `CutInfo`
  1051. 466.73 s > --> tests/tests/test_runs/utils.rs:580:36
  1052. 466.73 s > |
  1053. 466.73 s > 580 | event.cut_info.lmb_channel_id,
  1054. 466.73 s > | ^^^^^^^^^^^^^^ unknown field
  1055. 466.73 s > |
  1056. 466.73 s > = note: available fields are: `particle_pdgs`, `cut_id`, `graph_id`, `graph_group_id`, `orientation_id` ... and 2 others
  1057. 466.73 s >
  1058. 466.73 s > error: could not compile `gammaloop-integration-tests` (test "test_runs") due to 2 previous errors
  1059. 466.73 s For full logs, run:
  1060. 466.73 s nix log /nix/store/2f1j2lkyg12g36flfbgvv1q9204gpqa0-gammaloop-workspace-check-0.1.0.drv
  1061. 466.94 s Build failed.