0.00 s
$ /nix/store/9ypz3flqsrl5xl495mm8h645gadjsxi1-coreutils-9.11/bin/timeout --kill-after=15s 7200s /nix/store/23zk8sgzamrbmj1fday15szf7f2279s8-nix-2.34.7/bin/nix --extra-experimental-features nix-command --extra-experimental-features flakes --log-format internal-json build --no-link --print-out-paths git+https://github.com/alphal00p/gammaloop?ref=advanced_sampling&rev=ad713af8ba0173320df0aef4e53935ec4cf8a238&shallow=1#packages.x86_64-linux.crate-test-binaries-gammaloop-integration-tests --print-build-logs
3.32 s
4.25 s
Downloading cached cargoHelperFunctionsHook from https://cache.nix-ci.com
4.25 s
Downloading cached configureCargoCommonVarsHook from https://cache.nix-ci.com
4.25 s
Downloading cached configureCargoVendoredDepsHook from https://cache.nix-ci.com
4.25 s
Downloading cached gammaloop-ci-test-binary-dependencies-b8cda0d438c96d4f-Cargo.toml from https://cache.nix-ci.com
4.26 s
Downloading cached inheritCargoArtifactsHook from https://cache.nix-ci.com
4.26 s
Downloading cached installCargoArtifactsHook from https://cache.nix-ci.com
4.26 s
Downloading cached replaceCargoLockHook from https://cache.nix-ci.com
4.26 s
Downloading cached mailcap from https://cache.nix-ci.com
4.26 s
Downloading cached tzdata from https://cache.nix-ci.com
4.26 s
Downloading cached expand-response-params from https://cache.nix-ci.com
4.26 s
Downloading cached expand-response-params from https://cache.nix-ci.com
4.26 s
Downloading cached expat from https://cache.nix-ci.com
4.26 s
Downloading cached gdbm-1.26-lib from https://cache.nix-ci.com
4.26 s
Downloading cached gmp-with-cxx from https://cache.nix-ci.com
4.26 s
Downloading cached gnum4 from https://cache.nix-ci.com
4.26 s
Downloading cached linux-headers from https://cache.nix-ci.com
4.27 s
Downloaded cached configureCargoVendoredDepsHook (1632 B) in 12ms
4.27 s
Downloaded cached configureCargoCommonVarsHook (2728 B) in 12ms
4.27 s
Downloaded cached cargoHelperFunctionsHook (1016 B) in 13ms
4.27 s
Downloaded cached gammaloop-ci-test-binary-dependencies-b8cda0d438c96d4f-Cargo.toml (1344 B) in 13ms
4.27 s
Downloaded cached inheritCargoArtifactsHook (5944 B) in 13ms
4.27 s
Downloaded cached installCargoArtifactsHook (4624 B) in 14ms
4.27 s
Downloaded cached replaceCargoLockHook (1032 B) in 13ms
4.28 s
Downloaded cached mailcap (116 KiB) in 17ms
4.28 s
Downloaded cached expand-response-params (16 KiB) in 22ms
4.29 s
Downloaded cached expand-response-params (16 KiB) in 27ms
4.30 s
Downloaded cached expat (312 KiB) in 42ms
4.30 s
Downloaded cached gdbm-1.26-lib (448 KiB) in 42ms
4.31 s
Downloaded cached gmp-with-cxx (765 KiB) in 45ms
4.31 s
Downloaded cached gnum4 (1.1 MiB) in 52ms
4.33 s
Building /nix/store/lw1x11cpmlidxcnakx6xvy0laaxvcp34-crane-dummy-cargo-target.rs.drv
4.35 s
Downloaded cached tzdata (2 MiB) in 89ms
4.35 s
Building /nix/store/9d5pq3a3kirmah8ad81bjkjxw8qcs37i-crane-dummy-proc-macro-cargo-target.rs.drv
4.37 s
Building /nix/store/7bvilb8f8jk96pxj7jzk23i0qicj2vy5-gammaloop-ci-test-binary-dependencies-b8cda0d438c96d4f-gammaloop-integration-tests-dev-dependency.toml.drv
4.39 s
Progress: 0 of 40 built (3 building), 1 of 82 downloaded from cache (15 downloading)
4.39 s
Progress: 0 of 40 built (3 building), 2 of 82 downloaded from cache (14 downloading)
4.39 s
Progress: 0 of 40 built (3 building), 3 of 82 downloaded from cache (13 downloading)
4.40 s
Progress: 0 of 40 built (3 building), 4 of 82 downloaded from cache (12 downloading)
4.40 s
Progress: 0 of 40 built (3 building), 5 of 82 downloaded from cache (11 downloading)
4.40 s
Progress: 0 of 40 built (3 building), 6 of 82 downloaded from cache (10 downloading)
4.40 s
Progress: 0 of 40 built (3 building), 7 of 82 downloaded from cache (9 downloading)
4.40 s
Progress: 0 of 40 built (3 building), 8 of 82 downloaded from cache (8 downloading)
4.40 s
Progress: 0 of 40 built (3 building), 9 of 82 downloaded from cache (7 downloading)
4.40 s
Progress: 0 of 40 built (3 building), 10 of 82 downloaded from cache (6 downloading)
4.40 s
Progress: 0 of 40 built (3 building), 11 of 82 downloaded from cache (5 downloading)
4.40 s
Progress: 0 of 40 built (3 building), 12 of 82 downloaded from cache (4 downloading)
4.40 s
Progress: 0 of 40 built (3 building), 13 of 82 downloaded from cache (3 downloading)
4.40 s
Progress: 0 of 40 built (3 building), 14 of 82 downloaded from cache (2 downloading)
4.40 s
Progress: 0 of 40 built (3 building), 15 of 82 downloaded from cache (1 downloading)
4.41 s
Downloaded cached linux-headers (7.1 MiB) in 144ms
4.41 s
[crane-dummy-cargo-target.rs:post-build] Uploading to the NixCI cache: /nix/store/hd50hqi25fymr09a2w4xdiy5jmb2cfl5-crane-dummy-cargo-target.rs
4.45 s
[crane-dummy-cargo-target.rs:post-build] warning: 'warn-short-path-literals' is deprecated, use 'lint-short-path-literals = ignore' instead
4.47 s
[crane-dummy-cargo-target.rs:post-build] copying 0 paths...
4.51 s
[crane-dummy-cargo-target.rs:post-build] warning: 'warn-short-path-literals' is deprecated, use 'lint-short-path-literals = ignore' instead
4.55 s
[crane-dummy-cargo-target.rs:post-build] copying 0 paths...
4.55 s
Uploaded crane-dummy-cargo-target.rs in 155ms
4.55 s
Progress: 1 of 41 built (2 building), 15 of 82 downloaded from cache (1 downloading)
4.55 s
Built crane-dummy-cargo-target.rs in 224ms
4.57 s
[crane-dummy-proc-macro-cargo-target.rs:post-build] Uploading to the NixCI cache: /nix/store/z0b4s6pznqwlbyw5v4bbq7k1kp721g19-crane-dummy-proc-macro-cargo-target.rs
4.60 s
[crane-dummy-proc-macro-cargo-target.rs:post-build] warning: 'warn-short-path-literals' is deprecated, use 'lint-short-path-literals = ignore' instead
4.63 s
[crane-dummy-proc-macro-cargo-target.rs:post-build] copying 0 paths...
4.67 s
[crane-dummy-proc-macro-cargo-target.rs:post-build] warning: 'warn-short-path-literals' is deprecated, use 'lint-short-path-literals = ignore' instead
4.70 s
[crane-dummy-proc-macro-cargo-target.rs:post-build] copying 0 paths...
4.71 s
Uploaded crane-dummy-proc-macro-cargo-target.rs in 154ms
4.71 s
Progress: 2 of 42 built (1 building), 15 of 82 downloaded from cache (1 downloading)
4.71 s
Built crane-dummy-proc-macro-cargo-target.rs in 362ms
4.71 s
Downloading cached binutils-2.46-lib from https://cache.nix-ci.com
4.71 s
Downloading cached cargo-stable-2026-07 from https://cache.nix-ci.com
4.71 s
Downloading cached clippy-preview-stable-2026-07 from https://cache.nix-ci.com
4.71 s
Downloading cached dummyBuild.rs from https://cache.nix-ci.com
4.71 s
Downloading cached gammaloop-crate-gammaloop-workspace-hack-deps from https://cache.nix-ci.com
4.71 s
Downloading cached glibc-2.42-67-bin from https://cache.nix-ci.com
4.71 s
Downloading cached gmp from https://cache.nix-ci.com
4.71 s
Downloading cached gnutar from https://cache.nix-ci.com
4.71 s
Downloading cached libffi from https://cache.nix-ci.com
4.71 s
Downloading cached llvm-tools-preview-stable-2026-07 from https://cache.nix-ci.com
4.71 s
Downloading cached lndir from https://cache.nix-ci.com
4.71 s
Downloading cached lz4-1.10.0-lib from https://cache.nix-ci.com
4.71 s
Downloading cached mpdecimal from https://cache.nix-ci.com
4.71 s
Downloading cached ncurses from https://cache.nix-ci.com
4.71 s
Downloading cached openssl from https://cache.nix-ci.com
4.72 s
Progress: 2 of 31 built (1 building), 16 of 82 downloaded from cache (15 downloading)
4.73 s
[gammaloop-ci-test-binary-dependencies-b8cda0d438c96d4f-gammaloop-integration-tests-dev-dependency.toml:post-build] Uploading to the NixCI cache: /nix/store/2lfqmlw92swx4z82ikq7m59s1qqd8l2d-gammaloop-ci-test-binary-dependencies-b8cda0d438c96d4f-gammaloop-integration-tests-dev-dependency.toml
4.74 s
Downloaded cached lndir (23 KiB) in 20ms
4.74 s
Downloaded cached lz4-1.10.0-lib (256 KiB) in 27ms
4.75 s
Downloaded cached libffi (72 KiB) in 35ms
4.75 s
Downloaded cached gmp (722 KiB) in 38ms
4.76 s
Downloaded cached gnutar (2.7 MiB) in 43ms
4.76 s
Downloaded cached dummyBuild.rs (640 B) in 44ms
4.76 s
Downloaded cached binutils-2.46-lib (2.9 MiB) in 48ms
4.76 s
Downloaded cached mpdecimal (220 KiB) in 47ms
4.79 s
Downloaded cached glibc-2.42-67-bin (2.8 MiB) in 75ms
4.79 s
Downloaded cached openssl (8.9 MiB) in 75ms
4.80 s
[gammaloop-ci-test-binary-dependencies-b8cda0d438c96d4f-gammaloop-integration-tests-dev-dependency.toml:post-build] warning: 'warn-short-path-literals' is deprecated, use 'lint-short-path-literals = ignore' instead
4.84 s
[gammaloop-ci-test-binary-dependencies-b8cda0d438c96d4f-gammaloop-integration-tests-dev-dependency.toml:post-build] copying 0 paths...
4.89 s
[gammaloop-ci-test-binary-dependencies-b8cda0d438c96d4f-gammaloop-integration-tests-dev-dependency.toml:post-build] warning: 'warn-short-path-literals' is deprecated, use 'lint-short-path-literals = ignore' instead
4.90 s
Downloaded cached ncurses (3.7 MiB) in 182ms
4.94 s
Downloaded cached clippy-preview-stable-2026-07 (22.9 MiB) in 226ms
4.95 s
[gammaloop-ci-test-binary-dependencies-b8cda0d438c96d4f-gammaloop-integration-tests-dev-dependency.toml:post-build] copying 0 paths...
4.96 s
Uploaded gammaloop-ci-test-binary-dependencies-b8cda0d438c96d4f-gammaloop-integration-tests-dev-dependency.toml in 242ms
4.96 s
Progress: 3 of 32 built, 16 of 82 downloaded from cache (15 downloading)
4.96 s
Built gammaloop-ci-test-binary-dependencies-b8cda0d438c96d4f-gammaloop-integration-tests-dev-dependency.toml in 591ms
4.96 s
Downloading cached gmp-with-cxx-6.3.0-dev from https://cache.nix-ci.com
4.96 s
Progress: 3 of 31 built, 17 of 82 downloaded from cache (15 downloading)
4.96 s
Progress: 3 of 31 built, 18 of 82 downloaded from cache (14 downloading)
4.96 s
Progress: 3 of 31 built, 19 of 82 downloaded from cache (13 downloading)
4.96 s
Progress: 3 of 31 built, 20 of 82 downloaded from cache (12 downloading)
4.96 s
Progress: 3 of 31 built, 21 of 82 downloaded from cache (11 downloading)
4.96 s
Progress: 3 of 31 built, 22 of 82 downloaded from cache (10 downloading)
4.96 s
Progress: 3 of 31 built, 23 of 82 downloaded from cache (9 downloading)
4.96 s
Progress: 3 of 31 built, 24 of 82 downloaded from cache (8 downloading)
4.96 s
Progress: 3 of 31 built, 25 of 82 downloaded from cache (7 downloading)
4.96 s
Progress: 3 of 31 built, 26 of 82 downloaded from cache (6 downloading)
4.96 s
Progress: 3 of 31 built, 27 of 82 downloaded from cache (5 downloading)
4.96 s
Progress: 3 of 31 built, 28 of 82 downloaded from cache (4 downloading)
4.96 s
Downloading cached mpfr from https://cache.nix-ci.com
4.96 s
Downloading cached pkg-config from https://cache.nix-ci.com
4.97 s
Downloading cached popt from https://cache.nix-ci.com
4.97 s
Downloading cached rust-std-stable-2026-07 from https://cache.nix-ci.com
4.97 s
Downloading cached rustc-stable-2026-07 from https://cache.nix-ci.com
4.97 s
Downloading cached sqlite from https://cache.nix-ci.com
4.97 s
Downloading cached util-linux-minimal-2.42.2-lib from https://cache.nix-ci.com
4.97 s
Downloading cached xxhash from https://cache.nix-ci.com
4.97 s
Downloading cached zstd from https://cache.nix-ci.com
4.97 s
Downloading cached binutils from https://cache.nix-ci.com
4.97 s
Downloading cached gammaloop-workspace-deps-deps from https://cache.nix-ci.com
4.97 s
Downloading cached glibc-2.42-67-dev from https://cache.nix-ci.com
4.99 s
Downloaded cached gmp-with-cxx-6.3.0-dev (211 KiB) in 27ms
4.99 s
Progress: 3 of 27 built, 29 of 82 downloaded from cache (15 downloading)
4.99 s
Downloading cached isl from https://cache.nix-ci.com
4.99 s
Downloaded cached pkg-config (673 KiB) in 27ms
4.99 s
Progress: 3 of 26 built, 30 of 82 downloaded from cache (15 downloading)
4.99 s
Downloading cached mpfr from https://cache.nix-ci.com
5.00 s
Downloaded cached mpfr (803 KiB) in 30ms
5.00 s
Progress: 3 of 26 built, 31 of 82 downloaded from cache (15 downloading)
5.00 s
Downloading cached openssl-3.6.3-bin from https://cache.nix-ci.com
5.01 s
Downloaded cached popt (161 KiB) in 46ms
5.01 s
Progress: 3 of 25 built, 32 of 82 downloaded from cache (15 downloading)
5.01 s
Downloading cached libmpc from https://cache.nix-ci.com
5.01 s
Downloaded cached util-linux-minimal-2.42.2-lib (2 MiB) in 48ms
5.01 s
Progress: 3 of 25 built, 33 of 82 downloaded from cache (15 downloading)
5.01 s
Downloading cached mpfr-4.2.2-dev from https://cache.nix-ci.com
5.02 s
Downloaded cached xxhash (413 KiB) in 49ms
5.02 s
Progress: 3 of 25 built, 34 of 82 downloaded from cache (15 downloading)
5.02 s
Downloading cached pkg-config-wrapper from https://cache.nix-ci.com
5.03 s
Downloaded cached sqlite (5.7 MiB) in 65ms
5.03 s
Progress: 3 of 25 built, 35 of 82 downloaded from cache (15 downloading)
5.03 s
Downloading cached readline from https://cache.nix-ci.com
5.03 s
Downloaded cached zstd (1.1 MiB) in 68ms
5.03 s
Progress: 3 of 25 built, 36 of 82 downloaded from cache (15 downloading)
5.03 s
Downloading cached rsync from https://cache.nix-ci.com
5.06 s
Downloaded cached openssl-3.6.3-bin (1.3 MiB) in 64ms
5.06 s
Progress: 3 of 25 built, 37 of 82 downloaded from cache (15 downloading)
5.06 s
Downloading cached zstd-1.5.7-bin from https://cache.nix-ci.com
5.06 s
Downloaded cached mpfr (803 KiB) in 70ms
5.06 s
Progress: 3 of 25 built, 38 of 82 downloaded from cache (15 downloading)
5.06 s
Downloading cached openssl-3.6.3-dev from https://cache.nix-ci.com
5.06 s
Downloaded cached pkg-config-wrapper (11 KiB) in 48ms
5.06 s
Progress: 3 of 25 built, 39 of 82 downloaded from cache (15 downloading)
5.06 s
Downloading cached libmpc from https://cache.nix-ci.com
5.07 s
Downloaded cached mpfr-4.2.2-dev (64 KiB) in 50ms
5.07 s
Progress: 3 of 24 built, 40 of 82 downloaded from cache (15 downloading)
5.07 s
Downloaded cached libmpc (301 KiB) in 53ms
5.07 s
Progress: 3 of 23 built, 41 of 82 downloaded from cache (14 downloading)
5.07 s
Downloaded cached glibc-2.42-67-dev (2.3 MiB) in 108ms
5.07 s
Progress: 3 of 22 built, 42 of 82 downloaded from cache (13 downloading)
5.08 s
Downloaded cached readline (494 KiB) in 53ms
5.08 s
Progress: 3 of 22 built, 43 of 82 downloaded from cache (12 downloading)
5.08 s
Downloading cached python3 from https://cache.nix-ci.com
5.09 s
Downloaded cached isl (2.5 MiB) in 94ms
5.09 s
Progress: 3 of 22 built, 44 of 82 downloaded from cache (12 downloading)
5.09 s
Downloaded cached rsync (710 KiB) in 53ms
5.09 s
Progress: 3 of 22 built, 45 of 82 downloaded from cache (11 downloading)
5.10 s
Downloaded cached zstd-1.5.7-bin (380 KiB) in 41ms
5.10 s
Progress: 3 of 21 built, 46 of 82 downloaded from cache (10 downloading)
5.10 s
Downloading cached zstd-1.5.7-dev from https://cache.nix-ci.com
5.11 s
Downloaded cached libmpc (301 KiB) in 41ms
5.11 s
Progress: 3 of 21 built, 47 of 82 downloaded from cache (10 downloading)
5.11 s
Downloading cached gcc from https://cache.nix-ci.com
5.11 s
Downloaded cached openssl-3.6.3-dev (1.9 MiB) in 46ms
5.11 s
Progress: 3 of 21 built, 48 of 82 downloaded from cache (10 downloading)
5.16 s
Downloaded cached zstd-1.5.7-dev (219 KiB) in 58ms
5.16 s
Progress: 3 of 20 built, 49 of 82 downloaded from cache (9 downloading)
5.16 s
Downloaded cached cargo-stable-2026-07 (41.1 MiB) in 450ms
5.16 s
Progress: 3 of 19 built, 50 of 82 downloaded from cache (8 downloading)
5.30 s
Downloaded cached binutils (32.6 MiB) in 329ms
5.30 s
Progress: 3 of 18 built, 51 of 82 downloaded from cache (7 downloading)
5.30 s
Downloading cached binutils-wrapper from https://cache.nix-ci.com
5.35 s
Downloaded cached binutils-wrapper (55 KiB) in 50ms
5.35 s
Progress: 3 of 18 built, 52 of 82 downloaded from cache (7 downloading)
6.23 s
Downloaded cached python3 (127 MiB) in 1.1s
6.23 s
Progress: 3 of 18 built, 53 of 82 downloaded from cache (6 downloading)
6.79 s
Downloaded cached rust-std-stable-2026-07 (161.4 MiB) in 1.8s
6.79 s
Progress: 3 of 17 built, 54 of 82 downloaded from cache (5 downloading)
6.88 s
Downloaded cached llvm-tools-preview-stable-2026-07 (201.8 MiB) in 2.1s
6.88 s
Progress: 3 of 16 built, 55 of 82 downloaded from cache (4 downloading)
7.59 s
Downloaded cached gcc (264.1 MiB) in 2.4s
7.59 s
Progress: 3 of 15 built, 56 of 82 downloaded from cache (3 downloading)
7.59 s
Downloading cached gcc-wrapper from https://cache.nix-ci.com
7.62 s
Downloaded cached gcc-wrapper (69 KiB) in 21ms
7.62 s
Progress: 3 of 15 built, 57 of 82 downloaded from cache (3 downloading)
7.62 s
Downloading cached stdenv-linux from https://cache.nix-ci.com
7.64 s
Downloaded cached stdenv-linux (60 KiB) in 25ms
7.64 s
Progress: 3 of 14 built, 58 of 82 downloaded from cache (3 downloading)
8.85 s
Downloaded cached rustc-stable-2026-07 (395.4 MiB) in 3.8s
8.85 s
Progress: 3 of 13 built, 59 of 82 downloaded from cache (2 downloading)
8.85 s
Downloading cached rustfmt-preview-stable-2026-07 from https://cache.nix-ci.com
8.89 s
Building /nix/store/0278k537z0dbnrpx1zavbqcn0h9lxpnr-clippy-stable-with-std-2026-07-09.drv
8.92 s
Building /nix/store/hb2gbp84is9q8ij9m36pw4n1c0ngrpd6-rust-stable-with-std-2026-07-09.drv
8.98 s
Downloaded cached rustfmt-preview-stable-2026-07 (8.7 MiB) in 128ms
8.98 s
Progress: 3 of 12 built (2 building), 60 of 82 downloaded from cache (2 downloading)
8.98 s
Downloading cached rust-stable-with-components-2026-07 from https://cache.nix-ci.com
9.15 s
Downloaded cached gammaloop-crate-gammaloop-workspace-hack-deps (186.2 MiB) in 4.4s
9.23 s
[rust-stable-with-std-2026-07:post-build] Uploading to the NixCI cache: /nix/store/imnwv6nazijihjlgf2h3l1qm63m7l9wk-rust-stable-with-std-2026-07-09
9.27 s
[rust-stable-with-std-2026-07:post-build] warning: 'warn-short-path-literals' is deprecated, use 'lint-short-path-literals = ignore' instead
9.31 s
[rust-stable-with-std-2026-07:post-build] copying 0 paths...
9.36 s
[rust-stable-with-std-2026-07:post-build] warning: 'warn-short-path-literals' is deprecated, use 'lint-short-path-literals = ignore' instead
9.40 s
[rust-stable-with-std-2026-07:post-build] copying 0 paths...
9.41 s
Uploaded rust-stable-with-std-2026-07 in 202ms
9.41 s
Progress: 4 of 12 built (1 building), 60 of 82 downloaded from cache (3 downloading)
9.41 s
Built rust-stable-with-std-2026-07 in 494ms
9.41 s
Progress: 4 of 11 built (1 building), 61 of 82 downloaded from cache (2 downloading)
9.58 s
[clippy-stable-with-std-2026-07:post-build] Uploading to the NixCI cache: /nix/store/r4bjy93lvnfma1awpi480n2mz3af0adx-clippy-stable-with-std-2026-07-09
9.62 s
[clippy-stable-with-std-2026-07:post-build] warning: 'warn-short-path-literals' is deprecated, use 'lint-short-path-literals = ignore' instead
9.66 s
[clippy-stable-with-std-2026-07:post-build] copying 0 paths...
9.71 s
[clippy-stable-with-std-2026-07:post-build] warning: 'warn-short-path-literals' is deprecated, use 'lint-short-path-literals = ignore' instead
9.75 s
[clippy-stable-with-std-2026-07:post-build] copying 0 paths...
9.76 s
Uploaded clippy-stable-with-std-2026-07 in 201ms
9.76 s
Progress: 5 of 12 built, 61 of 82 downloaded from cache (2 downloading)
9.76 s
Built clippy-stable-with-std-2026-07 in 876ms
9.76 s
Downloading cached gammaloop-crate-gammaloop-workspace-hack-build from https://cache.nix-ci.com
9.77 s
Waiting for lock on rust-stable-with-components-2026-07
9.78 s
Downloaded cached gammaloop-crate-gammaloop-workspace-hack-build (196 KiB) in 15ms
9.78 s
Progress: 5 of 11 built, 62 of 82 downloaded from cache (2 downloading)
10.37 s
Downloaded cached gammaloop-workspace-deps-deps (306.1 MiB) in 5.4s
10.37 s
Progress: 5 of 11 built, 63 of 82 downloaded from cache (1 downloading)
10.37 s
Downloading cached gammaloop-crate-test-dependencies-01b6df4f694091ad-inputs from https://cache.nix-ci.com
10.37 s
Downloading cached gammaloop-crate-test-dependencies-1b17e1ec025c6580-inputs from https://cache.nix-ci.com
10.37 s
Downloading cached gammaloop-crate-test-dependencies-78814cb8a1862b52-inputs from https://cache.nix-ci.com
11.24 s
Downloaded cached rust-stable-with-components-2026-07 (240.3 MiB) in 2.2s
11.24 s
Progress: 5 of 10 built, 64 of 82 downloaded from cache (3 downloading)
17.97 s
Downloaded cached gammaloop-crate-test-dependencies-1b17e1ec025c6580-inputs (1.1 GiB) in 7.5s
17.97 s
Progress: 5 of 9 built, 65 of 82 downloaded from cache (2 downloading)
17.97 s
Downloading cached gammaloop-crate-test-dependencies-1b17e1ec025c6580-deps from https://cache.nix-ci.com
17.98 s
Downloaded cached gammaloop-crate-test-dependencies-1b17e1ec025c6580-deps (305 KiB) in 8ms
17.98 s
Progress: 5 of 9 built, 66 of 82 downloaded from cache (2 downloading)
17.99 s
Downloaded cached gammaloop-crate-test-dependencies-78814cb8a1862b52-inputs (1.1 GiB) in 7.6s
17.99 s
Progress: 5 of 9 built, 67 of 82 downloaded from cache (1 downloading)
17.99 s
Downloading cached gammaloop-crate-test-dependencies-78814cb8a1862b52-deps from https://cache.nix-ci.com
17.99 s
Downloaded cached gammaloop-crate-test-dependencies-01b6df4f694091ad-inputs (1.1 GiB) in 7.6s
17.99 s
Progress: 5 of 9 built, 68 of 82 downloaded from cache (1 downloading)
17.99 s
Downloading cached gammaloop-crate-test-dependencies-01b6df4f694091ad-deps from https://cache.nix-ci.com
18.28 s
Downloaded cached gammaloop-crate-test-dependencies-01b6df4f694091ad-deps (22.5 MiB) in 289ms
18.28 s
Progress: 5 of 9 built, 69 of 82 downloaded from cache (1 downloading)
18.52 s
Downloaded cached gammaloop-crate-test-dependencies-78814cb8a1862b52-deps (60.7 MiB) in 533ms
18.52 s
Progress: 5 of 9 built, 70 of 82 downloaded from cache
18.52 s
Downloading cached gammaloop-crate-test-dependencies-b6a0734be42e3503-inputs from https://cache.nix-ci.com
18.52 s
Downloading cached gammaloop-crate-test-dependencies-ef81405b5d18987b-inputs from https://cache.nix-ci.com
27.47 s
Downloaded cached gammaloop-crate-test-dependencies-b6a0734be42e3503-inputs (1.4 GiB) in 8.9s
27.47 s
Progress: 5 of 9 built, 71 of 82 downloaded from cache (1 downloading)
27.47 s
Downloading cached gammaloop-crate-test-dependencies-b6a0734be42e3503-deps from https://cache.nix-ci.com
27.56 s
Downloaded cached gammaloop-crate-test-dependencies-ef81405b5d18987b-inputs (1.4 GiB) in 9.0s
27.56 s
Progress: 5 of 9 built, 72 of 82 downloaded from cache (1 downloading)
27.56 s
Downloading cached gammaloop-crate-test-dependencies-ef81405b5d18987b-deps from https://cache.nix-ci.com
28.29 s
Downloaded cached gammaloop-crate-test-dependencies-ef81405b5d18987b-deps (21.1 MiB) in 730ms
28.29 s
Progress: 5 of 9 built, 73 of 82 downloaded from cache (1 downloading)
28.41 s
Downloaded cached gammaloop-crate-test-dependencies-b6a0734be42e3503-deps (36.2 MiB) in 938ms
28.41 s
Progress: 5 of 9 built, 74 of 82 downloaded from cache
28.41 s
Downloading cached gammaloop-crate-test-dependencies-91f21e5f130440bb-inputs from https://cache.nix-ci.com
37.99 s
Downloaded cached gammaloop-crate-test-dependencies-91f21e5f130440bb-inputs (1.5 GiB) in 9.5s
37.99 s
Progress: 5 of 9 built, 75 of 82 downloaded from cache
37.99 s
Downloading cached gammaloop-crate-test-dependencies-91f21e5f130440bb-deps from https://cache.nix-ci.com
38.20 s
Downloaded cached gammaloop-crate-test-dependencies-91f21e5f130440bb-deps (29.8 MiB) in 205ms
38.20 s
Progress: 5 of 9 built, 76 of 82 downloaded from cache
38.20 s
Downloading cached gammaloop-crate-test-dependencies-ea99827d76e4dd39-inputs from https://cache.nix-ci.com
49.82 s
Downloaded cached gammaloop-crate-test-dependencies-ea99827d76e4dd39-inputs (1.8 GiB) in 11.6s
49.82 s
Progress: 5 of 9 built, 77 of 82 downloaded from cache
49.82 s
Downloading cached gammaloop-crate-test-dependencies-ea99827d76e4dd39-deps from https://cache.nix-ci.com
50.39 s
Downloaded cached gammaloop-crate-test-dependencies-ea99827d76e4dd39-deps (93.1 MiB) in 566ms
50.39 s
Progress: 5 of 9 built, 78 of 82 downloaded from cache
50.39 s
Downloading cached gammaloop-crate-test-dependencies-6e86b9f305aafb81-inputs from https://cache.nix-ci.com
66.01 s
Downloaded cached gammaloop-crate-test-dependencies-6e86b9f305aafb81-inputs (2.4 GiB) in 15.6s
66.01 s
Progress: 5 of 9 built, 79 of 82 downloaded from cache
66.01 s
Downloading cached gammaloop-crate-test-dependencies-6e86b9f305aafb81-deps from https://cache.nix-ci.com
66.85 s
Downloaded cached gammaloop-crate-test-dependencies-6e86b9f305aafb81-deps (124.1 MiB) in 837ms
66.85 s
Progress: 5 of 9 built, 80 of 82 downloaded from cache
66.85 s
Downloading cached gammaloop-crate-test-dependencies-b8cda0d438c96d4f-inputs from https://cache.nix-ci.com
91.91 s
Downloaded cached gammaloop-crate-test-dependencies-b8cda0d438c96d4f-inputs (3.1 GiB) in 25.0s
91.91 s
Progress: 5 of 9 built, 81 of 82 downloaded from cache
91.91 s
Downloading cached gammaloop-crate-test-dependencies-b8cda0d438c96d4f-deps from https://cache.nix-ci.com
92.11 s
Downloaded cached gammaloop-crate-test-dependencies-b8cda0d438c96d4f-deps (30 MiB) in 201ms
92.11 s
Progress: 5 of 9 built, 82 of 82 downloaded from cache
92.26 s
Building /nix/store/2a7a6bfvaxbdily0ba9vx91v3v4kn44r-gammaloop-crate-test-binaries-gammaloop-integration-tests-b8cda0d438c96d4f-inputs.drv
103.26 s
[gammaloop-crate-test-binaries-gammaloop-integration-tests-b8cda0d438c96d4f-inputs:post-build] Uploading to the NixCI cache: /nix/store/crwvzla71cgag15sf2ldrx93yxi308jj-gammaloop-crate-test-binaries-gammaloop-integration-tests-b8cda0d438c96d4f-inputs
103.30 s
[gammaloop-crate-test-binaries-gammaloop-integration-tests-b8cda0d438c96d4f-inputs:post-build] warning: 'warn-short-path-literals' is deprecated, use 'lint-short-path-literals = ignore' instead
103.33 s
[gammaloop-crate-test-binaries-gammaloop-integration-tests-b8cda0d438c96d4f-inputs:post-build] copying 1 paths...
103.33 s
[gammaloop-crate-test-binaries-gammaloop-integration-tests-b8cda0d438c96d4f-inputs:post-build] copying path '/nix/store/crwvzla71cgag15sf2ldrx93yxi308jj-gammaloop-crate-test-binaries-gammaloop-integration-tests-b8cda0d438c96d4f-inputs' to 'https://cache.nix-ci.com'...
180.74 s
[gammaloop-crate-test-binaries-gammaloop-integration-tests-b8cda0d438c96d4f-inputs:post-build] warning: 'warn-short-path-literals' is deprecated, use 'lint-short-path-literals = ignore' instead
180.98 s
[gammaloop-crate-test-binaries-gammaloop-integration-tests-b8cda0d438c96d4f-inputs:post-build] copying 1 paths...
180.98 s
[gammaloop-crate-test-binaries-gammaloop-integration-tests-b8cda0d438c96d4f-inputs:post-build] copying path '/nix/store/2a7a6bfvaxbdily0ba9vx91v3v4kn44r-gammaloop-crate-test-binaries-gammaloop-integration-tests-b8cda0d438c96d4f-inputs.drv' to 'https://cache.nix-ci.com'...
181.14 s
Uploaded gammaloop-crate-test-binaries-gammaloop-integration-tests-b8cda0d438c96d4f-inputs in 1m17s
181.14 s
Progress: 6 of 9 built, 82 of 82 downloaded from cache
181.14 s
Built gammaloop-crate-test-binaries-gammaloop-integration-tests-b8cda0d438c96d4f-inputs in 1m28s
181.22 s
Building /nix/store/87hq7ppbbyjsyasszv0zcc1zv7d81635-gammaloop-crate-test-binaries-gammaloop-integration-tests-b8cda0d438c96d4f-deps-0.1.0.drv
181.29 s
[gammaloop-crate-test-binaries-gammaloop-integration-tests-b8cda0d438c96d4f-deps] Phase: unpackPhase
181.29 s
[gammaloop-crate-test-binaries-gammaloop-integration-tests-b8cda0d438c96d4f-deps] unpacking source archive /nix/store/a2mf5ss32qm0vv8qxhcf041bxajmsxnq-source
181.35 s
[gammaloop-crate-test-binaries-gammaloop-integration-tests-b8cda0d438c96d4f-deps] source root is source
181.37 s
[gammaloop-crate-test-binaries-gammaloop-integration-tests-b8cda0d438c96d4f-deps] Phase: patchPhase
181.45 s
[gammaloop-crate-test-binaries-gammaloop-integration-tests-b8cda0d438c96d4f-deps] Executing configureCargoCommonVars
181.45 s
[gammaloop-crate-test-binaries-gammaloop-integration-tests-b8cda0d438c96d4f-deps] copying cargo artifacts from /nix/store/crwvzla71cgag15sf2ldrx93yxi308jj-gammaloop-crate-test-binaries-gammaloop-integration-tests-b8cda0d438c96d4f-inputs/target to target
181.45 s
[gammaloop-crate-test-binaries-gammaloop-integration-tests-b8cda0d438c96d4f-deps] will deep copy artifacts (instead of symlinking) as requested
183.30 s
[gammaloop-crate-test-binaries-gammaloop-integration-tests-b8cda0d438c96d4f-deps] Phase: updateAutotoolsGnuConfigScriptsPhase
183.33 s
[gammaloop-crate-test-binaries-gammaloop-integration-tests-b8cda0d438c96d4f-deps] Phase: configurePhase
183.34 s
[gammaloop-crate-test-binaries-gammaloop-integration-tests-b8cda0d438c96d4f-deps] will append /build/source/.cargo-home/config.toml with contents of /nix/store/5drf77x6km4ky7gwlrzdx9bbd6fz09g3-vendor-cargo-deps/config.toml
183.34 s
[gammaloop-crate-test-binaries-gammaloop-integration-tests-b8cda0d438c96d4f-deps] default configurePhase, nothing to do
183.34 s
[gammaloop-crate-test-binaries-gammaloop-integration-tests-b8cda0d438c96d4f-deps] Phase: buildPhase
183.35 s
[gammaloop-crate-test-binaries-gammaloop-integration-tests-b8cda0d438c96d4f-deps] +++ command cargo --version
183.35 s
[gammaloop-crate-test-binaries-gammaloop-integration-tests-b8cda0d438c96d4f-deps] cargo 1.97.0 (c980f4866 2026-06-30)
183.35 s
[gammaloop-crate-test-binaries-gammaloop-integration-tests-b8cda0d438c96d4f-deps] +++ command cargo test --profile ci-optim --no-run --offline -p gammaloop-integration-tests
183.79 s
[gammaloop-crate-test-binaries-gammaloop-integration-tests-b8cda0d438c96d4f-deps] Compiling gammaloop-integration-tests v0.1.0 (/build/source/tests)
183.93 s
[gammaloop-crate-test-binaries-gammaloop-integration-tests-b8cda0d438c96d4f-deps] error[E0560] : struct `CutInfo` has no field named `lmb_channel_id`
183.93 s
[gammaloop-crate-test-binaries-gammaloop-integration-tests-b8cda0d438c96d4f-deps] --> tests/tests/test_differential.rs:86:13
183.93 s
[gammaloop-crate-test-binaries-gammaloop-integration-tests-b8cda0d438c96d4f-deps] |
183.93 s
[gammaloop-crate-test-binaries-gammaloop-integration-tests-b8cda0d438c96d4f-deps] 86 | lmb_channel_id: None,
183.93 s
[gammaloop-crate-test-binaries-gammaloop-integration-tests-b8cda0d438c96d4f-deps] | ^^^^^^^^^^^^^^ `CutInfo` does not have this field
183.93 s
[gammaloop-crate-test-binaries-gammaloop-integration-tests-b8cda0d438c96d4f-deps] |
183.93 s
[gammaloop-crate-test-binaries-gammaloop-integration-tests-b8cda0d438c96d4f-deps] = note : available fields are: `sampling_channel_id`, `sampling_channel_edge_ids`
183.93 s
[gammaloop-crate-test-binaries-gammaloop-integration-tests-b8cda0d438c96d4f-deps]
183.93 s
[gammaloop-crate-test-binaries-gammaloop-integration-tests-b8cda0d438c96d4f-deps] error[E0560] : struct `CutInfo` has no field named `lmb_channel_edge_ids`
183.93 s
[gammaloop-crate-test-binaries-gammaloop-integration-tests-b8cda0d438c96d4f-deps] --> tests/tests/test_differential.rs:87:13
183.93 s
[gammaloop-crate-test-binaries-gammaloop-integration-tests-b8cda0d438c96d4f-deps] |
183.93 s
[gammaloop-crate-test-binaries-gammaloop-integration-tests-b8cda0d438c96d4f-deps] 87 | lmb_channel_edge_ids: None,
183.93 s
[gammaloop-crate-test-binaries-gammaloop-integration-tests-b8cda0d438c96d4f-deps] | ^^^^^^^^^^^^^^^^^^^^ `CutInfo` does not have this field
183.93 s
[gammaloop-crate-test-binaries-gammaloop-integration-tests-b8cda0d438c96d4f-deps] |
183.93 s
[gammaloop-crate-test-binaries-gammaloop-integration-tests-b8cda0d438c96d4f-deps] = note : available fields are: `sampling_channel_id`, `sampling_channel_edge_ids`
183.93 s
[gammaloop-crate-test-binaries-gammaloop-integration-tests-b8cda0d438c96d4f-deps]
183.94 s
[gammaloop-crate-test-binaries-gammaloop-integration-tests-b8cda0d438c96d4f-deps] error[E0063] : missing field `reference_moments` in initializer of `GraphEvaluationResult<_>`
183.94 s
[gammaloop-crate-test-binaries-gammaloop-integration-tests-b8cda0d438c96d4f-deps] --> tests/tests/test_differential.rs:532:19
183.94 s
[gammaloop-crate-test-binaries-gammaloop-integration-tests-b8cda0d438c96d4f-deps] |
183.94 s
[gammaloop-crate-test-binaries-gammaloop-integration-tests-b8cda0d438c96d4f-deps] 532 | let mut lhs = GraphEvaluationResult {
183.94 s
[gammaloop-crate-test-binaries-gammaloop-integration-tests-b8cda0d438c96d4f-deps] | ^^^^^^^^^^^^^^^^^^^^^ missing `reference_moments`
183.94 s
[gammaloop-crate-test-binaries-gammaloop-integration-tests-b8cda0d438c96d4f-deps]
183.94 s
[gammaloop-crate-test-binaries-gammaloop-integration-tests-b8cda0d438c96d4f-deps] error[E0063] : missing field `reference_moments` in initializer of `GraphEvaluationResult<_>`
183.94 s
[gammaloop-crate-test-binaries-gammaloop-integration-tests-b8cda0d438c96d4f-deps] --> tests/tests/test_differential.rs:539:15
183.94 s
[gammaloop-crate-test-binaries-gammaloop-integration-tests-b8cda0d438c96d4f-deps] |
183.94 s
[gammaloop-crate-test-binaries-gammaloop-integration-tests-b8cda0d438c96d4f-deps] 539 | let rhs = GraphEvaluationResult {
183.94 s
[gammaloop-crate-test-binaries-gammaloop-integration-tests-b8cda0d438c96d4f-deps] | ^^^^^^^^^^^^^^^^^^^^^ missing `reference_moments`
183.94 s
[gammaloop-crate-test-binaries-gammaloop-integration-tests-b8cda0d438c96d4f-deps]
184.00 s
[gammaloop-crate-test-binaries-gammaloop-integration-tests-b8cda0d438c96d4f-deps] error[E0609] : no field `lmb_channel_edge_ids` on type `CutInfo`
184.00 s
[gammaloop-crate-test-binaries-gammaloop-integration-tests-b8cda0d438c96d4f-deps] --> tests/tests/test_evaluation_api.rs:311:10
184.00 s
[gammaloop-crate-test-binaries-gammaloop-integration-tests-b8cda0d438c96d4f-deps] |
184.00 s
[gammaloop-crate-test-binaries-gammaloop-integration-tests-b8cda0d438c96d4f-deps] 311 | .lmb_channel_edge_ids
184.00 s
[gammaloop-crate-test-binaries-gammaloop-integration-tests-b8cda0d438c96d4f-deps] | ^^^^^^^^^^^^^^^^^^^^ unknown field
184.00 s
[gammaloop-crate-test-binaries-gammaloop-integration-tests-b8cda0d438c96d4f-deps] |
184.00 s
[gammaloop-crate-test-binaries-gammaloop-integration-tests-b8cda0d438c96d4f-deps] = note : available fields are: `particle_pdgs`, `cut_id`, `graph_id`, `graph_group_id`, `orientation_id` ... and 2 others
184.00 s
[gammaloop-crate-test-binaries-gammaloop-integration-tests-b8cda0d438c96d4f-deps]
184.00 s
[gammaloop-crate-test-binaries-gammaloop-integration-tests-b8cda0d438c96d4f-deps] Some errors have detailed explanations: E0063, E0560.
184.00 s
[gammaloop-crate-test-binaries-gammaloop-integration-tests-b8cda0d438c96d4f-deps] For more information about an error, try `rustc --explain E0063`.
184.00 s
[gammaloop-crate-test-binaries-gammaloop-integration-tests-b8cda0d438c96d4f-deps] error : could not compile `gammaloop-integration-tests` (test "test_differential") due to 4 previous errors
184.00 s
[gammaloop-crate-test-binaries-gammaloop-integration-tests-b8cda0d438c96d4f-deps] warning : build failed, waiting for other jobs to finish...
184.02 s
[gammaloop-crate-test-binaries-gammaloop-integration-tests-b8cda0d438c96d4f-deps] error[E0609] : no field `lmb_channel_edge_ids` on type `CutInfo`
184.02 s
[gammaloop-crate-test-binaries-gammaloop-integration-tests-b8cda0d438c96d4f-deps] --> tests/tests/test_evaluation_api.rs:591:26
184.02 s
[gammaloop-crate-test-binaries-gammaloop-integration-tests-b8cda0d438c96d4f-deps] |
184.02 s
[gammaloop-crate-test-binaries-gammaloop-integration-tests-b8cda0d438c96d4f-deps] 591 | .lmb_channel_edge_ids
184.02 s
[gammaloop-crate-test-binaries-gammaloop-integration-tests-b8cda0d438c96d4f-deps] | ^^^^^^^^^^^^^^^^^^^^ unknown field
184.02 s
[gammaloop-crate-test-binaries-gammaloop-integration-tests-b8cda0d438c96d4f-deps] |
184.02 s
[gammaloop-crate-test-binaries-gammaloop-integration-tests-b8cda0d438c96d4f-deps] = note : available fields are: `particle_pdgs`, `cut_id`, `graph_id`, `graph_group_id`, `orientation_id` ... and 2 others
184.02 s
[gammaloop-crate-test-binaries-gammaloop-integration-tests-b8cda0d438c96d4f-deps]
184.06 s
[gammaloop-crate-test-binaries-gammaloop-integration-tests-b8cda0d438c96d4f-deps] error[E0609] : no field `lmb_channel_edge_ids` on type `CutInfo`
184.06 s
[gammaloop-crate-test-binaries-gammaloop-integration-tests-b8cda0d438c96d4f-deps] --> tests/tests/test_evaluation_api.rs:1177:18
184.06 s
[gammaloop-crate-test-binaries-gammaloop-integration-tests-b8cda0d438c96d4f-deps] |
184.06 s
[gammaloop-crate-test-binaries-gammaloop-integration-tests-b8cda0d438c96d4f-deps] 1177 | .lmb_channel_edge_ids
184.06 s
[gammaloop-crate-test-binaries-gammaloop-integration-tests-b8cda0d438c96d4f-deps] | ^^^^^^^^^^^^^^^^^^^^ unknown field
184.06 s
[gammaloop-crate-test-binaries-gammaloop-integration-tests-b8cda0d438c96d4f-deps] |
184.06 s
[gammaloop-crate-test-binaries-gammaloop-integration-tests-b8cda0d438c96d4f-deps] = note : available fields are: `particle_pdgs`, `cut_id`, `graph_id`, `graph_group_id`, `orientation_id` ... and 2 others
184.06 s
[gammaloop-crate-test-binaries-gammaloop-integration-tests-b8cda0d438c96d4f-deps]
184.17 s
[gammaloop-crate-test-binaries-gammaloop-integration-tests-b8cda0d438c96d4f-deps] error[E0609] : no field `lmb_channel_edge_ids` on type `CutInfo`
184.17 s
[gammaloop-crate-test-binaries-gammaloop-integration-tests-b8cda0d438c96d4f-deps] --> tests/tests/test_evaluation_api.rs:1222:22
184.17 s
[gammaloop-crate-test-binaries-gammaloop-integration-tests-b8cda0d438c96d4f-deps] |
184.17 s
[gammaloop-crate-test-binaries-gammaloop-integration-tests-b8cda0d438c96d4f-deps] 1222 | .lmb_channel_edge_ids
184.17 s
[gammaloop-crate-test-binaries-gammaloop-integration-tests-b8cda0d438c96d4f-deps] | ^^^^^^^^^^^^^^^^^^^^ unknown field
184.17 s
[gammaloop-crate-test-binaries-gammaloop-integration-tests-b8cda0d438c96d4f-deps] |
184.17 s
[gammaloop-crate-test-binaries-gammaloop-integration-tests-b8cda0d438c96d4f-deps] = note : available fields are: `particle_pdgs`, `cut_id`, `graph_id`, `graph_group_id`, `orientation_id` ... and 2 others
184.17 s
[gammaloop-crate-test-binaries-gammaloop-integration-tests-b8cda0d438c96d4f-deps]
184.17 s
[gammaloop-crate-test-binaries-gammaloop-integration-tests-b8cda0d438c96d4f-deps] error[E0609] : no field `lmb_channel_edge_ids` on type `CutInfo`
184.17 s
[gammaloop-crate-test-binaries-gammaloop-integration-tests-b8cda0d438c96d4f-deps] --> tests/tests/test_evaluation_api.rs:1281:14
184.17 s
[gammaloop-crate-test-binaries-gammaloop-integration-tests-b8cda0d438c96d4f-deps] |
184.17 s
[gammaloop-crate-test-binaries-gammaloop-integration-tests-b8cda0d438c96d4f-deps] 1281 | .lmb_channel_edge_ids
184.17 s
[gammaloop-crate-test-binaries-gammaloop-integration-tests-b8cda0d438c96d4f-deps] | ^^^^^^^^^^^^^^^^^^^^ unknown field
184.17 s
[gammaloop-crate-test-binaries-gammaloop-integration-tests-b8cda0d438c96d4f-deps] |
184.17 s
[gammaloop-crate-test-binaries-gammaloop-integration-tests-b8cda0d438c96d4f-deps] = note : available fields are: `particle_pdgs`, `cut_id`, `graph_id`, `graph_group_id`, `orientation_id` ... and 2 others
184.17 s
[gammaloop-crate-test-binaries-gammaloop-integration-tests-b8cda0d438c96d4f-deps]
184.21 s
[gammaloop-crate-test-binaries-gammaloop-integration-tests-b8cda0d438c96d4f-deps] error[E0609] : no field `lmb_channel_edge_ids` on type `CutInfo`
184.21 s
[gammaloop-crate-test-binaries-gammaloop-integration-tests-b8cda0d438c96d4f-deps] --> tests/tests/test_evaluation_api.rs:1428:18
184.21 s
[gammaloop-crate-test-binaries-gammaloop-integration-tests-b8cda0d438c96d4f-deps] |
184.21 s
[gammaloop-crate-test-binaries-gammaloop-integration-tests-b8cda0d438c96d4f-deps] 1428 | .lmb_channel_edge_ids
184.21 s
[gammaloop-crate-test-binaries-gammaloop-integration-tests-b8cda0d438c96d4f-deps] | ^^^^^^^^^^^^^^^^^^^^ unknown field
184.21 s
[gammaloop-crate-test-binaries-gammaloop-integration-tests-b8cda0d438c96d4f-deps] |
184.21 s
[gammaloop-crate-test-binaries-gammaloop-integration-tests-b8cda0d438c96d4f-deps] = note : available fields are: `particle_pdgs`, `cut_id`, `graph_id`, `graph_group_id`, `orientation_id` ... and 2 others
184.21 s
[gammaloop-crate-test-binaries-gammaloop-integration-tests-b8cda0d438c96d4f-deps]
184.30 s
[gammaloop-crate-test-binaries-gammaloop-integration-tests-b8cda0d438c96d4f-deps] For more information about this error, try `rustc --explain E0609`.
184.31 s
[gammaloop-crate-test-binaries-gammaloop-integration-tests-b8cda0d438c96d4f-deps] error : could not compile `gammaloop-integration-tests` (test "test_evaluation_api") due to 6 previous errors
184.91 s
[gammaloop-crate-test-binaries-gammaloop-integration-tests-b8cda0d438c96d4f-deps] error[E0609] : no field `lmb_channel_id` on type `CutInfo`
184.91 s
[gammaloop-crate-test-binaries-gammaloop-integration-tests-b8cda0d438c96d4f-deps] --> tests/tests/test_runs/utils.rs:568:36
184.91 s
[gammaloop-crate-test-binaries-gammaloop-integration-tests-b8cda0d438c96d4f-deps] |
184.91 s
[gammaloop-crate-test-binaries-gammaloop-integration-tests-b8cda0d438c96d4f-deps] 568 | event.cut_info.lmb_channel_id,
184.91 s
[gammaloop-crate-test-binaries-gammaloop-integration-tests-b8cda0d438c96d4f-deps] | ^^^^^^^^^^^^^^ unknown field
184.91 s
[gammaloop-crate-test-binaries-gammaloop-integration-tests-b8cda0d438c96d4f-deps] |
184.91 s
[gammaloop-crate-test-binaries-gammaloop-integration-tests-b8cda0d438c96d4f-deps] = note : available fields are: `particle_pdgs`, `cut_id`, `graph_id`, `graph_group_id`, `orientation_id` ... and 2 others
184.91 s
[gammaloop-crate-test-binaries-gammaloop-integration-tests-b8cda0d438c96d4f-deps]
184.91 s
[gammaloop-crate-test-binaries-gammaloop-integration-tests-b8cda0d438c96d4f-deps] error[E0609] : no field `lmb_channel_id` on type `CutInfo`
184.91 s
[gammaloop-crate-test-binaries-gammaloop-integration-tests-b8cda0d438c96d4f-deps] --> tests/tests/test_runs/utils.rs:580:36
184.91 s
[gammaloop-crate-test-binaries-gammaloop-integration-tests-b8cda0d438c96d4f-deps] |
184.91 s
[gammaloop-crate-test-binaries-gammaloop-integration-tests-b8cda0d438c96d4f-deps] 580 | event.cut_info.lmb_channel_id,
184.91 s
[gammaloop-crate-test-binaries-gammaloop-integration-tests-b8cda0d438c96d4f-deps] | ^^^^^^^^^^^^^^ unknown field
184.91 s
[gammaloop-crate-test-binaries-gammaloop-integration-tests-b8cda0d438c96d4f-deps] |
184.91 s
[gammaloop-crate-test-binaries-gammaloop-integration-tests-b8cda0d438c96d4f-deps] = note : available fields are: `particle_pdgs`, `cut_id`, `graph_id`, `graph_group_id`, `orientation_id` ... and 2 others
184.91 s
[gammaloop-crate-test-binaries-gammaloop-integration-tests-b8cda0d438c96d4f-deps]
185.74 s
[gammaloop-crate-test-binaries-gammaloop-integration-tests-b8cda0d438c96d4f-deps] error : could not compile `gammaloop-integration-tests` (test "test_runs") due to 2 previous errors
249.47 s
Progress: 6 of 8 built (1 failed), 82 of 82 downloaded from cache
249.47 s
Failed to build gammaloop-crate-test-binaries-gammaloop-integration-tests-b8cda0d438c96d4f-deps after 1m08s
249.47 s
error: Cannot build '/nix/store/87hq7ppbbyjsyasszv0zcc1zv7d81635-gammaloop-crate-test-binaries-gammaloop-integration-tests-b8cda0d438c96d4f-deps-0.1.0.drv '.
249.47 s
Reason: builder failed with exit code 101 .
249.47 s
Output paths:
249.47 s
/nix/store/8k7s2i9d6dyh8kk6s8dp9rn2f63qcf5n-gammaloop-crate-test-binaries-gammaloop-integration-tests-b8cda0d438c96d4f-deps-0.1.0
249.47 s
Last 115 log lines:
249.47 s
> Running phase: unpackPhase
249.47 s
> unpacking source archive /nix/store/a2mf5ss32qm0vv8qxhcf041bxajmsxnq-source
249.47 s
> source root is source
249.47 s
> Running phase: patchPhase
249.47 s
> Executing configureCargoCommonVars
249.47 s
> copying cargo artifacts from /nix/store/crwvzla71cgag15sf2ldrx93yxi308jj-gammaloop-crate-test-binaries-gammaloop-integration-tests-b8cda0d438c96d4f-inputs/target to target
249.47 s
> will deep copy artifacts (instead of symlinking) as requested
249.47 s
> Running phase: updateAutotoolsGnuConfigScriptsPhase
249.47 s
> Running phase: configurePhase
249.47 s
> will append /build/source/.cargo-home/config.toml with contents of /nix/store/5drf77x6km4ky7gwlrzdx9bbd6fz09g3-vendor-cargo-deps/config.toml
249.47 s
> default configurePhase, nothing to do
249.47 s
> Running phase: buildPhase
249.47 s
> +++ command cargo --version
249.47 s
> cargo 1.97.0 (c980f4866 2026-06-30)
249.47 s
> +++ command cargo test --profile ci-optim --no-run --offline -p gammaloop-integration-tests
249.47 s
> Compiling gammaloop-integration-tests v0.1.0 (/build/source/tests)
249.47 s
> error[E0560] : struct `CutInfo` has no field named `lmb_channel_id`
249.47 s
> --> tests/tests/test_differential.rs:86:13
249.47 s
> |
249.47 s
> 86 | lmb_channel_id: None,
249.47 s
> | ^^^^^^^^^^^^^^ `CutInfo` does not have this field
249.47 s
> |
249.47 s
> = note : available fields are: `sampling_channel_id`, `sampling_channel_edge_ids`
249.47 s
>
249.47 s
> error[E0560] : struct `CutInfo` has no field named `lmb_channel_edge_ids`
249.47 s
> --> tests/tests/test_differential.rs:87:13
249.47 s
> |
249.47 s
> 87 | lmb_channel_edge_ids: None,
249.47 s
> | ^^^^^^^^^^^^^^^^^^^^ `CutInfo` does not have this field
249.47 s
> |
249.47 s
> = note : available fields are: `sampling_channel_id`, `sampling_channel_edge_ids`
249.47 s
>
249.47 s
> error[E0063] : missing field `reference_moments` in initializer of `GraphEvaluationResult<_>`
249.47 s
> --> tests/tests/test_differential.rs:532:19
249.47 s
> |
249.47 s
> 532 | let mut lhs = GraphEvaluationResult {
249.47 s
> | ^^^^^^^^^^^^^^^^^^^^^ missing `reference_moments`
249.47 s
>
249.47 s
> error[E0063] : missing field `reference_moments` in initializer of `GraphEvaluationResult<_>`
249.47 s
> --> tests/tests/test_differential.rs:539:15
249.47 s
> |
249.47 s
> 539 | let rhs = GraphEvaluationResult {
249.47 s
> | ^^^^^^^^^^^^^^^^^^^^^ missing `reference_moments`
249.47 s
>
249.47 s
> error[E0609] : no field `lmb_channel_edge_ids` on type `CutInfo`
249.47 s
> --> tests/tests/test_evaluation_api.rs:311:10
249.47 s
> |
249.47 s
> 311 | .lmb_channel_edge_ids
249.47 s
> | ^^^^^^^^^^^^^^^^^^^^ unknown field
249.47 s
> |
249.47 s
> = note : available fields are: `particle_pdgs`, `cut_id`, `graph_id`, `graph_group_id`, `orientation_id` ... and 2 others
249.47 s
>
249.47 s
> Some errors have detailed explanations: E0063, E0560.
249.47 s
> For more information about an error, try `rustc --explain E0063`.
249.47 s
> error : could not compile `gammaloop-integration-tests` (test "test_differential") due to 4 previous errors
249.47 s
> warning : build failed, waiting for other jobs to finish...
249.47 s
> error[E0609] : no field `lmb_channel_edge_ids` on type `CutInfo`
249.47 s
> --> tests/tests/test_evaluation_api.rs:591:26
249.47 s
> |
249.47 s
> 591 | .lmb_channel_edge_ids
249.47 s
> | ^^^^^^^^^^^^^^^^^^^^ unknown field
249.47 s
> |
249.47 s
> = note : available fields are: `particle_pdgs`, `cut_id`, `graph_id`, `graph_group_id`, `orientation_id` ... and 2 others
249.47 s
>
249.47 s
> error[E0609] : no field `lmb_channel_edge_ids` on type `CutInfo`
249.47 s
> --> tests/tests/test_evaluation_api.rs:1177:18
249.47 s
> |
249.47 s
> 1177 | .lmb_channel_edge_ids
249.47 s
> | ^^^^^^^^^^^^^^^^^^^^ unknown field
249.47 s
> |
249.47 s
> = note : available fields are: `particle_pdgs`, `cut_id`, `graph_id`, `graph_group_id`, `orientation_id` ... and 2 others
249.47 s
>
249.47 s
> error[E0609] : no field `lmb_channel_edge_ids` on type `CutInfo`
249.47 s
> --> tests/tests/test_evaluation_api.rs:1222:22
249.47 s
> |
249.47 s
> 1222 | .lmb_channel_edge_ids
249.47 s
> | ^^^^^^^^^^^^^^^^^^^^ unknown field
249.47 s
> |
249.47 s
> = note : available fields are: `particle_pdgs`, `cut_id`, `graph_id`, `graph_group_id`, `orientation_id` ... and 2 others
249.47 s
>
249.47 s
> error[E0609] : no field `lmb_channel_edge_ids` on type `CutInfo`
249.47 s
> --> tests/tests/test_evaluation_api.rs:1281:14
249.47 s
> |
249.47 s
> 1281 | .lmb_channel_edge_ids
249.47 s
> | ^^^^^^^^^^^^^^^^^^^^ unknown field
249.47 s
> |
249.47 s
> = note : available fields are: `particle_pdgs`, `cut_id`, `graph_id`, `graph_group_id`, `orientation_id` ... and 2 others
249.47 s
>
249.47 s
> error[E0609] : no field `lmb_channel_edge_ids` on type `CutInfo`
249.47 s
> --> tests/tests/test_evaluation_api.rs:1428:18
249.47 s
> |
249.47 s
> 1428 | .lmb_channel_edge_ids
249.47 s
> | ^^^^^^^^^^^^^^^^^^^^ unknown field
249.47 s
> |
249.47 s
> = note : available fields are: `particle_pdgs`, `cut_id`, `graph_id`, `graph_group_id`, `orientation_id` ... and 2 others
249.47 s
>
249.47 s
> For more information about this error, try `rustc --explain E0609`.
249.47 s
> error : could not compile `gammaloop-integration-tests` (test "test_evaluation_api") due to 6 previous errors
249.47 s
> error[E0609] : no field `lmb_channel_id` on type `CutInfo`
249.47 s
> --> tests/tests/test_runs/utils.rs:568:36
249.47 s
> |
249.47 s
> 568 | event.cut_info.lmb_channel_id,
249.47 s
> | ^^^^^^^^^^^^^^ unknown field
249.47 s
> |
249.47 s
> = note : available fields are: `particle_pdgs`, `cut_id`, `graph_id`, `graph_group_id`, `orientation_id` ... and 2 others
249.47 s
>
249.47 s
> error[E0609] : no field `lmb_channel_id` on type `CutInfo`
249.47 s
> --> tests/tests/test_runs/utils.rs:580:36
249.47 s
> |
249.47 s
> 580 | event.cut_info.lmb_channel_id,
249.47 s
> | ^^^^^^^^^^^^^^ unknown field
249.47 s
> |
249.47 s
> = note : available fields are: `particle_pdgs`, `cut_id`, `graph_id`, `graph_group_id`, `orientation_id` ... and 2 others
249.47 s
>
249.47 s
> error : could not compile `gammaloop-integration-tests` (test "test_runs") due to 2 previous errors
249.47 s
For full logs, run:
249.47 s
nix log /nix/store/87hq7ppbbyjsyasszv0zcc1zv7d81635-gammaloop-crate-test-binaries-gammaloop-integration-tests-b8cda0d438c96d4f-deps-0.1.0.drv
249.47 s
error: Cannot build '/nix/store/lm6y269bqrdbaw9nlnfib2x02cf702w3-nix-ci-artifact-barrier-crate-test-binaries-gammaloop-integration-tests.drv '.
249.47 s
Reason: 1 dependency failed .
249.47 s
Output paths:
249.47 s
/nix/store/clbszfvrq0b59j8j7yx83vr1vs7l8rbq-nix-ci-artifact-barrier-crate-test-binaries-gammaloop-integration-tests
249.48 s
Build failed due to failed dependency
249.52 s
Build failed.