build checks.x86_64-linux.gammaloop-check

Reproduce this run
Retry Run
  1. 0.00 s $ /nix/store/9ypz3flqsrl5xl495mm8h645gadjsxi1-coreutils-9.11/bin/timeout --kill-after=15s 7200s /nix/store/23zk8sgzamrbmj1fday15szf7f2279s8-nix-2.34.7/bin/nix --extra-experimental-features nix-command --extra-experimental-features flakes --log-format internal-json build --no-link --print-out-paths git+https://github.com/alphal00p/gammaloop?ref=advanced_sampling&rev=e9031dcd251401a6700423d61fd2a0a090245bcf&shallow=1#checks.x86_64-linux.gammaloop-check --print-build-logs
  2. 0.19 s error (ignored): SQLite database '/var/cache/nix-ci-worker/eval-cache-v6/b20626d1bc1175f729e8a70cc2eb83402c8ea1609789f5e1588870fa9fba19ec.sqlite' is busy
  3. 3.09 s
  4. 3.56 s Building /nix/store/678qn1yyh3j4046ys9sarqm9q60571r7-gammaloop-workspace-check-0.1.0.drv
  5. 3.65 s [gammaloop-workspace-check] Phase: unpackPhase
  6. 3.65 s [gammaloop-workspace-check] unpacking source archive /nix/store/3jj3smp74rs9m6ykxsf11s7cz9qgyqb0-source
  7. 3.81 s [gammaloop-workspace-check] source root is source
  8. 3.86 s [gammaloop-workspace-check] Phase: patchPhase
  9. 3.86 s [gammaloop-workspace-check] Executing configureCargoCommonVars
  10. 3.87 s [gammaloop-workspace-check] decompressing cargo artifacts from /nix/store/50vpxlcgfxf2d57i27v3d10zjwxxbm2r-gammaloop-workspace-deps-deps-0.1.0/target.tar.zst to target
  11. 5.89 s [gammaloop-workspace-check] Phase: updateAutotoolsGnuConfigScriptsPhase
  12. 5.93 s [gammaloop-workspace-check] Phase: configurePhase
  13. 5.94 s [gammaloop-workspace-check] will append /build/source/.cargo-home/config.toml with contents of /nix/store/5drf77x6km4ky7gwlrzdx9bbd6fz09g3-vendor-cargo-deps/config.toml
  14. 5.95 s [gammaloop-workspace-check] default configurePhase, nothing to do
  15. 5.95 s [gammaloop-workspace-check] Phase: buildPhase
  16. 5.96 s [gammaloop-workspace-check] +++ command cargo --version
  17. 5.96 s [gammaloop-workspace-check] cargo 1.97.0 (c980f4866 2026-06-30)
  18. 6.00 s [gammaloop-workspace-check] +++ command cargo check --profile ci-optim --locked --workspace --features gammaloop-tracing-filter/clap,gammaloop-tracing-filter/symbolica,idenso/bincode,idenso/reference-cases,linnet/bincode,linnet/drawing,linnet/rkyv,linnet/serde,linnet/symbolica,spenso-macros/shadowing,spenso/shadowing,symbolica/tracing_max_level_info,three-dimensional-reps/display,three-dimensional-reps/eval,three-dimensional-reps/serde --all-targets
  19. 7.00 s [gammaloop-workspace-check] Checking cfg-if v1.0.4
  20. 7.00 s [gammaloop-workspace-check] Checking memchr v2.8.0
  21. 7.00 s [gammaloop-workspace-check] Checking once_cell v1.21.4
  22. 7.00 s [gammaloop-workspace-check] Checking either v1.15.0
  23. 7.00 s [gammaloop-workspace-check] Checking itoa v1.0.18
  24. 7.01 s [gammaloop-workspace-check] Checking serde_core v1.0.228
  25. 7.01 s [gammaloop-workspace-check] Checking libc v0.2.186
  26. 7.01 s [gammaloop-workspace-check] Checking libm v0.2.16
  27. 7.01 s [gammaloop-workspace-check] Checking log v0.4.29
  28. 7.01 s [gammaloop-workspace-check] Checking regex-syntax v0.8.10
  29. 7.02 s [gammaloop-workspace-check] Checking zerocopy v0.8.48
  30. 7.03 s [gammaloop-workspace-check] Checking crossbeam-utils v0.8.21
  31. 7.03 s [gammaloop-workspace-check] Checking equivalent v1.0.2
  32. 7.06 s [gammaloop-workspace-check] Checking zmij v1.0.21
  33. 7.06 s [gammaloop-workspace-check] Checking lazy_static v1.5.0
  34. 7.06 s [gammaloop-workspace-check] Checking bytemuck v1.25.0
  35. 7.10 s [gammaloop-workspace-check] Compiling target-lexicon v0.13.5
  36. 7.11 s [gammaloop-workspace-check] Checking arrayvec v0.7.6
  37. 7.14 s [gammaloop-workspace-check] Checking powerfmt v0.2.0
  38. 7.23 s [gammaloop-workspace-check] Checking itertools v0.14.0
  39. 7.62 s [gammaloop-workspace-check] Checking aho-corasick v1.1.4
  40. 7.62 s [gammaloop-workspace-check] Checking crossbeam-epoch v0.9.18
  41. 7.62 s [gammaloop-workspace-check] Checking safe_arch v0.7.4
  42. 7.62 s [gammaloop-workspace-check] Checking deranged v0.5.8
  43. 7.62 s [gammaloop-workspace-check] Checking num-conv v0.2.1
  44. 7.62 s [gammaloop-workspace-check] Checking num_threads v0.1.7
  45. 7.62 s [gammaloop-workspace-check] Checking pin-project-lite v0.2.17
  46. 7.62 s [gammaloop-workspace-check] Checking time-core v0.1.8
  47. 7.62 s [gammaloop-workspace-check] Checking tracing-core v0.1.36
  48. 7.80 s [gammaloop-workspace-check] Checking allocator-api2 v0.2.21
  49. 7.84 s [gammaloop-workspace-check] Checking foldhash v0.2.0
  50. 7.88 s [gammaloop-workspace-check] Checking const-random v0.1.18
  51. 7.90 s [gammaloop-workspace-check] Checking crossbeam-deque v0.8.6
  52. 7.90 s [gammaloop-workspace-check] Checking unty v0.0.4
  53. 7.93 s [gammaloop-workspace-check] Checking nu-ansi-term v0.50.3
  54. 7.96 s [gammaloop-workspace-check] Checking static_assertions v1.1.0
  55. 7.98 s [gammaloop-workspace-check] Checking winnow v1.0.2
  56. 8.01 s [gammaloop-workspace-check] Checking safe_arch v1.0.0
  57. 8.16 s [gammaloop-workspace-check] Checking wide v0.7.33
  58. 8.18 s [gammaloop-workspace-check] Checking sharded-slab v0.1.7
  59. 8.26 s [gammaloop-workspace-check] Checking tracing-log v0.2.0
  60. 8.28 s [gammaloop-workspace-check] Checking hashbrown v0.16.1
  61. 8.32 s [gammaloop-workspace-check] Checking rayon-core v1.13.0
  62. 8.35 s [gammaloop-workspace-check] Checking tracing v0.1.44
  63. 8.58 s [gammaloop-workspace-check] Checking num-traits v0.2.19
  64. 8.77 s [gammaloop-workspace-check] Checking thread_local v1.1.9
  65. 8.90 s [gammaloop-workspace-check] Checking toml_writer v1.1.1+spec-1.1.0
  66. 8.90 s [gammaloop-workspace-check] Checking az v1.3.0
  67. 8.93 s [gammaloop-workspace-check] Checking indenter v0.3.4
  68. 9.02 s [gammaloop-workspace-check] Checking rayon v1.12.0
  69. 9.07 s [gammaloop-workspace-check] Checking wide v1.3.0
  70. 9.09 s [gammaloop-workspace-check] Compiling phf_shared v0.11.3
  71. 9.24 s [gammaloop-workspace-check] Checking anyhow v1.0.102
  72. 9.36 s [gammaloop-workspace-check] Checking regex-automata v0.4.14
  73. 10.23 s [gammaloop-workspace-check] Checking serde v1.0.228
  74. 10.23 s [gammaloop-workspace-check] Checking serde_json v1.0.149
  75. 10.23 s [gammaloop-workspace-check] Checking getrandom v0.3.4
  76. 10.23 s [gammaloop-workspace-check] Checking approx v0.5.1
  77. 10.23 s [gammaloop-workspace-check] Checking bitflags v2.11.1
  78. 10.23 s [gammaloop-workspace-check] Checking time v0.3.47
  79. 10.23 s [gammaloop-workspace-check] Checking num-integer v0.1.46
  80. 10.23 s [gammaloop-workspace-check] Checking serde_spanned v1.1.1
  81. 10.23 s [gammaloop-workspace-check] Checking toml_parser v1.1.2+spec-1.1.0
  82. 10.42 s [gammaloop-workspace-check] Checking gmp-mpfr-sys v1.7.1
  83. 10.45 s [gammaloop-workspace-check] Checking dyn-clone v1.0.20
  84. 10.49 s [gammaloop-workspace-check] Checking rand_core v0.9.5
  85. 10.50 s [gammaloop-workspace-check] Checking rawpointer v0.2.1
  86. 10.53 s [gammaloop-workspace-check] Checking alloc-no-stdlib v2.0.4
  87. 10.57 s [gammaloop-workspace-check] Checking utf8parse v0.2.2
  88. 10.60 s [gammaloop-workspace-check] Checking toml_datetime v1.1.1+spec-1.1.0
  89. 10.61 s [gammaloop-workspace-check] Checking matrixmultiply v0.3.10
  90. 10.67 s [gammaloop-workspace-check] Checking alloc-stdlib v0.2.2
  91. 10.72 s [gammaloop-workspace-check] Checking anstyle-parse v1.0.0
  92. 10.79 s [gammaloop-workspace-check] Checking colored v3.1.1
  93. 10.81 s [gammaloop-workspace-check] Checking colorchoice v1.0.5
  94. 10.85 s [gammaloop-workspace-check] Checking anstyle v1.0.14
  95. 10.88 s [gammaloop-workspace-check] Checking is_terminal_polyfill v1.70.2
  96. 10.90 s [gammaloop-workspace-check] Checking anstyle-query v1.1.5
  97. 10.92 s [gammaloop-workspace-check] Compiling phf_generator v0.11.3
  98. 10.94 s [gammaloop-workspace-check] Checking eyre v0.6.12
  99. 10.98 s [gammaloop-workspace-check] Checking unicode-width v0.2.2
  100. 10.99 s [gammaloop-workspace-check] Checking anstream v1.0.0
  101. 11.00 s [gammaloop-workspace-check] Checking bitflags v1.3.2
  102. 11.02 s [gammaloop-workspace-check] Checking toml v1.1.2+spec-1.1.0
  103. 11.18 s [gammaloop-workspace-check] Compiling phf_codegen v0.11.3
  104. 11.21 s [gammaloop-workspace-check] Checking region v3.0.2
  105. 11.26 s [gammaloop-workspace-check] Checking brotli-decompressor v5.0.0
  106. 11.46 s [gammaloop-workspace-check] Checking wasmtime-jit-icache-coherence v34.0.2
  107. 11.59 s [gammaloop-workspace-check] Checking hugepage-rs v0.1.1
  108. 11.61 s [gammaloop-workspace-check] Checking inventory v0.3.24
  109. 11.65 s [gammaloop-workspace-check] Checking spec_math v0.1.6
  110. 11.65 s [gammaloop-workspace-check] Checking thiserror v2.0.18
  111. 11.74 s [gammaloop-workspace-check] Compiling getopts v0.2.24
  112. 11.75 s [gammaloop-workspace-check] Checking libloading v0.9.0
  113. 11.79 s [gammaloop-workspace-check] Checking self_cell v1.2.2
  114. 11.81 s [gammaloop-workspace-check] Checking append-only-vec v0.1.8
  115. 11.81 s [gammaloop-workspace-check] Checking tinyjson v2.5.1
  116. 11.88 s [gammaloop-workspace-check] Checking bytes v1.11.1
  117. 11.91 s [gammaloop-workspace-check] Checking byteorder v1.5.0
  118. 11.92 s [gammaloop-workspace-check] Checking smallvec v1.15.1
  119. 11.99 s [gammaloop-workspace-check] Checking num-complex v0.4.6
  120. 12.09 s [gammaloop-workspace-check] Checking tracing-serde v0.2.0
  121. 12.21 s [gammaloop-workspace-check] Checking bincode v2.0.1
  122. 12.24 s [gammaloop-workspace-check] Checking smartstring v1.0.1
  123. 12.41 s [gammaloop-workspace-check] Compiling unic-common v0.9.0
  124. 12.46 s [gammaloop-workspace-check] Compiling pyo3-build-config v0.28.3
  125. 12.54 s [gammaloop-workspace-check] Compiling unicode_names2_generator v1.3.0
  126. 12.68 s [gammaloop-workspace-check] Compiling unic-char-range v0.9.0
  127. 12.76 s [gammaloop-workspace-check] Checking linux-raw-sys v0.12.1
  128. 12.81 s [gammaloop-workspace-check] Compiling unic-char-property v0.9.0
  129. 12.81 s [gammaloop-workspace-check] Checking simba v0.9.1
  130. 12.83 s [gammaloop-workspace-check] Compiling unic-ucd-version v0.9.0
  131. 12.83 s [gammaloop-workspace-check] Compiling is-macro v0.3.7
  132. 12.87 s [gammaloop-workspace-check] Compiling rustpython-parser-vendored v0.4.0
  133. 12.92 s [gammaloop-workspace-check] Checking iana-time-zone v0.1.65
  134. 12.93 s [gammaloop-workspace-check] Compiling rustpython-parser v0.4.0
  135. 13.08 s [gammaloop-workspace-check] Checking chrono v0.4.44
  136. 13.26 s [gammaloop-workspace-check] Compiling phf v0.11.3
  137. 13.44 s [gammaloop-workspace-check] Checking rustix v1.1.4
  138. 13.84 s [gammaloop-workspace-check] Checking brotli v8.0.2
  139. 13.86 s [gammaloop-workspace-check] Checking rustc-hash v2.1.2
  140. 13.87 s [gammaloop-workspace-check] Compiling unic-ucd-ident v0.9.0
  141. 13.97 s [gammaloop-workspace-check] Compiling unic-emoji-char v0.9.0
  142. 14.41 s [gammaloop-workspace-check] Checking ndarray v0.17.2
  143. 14.54 s [gammaloop-workspace-check] Compiling rustc-hash v1.1.0
  144. 14.63 s [gammaloop-workspace-check] Compiling lalrpop-util v0.20.2
  145. 14.72 s [gammaloop-workspace-check] Checking rug v1.30.0
  146. 15.05 s [gammaloop-workspace-check] Checking unicode-segmentation v1.13.2
  147. 15.32 s [gammaloop-workspace-check] Compiling symbolica v2.2.0 (https://github.com/alphal00p/symbolica?rev=a277a8dadbaae5a8d6605f2f381991a601e1f345#a277a8da)
  148. 15.45 s [gammaloop-workspace-check] Checking typenum v1.20.0
  149. 15.54 s [gammaloop-workspace-check] Checking getrandom v0.2.17
  150. 15.66 s [gammaloop-workspace-check] Checking scopeguard v1.2.0
  151. 15.70 s [gammaloop-workspace-check] Checking parking_lot_core v0.9.12
  152. 15.75 s [gammaloop-workspace-check] Checking lock_api v0.4.14
  153. 16.29 s [gammaloop-workspace-check] Checking unicode-ident v1.0.24
  154. 16.32 s [gammaloop-workspace-check] Checking matchers v0.2.0
  155. 16.40 s [gammaloop-workspace-check] Checking tracing-subscriber v0.3.23
  156. 16.41 s [gammaloop-workspace-check] Checking regex v1.12.3
  157. 16.47 s [gammaloop-workspace-check] Checking hashbrown v0.17.0
  158. 16.68 s [gammaloop-workspace-check] Checking parking_lot v0.12.5
  159. 16.76 s [gammaloop-workspace-check] Checking errno v0.3.14
  160. 16.88 s [gammaloop-workspace-check] Checking strsim v0.11.1
  161. 17.14 s [gammaloop-workspace-check] Checking unicase v2.9.0
  162. 17.14 s [gammaloop-workspace-check] Checking ppv-lite86 v0.2.21
  163. 17.20 s [gammaloop-workspace-check] Checking ahash v0.8.12
  164. 17.32 s [gammaloop-workspace-check] Checking clap_lex v1.1.0
  165. 17.42 s [gammaloop-workspace-check] Checking signal-hook-registry v1.4.8
  166. 17.48 s [gammaloop-workspace-check] Checking vte v0.14.1
  167. 17.59 s [gammaloop-workspace-check] Checking same-file v1.0.6
  168. 17.72 s [gammaloop-workspace-check] Checking half v2.7.1
  169. 17.77 s [gammaloop-workspace-check] Checking indexmap v2.14.0
  170. 17.91 s [gammaloop-workspace-check] Checking signal-hook v0.3.18
  171. 17.91 s [gammaloop-workspace-check] Checking walkdir v2.5.0
  172. 18.27 s [gammaloop-workspace-check] Checking generic-array v0.14.7
  173. 18.35 s [gammaloop-workspace-check] Checking mio v1.2.0
  174. 18.42 s [gammaloop-workspace-check] Checking minimal-lexical v0.2.1
  175. 18.77 s [gammaloop-workspace-check] Checking rand_chacha v0.9.0
  176. 18.77 s [gammaloop-workspace-check] Checking ciborium-io v0.2.2
  177. 18.83 s [gammaloop-workspace-check] Checking nom v7.1.3
  178. 18.89 s [gammaloop-workspace-check] Checking ciborium-ll v0.2.2
  179. 19.18 s [gammaloop-workspace-check] Checking rand v0.9.4
  180. 19.23 s [gammaloop-workspace-check] Checking derive_more v2.1.1
  181. 19.40 s [gammaloop-workspace-check] Checking num-bigint v0.4.6
  182. 19.73 s [gammaloop-workspace-check] Checking signal-hook-mio v0.2.5
  183. 19.78 s [gammaloop-workspace-check] Checking block-buffer v0.10.4
  184. 19.93 s [gammaloop-workspace-check] Checking crypto-common v0.1.7
  185. 20.17 s [gammaloop-workspace-check] Checking console v0.16.3
  186. 20.23 s [gammaloop-workspace-check] Checking bstr v1.12.1
  187. 20.26 s [gammaloop-workspace-check] Checking digest v0.10.7
  188. 20.84 s [gammaloop-workspace-check] Checking cpufeatures v0.2.17
  189. 20.89 s [gammaloop-workspace-check] Checking symjit v2.21.0
  190. 20.91 s [gammaloop-workspace-check] Checking winnow v0.7.15
  191. 20.92 s [gammaloop-workspace-check] Checking linux-raw-sys v0.4.15
  192. 21.03 s [gammaloop-workspace-check] Checking terminal_size v0.4.4
  193. 21.17 s [gammaloop-workspace-check] Checking clap_builder v4.6.0
  194. 21.32 s [gammaloop-workspace-check] Checking sha2 v0.10.9
  195. 21.32 s [gammaloop-workspace-check] Checking ciborium v0.2.2
  196. 21.77 s [gammaloop-workspace-check] Checking rustix v0.38.44
  197. 21.78 s [gammaloop-workspace-check] Checking getrandom v0.4.2
  198. 21.91 s [gammaloop-workspace-check] Checking globset v0.4.18
  199. 21.97 s [gammaloop-workspace-check] Checking rand_core v0.6.4
  200. 22.12 s [gammaloop-workspace-check] Checking fastrand v2.4.1
  201. 22.25 s [gammaloop-workspace-check] Checking plotters-backend v0.3.7
  202. 22.34 s [gammaloop-workspace-check] Checking fnv v1.0.7
  203. 22.48 s [gammaloop-workspace-check] Checking tempfile v3.27.0
  204. 22.49 s [gammaloop-workspace-check] Checking serde_spanned v0.6.9
  205. 22.72 s [gammaloop-workspace-check] Compiling unicode_names2 v1.3.0
  206. 22.80 s [gammaloop-workspace-check] Checking ansitok v0.3.0
  207. 22.87 s [gammaloop-workspace-check] Checking plotters-svg v0.3.7
  208. 22.90 s [gammaloop-workspace-check] Checking toml_datetime v0.6.11
  209. 22.95 s [gammaloop-workspace-check] Checking xprec v0.2.2
  210. 22.95 s [gammaloop-workspace-check] Checking itertools v0.10.5
  211. 23.31 s [gammaloop-workspace-check] Checking cast v0.3.0
  212. 23.36 s [gammaloop-workspace-check] Checking toml_write v0.1.2
  213. 23.43 s [gammaloop-workspace-check] Checking rust-embed-utils v8.11.0
  214. 23.43 s [gammaloop-workspace-check] Checking tap v1.0.1
  215. 23.45 s [gammaloop-workspace-check] Checking crossterm v0.28.1
  216. 23.50 s [gammaloop-workspace-check] Checking plotters v0.3.7
  217. 23.56 s [gammaloop-workspace-check] Checking wyz v0.5.1
  218. 23.77 s [gammaloop-workspace-check] Checking rand_chacha v0.3.1
  219. 23.89 s [gammaloop-workspace-check] Checking radium v0.7.0
  220. 23.92 s [gammaloop-workspace-check] Checking typeid v1.0.3
  221. 24.04 s [gammaloop-workspace-check] Checking similar v2.7.0
  222. 24.12 s [gammaloop-workspace-check] Checking tinytemplate v1.2.1
  223. 24.16 s [gammaloop-workspace-check] Checking is-terminal v0.4.17
  224. 24.30 s [gammaloop-workspace-check] Checking anes v0.1.6
  225. 24.36 s [gammaloop-workspace-check] Checking oorandom v11.1.5
  226. 24.59 s [gammaloop-workspace-check] Checking funty v2.0.0
  227. 24.76 s [gammaloop-workspace-check] Checking ansi-str v0.9.0
  228. 24.86 s [gammaloop-workspace-check] Checking bytecount v0.6.9
  229. 24.93 s [gammaloop-workspace-check] Checking testing_table v0.3.0
  230. 24.97 s [gammaloop-workspace-check] Checking rand v0.8.6
  231. 24.99 s [gammaloop-workspace-check] Checking ron v0.12.1
  232. 25.13 s [gammaloop-workspace-check] Checking toml_edit v0.25.11+spec-1.1.0
  233. 25.78 s [gammaloop-workspace-check] Checking clap v4.6.1
  234. 25.83 s [gammaloop-workspace-check] Checking uncased v0.9.10
  235. 25.86 s [gammaloop-workspace-check] Checking criterion-plot v0.5.0
  236. 25.95 s [gammaloop-workspace-check] Checking papergrid v0.17.0
  237. 26.06 s [gammaloop-workspace-check] Checking env_filter v1.0.1
  238. 26.08 s [gammaloop-workspace-check] Checking jiff v0.2.24
  239. 26.24 s [gammaloop-workspace-check] Checking bitvec v1.0.1
  240. 26.28 s [gammaloop-workspace-check] Checking ptr_meta v0.1.4
  241. 26.38 s [gammaloop-workspace-check] Checking ucd-trie v0.1.7
  242. 26.51 s [gammaloop-workspace-check] Checking simdutf8 v0.1.5
  243. 26.65 s [gammaloop-workspace-check] Checking criterion v0.5.1
  244. 26.74 s [gammaloop-workspace-check] Checking pest v2.8.6
  245. 26.74 s [gammaloop-workspace-check] Checking ahash v0.7.8
  246. 26.78 s [gammaloop-workspace-check] Checking bytecheck v0.6.12
  247. 27.15 s [gammaloop-workspace-check] Checking toml_edit v0.22.27
  248. 27.40 s [gammaloop-workspace-check] Checking hashbrown v0.12.3
  249. 27.50 s [gammaloop-workspace-check] Checking tabled v0.20.0
  250. 27.71 s [gammaloop-workspace-check] Checking approx v0.4.0
  251. 27.76 s [gammaloop-workspace-check] Checking seahash v4.1.0
  252. 27.77 s [gammaloop-workspace-check] Checking rend v0.4.2
  253. 27.94 s [gammaloop-workspace-check] Checking cgmath v0.18.0
  254. 28.02 s [gammaloop-workspace-check] Checking num-rational v0.4.2
  255. 28.04 s [gammaloop-workspace-check] Checking insta v1.47.2
  256. 28.07 s [gammaloop-workspace-check] Checking num-iter v0.1.45
  257. 28.33 s [gammaloop-workspace-check] Checking ref-ops v0.2.5
  258. 28.55 s [gammaloop-workspace-check] Checking rand_xoshiro v0.6.0
  259. 28.69 s [gammaloop-workspace-check] Checking features v0.10.0
  260. 28.77 s [gammaloop-workspace-check] Checking constcat v0.5.1
  261. 28.95 s [gammaloop-workspace-check] Checking gat-lending-iterator v0.1.8
  262. 29.05 s [gammaloop-workspace-check] Checking colored v2.2.0
  263. 29.25 s [gammaloop-workspace-check] Checking num v0.4.3
  264. 29.36 s [gammaloop-workspace-check] Checking constant_time_eq v0.4.2
  265. 29.41 s [gammaloop-workspace-check] Checking cpufeatures v0.3.0
  266. 29.45 s [gammaloop-workspace-check] Checking arrayref v0.3.9
  267. 29.49 s [gammaloop-workspace-check] Checking base64 v0.22.1
  268. 29.54 s [gammaloop-workspace-check] Checking joinery v2.1.0
  269. 29.62 s [gammaloop-workspace-check] Checking dot-parser v0.5.1
  270. 29.86 s [gammaloop-workspace-check] Checking siphasher v1.0.2
  271. 29.88 s [gammaloop-workspace-check] Checking blake3 v1.8.5
  272. 30.07 s [gammaloop-workspace-check] Checking phf_shared v0.13.1
  273. 30.10 s [gammaloop-workspace-check] Checking titlecase v2.2.1
  274. 30.35 s [gammaloop-workspace-check] Checking subprocess v0.2.15
  275. 30.56 s [gammaloop-workspace-check] Checking rust_lisp v0.18.0
  276. 30.74 s [gammaloop-workspace-check] Compiling vakint v0.1.2 (/build/source/crates/vakint)
  277. 30.79 s [gammaloop-workspace-check] Checking phf v0.13.1
  278. 30.95 s [gammaloop-workspace-check] Checking version-compare v0.2.1
  279. 30.99 s [gammaloop-workspace-check] Checking xpct v0.5.1
  280. 31.09 s [gammaloop-workspace-check] Checking ryu v1.0.23
  281. 31.12 s [gammaloop-workspace-check] Checking castaway v0.2.4
  282. 31.18 s [gammaloop-workspace-check] Checking toml_datetime v0.7.5+spec-1.1.0
  283. 31.25 s [gammaloop-workspace-check] Checking strum v0.27.2
  284. 31.26 s [gammaloop-workspace-check] Checking unicode-truncate v2.0.1
  285. 31.29 s [gammaloop-workspace-check] Checking compact_str v0.9.0
  286. 31.34 s [gammaloop-workspace-check] Checking kasuari v0.4.12
  287. 31.37 s [gammaloop-workspace-check] Checking toml v0.9.12+spec-1.1.0
  288. 31.41 s [gammaloop-workspace-check] Checking lru v0.16.4
  289. 31.58 s [gammaloop-workspace-check] Checking vte v0.15.0
  290. 31.60 s [gammaloop-workspace-check] Checking toml v0.8.23
  291. 31.63 s [gammaloop-workspace-check] Checking portable-atomic v1.13.1
  292. 31.70 s [gammaloop-workspace-check] Checking unit-prefix v0.5.2
  293. 31.83 s [gammaloop-workspace-check] Checking ratatui-core v0.1.0
  294. 31.91 s [gammaloop-workspace-check] Checking vt100 v0.16.2
  295. 31.95 s [gammaloop-workspace-check] Checking rand_distr v0.4.3
  296. 32.18 s [gammaloop-workspace-check] Checking string-template-plus v0.4.3
  297. 32.51 s [gammaloop-workspace-check] Compiling pyo3-ffi v0.28.3
  298. 32.60 s [gammaloop-workspace-check] Compiling pyo3-macros-backend v0.28.3
  299. 32.60 s [gammaloop-workspace-check] Compiling pyo3 v0.28.3
  300. 32.70 s [gammaloop-workspace-check] Compiling numpy v0.28.0
  301. 32.76 s [gammaloop-workspace-check] Checking figment v0.10.19
  302. 32.78 s [gammaloop-workspace-check] Checking simba v0.6.0
  303. 32.81 s [gammaloop-workspace-check] Checking indicatif v0.18.4
  304. 33.02 s [gammaloop-workspace-check] Checking line-clipping v0.3.7
  305. 33.14 s [gammaloop-workspace-check] Checking gimli v0.32.3
  306. 33.26 s [gammaloop-workspace-check] Checking adler2 v2.0.1
  307. 33.26 s [gammaloop-workspace-check] Compiling three-dimensional-reps v0.1.0 (/build/source/crates/three-dimensional-reps)
  308. 33.31 s [gammaloop-workspace-check] Checking thiserror v1.0.69
  309. 33.43 s [gammaloop-workspace-check] Checking derive_builder v0.11.2
  310. 33.43 s [gammaloop-workspace-check] Checking miniz_oxide v0.8.9
  311. 33.46 s [gammaloop-workspace-check] Checking object v0.37.3
  312. 33.51 s [gammaloop-workspace-check] Checking crossterm v0.29.0
  313. 33.53 s [gammaloop-workspace-check] Checking owo-colors v4.3.0
  314. 33.55 s [gammaloop-workspace-check] Checking tracing-error v0.2.1
  315. 33.64 s [gammaloop-workspace-check] Compiling rustpython-parser-core v0.4.0
  316. 33.75 s [gammaloop-workspace-check] Checking typed-index-collections v3.5.0
  317. 33.80 s [gammaloop-workspace-check] Checking ratatui-widgets v0.3.0
  318. 33.81 s [gammaloop-workspace-check] Checking serde-big-array v0.5.1
  319. 33.97 s [gammaloop-workspace-check] Checking amd v0.2.2
  320. 34.03 s [gammaloop-workspace-check] Compiling rustpython-ast v0.4.0
  321. 34.07 s [gammaloop-workspace-check] Checking rkyv v0.7.46
  322. 34.13 s [gammaloop-workspace-check] Checking itertools v0.11.0
  323. 34.37 s [gammaloop-workspace-check] Compiling gammaloop-tracing-filter-macros v0.1.0 (/build/source/crates/gammaloop-tracing-filter-macros)
  324. 34.43 s [gammaloop-workspace-check] Checking option-ext v0.2.0
  325. 34.49 s [gammaloop-workspace-check] Checking rustc-demangle v0.1.27
  326. 34.72 s [gammaloop-workspace-check] Checking dirs-sys v0.5.0
  327. 34.84 s [gammaloop-workspace-check] Checking ref-cast v1.0.25
  328. 34.96 s [gammaloop-workspace-check] Checking nix v0.31.2
  329. 35.20 s [gammaloop-workspace-check] Checking brotli-decompressor v4.0.3
  330. 35.22 s [gammaloop-workspace-check] Checking integer-sqrt v0.1.5
  331. 35.31 s [gammaloop-workspace-check] Checking crossbeam-channel v0.5.15
  332. 35.33 s [gammaloop-workspace-check] Checking env_logger v0.11.10
  333. 35.62 s [gammaloop-workspace-check] Checking ratatui-crossterm v0.1.0
  334. 35.68 s [gammaloop-workspace-check] Checking clarabel v0.11.1
  335. 35.74 s [gammaloop-workspace-check] Checking itertools v0.12.1
  336. 35.88 s [gammaloop-workspace-check] Checking symlink v0.1.0
  337. 35.90 s [gammaloop-workspace-check] Compiling gammalooprs v0.3.4 (/build/source/crates/gammalooprs)
  338. 36.01 s [gammaloop-workspace-check] Checking unsafe-libyaml v0.2.11
  339. 36.04 s [gammaloop-workspace-check] Checking ratatui-macros v0.7.0
  340. 36.14 s [gammaloop-workspace-check] Checking ratatui v0.30.0
  341. 36.33 s [gammaloop-workspace-check] Checking tracing-appender v0.2.5
  342. 36.37 s [gammaloop-workspace-check] Checking include_dir v0.7.4
  343. 36.46 s [gammaloop-workspace-check] Checking color-spantrace v0.3.0
  344. 36.52 s [gammaloop-workspace-check] Checking tracing-indicatif v0.3.14
  345. 36.76 s [gammaloop-workspace-check] Checking pathfinding v4.15.0
  346. 37.15 s [gammaloop-workspace-check] Checking schemars v1.2.1
  347. 37.29 s [gammaloop-workspace-check] Checking slotmap v1.1.1
  348. 37.33 s [gammaloop-workspace-check] Checking serde_yaml v0.9.34+deprecated
  349. 37.35 s [gammaloop-workspace-check] Checking dirs v6.0.0
  350. 37.41 s [gammaloop-workspace-check] Checking json5 v0.4.1
  351. 37.59 s [gammaloop-workspace-check] Checking brotli v7.0.0
  352. 37.64 s [gammaloop-workspace-check] Checking ctrlc v3.5.2
  353. 37.66 s [gammaloop-workspace-check] Checking vectorize v0.2.0
  354. 37.82 s [gammaloop-workspace-check] Checking addr2line v0.25.1
  355. 38.00 s [gammaloop-workspace-check] Checking ringbuffer v0.16.0
  356. 38.21 s [gammaloop-workspace-check] Checking base62 v2.2.4
  357. 38.24 s [gammaloop-workspace-check] Checking rust-embed v8.11.0
  358. 38.31 s [gammaloop-workspace-check] Checking clap_complete v4.6.3
  359. 38.58 s [gammaloop-workspace-check] Checking fd-lock v4.0.4
  360. 38.70 s [gammaloop-workspace-check] Checking strip-ansi-escapes v0.2.1
  361. 38.72 s [gammaloop-workspace-check] Compiling gammaloop-api v0.1.0 (/build/source/crates/gammaloop-api)
  362. 38.72 s [gammaloop-workspace-check] Checking itertools v0.13.0
  363. 38.78 s [gammaloop-workspace-check] Checking strum v0.26.3
  364. 38.86 s [gammaloop-workspace-check] Checking sysinfo v0.33.1
  365. 38.99 s [gammaloop-workspace-check] Checking shlex v1.3.0
  366. 39.26 s [gammaloop-workspace-check] Checking futures-core v0.3.32
  367. 39.33 s [gammaloop-workspace-check] Checking futures-task v0.3.32
  368. 39.46 s [gammaloop-workspace-check] Checking slab v0.4.12
  369. 39.52 s [gammaloop-workspace-check] Checking clap_complete_nushell v4.6.0
  370. 39.57 s [gammaloop-workspace-check] Checking sdd v3.0.10
  371. 39.60 s [gammaloop-workspace-check] Compiling gammaloop-integration-tests v0.1.0 (/build/source/tests)
  372. 39.71 s [gammaloop-workspace-check] Compiling test-log-core v0.2.20
  373. 39.75 s [gammaloop-workspace-check] Compiling rustc_version v0.4.1
  374. 39.77 s [gammaloop-workspace-check] Checking which v8.0.2
  375. 39.92 s [gammaloop-workspace-check] Checking futures-util v0.3.32
  376. 40.20 s [gammaloop-workspace-check] Checking bincode v1.3.3
  377. 40.27 s [gammaloop-workspace-check] Compiling gungraun-runner v0.18.2
  378. 40.49 s [gammaloop-workspace-check] Checking scc v2.4.0
  379. 40.99 s [gammaloop-workspace-check] Checking proc-macro2 v1.0.106
  380. 41.20 s [gammaloop-workspace-check] Checking nalgebra v0.29.0
  381. 41.66 s [gammaloop-workspace-check] Compiling gungraun-macros v0.8.0
  382. 42.32 s [gammaloop-workspace-check] Checking backtrace v0.3.76
  383. 43.29 s [gammaloop-workspace-check] Compiling numerica v2.2.0 (https://github.com/alphal00p/symbolica?rev=a277a8dadbaae5a8d6605f2f381991a601e1f345#a277a8da)
  384. 43.85 s [gammaloop-workspace-check] Checking color-eyre v0.6.5
  385. 44.70 s [gammaloop-workspace-check] Checking reedline v0.42.0
  386. 46.10 s [gammaloop-workspace-check] Checking quote v1.0.45
  387. 47.09 s [gammaloop-workspace-check] Checking maplit v1.0.2
  388. 47.22 s [gammaloop-workspace-check] Checking futures-executor v0.3.32
  389. 47.30 s [gammaloop-workspace-check] Checking base64 v0.21.7
  390. 47.88 s [gammaloop-workspace-check] Compiling iai-callgrind-runner v0.14.2
  391. 48.85 s [gammaloop-workspace-check] Compiling test-log-macros v0.2.20
  392. 48.97 s [gammaloop-workspace-check] Checking serial_test v3.4.0
  393. 48.99 s [gammaloop-workspace-check] Checking ron v0.8.1
  394. 49.06 s [gammaloop-workspace-check] Checking kurbo v0.13.0
  395. 49.15 s [gammaloop-workspace-check] Checking wait-timeout v0.2.1
  396. 49.37 s [gammaloop-workspace-check] Checking quick-error v1.2.3
  397. 49.46 s [gammaloop-workspace-check] Checking bit-vec v0.8.0
  398. 49.58 s [gammaloop-workspace-check] Compiling iai-callgrind v0.14.2
  399. 49.77 s [gammaloop-workspace-check] Checking bit-set v0.8.0
  400. 49.82 s [gammaloop-workspace-check] Checking rusty-fork v0.3.1
  401. 50.29 s [gammaloop-workspace-check] Checking syn v2.0.117
  402. 50.43 s [gammaloop-workspace-check] Compiling iai-callgrind-macros v0.5.1
  403. 53.73 s [gammaloop-workspace-check] Checking rand_xorshift v0.4.0
  404. 53.78 s [gammaloop-workspace-check] Checking console v0.15.11
  405. 54.01 s [gammaloop-workspace-check] Checking unarray v0.1.4
  406. 54.12 s [gammaloop-workspace-check] Checking pathdiff v0.2.3
  407. 54.26 s [gammaloop-workspace-check] Checking proptest v1.11.0
  408. 54.57 s [gammaloop-workspace-check] Checking clinnet v0.1.8 (/build/source/crates/clinnet)
  409. 55.56 s [gammaloop-workspace-check] Checking similar-asserts v1.7.0
  410. 56.44 s [gammaloop-workspace-check] Checking kurvst v0.1.0 (/build/source/crates/kurvst)
  411. 63.42 s [gammaloop-workspace-check] Checking test-log v0.2.20
  412. 64.30 s [gammaloop-workspace-check] Compiling graphica v2.1.0 (https://github.com/alphal00p/symbolica?rev=a277a8dadbaae5a8d6605f2f381991a601e1f345#a277a8da)
  413. 75.54 s [gammaloop-workspace-check] Checking gungraun v0.18.2
  414. 76.19 s [gammaloop-workspace-check] Checking statrs v0.16.1
  415. 79.76 s [gammaloop-workspace-check] Checking momtrop v0.3.0
  416. 88.21 s [gammaloop-workspace-check] Compiling pyo3-stub-gen-derive v0.17.2
  417. 88.72 s [gammaloop-workspace-check] Compiling pyo3-macros v0.28.3
  418. 108.85 s [gammaloop-workspace-check] Checking pyo3-stub-gen v0.17.2
  419. 117.73 s [gammaloop-workspace-check] Checking symbolica-utils v0.1.0 (/build/source/crates/symbolica-utils)
  420. 117.73 s [gammaloop-workspace-check] Checking spenso-macros v0.3.2 (/build/source/crates/spenso-macros)
  421. 346.27 s [gammaloop-workspace-check] Compiling gammaloop-workspace-hack v0.1.0 (/build/source/crates/gammaloop-workspace-hack)
  422. 346.82 s [gammaloop-workspace-check] Checking linnet v0.17.0 (/build/source/crates/linnet)
  423. 351.35 s [gammaloop-workspace-check] Checking spenso v0.6.0 (/build/source/crates/spenso)
  424. 351.70 s [gammaloop-workspace-check] Checking linnet-py v0.1.0 (/build/source/crates/linnet-py)
  425. 351.70 s [gammaloop-workspace-check] Checking linnest v0.1.0 (/build/source/crates/linnest)
  426. 359.64 s [gammaloop-workspace-check] Checking idenso v0.3.0 (/build/source/crates/idenso)
  427. 359.65 s [gammaloop-workspace-check] Checking gammaloop-tracing-filter v0.1.0 (/build/source/crates/gammaloop-tracing-filter)
  428. 362.70 s [gammaloop-workspace-check] Checking spenso-hep-lib v0.1.7 (/build/source/crates/spenso-hep-lib)
  429. 363.11 s [gammaloop-workspace-check] Checking spynso3 v0.1.2 (/build/source/crates/spynso3)
  430. 399.38 s [gammaloop-workspace-check] error[E0609]: no field `lmb_channel_id` on type `CutInfo`
  431. 399.38 s [gammaloop-workspace-check] --> tests/tests/test_runs/utils.rs:568:36
  432. 399.38 s [gammaloop-workspace-check] |
  433. 399.38 s [gammaloop-workspace-check] 568 | event.cut_info.lmb_channel_id,
  434. 399.38 s [gammaloop-workspace-check] | ^^^^^^^^^^^^^^ unknown field
  435. 399.38 s [gammaloop-workspace-check] |
  436. 399.38 s [gammaloop-workspace-check] = note: available fields are: `particle_pdgs`, `cut_id`, `graph_id`, `graph_group_id`, `orientation_id` ... and 2 others
  437. 399.38 s [gammaloop-workspace-check]
  438. 399.38 s [gammaloop-workspace-check] error[E0609]: no field `lmb_channel_id` on type `CutInfo`
  439. 399.38 s [gammaloop-workspace-check] --> tests/tests/test_runs/utils.rs:580:36
  440. 399.38 s [gammaloop-workspace-check] |
  441. 399.38 s [gammaloop-workspace-check] 580 | event.cut_info.lmb_channel_id,
  442. 399.38 s [gammaloop-workspace-check] | ^^^^^^^^^^^^^^ unknown field
  443. 399.38 s [gammaloop-workspace-check] |
  444. 399.38 s [gammaloop-workspace-check] = note: available fields are: `particle_pdgs`, `cut_id`, `graph_id`, `graph_group_id`, `orientation_id` ... and 2 others
  445. 399.38 s [gammaloop-workspace-check]
  446. 399.86 s [gammaloop-workspace-check] For more information about this error, try `rustc --explain E0609`.
  447. 399.88 s [gammaloop-workspace-check] error: could not compile `gammaloop-integration-tests` (test "test_runs") due to 2 previous errors
  448. 400.41 s Progress: 0 of 1 built (1 failed)
  449. 400.41 s Failed to build gammaloop-workspace-check after 6m36s
  450. 400.42 s Cannot build '/nix/store/678qn1yyh3j4046ys9sarqm9q60571r7-gammaloop-workspace-check-0.1.0.drv'.
  451. 400.42 s Reason: builder failed with exit code 101.
  452. 400.42 s Output paths:
  453. 400.42 s /nix/store/164617w7wk11sv41wc87zhpky9g3qq80-gammaloop-workspace-check-0.1.0
  454. 400.42 s Last 443 log lines:
  455. 400.42 s > Running phase: unpackPhase
  456. 400.42 s > unpacking source archive /nix/store/3jj3smp74rs9m6ykxsf11s7cz9qgyqb0-source
  457. 400.42 s > source root is source
  458. 400.42 s > Running phase: patchPhase
  459. 400.42 s > Executing configureCargoCommonVars
  460. 400.42 s > decompressing cargo artifacts from /nix/store/50vpxlcgfxf2d57i27v3d10zjwxxbm2r-gammaloop-workspace-deps-deps-0.1.0/target.tar.zst to target
  461. 400.42 s > Running phase: updateAutotoolsGnuConfigScriptsPhase
  462. 400.42 s > Running phase: configurePhase
  463. 400.42 s > will append /build/source/.cargo-home/config.toml with contents of /nix/store/5drf77x6km4ky7gwlrzdx9bbd6fz09g3-vendor-cargo-deps/config.toml
  464. 400.42 s > default configurePhase, nothing to do
  465. 400.42 s > Running phase: buildPhase
  466. 400.42 s > +++ command cargo --version
  467. 400.42 s > cargo 1.97.0 (c980f4866 2026-06-30)
  468. 400.42 s > +++ command cargo check --profile ci-optim --locked --workspace --features gammaloop-tracing-filter/clap,gammaloop-tracing-filter/symbolica,idenso/bincode,idenso/reference-cases,linnet/bincode,linnet/drawing,linnet/rkyv,linnet/serde,linnet/symbolica,spenso-macros/shadowing,spenso/shadowing,symbolica/tracing_max_level_info,three-dimensional-reps/display,three-dimensional-reps/eval,three-dimensional-reps/serde --all-targets
  469. 400.42 s > Checking cfg-if v1.0.4
  470. 400.42 s > Checking memchr v2.8.0
  471. 400.42 s > Checking once_cell v1.21.4
  472. 400.42 s > Checking either v1.15.0
  473. 400.42 s > Checking itoa v1.0.18
  474. 400.42 s > Checking serde_core v1.0.228
  475. 400.42 s > Checking libc v0.2.186
  476. 400.42 s > Checking libm v0.2.16
  477. 400.42 s > Checking log v0.4.29
  478. 400.42 s > Checking regex-syntax v0.8.10
  479. 400.42 s > Checking zerocopy v0.8.48
  480. 400.42 s > Checking crossbeam-utils v0.8.21
  481. 400.42 s > Checking equivalent v1.0.2
  482. 400.42 s > Checking zmij v1.0.21
  483. 400.42 s > Checking lazy_static v1.5.0
  484. 400.42 s > Checking bytemuck v1.25.0
  485. 400.42 s > Compiling target-lexicon v0.13.5
  486. 400.42 s > Checking arrayvec v0.7.6
  487. 400.42 s > Checking powerfmt v0.2.0
  488. 400.42 s > Checking itertools v0.14.0
  489. 400.42 s > Checking aho-corasick v1.1.4
  490. 400.42 s > Checking crossbeam-epoch v0.9.18
  491. 400.42 s > Checking safe_arch v0.7.4
  492. 400.42 s > Checking deranged v0.5.8
  493. 400.42 s > Checking num-conv v0.2.1
  494. 400.42 s > Checking num_threads v0.1.7
  495. 400.42 s > Checking pin-project-lite v0.2.17
  496. 400.42 s > Checking time-core v0.1.8
  497. 400.42 s > Checking tracing-core v0.1.36
  498. 400.42 s > Checking allocator-api2 v0.2.21
  499. 400.42 s > Checking foldhash v0.2.0
  500. 400.42 s > Checking const-random v0.1.18
  501. 400.42 s > Checking crossbeam-deque v0.8.6
  502. 400.42 s > Checking unty v0.0.4
  503. 400.42 s > Checking nu-ansi-term v0.50.3
  504. 400.42 s > Checking static_assertions v1.1.0
  505. 400.42 s > Checking winnow v1.0.2
  506. 400.42 s > Checking safe_arch v1.0.0
  507. 400.42 s > Checking wide v0.7.33
  508. 400.42 s > Checking sharded-slab v0.1.7
  509. 400.42 s > Checking tracing-log v0.2.0
  510. 400.42 s > Checking hashbrown v0.16.1
  511. 400.42 s > Checking rayon-core v1.13.0
  512. 400.42 s > Checking tracing v0.1.44
  513. 400.42 s > Checking num-traits v0.2.19
  514. 400.42 s > Checking thread_local v1.1.9
  515. 400.42 s > Checking toml_writer v1.1.1+spec-1.1.0
  516. 400.42 s > Checking az v1.3.0
  517. 400.42 s > Checking indenter v0.3.4
  518. 400.42 s > Checking rayon v1.12.0
  519. 400.42 s > Checking wide v1.3.0
  520. 400.42 s > Compiling phf_shared v0.11.3
  521. 400.42 s > Checking anyhow v1.0.102
  522. 400.42 s > Checking regex-automata v0.4.14
  523. 400.42 s > Checking serde v1.0.228
  524. 400.42 s > Checking serde_json v1.0.149
  525. 400.42 s > Checking getrandom v0.3.4
  526. 400.42 s > Checking approx v0.5.1
  527. 400.42 s > Checking bitflags v2.11.1
  528. 400.42 s > Checking time v0.3.47
  529. 400.42 s > Checking num-integer v0.1.46
  530. 400.42 s > Checking serde_spanned v1.1.1
  531. 400.42 s > Checking toml_parser v1.1.2+spec-1.1.0
  532. 400.42 s > Checking gmp-mpfr-sys v1.7.1
  533. 400.42 s > Checking dyn-clone v1.0.20
  534. 400.42 s > Checking rand_core v0.9.5
  535. 400.42 s > Checking rawpointer v0.2.1
  536. 400.42 s > Checking alloc-no-stdlib v2.0.4
  537. 400.42 s > Checking utf8parse v0.2.2
  538. 400.42 s > Checking toml_datetime v1.1.1+spec-1.1.0
  539. 400.42 s > Checking matrixmultiply v0.3.10
  540. 400.42 s > Checking alloc-stdlib v0.2.2
  541. 400.42 s > Checking anstyle-parse v1.0.0
  542. 400.42 s > Checking colored v3.1.1
  543. 400.42 s > Checking colorchoice v1.0.5
  544. 400.42 s > Checking anstyle v1.0.14
  545. 400.42 s > Checking is_terminal_polyfill v1.70.2
  546. 400.42 s > Checking anstyle-query v1.1.5
  547. 400.42 s > Compiling phf_generator v0.11.3
  548. 400.42 s > Checking eyre v0.6.12
  549. 400.42 s > Checking unicode-width v0.2.2
  550. 400.42 s > Checking anstream v1.0.0
  551. 400.42 s > Checking bitflags v1.3.2
  552. 400.42 s > Checking toml v1.1.2+spec-1.1.0
  553. 400.42 s > Compiling phf_codegen v0.11.3
  554. 400.42 s > Checking region v3.0.2
  555. 400.42 s > Checking brotli-decompressor v5.0.0
  556. 400.42 s > Checking wasmtime-jit-icache-coherence v34.0.2
  557. 400.42 s > Checking hugepage-rs v0.1.1
  558. 400.42 s > Checking inventory v0.3.24
  559. 400.42 s > Checking spec_math v0.1.6
  560. 400.42 s > Checking thiserror v2.0.18
  561. 400.42 s > Compiling getopts v0.2.24
  562. 400.42 s > Checking libloading v0.9.0
  563. 400.42 s > Checking self_cell v1.2.2
  564. 400.42 s > Checking append-only-vec v0.1.8
  565. 400.42 s > Checking tinyjson v2.5.1
  566. 400.42 s > Checking bytes v1.11.1
  567. 400.42 s > Checking byteorder v1.5.0
  568. 400.42 s > Checking smallvec v1.15.1
  569. 400.42 s > Checking num-complex v0.4.6
  570. 400.42 s > Checking tracing-serde v0.2.0
  571. 400.42 s > Checking bincode v2.0.1
  572. 400.42 s > Checking smartstring v1.0.1
  573. 400.42 s > Compiling unic-common v0.9.0
  574. 400.42 s > Compiling pyo3-build-config v0.28.3
  575. 400.42 s > Compiling unicode_names2_generator v1.3.0
  576. 400.42 s > Compiling unic-char-range v0.9.0
  577. 400.42 s > Checking linux-raw-sys v0.12.1
  578. 400.42 s > Compiling unic-char-property v0.9.0
  579. 400.42 s > Checking simba v0.9.1
  580. 400.42 s > Compiling unic-ucd-version v0.9.0
  581. 400.42 s > Compiling is-macro v0.3.7
  582. 400.42 s > Compiling rustpython-parser-vendored v0.4.0
  583. 400.42 s > Checking iana-time-zone v0.1.65
  584. 400.42 s > Compiling rustpython-parser v0.4.0
  585. 400.42 s > Checking chrono v0.4.44
  586. 400.42 s > Compiling phf v0.11.3
  587. 400.42 s > Checking rustix v1.1.4
  588. 400.42 s > Checking brotli v8.0.2
  589. 400.42 s > Checking rustc-hash v2.1.2
  590. 400.42 s > Compiling unic-ucd-ident v0.9.0
  591. 400.42 s > Compiling unic-emoji-char v0.9.0
  592. 400.42 s > Checking ndarray v0.17.2
  593. 400.42 s > Compiling rustc-hash v1.1.0
  594. 400.42 s > Compiling lalrpop-util v0.20.2
  595. 400.42 s > Checking rug v1.30.0
  596. 400.42 s > Checking unicode-segmentation v1.13.2
  597. 400.42 s > Compiling symbolica v2.2.0 (https://github.com/alphal00p/symbolica?rev=a277a8dadbaae5a8d6605f2f381991a601e1f345#a277a8da)
  598. 400.42 s > Checking typenum v1.20.0
  599. 400.42 s > Checking getrandom v0.2.17
  600. 400.42 s > Checking scopeguard v1.2.0
  601. 400.42 s > Checking parking_lot_core v0.9.12
  602. 400.42 s > Checking lock_api v0.4.14
  603. 400.42 s > Checking unicode-ident v1.0.24
  604. 400.42 s > Checking matchers v0.2.0
  605. 400.42 s > Checking tracing-subscriber v0.3.23
  606. 400.42 s > Checking regex v1.12.3
  607. 400.42 s > Checking hashbrown v0.17.0
  608. 400.42 s > Checking parking_lot v0.12.5
  609. 400.42 s > Checking errno v0.3.14
  610. 400.42 s > Checking strsim v0.11.1
  611. 400.42 s > Checking unicase v2.9.0
  612. 400.42 s > Checking ppv-lite86 v0.2.21
  613. 400.42 s > Checking ahash v0.8.12
  614. 400.42 s > Checking clap_lex v1.1.0
  615. 400.42 s > Checking signal-hook-registry v1.4.8
  616. 400.42 s > Checking vte v0.14.1
  617. 400.42 s > Checking same-file v1.0.6
  618. 400.42 s > Checking half v2.7.1
  619. 400.42 s > Checking indexmap v2.14.0
  620. 400.42 s > Checking signal-hook v0.3.18
  621. 400.42 s > Checking walkdir v2.5.0
  622. 400.42 s > Checking generic-array v0.14.7
  623. 400.42 s > Checking mio v1.2.0
  624. 400.42 s > Checking minimal-lexical v0.2.1
  625. 400.42 s > Checking rand_chacha v0.9.0
  626. 400.42 s > Checking ciborium-io v0.2.2
  627. 400.42 s > Checking nom v7.1.3
  628. 400.42 s > Checking ciborium-ll v0.2.2
  629. 400.42 s > Checking rand v0.9.4
  630. 400.42 s > Checking derive_more v2.1.1
  631. 400.42 s > Checking num-bigint v0.4.6
  632. 400.42 s > Checking signal-hook-mio v0.2.5
  633. 400.42 s > Checking block-buffer v0.10.4
  634. 400.42 s > Checking crypto-common v0.1.7
  635. 400.42 s > Checking console v0.16.3
  636. 400.42 s > Checking bstr v1.12.1
  637. 400.42 s > Checking digest v0.10.7
  638. 400.42 s > Checking cpufeatures v0.2.17
  639. 400.42 s > Checking symjit v2.21.0
  640. 400.42 s > Checking winnow v0.7.15
  641. 400.42 s > Checking linux-raw-sys v0.4.15
  642. 400.42 s > Checking terminal_size v0.4.4
  643. 400.42 s > Checking clap_builder v4.6.0
  644. 400.42 s > Checking sha2 v0.10.9
  645. 400.42 s > Checking ciborium v0.2.2
  646. 400.42 s > Checking rustix v0.38.44
  647. 400.42 s > Checking getrandom v0.4.2
  648. 400.42 s > Checking globset v0.4.18
  649. 400.42 s > Checking rand_core v0.6.4
  650. 400.42 s > Checking fastrand v2.4.1
  651. 400.42 s > Checking plotters-backend v0.3.7
  652. 400.42 s > Checking fnv v1.0.7
  653. 400.42 s > Checking tempfile v3.27.0
  654. 400.42 s > Checking serde_spanned v0.6.9
  655. 400.42 s > Compiling unicode_names2 v1.3.0
  656. 400.42 s > Checking ansitok v0.3.0
  657. 400.42 s > Checking plotters-svg v0.3.7
  658. 400.42 s > Checking toml_datetime v0.6.11
  659. 400.42 s > Checking xprec v0.2.2
  660. 400.42 s > Checking itertools v0.10.5
  661. 400.42 s > Checking cast v0.3.0
  662. 400.42 s > Checking toml_write v0.1.2
  663. 400.42 s > Checking rust-embed-utils v8.11.0
  664. 400.42 s > Checking tap v1.0.1
  665. 400.42 s > Checking crossterm v0.28.1
  666. 400.42 s > Checking plotters v0.3.7
  667. 400.42 s > Checking wyz v0.5.1
  668. 400.42 s > Checking rand_chacha v0.3.1
  669. 400.42 s > Checking radium v0.7.0
  670. 400.42 s > Checking typeid v1.0.3
  671. 400.42 s > Checking similar v2.7.0
  672. 400.42 s > Checking tinytemplate v1.2.1
  673. 400.42 s > Checking is-terminal v0.4.17
  674. 400.42 s > Checking anes v0.1.6
  675. 400.42 s > Checking oorandom v11.1.5
  676. 400.42 s > Checking funty v2.0.0
  677. 400.42 s > Checking ansi-str v0.9.0
  678. 400.42 s > Checking bytecount v0.6.9
  679. 400.42 s > Checking testing_table v0.3.0
  680. 400.42 s > Checking rand v0.8.6
  681. 400.42 s > Checking ron v0.12.1
  682. 400.42 s > Checking toml_edit v0.25.11+spec-1.1.0
  683. 400.42 s > Checking clap v4.6.1
  684. 400.42 s > Checking uncased v0.9.10
  685. 400.42 s > Checking criterion-plot v0.5.0
  686. 400.42 s > Checking papergrid v0.17.0
  687. 400.42 s > Checking env_filter v1.0.1
  688. 400.42 s > Checking jiff v0.2.24
  689. 400.42 s > Checking bitvec v1.0.1
  690. 400.42 s > Checking ptr_meta v0.1.4
  691. 400.42 s > Checking ucd-trie v0.1.7
  692. 400.42 s > Checking simdutf8 v0.1.5
  693. 400.42 s > Checking criterion v0.5.1
  694. 400.42 s > Checking pest v2.8.6
  695. 400.42 s > Checking ahash v0.7.8
  696. 400.42 s > Checking bytecheck v0.6.12
  697. 400.42 s > Checking toml_edit v0.22.27
  698. 400.42 s > Checking hashbrown v0.12.3
  699. 400.42 s > Checking tabled v0.20.0
  700. 400.42 s > Checking approx v0.4.0
  701. 400.42 s > Checking seahash v4.1.0
  702. 400.42 s > Checking rend v0.4.2
  703. 400.42 s > Checking cgmath v0.18.0
  704. 400.42 s > Checking num-rational v0.4.2
  705. 400.42 s > Checking insta v1.47.2
  706. 400.42 s > Checking num-iter v0.1.45
  707. 400.42 s > Checking ref-ops v0.2.5
  708. 400.42 s > Checking rand_xoshiro v0.6.0
  709. 400.42 s > Checking features v0.10.0
  710. 400.42 s > Checking constcat v0.5.1
  711. 400.42 s > Checking gat-lending-iterator v0.1.8
  712. 400.42 s > Checking colored v2.2.0
  713. 400.42 s > Checking num v0.4.3
  714. 400.42 s > Checking constant_time_eq v0.4.2
  715. 400.42 s > Checking cpufeatures v0.3.0
  716. 400.42 s > Checking arrayref v0.3.9
  717. 400.42 s > Checking base64 v0.22.1
  718. 400.42 s > Checking joinery v2.1.0
  719. 400.42 s > Checking dot-parser v0.5.1
  720. 400.42 s > Checking siphasher v1.0.2
  721. 400.42 s > Checking blake3 v1.8.5
  722. 400.42 s > Checking phf_shared v0.13.1
  723. 400.42 s > Checking titlecase v2.2.1
  724. 400.42 s > Checking subprocess v0.2.15
  725. 400.42 s > Checking rust_lisp v0.18.0
  726. 400.42 s > Compiling vakint v0.1.2 (/build/source/crates/vakint)
  727. 400.42 s > Checking phf v0.13.1
  728. 400.42 s > Checking version-compare v0.2.1
  729. 400.42 s > Checking xpct v0.5.1
  730. 400.42 s > Checking ryu v1.0.23
  731. 400.42 s > Checking castaway v0.2.4
  732. 400.42 s > Checking toml_datetime v0.7.5+spec-1.1.0
  733. 400.42 s > Checking strum v0.27.2
  734. 400.42 s > Checking unicode-truncate v2.0.1
  735. 400.42 s > Checking compact_str v0.9.0
  736. 400.42 s > Checking kasuari v0.4.12
  737. 400.42 s > Checking toml v0.9.12+spec-1.1.0
  738. 400.42 s > Checking lru v0.16.4
  739. 400.42 s > Checking vte v0.15.0
  740. 400.42 s > Checking toml v0.8.23
  741. 400.42 s > Checking portable-atomic v1.13.1
  742. 400.42 s > Checking unit-prefix v0.5.2
  743. 400.42 s > Checking ratatui-core v0.1.0
  744. 400.42 s > Checking vt100 v0.16.2
  745. 400.42 s > Checking rand_distr v0.4.3
  746. 400.42 s > Checking string-template-plus v0.4.3
  747. 400.42 s > Compiling pyo3-ffi v0.28.3
  748. 400.42 s > Compiling pyo3-macros-backend v0.28.3
  749. 400.42 s > Compiling pyo3 v0.28.3
  750. 400.42 s > Compiling numpy v0.28.0
  751. 400.42 s > Checking figment v0.10.19
  752. 400.42 s > Checking simba v0.6.0
  753. 400.42 s > Checking indicatif v0.18.4
  754. 400.42 s > Checking line-clipping v0.3.7
  755. 400.42 s > Checking gimli v0.32.3
  756. 400.42 s > Checking adler2 v2.0.1
  757. 400.42 s > Compiling three-dimensional-reps v0.1.0 (/build/source/crates/three-dimensional-reps)
  758. 400.42 s > Checking thiserror v1.0.69
  759. 400.42 s > Checking derive_builder v0.11.2
  760. 400.42 s > Checking miniz_oxide v0.8.9
  761. 400.42 s > Checking object v0.37.3
  762. 400.42 s > Checking crossterm v0.29.0
  763. 400.42 s > Checking owo-colors v4.3.0
  764. 400.42 s > Checking tracing-error v0.2.1
  765. 400.42 s > Compiling rustpython-parser-core v0.4.0
  766. 400.42 s > Checking typed-index-collections v3.5.0
  767. 400.42 s > Checking ratatui-widgets v0.3.0
  768. 400.42 s > Checking serde-big-array v0.5.1
  769. 400.42 s > Checking amd v0.2.2
  770. 400.42 s > Compiling rustpython-ast v0.4.0
  771. 400.42 s > Checking rkyv v0.7.46
  772. 400.42 s > Checking itertools v0.11.0
  773. 400.42 s > Compiling gammaloop-tracing-filter-macros v0.1.0 (/build/source/crates/gammaloop-tracing-filter-macros)
  774. 400.42 s > Checking option-ext v0.2.0
  775. 400.42 s > Checking rustc-demangle v0.1.27
  776. 400.42 s > Checking dirs-sys v0.5.0
  777. 400.42 s > Checking ref-cast v1.0.25
  778. 400.42 s > Checking nix v0.31.2
  779. 400.42 s > Checking brotli-decompressor v4.0.3
  780. 400.42 s > Checking integer-sqrt v0.1.5
  781. 400.42 s > Checking crossbeam-channel v0.5.15
  782. 400.42 s > Checking env_logger v0.11.10
  783. 400.42 s > Checking ratatui-crossterm v0.1.0
  784. 400.42 s > Checking clarabel v0.11.1
  785. 400.42 s > Checking itertools v0.12.1
  786. 400.42 s > Checking symlink v0.1.0
  787. 400.42 s > Compiling gammalooprs v0.3.4 (/build/source/crates/gammalooprs)
  788. 400.42 s > Checking unsafe-libyaml v0.2.11
  789. 400.42 s > Checking ratatui-macros v0.7.0
  790. 400.42 s > Checking ratatui v0.30.0
  791. 400.42 s > Checking tracing-appender v0.2.5
  792. 400.42 s > Checking include_dir v0.7.4
  793. 400.42 s > Checking color-spantrace v0.3.0
  794. 400.42 s > Checking tracing-indicatif v0.3.14
  795. 400.42 s > Checking pathfinding v4.15.0
  796. 400.42 s > Checking schemars v1.2.1
  797. 400.42 s > Checking slotmap v1.1.1
  798. 400.42 s > Checking serde_yaml v0.9.34+deprecated
  799. 400.42 s > Checking dirs v6.0.0
  800. 400.42 s > Checking json5 v0.4.1
  801. 400.42 s > Checking brotli v7.0.0
  802. 400.42 s > Checking ctrlc v3.5.2
  803. 400.42 s > Checking vectorize v0.2.0
  804. 400.42 s > Checking addr2line v0.25.1
  805. 400.42 s > Checking ringbuffer v0.16.0
  806. 400.42 s > Checking base62 v2.2.4
  807. 400.42 s > Checking rust-embed v8.11.0
  808. 400.42 s > Checking clap_complete v4.6.3
  809. 400.42 s > Checking fd-lock v4.0.4
  810. 400.42 s > Checking strip-ansi-escapes v0.2.1
  811. 400.42 s > Compiling gammaloop-api v0.1.0 (/build/source/crates/gammaloop-api)
  812. 400.42 s > Checking itertools v0.13.0
  813. 400.42 s > Checking strum v0.26.3
  814. 400.42 s > Checking sysinfo v0.33.1
  815. 400.42 s > Checking shlex v1.3.0
  816. 400.42 s > Checking futures-core v0.3.32
  817. 400.42 s > Checking futures-task v0.3.32
  818. 400.42 s > Checking slab v0.4.12
  819. 400.42 s > Checking clap_complete_nushell v4.6.0
  820. 400.42 s > Checking sdd v3.0.10
  821. 400.42 s > Compiling gammaloop-integration-tests v0.1.0 (/build/source/tests)
  822. 400.42 s > Compiling test-log-core v0.2.20
  823. 400.42 s > Compiling rustc_version v0.4.1
  824. 400.42 s > Checking which v8.0.2
  825. 400.42 s > Checking futures-util v0.3.32
  826. 400.42 s > Checking bincode v1.3.3
  827. 400.42 s > Compiling gungraun-runner v0.18.2
  828. 400.42 s > Checking scc v2.4.0
  829. 400.42 s > Checking proc-macro2 v1.0.106
  830. 400.42 s > Checking nalgebra v0.29.0
  831. 400.42 s > Compiling gungraun-macros v0.8.0
  832. 400.42 s > Checking backtrace v0.3.76
  833. 400.42 s > Compiling numerica v2.2.0 (https://github.com/alphal00p/symbolica?rev=a277a8dadbaae5a8d6605f2f381991a601e1f345#a277a8da)
  834. 400.42 s > Checking color-eyre v0.6.5
  835. 400.42 s > Checking reedline v0.42.0
  836. 400.42 s > Checking quote v1.0.45
  837. 400.42 s > Checking maplit v1.0.2
  838. 400.42 s > Checking futures-executor v0.3.32
  839. 400.42 s > Checking base64 v0.21.7
  840. 400.42 s > Compiling iai-callgrind-runner v0.14.2
  841. 400.42 s > Compiling test-log-macros v0.2.20
  842. 400.42 s > Checking serial_test v3.4.0
  843. 400.42 s > Checking ron v0.8.1
  844. 400.42 s > Checking kurbo v0.13.0
  845. 400.42 s > Checking wait-timeout v0.2.1
  846. 400.42 s > Checking quick-error v1.2.3
  847. 400.42 s > Checking bit-vec v0.8.0
  848. 400.42 s > Compiling iai-callgrind v0.14.2
  849. 400.42 s > Checking bit-set v0.8.0
  850. 400.42 s > Checking rusty-fork v0.3.1
  851. 400.42 s > Checking syn v2.0.117
  852. 400.42 s > Compiling iai-callgrind-macros v0.5.1
  853. 400.42 s > Checking rand_xorshift v0.4.0
  854. 400.42 s > Checking console v0.15.11
  855. 400.42 s > Checking unarray v0.1.4
  856. 400.42 s > Checking pathdiff v0.2.3
  857. 400.42 s > Checking proptest v1.11.0
  858. 400.42 s > Checking clinnet v0.1.8 (/build/source/crates/clinnet)
  859. 400.42 s > Checking similar-asserts v1.7.0
  860. 400.42 s > Checking kurvst v0.1.0 (/build/source/crates/kurvst)
  861. 400.42 s > Checking test-log v0.2.20
  862. 400.42 s > Compiling graphica v2.1.0 (https://github.com/alphal00p/symbolica?rev=a277a8dadbaae5a8d6605f2f381991a601e1f345#a277a8da)
  863. 400.42 s > Checking gungraun v0.18.2
  864. 400.42 s > Checking statrs v0.16.1
  865. 400.42 s > Checking momtrop v0.3.0
  866. 400.42 s > Compiling pyo3-stub-gen-derive v0.17.2
  867. 400.42 s > Compiling pyo3-macros v0.28.3
  868. 400.42 s > Checking pyo3-stub-gen v0.17.2
  869. 400.42 s > Checking symbolica-utils v0.1.0 (/build/source/crates/symbolica-utils)
  870. 400.42 s > Checking spenso-macros v0.3.2 (/build/source/crates/spenso-macros)
  871. 400.42 s > Compiling gammaloop-workspace-hack v0.1.0 (/build/source/crates/gammaloop-workspace-hack)
  872. 400.42 s > Checking linnet v0.17.0 (/build/source/crates/linnet)
  873. 400.42 s > Checking spenso v0.6.0 (/build/source/crates/spenso)
  874. 400.42 s > Checking linnet-py v0.1.0 (/build/source/crates/linnet-py)
  875. 400.42 s > Checking linnest v0.1.0 (/build/source/crates/linnest)
  876. 400.42 s > Checking idenso v0.3.0 (/build/source/crates/idenso)
  877. 400.42 s > Checking gammaloop-tracing-filter v0.1.0 (/build/source/crates/gammaloop-tracing-filter)
  878. 400.42 s > Checking spenso-hep-lib v0.1.7 (/build/source/crates/spenso-hep-lib)
  879. 400.42 s > Checking spynso3 v0.1.2 (/build/source/crates/spynso3)
  880. 400.42 s > error[E0609]: no field `lmb_channel_id` on type `CutInfo`
  881. 400.42 s > --> tests/tests/test_runs/utils.rs:568:36
  882. 400.42 s > |
  883. 400.42 s > 568 | event.cut_info.lmb_channel_id,
  884. 400.42 s > | ^^^^^^^^^^^^^^ unknown field
  885. 400.42 s > |
  886. 400.42 s > = note: available fields are: `particle_pdgs`, `cut_id`, `graph_id`, `graph_group_id`, `orientation_id` ... and 2 others
  887. 400.42 s >
  888. 400.42 s > error[E0609]: no field `lmb_channel_id` on type `CutInfo`
  889. 400.42 s > --> tests/tests/test_runs/utils.rs:580:36
  890. 400.42 s > |
  891. 400.42 s > 580 | event.cut_info.lmb_channel_id,
  892. 400.42 s > | ^^^^^^^^^^^^^^ unknown field
  893. 400.42 s > |
  894. 400.42 s > = note: available fields are: `particle_pdgs`, `cut_id`, `graph_id`, `graph_group_id`, `orientation_id` ... and 2 others
  895. 400.42 s >
  896. 400.42 s > For more information about this error, try `rustc --explain E0609`.
  897. 400.42 s > error: could not compile `gammaloop-integration-tests` (test "test_runs") due to 2 previous errors
  898. 400.42 s For full logs, run:
  899. 400.42 s nix log /nix/store/678qn1yyh3j4046ys9sarqm9q60571r7-gammaloop-workspace-check-0.1.0.drv
  900. 400.45 s Build failed.