0.00 s
$ /nix/store/9ypz3flqsrl5xl495mm8h645gadjsxi1-coreutils-9.11/bin/timeout --kill-after=15s 7200s /nix/store/23zk8sgzamrbmj1fday15szf7f2279s8-nix-2.34.7/bin/nix --extra-experimental-features nix-command --extra-experimental-features flakes --log-format internal-json build --no-link --print-out-paths git+https://github.com/alphal00p/gammaloop?ref=advanced_sampling&rev=e9031dcd251401a6700423d61fd2a0a090245bcf&shallow=1#checks.x86_64-linux.gammaloop-check --print-build-logs
0.19 s
error (ignored): SQLite database '/var/cache/nix-ci-worker/eval-cache-v6/b20626d1bc1175f729e8a70cc2eb83402c8ea1609789f5e1588870fa9fba19ec.sqlite ' is busy
3.09 s
3.56 s
Building /nix/store/678qn1yyh3j4046ys9sarqm9q60571r7-gammaloop-workspace-check-0.1.0.drv
3.65 s
[gammaloop-workspace-check] Phase: unpackPhase
3.65 s
[gammaloop-workspace-check] unpacking source archive /nix/store/3jj3smp74rs9m6ykxsf11s7cz9qgyqb0-source
3.81 s
[gammaloop-workspace-check] source root is source
3.86 s
[gammaloop-workspace-check] Phase: patchPhase
3.86 s
[gammaloop-workspace-check] Executing configureCargoCommonVars
3.87 s
[gammaloop-workspace-check] decompressing cargo artifacts from /nix/store/50vpxlcgfxf2d57i27v3d10zjwxxbm2r-gammaloop-workspace-deps-deps-0.1.0/target.tar.zst to target
5.89 s
[gammaloop-workspace-check] Phase: updateAutotoolsGnuConfigScriptsPhase
5.93 s
[gammaloop-workspace-check] Phase: configurePhase
5.94 s
[gammaloop-workspace-check] will append /build/source/.cargo-home/config.toml with contents of /nix/store/5drf77x6km4ky7gwlrzdx9bbd6fz09g3-vendor-cargo-deps/config.toml
5.95 s
[gammaloop-workspace-check] default configurePhase, nothing to do
5.95 s
[gammaloop-workspace-check] Phase: buildPhase
5.96 s
[gammaloop-workspace-check] +++ command cargo --version
5.96 s
[gammaloop-workspace-check] cargo 1.97.0 (c980f4866 2026-06-30)
6.00 s
[gammaloop-workspace-check] +++ command cargo check --profile ci-optim --locked --workspace --features gammaloop-tracing-filter/clap,gammaloop-tracing-filter/symbolica,idenso/bincode,idenso/reference-cases,linnet/bincode,linnet/drawing,linnet/rkyv,linnet/serde,linnet/symbolica,spenso-macros/shadowing,spenso/shadowing,symbolica/tracing_max_level_info,three-dimensional-reps/display,three-dimensional-reps/eval,three-dimensional-reps/serde --all-targets
7.00 s
[gammaloop-workspace-check] Checking cfg-if v1.0.4
7.00 s
[gammaloop-workspace-check] Checking memchr v2.8.0
7.00 s
[gammaloop-workspace-check] Checking once_cell v1.21.4
7.00 s
[gammaloop-workspace-check] Checking either v1.15.0
7.00 s
[gammaloop-workspace-check] Checking itoa v1.0.18
7.01 s
[gammaloop-workspace-check] Checking serde_core v1.0.228
7.01 s
[gammaloop-workspace-check] Checking libc v0.2.186
7.01 s
[gammaloop-workspace-check] Checking libm v0.2.16
7.01 s
[gammaloop-workspace-check] Checking log v0.4.29
7.01 s
[gammaloop-workspace-check] Checking regex-syntax v0.8.10
7.02 s
[gammaloop-workspace-check] Checking zerocopy v0.8.48
7.03 s
[gammaloop-workspace-check] Checking crossbeam-utils v0.8.21
7.03 s
[gammaloop-workspace-check] Checking equivalent v1.0.2
7.06 s
[gammaloop-workspace-check] Checking zmij v1.0.21
7.06 s
[gammaloop-workspace-check] Checking lazy_static v1.5.0
7.06 s
[gammaloop-workspace-check] Checking bytemuck v1.25.0
7.10 s
[gammaloop-workspace-check] Compiling target-lexicon v0.13.5
7.11 s
[gammaloop-workspace-check] Checking arrayvec v0.7.6
7.14 s
[gammaloop-workspace-check] Checking powerfmt v0.2.0
7.23 s
[gammaloop-workspace-check] Checking itertools v0.14.0
7.62 s
[gammaloop-workspace-check] Checking aho-corasick v1.1.4
7.62 s
[gammaloop-workspace-check] Checking crossbeam-epoch v0.9.18
7.62 s
[gammaloop-workspace-check] Checking safe_arch v0.7.4
7.62 s
[gammaloop-workspace-check] Checking deranged v0.5.8
7.62 s
[gammaloop-workspace-check] Checking num-conv v0.2.1
7.62 s
[gammaloop-workspace-check] Checking num_threads v0.1.7
7.62 s
[gammaloop-workspace-check] Checking pin-project-lite v0.2.17
7.62 s
[gammaloop-workspace-check] Checking time-core v0.1.8
7.62 s
[gammaloop-workspace-check] Checking tracing-core v0.1.36
7.80 s
[gammaloop-workspace-check] Checking allocator-api2 v0.2.21
7.84 s
[gammaloop-workspace-check] Checking foldhash v0.2.0
7.88 s
[gammaloop-workspace-check] Checking const-random v0.1.18
7.90 s
[gammaloop-workspace-check] Checking crossbeam-deque v0.8.6
7.90 s
[gammaloop-workspace-check] Checking unty v0.0.4
7.93 s
[gammaloop-workspace-check] Checking nu-ansi-term v0.50.3
7.96 s
[gammaloop-workspace-check] Checking static_assertions v1.1.0
7.98 s
[gammaloop-workspace-check] Checking winnow v1.0.2
8.01 s
[gammaloop-workspace-check] Checking safe_arch v1.0.0
8.16 s
[gammaloop-workspace-check] Checking wide v0.7.33
8.18 s
[gammaloop-workspace-check] Checking sharded-slab v0.1.7
8.26 s
[gammaloop-workspace-check] Checking tracing-log v0.2.0
8.28 s
[gammaloop-workspace-check] Checking hashbrown v0.16.1
8.32 s
[gammaloop-workspace-check] Checking rayon-core v1.13.0
8.35 s
[gammaloop-workspace-check] Checking tracing v0.1.44
8.58 s
[gammaloop-workspace-check] Checking num-traits v0.2.19
8.77 s
[gammaloop-workspace-check] Checking thread_local v1.1.9
8.90 s
[gammaloop-workspace-check] Checking toml_writer v1.1.1+spec-1.1.0
8.90 s
[gammaloop-workspace-check] Checking az v1.3.0
8.93 s
[gammaloop-workspace-check] Checking indenter v0.3.4
9.02 s
[gammaloop-workspace-check] Checking rayon v1.12.0
9.07 s
[gammaloop-workspace-check] Checking wide v1.3.0
9.09 s
[gammaloop-workspace-check] Compiling phf_shared v0.11.3
9.24 s
[gammaloop-workspace-check] Checking anyhow v1.0.102
9.36 s
[gammaloop-workspace-check] Checking regex-automata v0.4.14
10.23 s
[gammaloop-workspace-check] Checking serde v1.0.228
10.23 s
[gammaloop-workspace-check] Checking serde_json v1.0.149
10.23 s
[gammaloop-workspace-check] Checking getrandom v0.3.4
10.23 s
[gammaloop-workspace-check] Checking approx v0.5.1
10.23 s
[gammaloop-workspace-check] Checking bitflags v2.11.1
10.23 s
[gammaloop-workspace-check] Checking time v0.3.47
10.23 s
[gammaloop-workspace-check] Checking num-integer v0.1.46
10.23 s
[gammaloop-workspace-check] Checking serde_spanned v1.1.1
10.23 s
[gammaloop-workspace-check] Checking toml_parser v1.1.2+spec-1.1.0
10.42 s
[gammaloop-workspace-check] Checking gmp-mpfr-sys v1.7.1
10.45 s
[gammaloop-workspace-check] Checking dyn-clone v1.0.20
10.49 s
[gammaloop-workspace-check] Checking rand_core v0.9.5
10.50 s
[gammaloop-workspace-check] Checking rawpointer v0.2.1
10.53 s
[gammaloop-workspace-check] Checking alloc-no-stdlib v2.0.4
10.57 s
[gammaloop-workspace-check] Checking utf8parse v0.2.2
10.60 s
[gammaloop-workspace-check] Checking toml_datetime v1.1.1+spec-1.1.0
10.61 s
[gammaloop-workspace-check] Checking matrixmultiply v0.3.10
10.67 s
[gammaloop-workspace-check] Checking alloc-stdlib v0.2.2
10.72 s
[gammaloop-workspace-check] Checking anstyle-parse v1.0.0
10.79 s
[gammaloop-workspace-check] Checking colored v3.1.1
10.81 s
[gammaloop-workspace-check] Checking colorchoice v1.0.5
10.85 s
[gammaloop-workspace-check] Checking anstyle v1.0.14
10.88 s
[gammaloop-workspace-check] Checking is_terminal_polyfill v1.70.2
10.90 s
[gammaloop-workspace-check] Checking anstyle-query v1.1.5
10.92 s
[gammaloop-workspace-check] Compiling phf_generator v0.11.3
10.94 s
[gammaloop-workspace-check] Checking eyre v0.6.12
10.98 s
[gammaloop-workspace-check] Checking unicode-width v0.2.2
10.99 s
[gammaloop-workspace-check] Checking anstream v1.0.0
11.00 s
[gammaloop-workspace-check] Checking bitflags v1.3.2
11.02 s
[gammaloop-workspace-check] Checking toml v1.1.2+spec-1.1.0
11.18 s
[gammaloop-workspace-check] Compiling phf_codegen v0.11.3
11.21 s
[gammaloop-workspace-check] Checking region v3.0.2
11.26 s
[gammaloop-workspace-check] Checking brotli-decompressor v5.0.0
11.46 s
[gammaloop-workspace-check] Checking wasmtime-jit-icache-coherence v34.0.2
11.59 s
[gammaloop-workspace-check] Checking hugepage-rs v0.1.1
11.61 s
[gammaloop-workspace-check] Checking inventory v0.3.24
11.65 s
[gammaloop-workspace-check] Checking spec_math v0.1.6
11.65 s
[gammaloop-workspace-check] Checking thiserror v2.0.18
11.74 s
[gammaloop-workspace-check] Compiling getopts v0.2.24
11.75 s
[gammaloop-workspace-check] Checking libloading v0.9.0
11.79 s
[gammaloop-workspace-check] Checking self_cell v1.2.2
11.81 s
[gammaloop-workspace-check] Checking append-only-vec v0.1.8
11.81 s
[gammaloop-workspace-check] Checking tinyjson v2.5.1
11.88 s
[gammaloop-workspace-check] Checking bytes v1.11.1
11.91 s
[gammaloop-workspace-check] Checking byteorder v1.5.0
11.92 s
[gammaloop-workspace-check] Checking smallvec v1.15.1
11.99 s
[gammaloop-workspace-check] Checking num-complex v0.4.6
12.09 s
[gammaloop-workspace-check] Checking tracing-serde v0.2.0
12.21 s
[gammaloop-workspace-check] Checking bincode v2.0.1
12.24 s
[gammaloop-workspace-check] Checking smartstring v1.0.1
12.41 s
[gammaloop-workspace-check] Compiling unic-common v0.9.0
12.46 s
[gammaloop-workspace-check] Compiling pyo3-build-config v0.28.3
12.54 s
[gammaloop-workspace-check] Compiling unicode_names2_generator v1.3.0
12.68 s
[gammaloop-workspace-check] Compiling unic-char-range v0.9.0
12.76 s
[gammaloop-workspace-check] Checking linux-raw-sys v0.12.1
12.81 s
[gammaloop-workspace-check] Compiling unic-char-property v0.9.0
12.81 s
[gammaloop-workspace-check] Checking simba v0.9.1
12.83 s
[gammaloop-workspace-check] Compiling unic-ucd-version v0.9.0
12.83 s
[gammaloop-workspace-check] Compiling is-macro v0.3.7
12.87 s
[gammaloop-workspace-check] Compiling rustpython-parser-vendored v0.4.0
12.92 s
[gammaloop-workspace-check] Checking iana-time-zone v0.1.65
12.93 s
[gammaloop-workspace-check] Compiling rustpython-parser v0.4.0
13.08 s
[gammaloop-workspace-check] Checking chrono v0.4.44
13.26 s
[gammaloop-workspace-check] Compiling phf v0.11.3
13.44 s
[gammaloop-workspace-check] Checking rustix v1.1.4
13.84 s
[gammaloop-workspace-check] Checking brotli v8.0.2
13.86 s
[gammaloop-workspace-check] Checking rustc-hash v2.1.2
13.87 s
[gammaloop-workspace-check] Compiling unic-ucd-ident v0.9.0
13.97 s
[gammaloop-workspace-check] Compiling unic-emoji-char v0.9.0
14.41 s
[gammaloop-workspace-check] Checking ndarray v0.17.2
14.54 s
[gammaloop-workspace-check] Compiling rustc-hash v1.1.0
14.63 s
[gammaloop-workspace-check] Compiling lalrpop-util v0.20.2
14.72 s
[gammaloop-workspace-check] Checking rug v1.30.0
15.05 s
[gammaloop-workspace-check] Checking unicode-segmentation v1.13.2
15.32 s
[gammaloop-workspace-check] Compiling symbolica v2.2.0 (https://github.com/alphal00p/symbolica?rev=a277a8dadbaae5a8d6605f2f381991a601e1f345#a277a8da)
15.45 s
[gammaloop-workspace-check] Checking typenum v1.20.0
15.54 s
[gammaloop-workspace-check] Checking getrandom v0.2.17
15.66 s
[gammaloop-workspace-check] Checking scopeguard v1.2.0
15.70 s
[gammaloop-workspace-check] Checking parking_lot_core v0.9.12
15.75 s
[gammaloop-workspace-check] Checking lock_api v0.4.14
16.29 s
[gammaloop-workspace-check] Checking unicode-ident v1.0.24
16.32 s
[gammaloop-workspace-check] Checking matchers v0.2.0
16.40 s
[gammaloop-workspace-check] Checking tracing-subscriber v0.3.23
16.41 s
[gammaloop-workspace-check] Checking regex v1.12.3
16.47 s
[gammaloop-workspace-check] Checking hashbrown v0.17.0
16.68 s
[gammaloop-workspace-check] Checking parking_lot v0.12.5
16.76 s
[gammaloop-workspace-check] Checking errno v0.3.14
16.88 s
[gammaloop-workspace-check] Checking strsim v0.11.1
17.14 s
[gammaloop-workspace-check] Checking unicase v2.9.0
17.14 s
[gammaloop-workspace-check] Checking ppv-lite86 v0.2.21
17.20 s
[gammaloop-workspace-check] Checking ahash v0.8.12
17.32 s
[gammaloop-workspace-check] Checking clap_lex v1.1.0
17.42 s
[gammaloop-workspace-check] Checking signal-hook-registry v1.4.8
17.48 s
[gammaloop-workspace-check] Checking vte v0.14.1
17.59 s
[gammaloop-workspace-check] Checking same-file v1.0.6
17.72 s
[gammaloop-workspace-check] Checking half v2.7.1
17.77 s
[gammaloop-workspace-check] Checking indexmap v2.14.0
17.91 s
[gammaloop-workspace-check] Checking signal-hook v0.3.18
17.91 s
[gammaloop-workspace-check] Checking walkdir v2.5.0
18.27 s
[gammaloop-workspace-check] Checking generic-array v0.14.7
18.35 s
[gammaloop-workspace-check] Checking mio v1.2.0
18.42 s
[gammaloop-workspace-check] Checking minimal-lexical v0.2.1
18.77 s
[gammaloop-workspace-check] Checking rand_chacha v0.9.0
18.77 s
[gammaloop-workspace-check] Checking ciborium-io v0.2.2
18.83 s
[gammaloop-workspace-check] Checking nom v7.1.3
18.89 s
[gammaloop-workspace-check] Checking ciborium-ll v0.2.2
19.18 s
[gammaloop-workspace-check] Checking rand v0.9.4
19.23 s
[gammaloop-workspace-check] Checking derive_more v2.1.1
19.40 s
[gammaloop-workspace-check] Checking num-bigint v0.4.6
19.73 s
[gammaloop-workspace-check] Checking signal-hook-mio v0.2.5
19.78 s
[gammaloop-workspace-check] Checking block-buffer v0.10.4
19.93 s
[gammaloop-workspace-check] Checking crypto-common v0.1.7
20.17 s
[gammaloop-workspace-check] Checking console v0.16.3
20.23 s
[gammaloop-workspace-check] Checking bstr v1.12.1
20.26 s
[gammaloop-workspace-check] Checking digest v0.10.7
20.84 s
[gammaloop-workspace-check] Checking cpufeatures v0.2.17
20.89 s
[gammaloop-workspace-check] Checking symjit v2.21.0
20.91 s
[gammaloop-workspace-check] Checking winnow v0.7.15
20.92 s
[gammaloop-workspace-check] Checking linux-raw-sys v0.4.15
21.03 s
[gammaloop-workspace-check] Checking terminal_size v0.4.4
21.17 s
[gammaloop-workspace-check] Checking clap_builder v4.6.0
21.32 s
[gammaloop-workspace-check] Checking sha2 v0.10.9
21.32 s
[gammaloop-workspace-check] Checking ciborium v0.2.2
21.77 s
[gammaloop-workspace-check] Checking rustix v0.38.44
21.78 s
[gammaloop-workspace-check] Checking getrandom v0.4.2
21.91 s
[gammaloop-workspace-check] Checking globset v0.4.18
21.97 s
[gammaloop-workspace-check] Checking rand_core v0.6.4
22.12 s
[gammaloop-workspace-check] Checking fastrand v2.4.1
22.25 s
[gammaloop-workspace-check] Checking plotters-backend v0.3.7
22.34 s
[gammaloop-workspace-check] Checking fnv v1.0.7
22.48 s
[gammaloop-workspace-check] Checking tempfile v3.27.0
22.49 s
[gammaloop-workspace-check] Checking serde_spanned v0.6.9
22.72 s
[gammaloop-workspace-check] Compiling unicode_names2 v1.3.0
22.80 s
[gammaloop-workspace-check] Checking ansitok v0.3.0
22.87 s
[gammaloop-workspace-check] Checking plotters-svg v0.3.7
22.90 s
[gammaloop-workspace-check] Checking toml_datetime v0.6.11
22.95 s
[gammaloop-workspace-check] Checking xprec v0.2.2
22.95 s
[gammaloop-workspace-check] Checking itertools v0.10.5
23.31 s
[gammaloop-workspace-check] Checking cast v0.3.0
23.36 s
[gammaloop-workspace-check] Checking toml_write v0.1.2
23.43 s
[gammaloop-workspace-check] Checking rust-embed-utils v8.11.0
23.43 s
[gammaloop-workspace-check] Checking tap v1.0.1
23.45 s
[gammaloop-workspace-check] Checking crossterm v0.28.1
23.50 s
[gammaloop-workspace-check] Checking plotters v0.3.7
23.56 s
[gammaloop-workspace-check] Checking wyz v0.5.1
23.77 s
[gammaloop-workspace-check] Checking rand_chacha v0.3.1
23.89 s
[gammaloop-workspace-check] Checking radium v0.7.0
23.92 s
[gammaloop-workspace-check] Checking typeid v1.0.3
24.04 s
[gammaloop-workspace-check] Checking similar v2.7.0
24.12 s
[gammaloop-workspace-check] Checking tinytemplate v1.2.1
24.16 s
[gammaloop-workspace-check] Checking is-terminal v0.4.17
24.30 s
[gammaloop-workspace-check] Checking anes v0.1.6
24.36 s
[gammaloop-workspace-check] Checking oorandom v11.1.5
24.59 s
[gammaloop-workspace-check] Checking funty v2.0.0
24.76 s
[gammaloop-workspace-check] Checking ansi-str v0.9.0
24.86 s
[gammaloop-workspace-check] Checking bytecount v0.6.9
24.93 s
[gammaloop-workspace-check] Checking testing_table v0.3.0
24.97 s
[gammaloop-workspace-check] Checking rand v0.8.6
24.99 s
[gammaloop-workspace-check] Checking ron v0.12.1
25.13 s
[gammaloop-workspace-check] Checking toml_edit v0.25.11+spec-1.1.0
25.78 s
[gammaloop-workspace-check] Checking clap v4.6.1
25.83 s
[gammaloop-workspace-check] Checking uncased v0.9.10
25.86 s
[gammaloop-workspace-check] Checking criterion-plot v0.5.0
25.95 s
[gammaloop-workspace-check] Checking papergrid v0.17.0
26.06 s
[gammaloop-workspace-check] Checking env_filter v1.0.1
26.08 s
[gammaloop-workspace-check] Checking jiff v0.2.24
26.24 s
[gammaloop-workspace-check] Checking bitvec v1.0.1
26.28 s
[gammaloop-workspace-check] Checking ptr_meta v0.1.4
26.38 s
[gammaloop-workspace-check] Checking ucd-trie v0.1.7
26.51 s
[gammaloop-workspace-check] Checking simdutf8 v0.1.5
26.65 s
[gammaloop-workspace-check] Checking criterion v0.5.1
26.74 s
[gammaloop-workspace-check] Checking pest v2.8.6
26.74 s
[gammaloop-workspace-check] Checking ahash v0.7.8
26.78 s
[gammaloop-workspace-check] Checking bytecheck v0.6.12
27.15 s
[gammaloop-workspace-check] Checking toml_edit v0.22.27
27.40 s
[gammaloop-workspace-check] Checking hashbrown v0.12.3
27.50 s
[gammaloop-workspace-check] Checking tabled v0.20.0
27.71 s
[gammaloop-workspace-check] Checking approx v0.4.0
27.76 s
[gammaloop-workspace-check] Checking seahash v4.1.0
27.77 s
[gammaloop-workspace-check] Checking rend v0.4.2
27.94 s
[gammaloop-workspace-check] Checking cgmath v0.18.0
28.02 s
[gammaloop-workspace-check] Checking num-rational v0.4.2
28.04 s
[gammaloop-workspace-check] Checking insta v1.47.2
28.07 s
[gammaloop-workspace-check] Checking num-iter v0.1.45
28.33 s
[gammaloop-workspace-check] Checking ref-ops v0.2.5
28.55 s
[gammaloop-workspace-check] Checking rand_xoshiro v0.6.0
28.69 s
[gammaloop-workspace-check] Checking features v0.10.0
28.77 s
[gammaloop-workspace-check] Checking constcat v0.5.1
28.95 s
[gammaloop-workspace-check] Checking gat-lending-iterator v0.1.8
29.05 s
[gammaloop-workspace-check] Checking colored v2.2.0
29.25 s
[gammaloop-workspace-check] Checking num v0.4.3
29.36 s
[gammaloop-workspace-check] Checking constant_time_eq v0.4.2
29.41 s
[gammaloop-workspace-check] Checking cpufeatures v0.3.0
29.45 s
[gammaloop-workspace-check] Checking arrayref v0.3.9
29.49 s
[gammaloop-workspace-check] Checking base64 v0.22.1
29.54 s
[gammaloop-workspace-check] Checking joinery v2.1.0
29.62 s
[gammaloop-workspace-check] Checking dot-parser v0.5.1
29.86 s
[gammaloop-workspace-check] Checking siphasher v1.0.2
29.88 s
[gammaloop-workspace-check] Checking blake3 v1.8.5
30.07 s
[gammaloop-workspace-check] Checking phf_shared v0.13.1
30.10 s
[gammaloop-workspace-check] Checking titlecase v2.2.1
30.35 s
[gammaloop-workspace-check] Checking subprocess v0.2.15
30.56 s
[gammaloop-workspace-check] Checking rust_lisp v0.18.0
30.74 s
[gammaloop-workspace-check] Compiling vakint v0.1.2 (/build/source/crates/vakint)
30.79 s
[gammaloop-workspace-check] Checking phf v0.13.1
30.95 s
[gammaloop-workspace-check] Checking version-compare v0.2.1
30.99 s
[gammaloop-workspace-check] Checking xpct v0.5.1
31.09 s
[gammaloop-workspace-check] Checking ryu v1.0.23
31.12 s
[gammaloop-workspace-check] Checking castaway v0.2.4
31.18 s
[gammaloop-workspace-check] Checking toml_datetime v0.7.5+spec-1.1.0
31.25 s
[gammaloop-workspace-check] Checking strum v0.27.2
31.26 s
[gammaloop-workspace-check] Checking unicode-truncate v2.0.1
31.29 s
[gammaloop-workspace-check] Checking compact_str v0.9.0
31.34 s
[gammaloop-workspace-check] Checking kasuari v0.4.12
31.37 s
[gammaloop-workspace-check] Checking toml v0.9.12+spec-1.1.0
31.41 s
[gammaloop-workspace-check] Checking lru v0.16.4
31.58 s
[gammaloop-workspace-check] Checking vte v0.15.0
31.60 s
[gammaloop-workspace-check] Checking toml v0.8.23
31.63 s
[gammaloop-workspace-check] Checking portable-atomic v1.13.1
31.70 s
[gammaloop-workspace-check] Checking unit-prefix v0.5.2
31.83 s
[gammaloop-workspace-check] Checking ratatui-core v0.1.0
31.91 s
[gammaloop-workspace-check] Checking vt100 v0.16.2
31.95 s
[gammaloop-workspace-check] Checking rand_distr v0.4.3
32.18 s
[gammaloop-workspace-check] Checking string-template-plus v0.4.3
32.51 s
[gammaloop-workspace-check] Compiling pyo3-ffi v0.28.3
32.60 s
[gammaloop-workspace-check] Compiling pyo3-macros-backend v0.28.3
32.60 s
[gammaloop-workspace-check] Compiling pyo3 v0.28.3
32.70 s
[gammaloop-workspace-check] Compiling numpy v0.28.0
32.76 s
[gammaloop-workspace-check] Checking figment v0.10.19
32.78 s
[gammaloop-workspace-check] Checking simba v0.6.0
32.81 s
[gammaloop-workspace-check] Checking indicatif v0.18.4
33.02 s
[gammaloop-workspace-check] Checking line-clipping v0.3.7
33.14 s
[gammaloop-workspace-check] Checking gimli v0.32.3
33.26 s
[gammaloop-workspace-check] Checking adler2 v2.0.1
33.26 s
[gammaloop-workspace-check] Compiling three-dimensional-reps v0.1.0 (/build/source/crates/three-dimensional-reps)
33.31 s
[gammaloop-workspace-check] Checking thiserror v1.0.69
33.43 s
[gammaloop-workspace-check] Checking derive_builder v0.11.2
33.43 s
[gammaloop-workspace-check] Checking miniz_oxide v0.8.9
33.46 s
[gammaloop-workspace-check] Checking object v0.37.3
33.51 s
[gammaloop-workspace-check] Checking crossterm v0.29.0
33.53 s
[gammaloop-workspace-check] Checking owo-colors v4.3.0
33.55 s
[gammaloop-workspace-check] Checking tracing-error v0.2.1
33.64 s
[gammaloop-workspace-check] Compiling rustpython-parser-core v0.4.0
33.75 s
[gammaloop-workspace-check] Checking typed-index-collections v3.5.0
33.80 s
[gammaloop-workspace-check] Checking ratatui-widgets v0.3.0
33.81 s
[gammaloop-workspace-check] Checking serde-big-array v0.5.1
33.97 s
[gammaloop-workspace-check] Checking amd v0.2.2
34.03 s
[gammaloop-workspace-check] Compiling rustpython-ast v0.4.0
34.07 s
[gammaloop-workspace-check] Checking rkyv v0.7.46
34.13 s
[gammaloop-workspace-check] Checking itertools v0.11.0
34.37 s
[gammaloop-workspace-check] Compiling gammaloop-tracing-filter-macros v0.1.0 (/build/source/crates/gammaloop-tracing-filter-macros)
34.43 s
[gammaloop-workspace-check] Checking option-ext v0.2.0
34.49 s
[gammaloop-workspace-check] Checking rustc-demangle v0.1.27
34.72 s
[gammaloop-workspace-check] Checking dirs-sys v0.5.0
34.84 s
[gammaloop-workspace-check] Checking ref-cast v1.0.25
34.96 s
[gammaloop-workspace-check] Checking nix v0.31.2
35.20 s
[gammaloop-workspace-check] Checking brotli-decompressor v4.0.3
35.22 s
[gammaloop-workspace-check] Checking integer-sqrt v0.1.5
35.31 s
[gammaloop-workspace-check] Checking crossbeam-channel v0.5.15
35.33 s
[gammaloop-workspace-check] Checking env_logger v0.11.10
35.62 s
[gammaloop-workspace-check] Checking ratatui-crossterm v0.1.0
35.68 s
[gammaloop-workspace-check] Checking clarabel v0.11.1
35.74 s
[gammaloop-workspace-check] Checking itertools v0.12.1
35.88 s
[gammaloop-workspace-check] Checking symlink v0.1.0
35.90 s
[gammaloop-workspace-check] Compiling gammalooprs v0.3.4 (/build/source/crates/gammalooprs)
36.01 s
[gammaloop-workspace-check] Checking unsafe-libyaml v0.2.11
36.04 s
[gammaloop-workspace-check] Checking ratatui-macros v0.7.0
36.14 s
[gammaloop-workspace-check] Checking ratatui v0.30.0
36.33 s
[gammaloop-workspace-check] Checking tracing-appender v0.2.5
36.37 s
[gammaloop-workspace-check] Checking include_dir v0.7.4
36.46 s
[gammaloop-workspace-check] Checking color-spantrace v0.3.0
36.52 s
[gammaloop-workspace-check] Checking tracing-indicatif v0.3.14
36.76 s
[gammaloop-workspace-check] Checking pathfinding v4.15.0
37.15 s
[gammaloop-workspace-check] Checking schemars v1.2.1
37.29 s
[gammaloop-workspace-check] Checking slotmap v1.1.1
37.33 s
[gammaloop-workspace-check] Checking serde_yaml v0.9.34+deprecated
37.35 s
[gammaloop-workspace-check] Checking dirs v6.0.0
37.41 s
[gammaloop-workspace-check] Checking json5 v0.4.1
37.59 s
[gammaloop-workspace-check] Checking brotli v7.0.0
37.64 s
[gammaloop-workspace-check] Checking ctrlc v3.5.2
37.66 s
[gammaloop-workspace-check] Checking vectorize v0.2.0
37.82 s
[gammaloop-workspace-check] Checking addr2line v0.25.1
38.00 s
[gammaloop-workspace-check] Checking ringbuffer v0.16.0
38.21 s
[gammaloop-workspace-check] Checking base62 v2.2.4
38.24 s
[gammaloop-workspace-check] Checking rust-embed v8.11.0
38.31 s
[gammaloop-workspace-check] Checking clap_complete v4.6.3
38.58 s
[gammaloop-workspace-check] Checking fd-lock v4.0.4
38.70 s
[gammaloop-workspace-check] Checking strip-ansi-escapes v0.2.1
38.72 s
[gammaloop-workspace-check] Compiling gammaloop-api v0.1.0 (/build/source/crates/gammaloop-api)
38.72 s
[gammaloop-workspace-check] Checking itertools v0.13.0
38.78 s
[gammaloop-workspace-check] Checking strum v0.26.3
38.86 s
[gammaloop-workspace-check] Checking sysinfo v0.33.1
38.99 s
[gammaloop-workspace-check] Checking shlex v1.3.0
39.26 s
[gammaloop-workspace-check] Checking futures-core v0.3.32
39.33 s
[gammaloop-workspace-check] Checking futures-task v0.3.32
39.46 s
[gammaloop-workspace-check] Checking slab v0.4.12
39.52 s
[gammaloop-workspace-check] Checking clap_complete_nushell v4.6.0
39.57 s
[gammaloop-workspace-check] Checking sdd v3.0.10
39.60 s
[gammaloop-workspace-check] Compiling gammaloop-integration-tests v0.1.0 (/build/source/tests)
39.71 s
[gammaloop-workspace-check] Compiling test-log-core v0.2.20
39.75 s
[gammaloop-workspace-check] Compiling rustc_version v0.4.1
39.77 s
[gammaloop-workspace-check] Checking which v8.0.2
39.92 s
[gammaloop-workspace-check] Checking futures-util v0.3.32
40.20 s
[gammaloop-workspace-check] Checking bincode v1.3.3
40.27 s
[gammaloop-workspace-check] Compiling gungraun-runner v0.18.2
40.49 s
[gammaloop-workspace-check] Checking scc v2.4.0
40.99 s
[gammaloop-workspace-check] Checking proc-macro2 v1.0.106
41.20 s
[gammaloop-workspace-check] Checking nalgebra v0.29.0
41.66 s
[gammaloop-workspace-check] Compiling gungraun-macros v0.8.0
42.32 s
[gammaloop-workspace-check] Checking backtrace v0.3.76
43.29 s
[gammaloop-workspace-check] Compiling numerica v2.2.0 (https://github.com/alphal00p/symbolica?rev=a277a8dadbaae5a8d6605f2f381991a601e1f345#a277a8da)
43.85 s
[gammaloop-workspace-check] Checking color-eyre v0.6.5
44.70 s
[gammaloop-workspace-check] Checking reedline v0.42.0
46.10 s
[gammaloop-workspace-check] Checking quote v1.0.45
47.09 s
[gammaloop-workspace-check] Checking maplit v1.0.2
47.22 s
[gammaloop-workspace-check] Checking futures-executor v0.3.32
47.30 s
[gammaloop-workspace-check] Checking base64 v0.21.7
47.88 s
[gammaloop-workspace-check] Compiling iai-callgrind-runner v0.14.2
48.85 s
[gammaloop-workspace-check] Compiling test-log-macros v0.2.20
48.97 s
[gammaloop-workspace-check] Checking serial_test v3.4.0
48.99 s
[gammaloop-workspace-check] Checking ron v0.8.1
49.06 s
[gammaloop-workspace-check] Checking kurbo v0.13.0
49.15 s
[gammaloop-workspace-check] Checking wait-timeout v0.2.1
49.37 s
[gammaloop-workspace-check] Checking quick-error v1.2.3
49.46 s
[gammaloop-workspace-check] Checking bit-vec v0.8.0
49.58 s
[gammaloop-workspace-check] Compiling iai-callgrind v0.14.2
49.77 s
[gammaloop-workspace-check] Checking bit-set v0.8.0
49.82 s
[gammaloop-workspace-check] Checking rusty-fork v0.3.1
50.29 s
[gammaloop-workspace-check] Checking syn v2.0.117
50.43 s
[gammaloop-workspace-check] Compiling iai-callgrind-macros v0.5.1
53.73 s
[gammaloop-workspace-check] Checking rand_xorshift v0.4.0
53.78 s
[gammaloop-workspace-check] Checking console v0.15.11
54.01 s
[gammaloop-workspace-check] Checking unarray v0.1.4
54.12 s
[gammaloop-workspace-check] Checking pathdiff v0.2.3
54.26 s
[gammaloop-workspace-check] Checking proptest v1.11.0
54.57 s
[gammaloop-workspace-check] Checking clinnet v0.1.8 (/build/source/crates/clinnet)
55.56 s
[gammaloop-workspace-check] Checking similar-asserts v1.7.0
56.44 s
[gammaloop-workspace-check] Checking kurvst v0.1.0 (/build/source/crates/kurvst)
63.42 s
[gammaloop-workspace-check] Checking test-log v0.2.20
64.30 s
[gammaloop-workspace-check] Compiling graphica v2.1.0 (https://github.com/alphal00p/symbolica?rev=a277a8dadbaae5a8d6605f2f381991a601e1f345#a277a8da)
75.54 s
[gammaloop-workspace-check] Checking gungraun v0.18.2
76.19 s
[gammaloop-workspace-check] Checking statrs v0.16.1
79.76 s
[gammaloop-workspace-check] Checking momtrop v0.3.0
88.21 s
[gammaloop-workspace-check] Compiling pyo3-stub-gen-derive v0.17.2
88.72 s
[gammaloop-workspace-check] Compiling pyo3-macros v0.28.3
108.85 s
[gammaloop-workspace-check] Checking pyo3-stub-gen v0.17.2
117.73 s
[gammaloop-workspace-check] Checking symbolica-utils v0.1.0 (/build/source/crates/symbolica-utils)
117.73 s
[gammaloop-workspace-check] Checking spenso-macros v0.3.2 (/build/source/crates/spenso-macros)
346.27 s
[gammaloop-workspace-check] Compiling gammaloop-workspace-hack v0.1.0 (/build/source/crates/gammaloop-workspace-hack)
346.82 s
[gammaloop-workspace-check] Checking linnet v0.17.0 (/build/source/crates/linnet)
351.35 s
[gammaloop-workspace-check] Checking spenso v0.6.0 (/build/source/crates/spenso)
351.70 s
[gammaloop-workspace-check] Checking linnet-py v0.1.0 (/build/source/crates/linnet-py)
351.70 s
[gammaloop-workspace-check] Checking linnest v0.1.0 (/build/source/crates/linnest)
359.64 s
[gammaloop-workspace-check] Checking idenso v0.3.0 (/build/source/crates/idenso)
359.65 s
[gammaloop-workspace-check] Checking gammaloop-tracing-filter v0.1.0 (/build/source/crates/gammaloop-tracing-filter)
362.70 s
[gammaloop-workspace-check] Checking spenso-hep-lib v0.1.7 (/build/source/crates/spenso-hep-lib)
363.11 s
[gammaloop-workspace-check] Checking spynso3 v0.1.2 (/build/source/crates/spynso3)
399.38 s
[gammaloop-workspace-check] error[E0609] : no field `lmb_channel_id` on type `CutInfo`
399.38 s
[gammaloop-workspace-check] --> tests/tests/test_runs/utils.rs:568:36
399.38 s
[gammaloop-workspace-check] |
399.38 s
[gammaloop-workspace-check] 568 | event.cut_info.lmb_channel_id,
399.38 s
[gammaloop-workspace-check] | ^^^^^^^^^^^^^^ unknown field
399.38 s
[gammaloop-workspace-check] |
399.38 s
[gammaloop-workspace-check] = note : available fields are: `particle_pdgs`, `cut_id`, `graph_id`, `graph_group_id`, `orientation_id` ... and 2 others
399.38 s
[gammaloop-workspace-check]
399.38 s
[gammaloop-workspace-check] error[E0609] : no field `lmb_channel_id` on type `CutInfo`
399.38 s
[gammaloop-workspace-check] --> tests/tests/test_runs/utils.rs:580:36
399.38 s
[gammaloop-workspace-check] |
399.38 s
[gammaloop-workspace-check] 580 | event.cut_info.lmb_channel_id,
399.38 s
[gammaloop-workspace-check] | ^^^^^^^^^^^^^^ unknown field
399.38 s
[gammaloop-workspace-check] |
399.38 s
[gammaloop-workspace-check] = note : available fields are: `particle_pdgs`, `cut_id`, `graph_id`, `graph_group_id`, `orientation_id` ... and 2 others
399.38 s
[gammaloop-workspace-check]
399.86 s
[gammaloop-workspace-check] For more information about this error, try `rustc --explain E0609`.
399.88 s
[gammaloop-workspace-check] error : could not compile `gammaloop-integration-tests` (test "test_runs") due to 2 previous errors
400.41 s
Progress: 0 of 1 built (1 failed)
400.41 s
Failed to build gammaloop-workspace-check after 6m36s
400.42 s
Cannot build ' /nix/store/678qn1yyh3j4046ys9sarqm9q60571r7-gammaloop-workspace-check-0.1.0.drv '.
400.42 s
Reason: builder failed with exit code 101 .
400.42 s
Output paths:
400.42 s
/nix/store/164617w7wk11sv41wc87zhpky9g3qq80-gammaloop-workspace-check-0.1.0
400.42 s
Last 443 log lines:
400.42 s
> Running phase: unpackPhase
400.42 s
> unpacking source archive /nix/store/3jj3smp74rs9m6ykxsf11s7cz9qgyqb0-source
400.42 s
> source root is source
400.42 s
> Running phase: patchPhase
400.42 s
> Executing configureCargoCommonVars
400.42 s
> decompressing cargo artifacts from /nix/store/50vpxlcgfxf2d57i27v3d10zjwxxbm2r-gammaloop-workspace-deps-deps-0.1.0/target.tar.zst to target
400.42 s
> Running phase: updateAutotoolsGnuConfigScriptsPhase
400.42 s
> Running phase: configurePhase
400.42 s
> will append /build/source/.cargo-home/config.toml with contents of /nix/store/5drf77x6km4ky7gwlrzdx9bbd6fz09g3-vendor-cargo-deps/config.toml
400.42 s
> default configurePhase, nothing to do
400.42 s
> Running phase: buildPhase
400.42 s
> +++ command cargo --version
400.42 s
> cargo 1.97.0 (c980f4866 2026-06-30)
400.42 s
> +++ command cargo check --profile ci-optim --locked --workspace --features gammaloop-tracing-filter/clap,gammaloop-tracing-filter/symbolica,idenso/bincode,idenso/reference-cases,linnet/bincode,linnet/drawing,linnet/rkyv,linnet/serde,linnet/symbolica,spenso-macros/shadowing,spenso/shadowing,symbolica/tracing_max_level_info,three-dimensional-reps/display,three-dimensional-reps/eval,three-dimensional-reps/serde --all-targets
400.42 s
> Checking cfg-if v1.0.4
400.42 s
> Checking memchr v2.8.0
400.42 s
> Checking once_cell v1.21.4
400.42 s
> Checking either v1.15.0
400.42 s
> Checking itoa v1.0.18
400.42 s
> Checking serde_core v1.0.228
400.42 s
> Checking libc v0.2.186
400.42 s
> Checking libm v0.2.16
400.42 s
> Checking log v0.4.29
400.42 s
> Checking regex-syntax v0.8.10
400.42 s
> Checking zerocopy v0.8.48
400.42 s
> Checking crossbeam-utils v0.8.21
400.42 s
> Checking equivalent v1.0.2
400.42 s
> Checking zmij v1.0.21
400.42 s
> Checking lazy_static v1.5.0
400.42 s
> Checking bytemuck v1.25.0
400.42 s
> Compiling target-lexicon v0.13.5
400.42 s
> Checking arrayvec v0.7.6
400.42 s
> Checking powerfmt v0.2.0
400.42 s
> Checking itertools v0.14.0
400.42 s
> Checking aho-corasick v1.1.4
400.42 s
> Checking crossbeam-epoch v0.9.18
400.42 s
> Checking safe_arch v0.7.4
400.42 s
> Checking deranged v0.5.8
400.42 s
> Checking num-conv v0.2.1
400.42 s
> Checking num_threads v0.1.7
400.42 s
> Checking pin-project-lite v0.2.17
400.42 s
> Checking time-core v0.1.8
400.42 s
> Checking tracing-core v0.1.36
400.42 s
> Checking allocator-api2 v0.2.21
400.42 s
> Checking foldhash v0.2.0
400.42 s
> Checking const-random v0.1.18
400.42 s
> Checking crossbeam-deque v0.8.6
400.42 s
> Checking unty v0.0.4
400.42 s
> Checking nu-ansi-term v0.50.3
400.42 s
> Checking static_assertions v1.1.0
400.42 s
> Checking winnow v1.0.2
400.42 s
> Checking safe_arch v1.0.0
400.42 s
> Checking wide v0.7.33
400.42 s
> Checking sharded-slab v0.1.7
400.42 s
> Checking tracing-log v0.2.0
400.42 s
> Checking hashbrown v0.16.1
400.42 s
> Checking rayon-core v1.13.0
400.42 s
> Checking tracing v0.1.44
400.42 s
> Checking num-traits v0.2.19
400.42 s
> Checking thread_local v1.1.9
400.42 s
> Checking toml_writer v1.1.1+spec-1.1.0
400.42 s
> Checking az v1.3.0
400.42 s
> Checking indenter v0.3.4
400.42 s
> Checking rayon v1.12.0
400.42 s
> Checking wide v1.3.0
400.42 s
> Compiling phf_shared v0.11.3
400.42 s
> Checking anyhow v1.0.102
400.42 s
> Checking regex-automata v0.4.14
400.42 s
> Checking serde v1.0.228
400.42 s
> Checking serde_json v1.0.149
400.42 s
> Checking getrandom v0.3.4
400.42 s
> Checking approx v0.5.1
400.42 s
> Checking bitflags v2.11.1
400.42 s
> Checking time v0.3.47
400.42 s
> Checking num-integer v0.1.46
400.42 s
> Checking serde_spanned v1.1.1
400.42 s
> Checking toml_parser v1.1.2+spec-1.1.0
400.42 s
> Checking gmp-mpfr-sys v1.7.1
400.42 s
> Checking dyn-clone v1.0.20
400.42 s
> Checking rand_core v0.9.5
400.42 s
> Checking rawpointer v0.2.1
400.42 s
> Checking alloc-no-stdlib v2.0.4
400.42 s
> Checking utf8parse v0.2.2
400.42 s
> Checking toml_datetime v1.1.1+spec-1.1.0
400.42 s
> Checking matrixmultiply v0.3.10
400.42 s
> Checking alloc-stdlib v0.2.2
400.42 s
> Checking anstyle-parse v1.0.0
400.42 s
> Checking colored v3.1.1
400.42 s
> Checking colorchoice v1.0.5
400.42 s
> Checking anstyle v1.0.14
400.42 s
> Checking is_terminal_polyfill v1.70.2
400.42 s
> Checking anstyle-query v1.1.5
400.42 s
> Compiling phf_generator v0.11.3
400.42 s
> Checking eyre v0.6.12
400.42 s
> Checking unicode-width v0.2.2
400.42 s
> Checking anstream v1.0.0
400.42 s
> Checking bitflags v1.3.2
400.42 s
> Checking toml v1.1.2+spec-1.1.0
400.42 s
> Compiling phf_codegen v0.11.3
400.42 s
> Checking region v3.0.2
400.42 s
> Checking brotli-decompressor v5.0.0
400.42 s
> Checking wasmtime-jit-icache-coherence v34.0.2
400.42 s
> Checking hugepage-rs v0.1.1
400.42 s
> Checking inventory v0.3.24
400.42 s
> Checking spec_math v0.1.6
400.42 s
> Checking thiserror v2.0.18
400.42 s
> Compiling getopts v0.2.24
400.42 s
> Checking libloading v0.9.0
400.42 s
> Checking self_cell v1.2.2
400.42 s
> Checking append-only-vec v0.1.8
400.42 s
> Checking tinyjson v2.5.1
400.42 s
> Checking bytes v1.11.1
400.42 s
> Checking byteorder v1.5.0
400.42 s
> Checking smallvec v1.15.1
400.42 s
> Checking num-complex v0.4.6
400.42 s
> Checking tracing-serde v0.2.0
400.42 s
> Checking bincode v2.0.1
400.42 s
> Checking smartstring v1.0.1
400.42 s
> Compiling unic-common v0.9.0
400.42 s
> Compiling pyo3-build-config v0.28.3
400.42 s
> Compiling unicode_names2_generator v1.3.0
400.42 s
> Compiling unic-char-range v0.9.0
400.42 s
> Checking linux-raw-sys v0.12.1
400.42 s
> Compiling unic-char-property v0.9.0
400.42 s
> Checking simba v0.9.1
400.42 s
> Compiling unic-ucd-version v0.9.0
400.42 s
> Compiling is-macro v0.3.7
400.42 s
> Compiling rustpython-parser-vendored v0.4.0
400.42 s
> Checking iana-time-zone v0.1.65
400.42 s
> Compiling rustpython-parser v0.4.0
400.42 s
> Checking chrono v0.4.44
400.42 s
> Compiling phf v0.11.3
400.42 s
> Checking rustix v1.1.4
400.42 s
> Checking brotli v8.0.2
400.42 s
> Checking rustc-hash v2.1.2
400.42 s
> Compiling unic-ucd-ident v0.9.0
400.42 s
> Compiling unic-emoji-char v0.9.0
400.42 s
> Checking ndarray v0.17.2
400.42 s
> Compiling rustc-hash v1.1.0
400.42 s
> Compiling lalrpop-util v0.20.2
400.42 s
> Checking rug v1.30.0
400.42 s
> Checking unicode-segmentation v1.13.2
400.42 s
> Compiling symbolica v2.2.0 (https://github.com/alphal00p/symbolica?rev=a277a8dadbaae5a8d6605f2f381991a601e1f345#a277a8da)
400.42 s
> Checking typenum v1.20.0
400.42 s
> Checking getrandom v0.2.17
400.42 s
> Checking scopeguard v1.2.0
400.42 s
> Checking parking_lot_core v0.9.12
400.42 s
> Checking lock_api v0.4.14
400.42 s
> Checking unicode-ident v1.0.24
400.42 s
> Checking matchers v0.2.0
400.42 s
> Checking tracing-subscriber v0.3.23
400.42 s
> Checking regex v1.12.3
400.42 s
> Checking hashbrown v0.17.0
400.42 s
> Checking parking_lot v0.12.5
400.42 s
> Checking errno v0.3.14
400.42 s
> Checking strsim v0.11.1
400.42 s
> Checking unicase v2.9.0
400.42 s
> Checking ppv-lite86 v0.2.21
400.42 s
> Checking ahash v0.8.12
400.42 s
> Checking clap_lex v1.1.0
400.42 s
> Checking signal-hook-registry v1.4.8
400.42 s
> Checking vte v0.14.1
400.42 s
> Checking same-file v1.0.6
400.42 s
> Checking half v2.7.1
400.42 s
> Checking indexmap v2.14.0
400.42 s
> Checking signal-hook v0.3.18
400.42 s
> Checking walkdir v2.5.0
400.42 s
> Checking generic-array v0.14.7
400.42 s
> Checking mio v1.2.0
400.42 s
> Checking minimal-lexical v0.2.1
400.42 s
> Checking rand_chacha v0.9.0
400.42 s
> Checking ciborium-io v0.2.2
400.42 s
> Checking nom v7.1.3
400.42 s
> Checking ciborium-ll v0.2.2
400.42 s
> Checking rand v0.9.4
400.42 s
> Checking derive_more v2.1.1
400.42 s
> Checking num-bigint v0.4.6
400.42 s
> Checking signal-hook-mio v0.2.5
400.42 s
> Checking block-buffer v0.10.4
400.42 s
> Checking crypto-common v0.1.7
400.42 s
> Checking console v0.16.3
400.42 s
> Checking bstr v1.12.1
400.42 s
> Checking digest v0.10.7
400.42 s
> Checking cpufeatures v0.2.17
400.42 s
> Checking symjit v2.21.0
400.42 s
> Checking winnow v0.7.15
400.42 s
> Checking linux-raw-sys v0.4.15
400.42 s
> Checking terminal_size v0.4.4
400.42 s
> Checking clap_builder v4.6.0
400.42 s
> Checking sha2 v0.10.9
400.42 s
> Checking ciborium v0.2.2
400.42 s
> Checking rustix v0.38.44
400.42 s
> Checking getrandom v0.4.2
400.42 s
> Checking globset v0.4.18
400.42 s
> Checking rand_core v0.6.4
400.42 s
> Checking fastrand v2.4.1
400.42 s
> Checking plotters-backend v0.3.7
400.42 s
> Checking fnv v1.0.7
400.42 s
> Checking tempfile v3.27.0
400.42 s
> Checking serde_spanned v0.6.9
400.42 s
> Compiling unicode_names2 v1.3.0
400.42 s
> Checking ansitok v0.3.0
400.42 s
> Checking plotters-svg v0.3.7
400.42 s
> Checking toml_datetime v0.6.11
400.42 s
> Checking xprec v0.2.2
400.42 s
> Checking itertools v0.10.5
400.42 s
> Checking cast v0.3.0
400.42 s
> Checking toml_write v0.1.2
400.42 s
> Checking rust-embed-utils v8.11.0
400.42 s
> Checking tap v1.0.1
400.42 s
> Checking crossterm v0.28.1
400.42 s
> Checking plotters v0.3.7
400.42 s
> Checking wyz v0.5.1
400.42 s
> Checking rand_chacha v0.3.1
400.42 s
> Checking radium v0.7.0
400.42 s
> Checking typeid v1.0.3
400.42 s
> Checking similar v2.7.0
400.42 s
> Checking tinytemplate v1.2.1
400.42 s
> Checking is-terminal v0.4.17
400.42 s
> Checking anes v0.1.6
400.42 s
> Checking oorandom v11.1.5
400.42 s
> Checking funty v2.0.0
400.42 s
> Checking ansi-str v0.9.0
400.42 s
> Checking bytecount v0.6.9
400.42 s
> Checking testing_table v0.3.0
400.42 s
> Checking rand v0.8.6
400.42 s
> Checking ron v0.12.1
400.42 s
> Checking toml_edit v0.25.11+spec-1.1.0
400.42 s
> Checking clap v4.6.1
400.42 s
> Checking uncased v0.9.10
400.42 s
> Checking criterion-plot v0.5.0
400.42 s
> Checking papergrid v0.17.0
400.42 s
> Checking env_filter v1.0.1
400.42 s
> Checking jiff v0.2.24
400.42 s
> Checking bitvec v1.0.1
400.42 s
> Checking ptr_meta v0.1.4
400.42 s
> Checking ucd-trie v0.1.7
400.42 s
> Checking simdutf8 v0.1.5
400.42 s
> Checking criterion v0.5.1
400.42 s
> Checking pest v2.8.6
400.42 s
> Checking ahash v0.7.8
400.42 s
> Checking bytecheck v0.6.12
400.42 s
> Checking toml_edit v0.22.27
400.42 s
> Checking hashbrown v0.12.3
400.42 s
> Checking tabled v0.20.0
400.42 s
> Checking approx v0.4.0
400.42 s
> Checking seahash v4.1.0
400.42 s
> Checking rend v0.4.2
400.42 s
> Checking cgmath v0.18.0
400.42 s
> Checking num-rational v0.4.2
400.42 s
> Checking insta v1.47.2
400.42 s
> Checking num-iter v0.1.45
400.42 s
> Checking ref-ops v0.2.5
400.42 s
> Checking rand_xoshiro v0.6.0
400.42 s
> Checking features v0.10.0
400.42 s
> Checking constcat v0.5.1
400.42 s
> Checking gat-lending-iterator v0.1.8
400.42 s
> Checking colored v2.2.0
400.42 s
> Checking num v0.4.3
400.42 s
> Checking constant_time_eq v0.4.2
400.42 s
> Checking cpufeatures v0.3.0
400.42 s
> Checking arrayref v0.3.9
400.42 s
> Checking base64 v0.22.1
400.42 s
> Checking joinery v2.1.0
400.42 s
> Checking dot-parser v0.5.1
400.42 s
> Checking siphasher v1.0.2
400.42 s
> Checking blake3 v1.8.5
400.42 s
> Checking phf_shared v0.13.1
400.42 s
> Checking titlecase v2.2.1
400.42 s
> Checking subprocess v0.2.15
400.42 s
> Checking rust_lisp v0.18.0
400.42 s
> Compiling vakint v0.1.2 (/build/source/crates/vakint)
400.42 s
> Checking phf v0.13.1
400.42 s
> Checking version-compare v0.2.1
400.42 s
> Checking xpct v0.5.1
400.42 s
> Checking ryu v1.0.23
400.42 s
> Checking castaway v0.2.4
400.42 s
> Checking toml_datetime v0.7.5+spec-1.1.0
400.42 s
> Checking strum v0.27.2
400.42 s
> Checking unicode-truncate v2.0.1
400.42 s
> Checking compact_str v0.9.0
400.42 s
> Checking kasuari v0.4.12
400.42 s
> Checking toml v0.9.12+spec-1.1.0
400.42 s
> Checking lru v0.16.4
400.42 s
> Checking vte v0.15.0
400.42 s
> Checking toml v0.8.23
400.42 s
> Checking portable-atomic v1.13.1
400.42 s
> Checking unit-prefix v0.5.2
400.42 s
> Checking ratatui-core v0.1.0
400.42 s
> Checking vt100 v0.16.2
400.42 s
> Checking rand_distr v0.4.3
400.42 s
> Checking string-template-plus v0.4.3
400.42 s
> Compiling pyo3-ffi v0.28.3
400.42 s
> Compiling pyo3-macros-backend v0.28.3
400.42 s
> Compiling pyo3 v0.28.3
400.42 s
> Compiling numpy v0.28.0
400.42 s
> Checking figment v0.10.19
400.42 s
> Checking simba v0.6.0
400.42 s
> Checking indicatif v0.18.4
400.42 s
> Checking line-clipping v0.3.7
400.42 s
> Checking gimli v0.32.3
400.42 s
> Checking adler2 v2.0.1
400.42 s
> Compiling three-dimensional-reps v0.1.0 (/build/source/crates/three-dimensional-reps)
400.42 s
> Checking thiserror v1.0.69
400.42 s
> Checking derive_builder v0.11.2
400.42 s
> Checking miniz_oxide v0.8.9
400.42 s
> Checking object v0.37.3
400.42 s
> Checking crossterm v0.29.0
400.42 s
> Checking owo-colors v4.3.0
400.42 s
> Checking tracing-error v0.2.1
400.42 s
> Compiling rustpython-parser-core v0.4.0
400.42 s
> Checking typed-index-collections v3.5.0
400.42 s
> Checking ratatui-widgets v0.3.0
400.42 s
> Checking serde-big-array v0.5.1
400.42 s
> Checking amd v0.2.2
400.42 s
> Compiling rustpython-ast v0.4.0
400.42 s
> Checking rkyv v0.7.46
400.42 s
> Checking itertools v0.11.0
400.42 s
> Compiling gammaloop-tracing-filter-macros v0.1.0 (/build/source/crates/gammaloop-tracing-filter-macros)
400.42 s
> Checking option-ext v0.2.0
400.42 s
> Checking rustc-demangle v0.1.27
400.42 s
> Checking dirs-sys v0.5.0
400.42 s
> Checking ref-cast v1.0.25
400.42 s
> Checking nix v0.31.2
400.42 s
> Checking brotli-decompressor v4.0.3
400.42 s
> Checking integer-sqrt v0.1.5
400.42 s
> Checking crossbeam-channel v0.5.15
400.42 s
> Checking env_logger v0.11.10
400.42 s
> Checking ratatui-crossterm v0.1.0
400.42 s
> Checking clarabel v0.11.1
400.42 s
> Checking itertools v0.12.1
400.42 s
> Checking symlink v0.1.0
400.42 s
> Compiling gammalooprs v0.3.4 (/build/source/crates/gammalooprs)
400.42 s
> Checking unsafe-libyaml v0.2.11
400.42 s
> Checking ratatui-macros v0.7.0
400.42 s
> Checking ratatui v0.30.0
400.42 s
> Checking tracing-appender v0.2.5
400.42 s
> Checking include_dir v0.7.4
400.42 s
> Checking color-spantrace v0.3.0
400.42 s
> Checking tracing-indicatif v0.3.14
400.42 s
> Checking pathfinding v4.15.0
400.42 s
> Checking schemars v1.2.1
400.42 s
> Checking slotmap v1.1.1
400.42 s
> Checking serde_yaml v0.9.34+deprecated
400.42 s
> Checking dirs v6.0.0
400.42 s
> Checking json5 v0.4.1
400.42 s
> Checking brotli v7.0.0
400.42 s
> Checking ctrlc v3.5.2
400.42 s
> Checking vectorize v0.2.0
400.42 s
> Checking addr2line v0.25.1
400.42 s
> Checking ringbuffer v0.16.0
400.42 s
> Checking base62 v2.2.4
400.42 s
> Checking rust-embed v8.11.0
400.42 s
> Checking clap_complete v4.6.3
400.42 s
> Checking fd-lock v4.0.4
400.42 s
> Checking strip-ansi-escapes v0.2.1
400.42 s
> Compiling gammaloop-api v0.1.0 (/build/source/crates/gammaloop-api)
400.42 s
> Checking itertools v0.13.0
400.42 s
> Checking strum v0.26.3
400.42 s
> Checking sysinfo v0.33.1
400.42 s
> Checking shlex v1.3.0
400.42 s
> Checking futures-core v0.3.32
400.42 s
> Checking futures-task v0.3.32
400.42 s
> Checking slab v0.4.12
400.42 s
> Checking clap_complete_nushell v4.6.0
400.42 s
> Checking sdd v3.0.10
400.42 s
> Compiling gammaloop-integration-tests v0.1.0 (/build/source/tests)
400.42 s
> Compiling test-log-core v0.2.20
400.42 s
> Compiling rustc_version v0.4.1
400.42 s
> Checking which v8.0.2
400.42 s
> Checking futures-util v0.3.32
400.42 s
> Checking bincode v1.3.3
400.42 s
> Compiling gungraun-runner v0.18.2
400.42 s
> Checking scc v2.4.0
400.42 s
> Checking proc-macro2 v1.0.106
400.42 s
> Checking nalgebra v0.29.0
400.42 s
> Compiling gungraun-macros v0.8.0
400.42 s
> Checking backtrace v0.3.76
400.42 s
> Compiling numerica v2.2.0 (https://github.com/alphal00p/symbolica?rev=a277a8dadbaae5a8d6605f2f381991a601e1f345#a277a8da)
400.42 s
> Checking color-eyre v0.6.5
400.42 s
> Checking reedline v0.42.0
400.42 s
> Checking quote v1.0.45
400.42 s
> Checking maplit v1.0.2
400.42 s
> Checking futures-executor v0.3.32
400.42 s
> Checking base64 v0.21.7
400.42 s
> Compiling iai-callgrind-runner v0.14.2
400.42 s
> Compiling test-log-macros v0.2.20
400.42 s
> Checking serial_test v3.4.0
400.42 s
> Checking ron v0.8.1
400.42 s
> Checking kurbo v0.13.0
400.42 s
> Checking wait-timeout v0.2.1
400.42 s
> Checking quick-error v1.2.3
400.42 s
> Checking bit-vec v0.8.0
400.42 s
> Compiling iai-callgrind v0.14.2
400.42 s
> Checking bit-set v0.8.0
400.42 s
> Checking rusty-fork v0.3.1
400.42 s
> Checking syn v2.0.117
400.42 s
> Compiling iai-callgrind-macros v0.5.1
400.42 s
> Checking rand_xorshift v0.4.0
400.42 s
> Checking console v0.15.11
400.42 s
> Checking unarray v0.1.4
400.42 s
> Checking pathdiff v0.2.3
400.42 s
> Checking proptest v1.11.0
400.42 s
> Checking clinnet v0.1.8 (/build/source/crates/clinnet)
400.42 s
> Checking similar-asserts v1.7.0
400.42 s
> Checking kurvst v0.1.0 (/build/source/crates/kurvst)
400.42 s
> Checking test-log v0.2.20
400.42 s
> Compiling graphica v2.1.0 (https://github.com/alphal00p/symbolica?rev=a277a8dadbaae5a8d6605f2f381991a601e1f345#a277a8da)
400.42 s
> Checking gungraun v0.18.2
400.42 s
> Checking statrs v0.16.1
400.42 s
> Checking momtrop v0.3.0
400.42 s
> Compiling pyo3-stub-gen-derive v0.17.2
400.42 s
> Compiling pyo3-macros v0.28.3
400.42 s
> Checking pyo3-stub-gen v0.17.2
400.42 s
> Checking symbolica-utils v0.1.0 (/build/source/crates/symbolica-utils)
400.42 s
> Checking spenso-macros v0.3.2 (/build/source/crates/spenso-macros)
400.42 s
> Compiling gammaloop-workspace-hack v0.1.0 (/build/source/crates/gammaloop-workspace-hack)
400.42 s
> Checking linnet v0.17.0 (/build/source/crates/linnet)
400.42 s
> Checking spenso v0.6.0 (/build/source/crates/spenso)
400.42 s
> Checking linnet-py v0.1.0 (/build/source/crates/linnet-py)
400.42 s
> Checking linnest v0.1.0 (/build/source/crates/linnest)
400.42 s
> Checking idenso v0.3.0 (/build/source/crates/idenso)
400.42 s
> Checking gammaloop-tracing-filter v0.1.0 (/build/source/crates/gammaloop-tracing-filter)
400.42 s
> Checking spenso-hep-lib v0.1.7 (/build/source/crates/spenso-hep-lib)
400.42 s
> Checking spynso3 v0.1.2 (/build/source/crates/spynso3)
400.42 s
> error[E0609] : no field `lmb_channel_id` on type `CutInfo`
400.42 s
> --> tests/tests/test_runs/utils.rs:568:36
400.42 s
> |
400.42 s
> 568 | event.cut_info.lmb_channel_id,
400.42 s
> | ^^^^^^^^^^^^^^ unknown field
400.42 s
> |
400.42 s
> = note : available fields are: `particle_pdgs`, `cut_id`, `graph_id`, `graph_group_id`, `orientation_id` ... and 2 others
400.42 s
>
400.42 s
> error[E0609] : no field `lmb_channel_id` on type `CutInfo`
400.42 s
> --> tests/tests/test_runs/utils.rs:580:36
400.42 s
> |
400.42 s
> 580 | event.cut_info.lmb_channel_id,
400.42 s
> | ^^^^^^^^^^^^^^ unknown field
400.42 s
> |
400.42 s
> = note : available fields are: `particle_pdgs`, `cut_id`, `graph_id`, `graph_group_id`, `orientation_id` ... and 2 others
400.42 s
>
400.42 s
> For more information about this error, try `rustc --explain E0609`.
400.42 s
> error : could not compile `gammaloop-integration-tests` (test "test_runs") due to 2 previous errors
400.42 s
For full logs, run:
400.42 s
nix log /nix/store/678qn1yyh3j4046ys9sarqm9q60571r7-gammaloop-workspace-check-0.1.0.drv
400.45 s
Build failed.