build checks.x86_64-linux.gammaloop-check

Reproduce this run
Original Run
  1. 0.01 s $ /nix/store/9ypz3flqsrl5xl495mm8h645gadjsxi1-coreutils-9.11/bin/timeout --kill-after=15s 7200s /nix/store/23zk8sgzamrbmj1fday15szf7f2279s8-nix-2.34.7/bin/nix --extra-experimental-features nix-command --extra-experimental-features flakes --log-format internal-json build --no-link --print-out-paths git+https://github.com/alphal00p/gammaloop?ref=advanced_sampling&rev=f2f64fb17dd5dab588eca298dc61f1100fa4962d&shallow=1#checks.x86_64-linux.gammaloop-check --print-build-logs
  2. 0.50 s error (ignored): SQLite database '/var/cache/nix-ci-worker/eval-cache-v6/454083ca2d64c2bd9f46e959c6679698e2592f99823f5dd1778cef1bf40b2ddb.sqlite' is busy
  3. 2.73 s
  4. 3.79 s Building /nix/store/01wv2cvlxmkwk15rfvw73pimfsfm321c-gammaloop-workspace-check-0.1.0.drv
  5. 3.92 s [gammaloop-workspace-check] Phase: unpackPhase
  6. 3.92 s [gammaloop-workspace-check] unpacking source archive /nix/store/p4kvydb95jp9jm0ylgbb2r217q4zaj95-source
  7. 4.07 s [gammaloop-workspace-check] source root is source
  8. 4.11 s [gammaloop-workspace-check] Phase: patchPhase
  9. 4.11 s [gammaloop-workspace-check] Executing configureCargoCommonVars
  10. 4.11 s [gammaloop-workspace-check] decompressing cargo artifacts from /nix/store/50vpxlcgfxf2d57i27v3d10zjwxxbm2r-gammaloop-workspace-deps-deps-0.1.0/target.tar.zst to target
  11. 6.54 s [gammaloop-workspace-check] Phase: updateAutotoolsGnuConfigScriptsPhase
  12. 6.58 s [gammaloop-workspace-check] Phase: configurePhase
  13. 6.58 s [gammaloop-workspace-check] will append /build/source/.cargo-home/config.toml with contents of /nix/store/5drf77x6km4ky7gwlrzdx9bbd6fz09g3-vendor-cargo-deps/config.toml
  14. 6.58 s [gammaloop-workspace-check] default configurePhase, nothing to do
  15. 6.59 s [gammaloop-workspace-check] Phase: buildPhase
  16. 6.59 s [gammaloop-workspace-check] +++ command cargo --version
  17. 6.59 s [gammaloop-workspace-check] cargo 1.97.0 (c980f4866 2026-06-30)
  18. 6.62 s [gammaloop-workspace-check] +++ command cargo check --profile ci-optim --locked --workspace --features gammaloop-tracing-filter/clap,gammaloop-tracing-filter/symbolica,idenso/bincode,idenso/reference-cases,linnet/bincode,linnet/drawing,linnet/rkyv,linnet/serde,linnet/symbolica,spenso-macros/shadowing,spenso/shadowing,symbolica/tracing_max_level_info,three-dimensional-reps/display,three-dimensional-reps/eval,three-dimensional-reps/serde --all-targets
  19. 7.13 s [gammaloop-workspace-check] Checking cfg-if v1.0.4
  20. 7.13 s [gammaloop-workspace-check] Checking memchr v2.8.0
  21. 7.13 s [gammaloop-workspace-check] Checking once_cell v1.21.4
  22. 7.13 s [gammaloop-workspace-check] Checking either v1.15.0
  23. 7.14 s [gammaloop-workspace-check] Checking serde_core v1.0.228
  24. 7.14 s [gammaloop-workspace-check] Checking libc v0.2.186
  25. 7.15 s [gammaloop-workspace-check] Checking libm v0.2.16
  26. 7.16 s [gammaloop-workspace-check] Checking itoa v1.0.18
  27. 7.16 s [gammaloop-workspace-check] Checking log v0.4.29
  28. 7.18 s [gammaloop-workspace-check] Checking regex-syntax v0.8.10
  29. 7.19 s [gammaloop-workspace-check] Checking zerocopy v0.8.48
  30. 7.20 s [gammaloop-workspace-check] Checking crossbeam-utils v0.8.21
  31. 7.20 s [gammaloop-workspace-check] Checking equivalent v1.0.2
  32. 7.20 s [gammaloop-workspace-check] Checking zmij v1.0.21
  33. 7.20 s [gammaloop-workspace-check] Checking lazy_static v1.5.0
  34. 7.21 s [gammaloop-workspace-check] Checking bytemuck v1.25.0
  35. 7.21 s [gammaloop-workspace-check] Compiling target-lexicon v0.13.5
  36. 7.31 s [gammaloop-workspace-check] Checking arrayvec v0.7.6
  37. 7.31 s [gammaloop-workspace-check] Checking powerfmt v0.2.0
  38. 7.31 s [gammaloop-workspace-check] Checking pin-project-lite v0.2.17
  39. 7.31 s [gammaloop-workspace-check] Checking safe_arch v0.7.4
  40. 7.41 s [gammaloop-workspace-check] Checking time-core v0.1.8
  41. 7.44 s [gammaloop-workspace-check] Checking num_threads v0.1.7
  42. 7.45 s [gammaloop-workspace-check] Checking itertools v0.14.0
  43. 7.45 s [gammaloop-workspace-check] Checking num-conv v0.2.1
  44. 7.45 s [gammaloop-workspace-check] Checking foldhash v0.2.0
  45. 7.51 s [gammaloop-workspace-check] Checking allocator-api2 v0.2.21
  46. 7.52 s [gammaloop-workspace-check] Checking deranged v0.5.8
  47. 7.60 s [gammaloop-workspace-check] Checking const-random v0.1.18
  48. 7.60 s [gammaloop-workspace-check] Checking winnow v1.0.2
  49. 7.60 s [gammaloop-workspace-check] Checking nu-ansi-term v0.50.3
  50. 7.64 s [gammaloop-workspace-check] Checking wide v0.7.33
  51. 7.69 s [gammaloop-workspace-check] Checking tracing-core v0.1.36
  52. 7.71 s [gammaloop-workspace-check] Checking static_assertions v1.1.0
  53. 7.77 s [gammaloop-workspace-check] Checking unty v0.0.4
  54. 7.82 s [gammaloop-workspace-check] Checking sharded-slab v0.1.7
  55. 7.96 s [gammaloop-workspace-check] Checking safe_arch v1.0.0
  56. 7.97 s [gammaloop-workspace-check] Checking hashbrown v0.16.1
  57. 8.19 s [gammaloop-workspace-check] Checking aho-corasick v1.1.4
  58. 8.35 s [gammaloop-workspace-check] Checking crossbeam-epoch v0.9.18
  59. 8.45 s [gammaloop-workspace-check] Checking tracing v0.1.44
  60. 8.58 s [gammaloop-workspace-check] Checking tracing-log v0.2.0
  61. 8.64 s [gammaloop-workspace-check] Checking crossbeam-deque v0.8.6
  62. 8.73 s [gammaloop-workspace-check] Checking thread_local v1.1.9
  63. 8.75 s [gammaloop-workspace-check] Checking indenter v0.3.4
  64. 8.86 s [gammaloop-workspace-check] Checking az v1.3.0
  65. 8.91 s [gammaloop-workspace-check] Checking toml_writer v1.1.1+spec-1.1.0
  66. 8.91 s [gammaloop-workspace-check] Checking wide v1.3.0
  67. 8.93 s [gammaloop-workspace-check] Checking rayon-core v1.13.0
  68. 8.97 s [gammaloop-workspace-check] Compiling phf_shared v0.11.3
  69. 9.10 s [gammaloop-workspace-check] Checking anyhow v1.0.102
  70. 9.28 s [gammaloop-workspace-check] Checking rawpointer v0.2.1
  71. 9.30 s [gammaloop-workspace-check] Checking toml_parser v1.1.2+spec-1.1.0
  72. 9.34 s [gammaloop-workspace-check] Checking dyn-clone v1.0.20
  73. 9.34 s [gammaloop-workspace-check] Checking utf8parse v0.2.2
  74. 9.43 s [gammaloop-workspace-check] Checking alloc-no-stdlib v2.0.4
  75. 9.43 s [gammaloop-workspace-check] Checking anstyle-parse v1.0.0
  76. 9.52 s [gammaloop-workspace-check] Checking alloc-stdlib v0.2.2
  77. 9.53 s [gammaloop-workspace-check] Checking matrixmultiply v0.3.10
  78. 9.54 s [gammaloop-workspace-check] Checking rayon v1.12.0
  79. 9.59 s [gammaloop-workspace-check] Checking colorchoice v1.0.5
  80. 9.64 s [gammaloop-workspace-check] Checking anstyle-query v1.1.5
  81. 9.66 s [gammaloop-workspace-check] Checking anstyle v1.0.14
  82. 9.69 s [gammaloop-workspace-check] Checking colored v3.1.1
  83. 9.80 s [gammaloop-workspace-check] Checking is_terminal_polyfill v1.70.2
  84. 9.86 s [gammaloop-workspace-check] Checking anstream v1.0.0
  85. 9.89 s [gammaloop-workspace-check] Compiling phf_generator v0.11.3
  86. 9.92 s [gammaloop-workspace-check] Checking eyre v0.6.12
  87. 10.11 s [gammaloop-workspace-check] Checking serde v1.0.228
  88. 10.11 s [gammaloop-workspace-check] Checking serde_json v1.0.149
  89. 10.25 s [gammaloop-workspace-check] Compiling pyo3-build-config v0.28.3
  90. 10.26 s [gammaloop-workspace-check] Checking bitflags v2.11.1
  91. 10.35 s [gammaloop-workspace-check] Checking serde_spanned v1.1.1
  92. 10.36 s [gammaloop-workspace-check] Checking toml_datetime v1.1.1+spec-1.1.0
  93. 10.44 s [gammaloop-workspace-check] Checking bitflags v1.3.2
  94. 10.48 s [gammaloop-workspace-check] Checking unicode-width v0.2.2
  95. 10.49 s [gammaloop-workspace-check] Compiling phf_codegen v0.11.3
  96. 10.55 s [gammaloop-workspace-check] Checking num-traits v0.2.19
  97. 10.56 s [gammaloop-workspace-check] Checking getrandom v0.3.4
  98. 10.57 s [gammaloop-workspace-check] Checking time v0.3.47
  99. 10.60 s [gammaloop-workspace-check] Checking gmp-mpfr-sys v1.7.1
  100. 10.63 s [gammaloop-workspace-check] Checking hugepage-rs v0.1.1
  101. 10.69 s [gammaloop-workspace-check] Checking region v3.0.2
  102. 10.71 s [gammaloop-workspace-check] Checking wasmtime-jit-icache-coherence v34.0.2
  103. 10.77 s [gammaloop-workspace-check] Checking brotli-decompressor v5.0.0
  104. 10.78 s [gammaloop-workspace-check] Checking inventory v0.3.24
  105. 10.83 s [gammaloop-workspace-check] Checking smallvec v1.15.1
  106. 11.01 s [gammaloop-workspace-check] Checking tracing-serde v0.2.0
  107. 11.02 s [gammaloop-workspace-check] Checking regex-automata v0.4.14
  108. 11.02 s [gammaloop-workspace-check] Checking rand_core v0.9.5
  109. 11.04 s [gammaloop-workspace-check] Checking bincode v2.0.1
  110. 11.04 s [gammaloop-workspace-check] Checking toml v1.1.2+spec-1.1.0
  111. 11.05 s [gammaloop-workspace-check] Checking spec_math v0.1.6
  112. 11.06 s [gammaloop-workspace-check] Checking smartstring v1.0.1
  113. 11.16 s [gammaloop-workspace-check] Checking thiserror v2.0.18
  114. 11.20 s [gammaloop-workspace-check] Compiling getopts v0.2.24
  115. 11.21 s [gammaloop-workspace-check] Checking libloading v0.9.0
  116. 11.24 s [gammaloop-workspace-check] Checking append-only-vec v0.1.8
  117. 11.41 s [gammaloop-workspace-check] Checking self_cell v1.2.2
  118. 11.42 s [gammaloop-workspace-check] Checking tinyjson v2.5.1
  119. 11.44 s [gammaloop-workspace-check] Checking bytes v1.11.1
  120. 11.47 s [gammaloop-workspace-check] Checking byteorder v1.5.0
  121. 11.55 s [gammaloop-workspace-check] Checking linux-raw-sys v0.12.1
  122. 11.63 s [gammaloop-workspace-check] Checking num-complex v0.4.6
  123. 11.83 s [gammaloop-workspace-check] Checking approx v0.5.1
  124. 11.85 s [gammaloop-workspace-check] Checking num-integer v0.1.46
  125. 11.88 s [gammaloop-workspace-check] Compiling unicode_names2_generator v1.3.0
  126. 11.92 s [gammaloop-workspace-check] Compiling unic-char-range v0.9.0
  127. 11.97 s [gammaloop-workspace-check] Checking brotli v8.0.2
  128. 12.05 s [gammaloop-workspace-check] Compiling unic-common v0.9.0
  129. 12.10 s [gammaloop-workspace-check] Compiling unic-char-property v0.9.0
  130. 12.11 s [gammaloop-workspace-check] Checking rustix v1.1.4
  131. 12.12 s [gammaloop-workspace-check] Compiling is-macro v0.3.7
  132. 12.20 s [gammaloop-workspace-check] Compiling unic-ucd-version v0.9.0
  133. 12.24 s [gammaloop-workspace-check] Compiling rustpython-parser-vendored v0.4.0
  134. 12.25 s [gammaloop-workspace-check] Checking iana-time-zone v0.1.65
  135. 12.30 s [gammaloop-workspace-check] Checking simba v0.9.1
  136. 12.32 s [gammaloop-workspace-check] Compiling rustpython-parser v0.4.0
  137. 12.39 s [gammaloop-workspace-check] Checking chrono v0.4.44
  138. 12.39 s [gammaloop-workspace-check] Compiling phf v0.11.3
  139. 12.55 s [gammaloop-workspace-check] Checking rustc-hash v2.1.2
  140. 12.62 s [gammaloop-workspace-check] Checking ndarray v0.17.2
  141. 12.71 s [gammaloop-workspace-check] Compiling unic-ucd-ident v0.9.0
  142. 12.95 s [gammaloop-workspace-check] Compiling unic-emoji-char v0.9.0
  143. 12.97 s [gammaloop-workspace-check] Compiling rustc-hash v1.1.0
  144. 12.98 s [gammaloop-workspace-check] Compiling lalrpop-util v0.20.2
  145. 12.99 s [gammaloop-workspace-check] Checking ppv-lite86 v0.2.21
  146. 13.03 s [gammaloop-workspace-check] Checking ahash v0.8.12
  147. 13.11 s [gammaloop-workspace-check] Checking rug v1.30.0
  148. 13.23 s [gammaloop-workspace-check] Compiling symbolica v2.2.0 (https://github.com/alphal00p/symbolica?rev=a277a8dadbaae5a8d6605f2f381991a601e1f345#a277a8da)
  149. 13.26 s [gammaloop-workspace-check] Checking unicode-segmentation v1.13.2
  150. 13.27 s [gammaloop-workspace-check] Checking typenum v1.20.0
  151. 13.28 s [gammaloop-workspace-check] Checking getrandom v0.2.17
  152. 13.30 s [gammaloop-workspace-check] Checking rand_chacha v0.9.0
  153. 13.46 s [gammaloop-workspace-check] Checking rand v0.9.4
  154. 13.48 s [gammaloop-workspace-check] Checking scopeguard v1.2.0
  155. 13.53 s [gammaloop-workspace-check] Checking lock_api v0.4.14
  156. 13.60 s [gammaloop-workspace-check] Checking parking_lot_core v0.9.12
  157. 13.72 s [gammaloop-workspace-check] Checking unicode-ident v1.0.24
  158. 13.76 s [gammaloop-workspace-check] Checking hashbrown v0.17.0
  159. 13.79 s [gammaloop-workspace-check] Checking errno v0.3.14
  160. 13.81 s [gammaloop-workspace-check] Checking parking_lot v0.12.5
  161. 13.81 s [gammaloop-workspace-check] Checking clap_lex v1.1.0
  162. 13.91 s [gammaloop-workspace-check] Checking symjit v2.21.0
  163. 13.91 s [gammaloop-workspace-check] Checking strsim v0.11.1
  164. 13.98 s [gammaloop-workspace-check] Checking unicase v2.9.0
  165. 14.05 s [gammaloop-workspace-check] Checking signal-hook-registry v1.4.8
  166. 14.06 s [gammaloop-workspace-check] Checking vte v0.14.1
  167. 14.07 s [gammaloop-workspace-check] Checking same-file v1.0.6
  168. 14.18 s [gammaloop-workspace-check] Checking walkdir v2.5.0
  169. 14.20 s [gammaloop-workspace-check] Checking generic-array v0.14.7
  170. 14.21 s [gammaloop-workspace-check] Checking half v2.7.1
  171. 14.22 s [gammaloop-workspace-check] Checking terminal_size v0.4.4
  172. 14.35 s [gammaloop-workspace-check] Checking clap_builder v4.6.0
  173. 14.35 s [gammaloop-workspace-check] Checking signal-hook v0.3.18
  174. 14.35 s [gammaloop-workspace-check] Checking mio v1.2.0
  175. 14.38 s [gammaloop-workspace-check] Checking indexmap v2.14.0
  176. 14.44 s [gammaloop-workspace-check] Checking ciborium-io v0.2.2
  177. 14.51 s [gammaloop-workspace-check] Checking minimal-lexical v0.2.1
  178. 14.56 s [gammaloop-workspace-check] Checking ciborium-ll v0.2.2
  179. 14.59 s [gammaloop-workspace-check] Checking block-buffer v0.10.4
  180. 14.62 s [gammaloop-workspace-check] Checking crypto-common v0.1.7
  181. 14.67 s [gammaloop-workspace-check] Checking signal-hook-mio v0.2.5
  182. 14.68 s [gammaloop-workspace-check] Checking digest v0.10.7
  183. 14.70 s [gammaloop-workspace-check] Checking derive_more v2.1.1
  184. 14.72 s [gammaloop-workspace-check] Checking nom v7.1.3
  185. 14.73 s [gammaloop-workspace-check] Checking matchers v0.2.0
  186. 14.73 s [gammaloop-workspace-check] Checking regex v1.12.3
  187. 14.75 s [gammaloop-workspace-check] Checking num-bigint v0.4.6
  188. 14.80 s [gammaloop-workspace-check] Checking console v0.16.3
  189. 14.85 s [gammaloop-workspace-check] Checking tracing-subscriber v0.3.23
  190. 15.06 s [gammaloop-workspace-check] Checking bstr v1.12.1
  191. 15.07 s [gammaloop-workspace-check] Checking linux-raw-sys v0.4.15
  192. 15.13 s [gammaloop-workspace-check] Checking cpufeatures v0.2.17
  193. 15.20 s [gammaloop-workspace-check] Checking winnow v0.7.15
  194. 15.28 s [gammaloop-workspace-check] Checking rustix v0.38.44
  195. 15.31 s [gammaloop-workspace-check] Checking sha2 v0.10.9
  196. 15.36 s [gammaloop-workspace-check] Checking globset v0.4.18
  197. 15.49 s [gammaloop-workspace-check] Checking ciborium v0.2.2
  198. 15.72 s [gammaloop-workspace-check] Checking getrandom v0.4.2
  199. 15.73 s [gammaloop-workspace-check] Checking rand_core v0.6.4
  200. 15.74 s [gammaloop-workspace-check] Checking ansitok v0.3.0
  201. 15.76 s [gammaloop-workspace-check] Checking fastrand v2.4.1
  202. 15.82 s [gammaloop-workspace-check] Checking fnv v1.0.7
  203. 15.83 s [gammaloop-workspace-check] Compiling unicode_names2 v1.3.0
  204. 15.89 s [gammaloop-workspace-check] Checking plotters-backend v0.3.7
  205. 15.90 s [gammaloop-workspace-check] Checking tempfile v3.27.0
  206. 15.94 s [gammaloop-workspace-check] Checking rust-embed-utils v8.11.0
  207. 16.00 s [gammaloop-workspace-check] Checking crossterm v0.28.1
  208. 16.00 s [gammaloop-workspace-check] Checking serde_spanned v0.6.9
  209. 16.00 s [gammaloop-workspace-check] Checking toml_datetime v0.6.11
  210. 16.02 s [gammaloop-workspace-check] Checking itertools v0.10.5
  211. 16.09 s [gammaloop-workspace-check] Checking cast v0.3.0
  212. 16.11 s [gammaloop-workspace-check] Checking plotters-svg v0.3.7
  213. 16.12 s [gammaloop-workspace-check] Checking toml_write v0.1.2
  214. 16.13 s [gammaloop-workspace-check] Checking tap v1.0.1
  215. 16.16 s [gammaloop-workspace-check] Checking ansi-str v0.9.0
  216. 16.20 s [gammaloop-workspace-check] Checking plotters v0.3.7
  217. 16.21 s [gammaloop-workspace-check] Checking rand_chacha v0.3.1
  218. 16.23 s [gammaloop-workspace-check] Checking wyz v0.5.1
  219. 16.25 s [gammaloop-workspace-check] Checking radium v0.7.0
  220. 16.28 s [gammaloop-workspace-check] Checking xprec v0.2.2
  221. 16.36 s [gammaloop-workspace-check] Checking toml_edit v0.22.27
  222. 16.38 s [gammaloop-workspace-check] Checking typeid v1.0.3
  223. 16.41 s [gammaloop-workspace-check] Checking similar v2.7.0
  224. 16.43 s [gammaloop-workspace-check] Checking tinytemplate v1.2.1
  225. 16.47 s [gammaloop-workspace-check] Checking is-terminal v0.4.17
  226. 16.52 s [gammaloop-workspace-check] Checking bytecount v0.6.9
  227. 16.53 s [gammaloop-workspace-check] Checking anes v0.1.6
  228. 16.53 s [gammaloop-workspace-check] Checking oorandom v11.1.5
  229. 16.60 s [gammaloop-workspace-check] Checking funty v2.0.0
  230. 16.62 s [gammaloop-workspace-check] Checking papergrid v0.17.0
  231. 16.63 s [gammaloop-workspace-check] Checking ron v0.12.1
  232. 16.67 s [gammaloop-workspace-check] Checking clap v4.6.1
  233. 16.73 s [gammaloop-workspace-check] Checking rand v0.8.6
  234. 16.78 s [gammaloop-workspace-check] Checking testing_table v0.3.0
  235. 16.81 s [gammaloop-workspace-check] Checking env_filter v1.0.1
  236. 16.85 s [gammaloop-workspace-check] Checking toml_edit v0.25.11+spec-1.1.0
  237. 16.87 s [gammaloop-workspace-check] Checking uncased v0.9.10
  238. 16.98 s [gammaloop-workspace-check] Checking jiff v0.2.24
  239. 16.98 s [gammaloop-workspace-check] Checking ptr_meta v0.1.4
  240. 17.00 s [gammaloop-workspace-check] Checking bitvec v1.0.1
  241. 17.00 s [gammaloop-workspace-check] Checking simdutf8 v0.1.5
  242. 17.00 s [gammaloop-workspace-check] Checking ucd-trie v0.1.7
  243. 17.03 s [gammaloop-workspace-check] Checking criterion-plot v0.5.0
  244. 17.07 s [gammaloop-workspace-check] Checking ahash v0.7.8
  245. 17.12 s [gammaloop-workspace-check] Checking bytecheck v0.6.12
  246. 17.18 s [gammaloop-workspace-check] Checking pest v2.8.6
  247. 17.23 s [gammaloop-workspace-check] Checking hashbrown v0.12.3
  248. 17.27 s [gammaloop-workspace-check] Checking criterion v0.5.1
  249. 17.33 s [gammaloop-workspace-check] Checking approx v0.4.0
  250. 17.34 s [gammaloop-workspace-check] Checking seahash v4.1.0
  251. 17.41 s [gammaloop-workspace-check] Checking cgmath v0.18.0
  252. 17.45 s [gammaloop-workspace-check] Checking num-rational v0.4.2
  253. 17.58 s [gammaloop-workspace-check] Checking num-iter v0.1.45
  254. 17.60 s [gammaloop-workspace-check] Checking rend v0.4.2
  255. 17.62 s [gammaloop-workspace-check] Checking insta v1.47.2
  256. 17.63 s [gammaloop-workspace-check] Checking ref-ops v0.2.5
  257. 17.66 s [gammaloop-workspace-check] Checking toml v0.8.23
  258. 17.69 s [gammaloop-workspace-check] Checking rand_xoshiro v0.6.0
  259. 17.80 s [gammaloop-workspace-check] Checking tabled v0.20.0
  260. 17.89 s [gammaloop-workspace-check] Compiling pyo3-ffi v0.28.3
  261. 17.91 s [gammaloop-workspace-check] Compiling pyo3-macros-backend v0.28.3
  262. 17.94 s [gammaloop-workspace-check] Compiling pyo3 v0.28.3
  263. 17.95 s [gammaloop-workspace-check] Compiling numpy v0.28.0
  264. 17.99 s [gammaloop-workspace-check] Checking figment v0.10.19
  265. 18.34 s [gammaloop-workspace-check] Checking num v0.4.3
  266. 18.37 s [gammaloop-workspace-check] Checking features v0.10.0
  267. 18.38 s [gammaloop-workspace-check] Checking gat-lending-iterator v0.1.8
  268. 18.38 s [gammaloop-workspace-check] Checking constcat v0.5.1
  269. 18.40 s [gammaloop-workspace-check] Checking dot-parser v0.5.1
  270. 18.42 s [gammaloop-workspace-check] Checking colored v2.2.0
  271. 18.43 s [gammaloop-workspace-check] Checking cpufeatures v0.3.0
  272. 18.47 s [gammaloop-workspace-check] Checking constant_time_eq v0.4.2
  273. 18.51 s [gammaloop-workspace-check] Checking arrayref v0.3.9
  274. 18.53 s [gammaloop-workspace-check] Checking base64 v0.22.1
  275. 18.54 s [gammaloop-workspace-check] Checking siphasher v1.0.2
  276. 18.55 s [gammaloop-workspace-check] Checking blake3 v1.8.5
  277. 18.59 s [gammaloop-workspace-check] Checking joinery v2.1.0
  278. 18.66 s [gammaloop-workspace-check] Checking subprocess v0.2.15
  279. 18.67 s [gammaloop-workspace-check] Checking rust_lisp v0.18.0
  280. 18.68 s [gammaloop-workspace-check] Checking phf_shared v0.13.1
  281. 18.71 s [gammaloop-workspace-check] Checking titlecase v2.2.1
  282. 18.77 s [gammaloop-workspace-check] Compiling vakint v0.1.2 (/build/source/crates/vakint)
  283. 18.78 s [gammaloop-workspace-check] Checking version-compare v0.2.1
  284. 18.81 s [gammaloop-workspace-check] Checking xpct v0.5.1
  285. 18.83 s [gammaloop-workspace-check] Checking ryu v1.0.23
  286. 18.85 s [gammaloop-workspace-check] Checking castaway v0.2.4
  287. 18.86 s [gammaloop-workspace-check] Checking toml_datetime v0.7.5+spec-1.1.0
  288. 18.90 s [gammaloop-workspace-check] Checking phf v0.13.1
  289. 18.93 s [gammaloop-workspace-check] Checking strum v0.27.2
  290. 18.93 s [gammaloop-workspace-check] Checking unicode-truncate v2.0.1
  291. 18.94 s [gammaloop-workspace-check] Checking compact_str v0.9.0
  292. 18.99 s [gammaloop-workspace-check] Checking kasuari v0.4.12
  293. 19.01 s [gammaloop-workspace-check] Checking lru v0.16.4
  294. 19.02 s [gammaloop-workspace-check] Checking vte v0.15.0
  295. 19.03 s [gammaloop-workspace-check] Checking string-template-plus v0.4.3
  296. 19.03 s [gammaloop-workspace-check] Checking portable-atomic v1.13.1
  297. 19.05 s [gammaloop-workspace-check] Checking toml v0.9.12+spec-1.1.0
  298. 19.11 s [gammaloop-workspace-check] Checking unit-prefix v0.5.2
  299. 19.13 s [gammaloop-workspace-check] Checking vt100 v0.16.2
  300. 19.15 s [gammaloop-workspace-check] Checking rand_distr v0.4.3
  301. 19.17 s [gammaloop-workspace-check] Checking simba v0.6.0
  302. 19.18 s [gammaloop-workspace-check] Checking line-clipping v0.3.7
  303. 19.20 s [gammaloop-workspace-check] Compiling three-dimensional-reps v0.1.0 (/build/source/crates/three-dimensional-reps)
  304. 19.21 s [gammaloop-workspace-check] Checking adler2 v2.0.1
  305. 19.27 s [gammaloop-workspace-check] Checking gimli v0.32.3
  306. 19.30 s [gammaloop-workspace-check] Checking thiserror v1.0.69
  307. 19.31 s [gammaloop-workspace-check] Checking miniz_oxide v0.8.9
  308. 19.31 s [gammaloop-workspace-check] Checking derive_builder v0.11.2
  309. 19.35 s [gammaloop-workspace-check] Checking owo-colors v4.3.0
  310. 19.39 s [gammaloop-workspace-check] Checking object v0.37.3
  311. 19.40 s [gammaloop-workspace-check] Checking crossterm v0.29.0
  312. 19.44 s [gammaloop-workspace-check] Checking env_logger v0.11.10
  313. 19.45 s [gammaloop-workspace-check] Checking ratatui-core v0.1.0
  314. 19.46 s [gammaloop-workspace-check] Checking tracing-error v0.2.1
  315. 19.49 s [gammaloop-workspace-check] Checking indicatif v0.18.4
  316. 19.51 s [gammaloop-workspace-check] Checking typed-index-collections v3.5.0
  317. 19.58 s [gammaloop-workspace-check] Checking amd v0.2.2
  318. 19.61 s [gammaloop-workspace-check] Checking serde-big-array v0.5.1
  319. 19.68 s [gammaloop-workspace-check] Checking itertools v0.11.0
  320. 19.73 s [gammaloop-workspace-check] Compiling gammaloop-tracing-filter-macros v0.1.0 (/build/source/crates/gammaloop-tracing-filter-macros)
  321. 19.78 s [gammaloop-workspace-check] Checking rkyv v0.7.46
  322. 19.80 s [gammaloop-workspace-check] Checking rustc-demangle v0.1.27
  323. 19.82 s [gammaloop-workspace-check] Checking option-ext v0.2.0
  324. 19.85 s [gammaloop-workspace-check] Checking ref-cast v1.0.25
  325. 19.86 s [gammaloop-workspace-check] Compiling rustpython-parser-core v0.4.0
  326. 19.87 s [gammaloop-workspace-check] Checking dirs-sys v0.5.0
  327. 19.91 s [gammaloop-workspace-check] Checking color-spantrace v0.3.0
  328. 19.92 s [gammaloop-workspace-check] Checking nix v0.31.2
  329. 20.00 s [gammaloop-workspace-check] Checking integer-sqrt v0.1.5
  330. 20.01 s [gammaloop-workspace-check] Checking brotli-decompressor v4.0.3
  331. 20.04 s [gammaloop-workspace-check] Checking crossbeam-channel v0.5.15
  332. 20.06 s [gammaloop-workspace-check] Checking itertools v0.12.1
  333. 20.06 s [gammaloop-workspace-check] Checking unsafe-libyaml v0.2.11
  334. 20.14 s [gammaloop-workspace-check] Compiling rustpython-ast v0.4.0
  335. 20.15 s [gammaloop-workspace-check] Checking symlink v0.1.0
  336. 20.22 s [gammaloop-workspace-check] Compiling gammalooprs v0.3.4 (/build/source/crates/gammalooprs)
  337. 20.23 s [gammaloop-workspace-check] Checking include_dir v0.7.4
  338. 20.35 s [gammaloop-workspace-check] Checking ratatui-widgets v0.3.0
  339. 20.36 s [gammaloop-workspace-check] Checking ratatui-crossterm v0.1.0
  340. 20.49 s [gammaloop-workspace-check] Checking ctrlc v3.5.2
  341. 20.51 s [gammaloop-workspace-check] Checking pathfinding v4.15.0
  342. 20.52 s [gammaloop-workspace-check] Checking clarabel v0.11.1
  343. 20.56 s [gammaloop-workspace-check] Checking tracing-indicatif v0.3.14
  344. 20.59 s [gammaloop-workspace-check] Checking dirs v6.0.0
  345. 20.60 s [gammaloop-workspace-check] Checking tracing-appender v0.2.5
  346. 20.63 s [gammaloop-workspace-check] Checking brotli v7.0.0
  347. 20.65 s [gammaloop-workspace-check] Checking schemars v1.2.1
  348. 20.74 s [gammaloop-workspace-check] Checking slotmap v1.1.1
  349. 20.83 s [gammaloop-workspace-check] Checking serde_yaml v0.9.34+deprecated
  350. 20.88 s [gammaloop-workspace-check] Checking json5 v0.4.1
  351. 20.95 s [gammaloop-workspace-check] Checking vectorize v0.2.0
  352. 20.99 s [gammaloop-workspace-check] Checking ringbuffer v0.16.0
  353. 21.10 s [gammaloop-workspace-check] Checking addr2line v0.25.1
  354. 21.11 s [gammaloop-workspace-check] Checking base62 v2.2.4
  355. 21.11 s [gammaloop-workspace-check] Checking rust-embed v8.11.0
  356. 21.15 s [gammaloop-workspace-check] Checking clap_complete v4.6.3
  357. 21.18 s [gammaloop-workspace-check] Checking fd-lock v4.0.4
  358. 21.19 s [gammaloop-workspace-check] Checking ratatui-macros v0.7.0
  359. 21.20 s [gammaloop-workspace-check] Checking strip-ansi-escapes v0.2.1
  360. 21.24 s [gammaloop-workspace-check] Compiling gammaloop-api v0.1.0 (/build/source/crates/gammaloop-api)
  361. 21.29 s [gammaloop-workspace-check] Checking ratatui v0.30.0
  362. 21.30 s [gammaloop-workspace-check] Checking itertools v0.13.0
  363. 21.31 s [gammaloop-workspace-check] Checking strum v0.26.3
  364. 21.32 s [gammaloop-workspace-check] Checking sysinfo v0.33.1
  365. 21.37 s [gammaloop-workspace-check] Checking shlex v1.3.0
  366. 21.38 s [gammaloop-workspace-check] Checking futures-task v0.3.32
  367. 21.46 s [gammaloop-workspace-check] Checking futures-core v0.3.32
  368. 21.49 s [gammaloop-workspace-check] Checking slab v0.4.12
  369. 21.55 s [gammaloop-workspace-check] Checking clap_complete_nushell v4.6.0
  370. 21.56 s [gammaloop-workspace-check] Checking sdd v3.0.10
  371. 21.57 s [gammaloop-workspace-check] Compiling gammaloop-integration-tests v0.1.0 (/build/source/tests)
  372. 21.60 s [gammaloop-workspace-check] Compiling test-log-core v0.2.20
  373. 21.61 s [gammaloop-workspace-check] Checking futures-util v0.3.32
  374. 21.65 s [gammaloop-workspace-check] Compiling rustc_version v0.4.1
  375. 21.71 s [gammaloop-workspace-check] Checking which v8.0.2
  376. 21.72 s [gammaloop-workspace-check] Checking bincode v1.3.3
  377. 21.80 s [gammaloop-workspace-check] Checking scc v2.4.0
  378. 21.85 s [gammaloop-workspace-check] Compiling numerica v2.2.0 (https://github.com/alphal00p/symbolica?rev=a277a8dadbaae5a8d6605f2f381991a601e1f345#a277a8da)
  379. 21.90 s [gammaloop-workspace-check] Compiling gungraun-runner v0.18.2
  380. 22.42 s [gammaloop-workspace-check] Checking nalgebra v0.29.0
  381. 22.45 s [gammaloop-workspace-check] Checking backtrace v0.3.76
  382. 22.50 s [gammaloop-workspace-check] Compiling gungraun-macros v0.8.0
  383. 22.53 s [gammaloop-workspace-check] Checking reedline v0.42.0
  384. 22.78 s [gammaloop-workspace-check] Checking color-eyre v0.6.5
  385. 22.95 s [gammaloop-workspace-check] Checking proc-macro2 v1.0.106
  386. 23.01 s [gammaloop-workspace-check] Checking futures-executor v0.3.32
  387. 23.13 s [gammaloop-workspace-check] Checking serial_test v3.4.0
  388. 23.15 s [gammaloop-workspace-check] Checking maplit v1.0.2
  389. 23.20 s [gammaloop-workspace-check] Checking base64 v0.21.7
  390. 23.23 s [gammaloop-workspace-check] Compiling iai-callgrind-runner v0.14.2
  391. 23.35 s [gammaloop-workspace-check] Checking kurbo v0.13.0
  392. 23.37 s [gammaloop-workspace-check] Checking quote v1.0.45
  393. 23.37 s [gammaloop-workspace-check] Checking wait-timeout v0.2.1
  394. 23.46 s [gammaloop-workspace-check] Checking bit-vec v0.8.0
  395. 23.46 s [gammaloop-workspace-check] Checking ron v0.8.1
  396. 23.49 s [gammaloop-workspace-check] Compiling iai-callgrind v0.14.2
  397. 23.57 s [gammaloop-workspace-check] Checking quick-error v1.2.3
  398. 23.64 s [gammaloop-workspace-check] Checking bit-set v0.8.0
  399. 23.65 s [gammaloop-workspace-check] Checking rusty-fork v0.3.1
  400. 23.78 s [gammaloop-workspace-check] Checking syn v2.0.117
  401. 23.82 s [gammaloop-workspace-check] Compiling iai-callgrind-macros v0.5.1
  402. 23.90 s [gammaloop-workspace-check] Compiling test-log-macros v0.2.20
  403. 23.90 s [gammaloop-workspace-check] Checking rand_xorshift v0.4.0
  404. 23.98 s [gammaloop-workspace-check] Checking console v0.15.11
  405. 24.02 s [gammaloop-workspace-check] Checking unarray v0.1.4
  406. 24.04 s [gammaloop-workspace-check] Checking pathdiff v0.2.3
  407. 24.09 s [gammaloop-workspace-check] Checking proptest v1.11.0
  408. 24.11 s [gammaloop-workspace-check] Checking clinnet v0.1.8 (/build/source/crates/clinnet)
  409. 24.40 s [gammaloop-workspace-check] Checking similar-asserts v1.7.0
  410. 24.53 s [gammaloop-workspace-check] Checking kurvst v0.1.0 (/build/source/crates/kurvst)
  411. 25.45 s [gammaloop-workspace-check] Compiling graphica v2.1.0 (https://github.com/alphal00p/symbolica?rev=a277a8dadbaae5a8d6605f2f381991a601e1f345#a277a8da)
  412. 26.33 s [gammaloop-workspace-check] Checking test-log v0.2.20
  413. 29.31 s [gammaloop-workspace-check] Checking statrs v0.16.1
  414. 30.80 s [gammaloop-workspace-check] Checking momtrop v0.3.0
  415. 33.74 s [gammaloop-workspace-check] Checking gungraun v0.18.2
  416. 34.51 s [gammaloop-workspace-check] Compiling pyo3-macros v0.28.3
  417. 35.55 s [gammaloop-workspace-check] Compiling pyo3-stub-gen-derive v0.17.2
  418. 41.26 s [gammaloop-workspace-check] Checking pyo3-stub-gen v0.17.2
  419. 48.07 s [gammaloop-workspace-check] Checking symbolica-utils v0.1.0 (/build/source/crates/symbolica-utils)
  420. 48.07 s [gammaloop-workspace-check] Checking spenso-macros v0.3.2 (/build/source/crates/spenso-macros)
  421. 241.79 s [gammaloop-workspace-check] Compiling gammaloop-workspace-hack v0.1.0 (/build/source/crates/gammaloop-workspace-hack)
  422. 242.27 s [gammaloop-workspace-check] Checking linnet v0.17.0 (/build/source/crates/linnet)
  423. 246.01 s [gammaloop-workspace-check] Checking spenso v0.6.0 (/build/source/crates/spenso)
  424. 246.26 s [gammaloop-workspace-check] Checking linnet-py v0.1.0 (/build/source/crates/linnet-py)
  425. 246.26 s [gammaloop-workspace-check] Checking linnest v0.1.0 (/build/source/crates/linnest)
  426. 253.36 s [gammaloop-workspace-check] Checking idenso v0.3.0 (/build/source/crates/idenso)
  427. 253.36 s [gammaloop-workspace-check] Checking gammaloop-tracing-filter v0.1.0 (/build/source/crates/gammaloop-tracing-filter)
  428. 255.44 s [gammaloop-workspace-check] Checking spenso-hep-lib v0.1.7 (/build/source/crates/spenso-hep-lib)
  429. 255.65 s [gammaloop-workspace-check] Checking spynso3 v0.1.2 (/build/source/crates/spynso3)
  430. 305.84 s [gammaloop-workspace-check] error[E0609]: no field `lmb_channel_id` on type `CutInfo`
  431. 305.84 s [gammaloop-workspace-check] --> tests/tests/test_runs/utils.rs:568:36
  432. 305.84 s [gammaloop-workspace-check] |
  433. 305.84 s [gammaloop-workspace-check] 568 | event.cut_info.lmb_channel_id,
  434. 305.84 s [gammaloop-workspace-check] | ^^^^^^^^^^^^^^ unknown field
  435. 305.84 s [gammaloop-workspace-check] |
  436. 305.84 s [gammaloop-workspace-check] = note: available fields are: `particle_pdgs`, `cut_id`, `graph_id`, `graph_group_id`, `orientation_id` ... and 2 others
  437. 305.84 s [gammaloop-workspace-check]
  438. 305.84 s [gammaloop-workspace-check] error[E0609]: no field `lmb_channel_id` on type `CutInfo`
  439. 305.84 s [gammaloop-workspace-check] --> tests/tests/test_runs/utils.rs:580:36
  440. 305.84 s [gammaloop-workspace-check] |
  441. 305.84 s [gammaloop-workspace-check] 580 | event.cut_info.lmb_channel_id,
  442. 305.84 s [gammaloop-workspace-check] | ^^^^^^^^^^^^^^ unknown field
  443. 305.84 s [gammaloop-workspace-check] |
  444. 305.84 s [gammaloop-workspace-check] = note: available fields are: `particle_pdgs`, `cut_id`, `graph_id`, `graph_group_id`, `orientation_id` ... and 2 others
  445. 305.84 s [gammaloop-workspace-check]
  446. 306.30 s [gammaloop-workspace-check] For more information about this error, try `rustc --explain E0609`.
  447. 306.32 s [gammaloop-workspace-check] error: could not compile `gammaloop-integration-tests` (test "test_runs") due to 2 previous errors
  448. 306.74 s Progress: 0 of 1 built (1 failed)
  449. 306.74 s Failed to build gammaloop-workspace-check after 5m02s
  450. 306.75 s Cannot build '/nix/store/01wv2cvlxmkwk15rfvw73pimfsfm321c-gammaloop-workspace-check-0.1.0.drv'.
  451. 306.75 s Reason: builder failed with exit code 101.
  452. 306.75 s Output paths:
  453. 306.75 s /nix/store/yxmn18c7b66m3gq4ry6q3s28b9ipm4q2-gammaloop-workspace-check-0.1.0
  454. 306.75 s Last 443 log lines:
  455. 306.75 s > Running phase: unpackPhase
  456. 306.75 s > unpacking source archive /nix/store/p4kvydb95jp9jm0ylgbb2r217q4zaj95-source
  457. 306.75 s > source root is source
  458. 306.75 s > Running phase: patchPhase
  459. 306.75 s > Executing configureCargoCommonVars
  460. 306.75 s > decompressing cargo artifacts from /nix/store/50vpxlcgfxf2d57i27v3d10zjwxxbm2r-gammaloop-workspace-deps-deps-0.1.0/target.tar.zst to target
  461. 306.75 s > Running phase: updateAutotoolsGnuConfigScriptsPhase
  462. 306.75 s > Running phase: configurePhase
  463. 306.75 s > will append /build/source/.cargo-home/config.toml with contents of /nix/store/5drf77x6km4ky7gwlrzdx9bbd6fz09g3-vendor-cargo-deps/config.toml
  464. 306.75 s > default configurePhase, nothing to do
  465. 306.75 s > Running phase: buildPhase
  466. 306.75 s > +++ command cargo --version
  467. 306.75 s > cargo 1.97.0 (c980f4866 2026-06-30)
  468. 306.75 s > +++ command cargo check --profile ci-optim --locked --workspace --features gammaloop-tracing-filter/clap,gammaloop-tracing-filter/symbolica,idenso/bincode,idenso/reference-cases,linnet/bincode,linnet/drawing,linnet/rkyv,linnet/serde,linnet/symbolica,spenso-macros/shadowing,spenso/shadowing,symbolica/tracing_max_level_info,three-dimensional-reps/display,three-dimensional-reps/eval,three-dimensional-reps/serde --all-targets
  469. 306.75 s > Checking cfg-if v1.0.4
  470. 306.75 s > Checking memchr v2.8.0
  471. 306.75 s > Checking once_cell v1.21.4
  472. 306.75 s > Checking either v1.15.0
  473. 306.75 s > Checking serde_core v1.0.228
  474. 306.75 s > Checking libc v0.2.186
  475. 306.75 s > Checking libm v0.2.16
  476. 306.75 s > Checking itoa v1.0.18
  477. 306.75 s > Checking log v0.4.29
  478. 306.75 s > Checking regex-syntax v0.8.10
  479. 306.75 s > Checking zerocopy v0.8.48
  480. 306.75 s > Checking crossbeam-utils v0.8.21
  481. 306.75 s > Checking equivalent v1.0.2
  482. 306.75 s > Checking zmij v1.0.21
  483. 306.75 s > Checking lazy_static v1.5.0
  484. 306.75 s > Checking bytemuck v1.25.0
  485. 306.75 s > Compiling target-lexicon v0.13.5
  486. 306.75 s > Checking arrayvec v0.7.6
  487. 306.75 s > Checking powerfmt v0.2.0
  488. 306.75 s > Checking pin-project-lite v0.2.17
  489. 306.75 s > Checking safe_arch v0.7.4
  490. 306.75 s > Checking time-core v0.1.8
  491. 306.75 s > Checking num_threads v0.1.7
  492. 306.75 s > Checking itertools v0.14.0
  493. 306.75 s > Checking num-conv v0.2.1
  494. 306.75 s > Checking foldhash v0.2.0
  495. 306.75 s > Checking allocator-api2 v0.2.21
  496. 306.75 s > Checking deranged v0.5.8
  497. 306.75 s > Checking const-random v0.1.18
  498. 306.75 s > Checking winnow v1.0.2
  499. 306.75 s > Checking nu-ansi-term v0.50.3
  500. 306.75 s > Checking wide v0.7.33
  501. 306.75 s > Checking tracing-core v0.1.36
  502. 306.75 s > Checking static_assertions v1.1.0
  503. 306.75 s > Checking unty v0.0.4
  504. 306.75 s > Checking sharded-slab v0.1.7
  505. 306.75 s > Checking safe_arch v1.0.0
  506. 306.75 s > Checking hashbrown v0.16.1
  507. 306.75 s > Checking aho-corasick v1.1.4
  508. 306.75 s > Checking crossbeam-epoch v0.9.18
  509. 306.75 s > Checking tracing v0.1.44
  510. 306.75 s > Checking tracing-log v0.2.0
  511. 306.75 s > Checking crossbeam-deque v0.8.6
  512. 306.75 s > Checking thread_local v1.1.9
  513. 306.75 s > Checking indenter v0.3.4
  514. 306.75 s > Checking az v1.3.0
  515. 306.75 s > Checking toml_writer v1.1.1+spec-1.1.0
  516. 306.75 s > Checking wide v1.3.0
  517. 306.75 s > Checking rayon-core v1.13.0
  518. 306.75 s > Compiling phf_shared v0.11.3
  519. 306.75 s > Checking anyhow v1.0.102
  520. 306.75 s > Checking rawpointer v0.2.1
  521. 306.75 s > Checking toml_parser v1.1.2+spec-1.1.0
  522. 306.75 s > Checking dyn-clone v1.0.20
  523. 306.75 s > Checking utf8parse v0.2.2
  524. 306.75 s > Checking alloc-no-stdlib v2.0.4
  525. 306.75 s > Checking anstyle-parse v1.0.0
  526. 306.75 s > Checking alloc-stdlib v0.2.2
  527. 306.75 s > Checking matrixmultiply v0.3.10
  528. 306.75 s > Checking rayon v1.12.0
  529. 306.75 s > Checking colorchoice v1.0.5
  530. 306.75 s > Checking anstyle-query v1.1.5
  531. 306.75 s > Checking anstyle v1.0.14
  532. 306.75 s > Checking colored v3.1.1
  533. 306.75 s > Checking is_terminal_polyfill v1.70.2
  534. 306.75 s > Checking anstream v1.0.0
  535. 306.75 s > Compiling phf_generator v0.11.3
  536. 306.75 s > Checking eyre v0.6.12
  537. 306.75 s > Checking serde v1.0.228
  538. 306.75 s > Checking serde_json v1.0.149
  539. 306.75 s > Compiling pyo3-build-config v0.28.3
  540. 306.75 s > Checking bitflags v2.11.1
  541. 306.75 s > Checking serde_spanned v1.1.1
  542. 306.75 s > Checking toml_datetime v1.1.1+spec-1.1.0
  543. 306.75 s > Checking bitflags v1.3.2
  544. 306.75 s > Checking unicode-width v0.2.2
  545. 306.75 s > Compiling phf_codegen v0.11.3
  546. 306.75 s > Checking num-traits v0.2.19
  547. 306.75 s > Checking getrandom v0.3.4
  548. 306.75 s > Checking time v0.3.47
  549. 306.75 s > Checking gmp-mpfr-sys v1.7.1
  550. 306.75 s > Checking hugepage-rs v0.1.1
  551. 306.75 s > Checking region v3.0.2
  552. 306.75 s > Checking wasmtime-jit-icache-coherence v34.0.2
  553. 306.75 s > Checking brotli-decompressor v5.0.0
  554. 306.75 s > Checking inventory v0.3.24
  555. 306.75 s > Checking smallvec v1.15.1
  556. 306.75 s > Checking tracing-serde v0.2.0
  557. 306.75 s > Checking regex-automata v0.4.14
  558. 306.75 s > Checking rand_core v0.9.5
  559. 306.75 s > Checking bincode v2.0.1
  560. 306.75 s > Checking toml v1.1.2+spec-1.1.0
  561. 306.75 s > Checking spec_math v0.1.6
  562. 306.75 s > Checking smartstring v1.0.1
  563. 306.75 s > Checking thiserror v2.0.18
  564. 306.75 s > Compiling getopts v0.2.24
  565. 306.75 s > Checking libloading v0.9.0
  566. 306.75 s > Checking append-only-vec v0.1.8
  567. 306.75 s > Checking self_cell v1.2.2
  568. 306.75 s > Checking tinyjson v2.5.1
  569. 306.75 s > Checking bytes v1.11.1
  570. 306.75 s > Checking byteorder v1.5.0
  571. 306.75 s > Checking linux-raw-sys v0.12.1
  572. 306.75 s > Checking num-complex v0.4.6
  573. 306.75 s > Checking approx v0.5.1
  574. 306.75 s > Checking num-integer v0.1.46
  575. 306.75 s > Compiling unicode_names2_generator v1.3.0
  576. 306.75 s > Compiling unic-char-range v0.9.0
  577. 306.75 s > Checking brotli v8.0.2
  578. 306.75 s > Compiling unic-common v0.9.0
  579. 306.75 s > Compiling unic-char-property v0.9.0
  580. 306.75 s > Checking rustix v1.1.4
  581. 306.75 s > Compiling is-macro v0.3.7
  582. 306.75 s > Compiling unic-ucd-version v0.9.0
  583. 306.75 s > Compiling rustpython-parser-vendored v0.4.0
  584. 306.75 s > Checking iana-time-zone v0.1.65
  585. 306.75 s > Checking simba v0.9.1
  586. 306.75 s > Compiling rustpython-parser v0.4.0
  587. 306.75 s > Checking chrono v0.4.44
  588. 306.75 s > Compiling phf v0.11.3
  589. 306.75 s > Checking rustc-hash v2.1.2
  590. 306.75 s > Checking ndarray v0.17.2
  591. 306.75 s > Compiling unic-ucd-ident v0.9.0
  592. 306.75 s > Compiling unic-emoji-char v0.9.0
  593. 306.75 s > Compiling rustc-hash v1.1.0
  594. 306.75 s > Compiling lalrpop-util v0.20.2
  595. 306.75 s > Checking ppv-lite86 v0.2.21
  596. 306.75 s > Checking ahash v0.8.12
  597. 306.75 s > Checking rug v1.30.0
  598. 306.75 s > Compiling symbolica v2.2.0 (https://github.com/alphal00p/symbolica?rev=a277a8dadbaae5a8d6605f2f381991a601e1f345#a277a8da)
  599. 306.75 s > Checking unicode-segmentation v1.13.2
  600. 306.75 s > Checking typenum v1.20.0
  601. 306.75 s > Checking getrandom v0.2.17
  602. 306.75 s > Checking rand_chacha v0.9.0
  603. 306.75 s > Checking rand v0.9.4
  604. 306.75 s > Checking scopeguard v1.2.0
  605. 306.75 s > Checking lock_api v0.4.14
  606. 306.75 s > Checking parking_lot_core v0.9.12
  607. 306.75 s > Checking unicode-ident v1.0.24
  608. 306.75 s > Checking hashbrown v0.17.0
  609. 306.75 s > Checking errno v0.3.14
  610. 306.75 s > Checking parking_lot v0.12.5
  611. 306.75 s > Checking clap_lex v1.1.0
  612. 306.75 s > Checking symjit v2.21.0
  613. 306.75 s > Checking strsim v0.11.1
  614. 306.75 s > Checking unicase v2.9.0
  615. 306.75 s > Checking signal-hook-registry v1.4.8
  616. 306.75 s > Checking vte v0.14.1
  617. 306.75 s > Checking same-file v1.0.6
  618. 306.75 s > Checking walkdir v2.5.0
  619. 306.75 s > Checking generic-array v0.14.7
  620. 306.75 s > Checking half v2.7.1
  621. 306.75 s > Checking terminal_size v0.4.4
  622. 306.75 s > Checking clap_builder v4.6.0
  623. 306.75 s > Checking signal-hook v0.3.18
  624. 306.75 s > Checking mio v1.2.0
  625. 306.75 s > Checking indexmap v2.14.0
  626. 306.75 s > Checking ciborium-io v0.2.2
  627. 306.75 s > Checking minimal-lexical v0.2.1
  628. 306.75 s > Checking ciborium-ll v0.2.2
  629. 306.75 s > Checking block-buffer v0.10.4
  630. 306.75 s > Checking crypto-common v0.1.7
  631. 306.75 s > Checking signal-hook-mio v0.2.5
  632. 306.75 s > Checking digest v0.10.7
  633. 306.75 s > Checking derive_more v2.1.1
  634. 306.75 s > Checking nom v7.1.3
  635. 306.75 s > Checking matchers v0.2.0
  636. 306.75 s > Checking regex v1.12.3
  637. 306.75 s > Checking num-bigint v0.4.6
  638. 306.75 s > Checking console v0.16.3
  639. 306.75 s > Checking tracing-subscriber v0.3.23
  640. 306.75 s > Checking bstr v1.12.1
  641. 306.75 s > Checking linux-raw-sys v0.4.15
  642. 306.75 s > Checking cpufeatures v0.2.17
  643. 306.75 s > Checking winnow v0.7.15
  644. 306.75 s > Checking rustix v0.38.44
  645. 306.75 s > Checking sha2 v0.10.9
  646. 306.75 s > Checking globset v0.4.18
  647. 306.75 s > Checking ciborium v0.2.2
  648. 306.75 s > Checking getrandom v0.4.2
  649. 306.75 s > Checking rand_core v0.6.4
  650. 306.75 s > Checking ansitok v0.3.0
  651. 306.75 s > Checking fastrand v2.4.1
  652. 306.75 s > Checking fnv v1.0.7
  653. 306.75 s > Compiling unicode_names2 v1.3.0
  654. 306.75 s > Checking plotters-backend v0.3.7
  655. 306.75 s > Checking tempfile v3.27.0
  656. 306.75 s > Checking rust-embed-utils v8.11.0
  657. 306.75 s > Checking crossterm v0.28.1
  658. 306.75 s > Checking serde_spanned v0.6.9
  659. 306.75 s > Checking toml_datetime v0.6.11
  660. 306.75 s > Checking itertools v0.10.5
  661. 306.75 s > Checking cast v0.3.0
  662. 306.75 s > Checking plotters-svg v0.3.7
  663. 306.75 s > Checking toml_write v0.1.2
  664. 306.75 s > Checking tap v1.0.1
  665. 306.75 s > Checking ansi-str v0.9.0
  666. 306.75 s > Checking plotters v0.3.7
  667. 306.75 s > Checking rand_chacha v0.3.1
  668. 306.75 s > Checking wyz v0.5.1
  669. 306.75 s > Checking radium v0.7.0
  670. 306.75 s > Checking xprec v0.2.2
  671. 306.75 s > Checking toml_edit v0.22.27
  672. 306.75 s > Checking typeid v1.0.3
  673. 306.75 s > Checking similar v2.7.0
  674. 306.75 s > Checking tinytemplate v1.2.1
  675. 306.75 s > Checking is-terminal v0.4.17
  676. 306.75 s > Checking bytecount v0.6.9
  677. 306.75 s > Checking anes v0.1.6
  678. 306.75 s > Checking oorandom v11.1.5
  679. 306.75 s > Checking funty v2.0.0
  680. 306.75 s > Checking papergrid v0.17.0
  681. 306.75 s > Checking ron v0.12.1
  682. 306.75 s > Checking clap v4.6.1
  683. 306.75 s > Checking rand v0.8.6
  684. 306.75 s > Checking testing_table v0.3.0
  685. 306.75 s > Checking env_filter v1.0.1
  686. 306.75 s > Checking toml_edit v0.25.11+spec-1.1.0
  687. 306.75 s > Checking uncased v0.9.10
  688. 306.75 s > Checking jiff v0.2.24
  689. 306.75 s > Checking ptr_meta v0.1.4
  690. 306.75 s > Checking bitvec v1.0.1
  691. 306.75 s > Checking simdutf8 v0.1.5
  692. 306.75 s > Checking ucd-trie v0.1.7
  693. 306.75 s > Checking criterion-plot v0.5.0
  694. 306.75 s > Checking ahash v0.7.8
  695. 306.75 s > Checking bytecheck v0.6.12
  696. 306.75 s > Checking pest v2.8.6
  697. 306.75 s > Checking hashbrown v0.12.3
  698. 306.75 s > Checking criterion v0.5.1
  699. 306.75 s > Checking approx v0.4.0
  700. 306.75 s > Checking seahash v4.1.0
  701. 306.75 s > Checking cgmath v0.18.0
  702. 306.75 s > Checking num-rational v0.4.2
  703. 306.75 s > Checking num-iter v0.1.45
  704. 306.75 s > Checking rend v0.4.2
  705. 306.75 s > Checking insta v1.47.2
  706. 306.75 s > Checking ref-ops v0.2.5
  707. 306.75 s > Checking toml v0.8.23
  708. 306.75 s > Checking rand_xoshiro v0.6.0
  709. 306.75 s > Checking tabled v0.20.0
  710. 306.75 s > Compiling pyo3-ffi v0.28.3
  711. 306.75 s > Compiling pyo3-macros-backend v0.28.3
  712. 306.75 s > Compiling pyo3 v0.28.3
  713. 306.75 s > Compiling numpy v0.28.0
  714. 306.75 s > Checking figment v0.10.19
  715. 306.75 s > Checking num v0.4.3
  716. 306.75 s > Checking features v0.10.0
  717. 306.75 s > Checking gat-lending-iterator v0.1.8
  718. 306.75 s > Checking constcat v0.5.1
  719. 306.75 s > Checking dot-parser v0.5.1
  720. 306.75 s > Checking colored v2.2.0
  721. 306.75 s > Checking cpufeatures v0.3.0
  722. 306.75 s > Checking constant_time_eq v0.4.2
  723. 306.75 s > Checking arrayref v0.3.9
  724. 306.75 s > Checking base64 v0.22.1
  725. 306.75 s > Checking siphasher v1.0.2
  726. 306.75 s > Checking blake3 v1.8.5
  727. 306.75 s > Checking joinery v2.1.0
  728. 306.75 s > Checking subprocess v0.2.15
  729. 306.75 s > Checking rust_lisp v0.18.0
  730. 306.75 s > Checking phf_shared v0.13.1
  731. 306.75 s > Checking titlecase v2.2.1
  732. 306.75 s > Compiling vakint v0.1.2 (/build/source/crates/vakint)
  733. 306.75 s > Checking version-compare v0.2.1
  734. 306.75 s > Checking xpct v0.5.1
  735. 306.75 s > Checking ryu v1.0.23
  736. 306.75 s > Checking castaway v0.2.4
  737. 306.75 s > Checking toml_datetime v0.7.5+spec-1.1.0
  738. 306.75 s > Checking phf v0.13.1
  739. 306.75 s > Checking strum v0.27.2
  740. 306.75 s > Checking unicode-truncate v2.0.1
  741. 306.75 s > Checking compact_str v0.9.0
  742. 306.75 s > Checking kasuari v0.4.12
  743. 306.75 s > Checking lru v0.16.4
  744. 306.75 s > Checking vte v0.15.0
  745. 306.75 s > Checking string-template-plus v0.4.3
  746. 306.75 s > Checking portable-atomic v1.13.1
  747. 306.75 s > Checking toml v0.9.12+spec-1.1.0
  748. 306.75 s > Checking unit-prefix v0.5.2
  749. 306.75 s > Checking vt100 v0.16.2
  750. 306.75 s > Checking rand_distr v0.4.3
  751. 306.75 s > Checking simba v0.6.0
  752. 306.75 s > Checking line-clipping v0.3.7
  753. 306.75 s > Compiling three-dimensional-reps v0.1.0 (/build/source/crates/three-dimensional-reps)
  754. 306.75 s > Checking adler2 v2.0.1
  755. 306.75 s > Checking gimli v0.32.3
  756. 306.75 s > Checking thiserror v1.0.69
  757. 306.75 s > Checking miniz_oxide v0.8.9
  758. 306.75 s > Checking derive_builder v0.11.2
  759. 306.75 s > Checking owo-colors v4.3.0
  760. 306.75 s > Checking object v0.37.3
  761. 306.75 s > Checking crossterm v0.29.0
  762. 306.75 s > Checking env_logger v0.11.10
  763. 306.75 s > Checking ratatui-core v0.1.0
  764. 306.75 s > Checking tracing-error v0.2.1
  765. 306.75 s > Checking indicatif v0.18.4
  766. 306.75 s > Checking typed-index-collections v3.5.0
  767. 306.75 s > Checking amd v0.2.2
  768. 306.75 s > Checking serde-big-array v0.5.1
  769. 306.75 s > Checking itertools v0.11.0
  770. 306.75 s > Compiling gammaloop-tracing-filter-macros v0.1.0 (/build/source/crates/gammaloop-tracing-filter-macros)
  771. 306.75 s > Checking rkyv v0.7.46
  772. 306.75 s > Checking rustc-demangle v0.1.27
  773. 306.75 s > Checking option-ext v0.2.0
  774. 306.75 s > Checking ref-cast v1.0.25
  775. 306.75 s > Compiling rustpython-parser-core v0.4.0
  776. 306.75 s > Checking dirs-sys v0.5.0
  777. 306.75 s > Checking color-spantrace v0.3.0
  778. 306.75 s > Checking nix v0.31.2
  779. 306.75 s > Checking integer-sqrt v0.1.5
  780. 306.75 s > Checking brotli-decompressor v4.0.3
  781. 306.75 s > Checking crossbeam-channel v0.5.15
  782. 306.75 s > Checking itertools v0.12.1
  783. 306.75 s > Checking unsafe-libyaml v0.2.11
  784. 306.75 s > Compiling rustpython-ast v0.4.0
  785. 306.75 s > Checking symlink v0.1.0
  786. 306.75 s > Compiling gammalooprs v0.3.4 (/build/source/crates/gammalooprs)
  787. 306.75 s > Checking include_dir v0.7.4
  788. 306.75 s > Checking ratatui-widgets v0.3.0
  789. 306.75 s > Checking ratatui-crossterm v0.1.0
  790. 306.75 s > Checking ctrlc v3.5.2
  791. 306.75 s > Checking pathfinding v4.15.0
  792. 306.75 s > Checking clarabel v0.11.1
  793. 306.75 s > Checking tracing-indicatif v0.3.14
  794. 306.75 s > Checking dirs v6.0.0
  795. 306.75 s > Checking tracing-appender v0.2.5
  796. 306.75 s > Checking brotli v7.0.0
  797. 306.75 s > Checking schemars v1.2.1
  798. 306.75 s > Checking slotmap v1.1.1
  799. 306.75 s > Checking serde_yaml v0.9.34+deprecated
  800. 306.75 s > Checking json5 v0.4.1
  801. 306.75 s > Checking vectorize v0.2.0
  802. 306.75 s > Checking ringbuffer v0.16.0
  803. 306.75 s > Checking addr2line v0.25.1
  804. 306.75 s > Checking base62 v2.2.4
  805. 306.75 s > Checking rust-embed v8.11.0
  806. 306.75 s > Checking clap_complete v4.6.3
  807. 306.75 s > Checking fd-lock v4.0.4
  808. 306.75 s > Checking ratatui-macros v0.7.0
  809. 306.75 s > Checking strip-ansi-escapes v0.2.1
  810. 306.75 s > Compiling gammaloop-api v0.1.0 (/build/source/crates/gammaloop-api)
  811. 306.75 s > Checking ratatui v0.30.0
  812. 306.75 s > Checking itertools v0.13.0
  813. 306.75 s > Checking strum v0.26.3
  814. 306.75 s > Checking sysinfo v0.33.1
  815. 306.75 s > Checking shlex v1.3.0
  816. 306.75 s > Checking futures-task v0.3.32
  817. 306.75 s > Checking futures-core v0.3.32
  818. 306.75 s > Checking slab v0.4.12
  819. 306.75 s > Checking clap_complete_nushell v4.6.0
  820. 306.75 s > Checking sdd v3.0.10
  821. 306.75 s > Compiling gammaloop-integration-tests v0.1.0 (/build/source/tests)
  822. 306.75 s > Compiling test-log-core v0.2.20
  823. 306.75 s > Checking futures-util v0.3.32
  824. 306.75 s > Compiling rustc_version v0.4.1
  825. 306.75 s > Checking which v8.0.2
  826. 306.75 s > Checking bincode v1.3.3
  827. 306.75 s > Checking scc v2.4.0
  828. 306.75 s > Compiling numerica v2.2.0 (https://github.com/alphal00p/symbolica?rev=a277a8dadbaae5a8d6605f2f381991a601e1f345#a277a8da)
  829. 306.75 s > Compiling gungraun-runner v0.18.2
  830. 306.75 s > Checking nalgebra v0.29.0
  831. 306.75 s > Checking backtrace v0.3.76
  832. 306.75 s > Compiling gungraun-macros v0.8.0
  833. 306.75 s > Checking reedline v0.42.0
  834. 306.75 s > Checking color-eyre v0.6.5
  835. 306.75 s > Checking proc-macro2 v1.0.106
  836. 306.75 s > Checking futures-executor v0.3.32
  837. 306.75 s > Checking serial_test v3.4.0
  838. 306.75 s > Checking maplit v1.0.2
  839. 306.75 s > Checking base64 v0.21.7
  840. 306.75 s > Compiling iai-callgrind-runner v0.14.2
  841. 306.75 s > Checking kurbo v0.13.0
  842. 306.75 s > Checking quote v1.0.45
  843. 306.75 s > Checking wait-timeout v0.2.1
  844. 306.75 s > Checking bit-vec v0.8.0
  845. 306.75 s > Checking ron v0.8.1
  846. 306.75 s > Compiling iai-callgrind v0.14.2
  847. 306.75 s > Checking quick-error v1.2.3
  848. 306.75 s > Checking bit-set v0.8.0
  849. 306.75 s > Checking rusty-fork v0.3.1
  850. 306.75 s > Checking syn v2.0.117
  851. 306.75 s > Compiling iai-callgrind-macros v0.5.1
  852. 306.75 s > Compiling test-log-macros v0.2.20
  853. 306.75 s > Checking rand_xorshift v0.4.0
  854. 306.75 s > Checking console v0.15.11
  855. 306.75 s > Checking unarray v0.1.4
  856. 306.75 s > Checking pathdiff v0.2.3
  857. 306.75 s > Checking proptest v1.11.0
  858. 306.75 s > Checking clinnet v0.1.8 (/build/source/crates/clinnet)
  859. 306.75 s > Checking similar-asserts v1.7.0
  860. 306.75 s > Checking kurvst v0.1.0 (/build/source/crates/kurvst)
  861. 306.75 s > Compiling graphica v2.1.0 (https://github.com/alphal00p/symbolica?rev=a277a8dadbaae5a8d6605f2f381991a601e1f345#a277a8da)
  862. 306.75 s > Checking test-log v0.2.20
  863. 306.75 s > Checking statrs v0.16.1
  864. 306.75 s > Checking momtrop v0.3.0
  865. 306.75 s > Checking gungraun v0.18.2
  866. 306.75 s > Compiling pyo3-macros v0.28.3
  867. 306.75 s > Compiling pyo3-stub-gen-derive v0.17.2
  868. 306.75 s > Checking pyo3-stub-gen v0.17.2
  869. 306.75 s > Checking symbolica-utils v0.1.0 (/build/source/crates/symbolica-utils)
  870. 306.75 s > Checking spenso-macros v0.3.2 (/build/source/crates/spenso-macros)
  871. 306.75 s > Compiling gammaloop-workspace-hack v0.1.0 (/build/source/crates/gammaloop-workspace-hack)
  872. 306.75 s > Checking linnet v0.17.0 (/build/source/crates/linnet)
  873. 306.75 s > Checking spenso v0.6.0 (/build/source/crates/spenso)
  874. 306.75 s > Checking linnet-py v0.1.0 (/build/source/crates/linnet-py)
  875. 306.75 s > Checking linnest v0.1.0 (/build/source/crates/linnest)
  876. 306.75 s > Checking idenso v0.3.0 (/build/source/crates/idenso)
  877. 306.75 s > Checking gammaloop-tracing-filter v0.1.0 (/build/source/crates/gammaloop-tracing-filter)
  878. 306.75 s > Checking spenso-hep-lib v0.1.7 (/build/source/crates/spenso-hep-lib)
  879. 306.75 s > Checking spynso3 v0.1.2 (/build/source/crates/spynso3)
  880. 306.75 s > error[E0609]: no field `lmb_channel_id` on type `CutInfo`
  881. 306.75 s > --> tests/tests/test_runs/utils.rs:568:36
  882. 306.75 s > |
  883. 306.75 s > 568 | event.cut_info.lmb_channel_id,
  884. 306.75 s > | ^^^^^^^^^^^^^^ unknown field
  885. 306.75 s > |
  886. 306.75 s > = note: available fields are: `particle_pdgs`, `cut_id`, `graph_id`, `graph_group_id`, `orientation_id` ... and 2 others
  887. 306.75 s >
  888. 306.75 s > error[E0609]: no field `lmb_channel_id` on type `CutInfo`
  889. 306.75 s > --> tests/tests/test_runs/utils.rs:580:36
  890. 306.75 s > |
  891. 306.75 s > 580 | event.cut_info.lmb_channel_id,
  892. 306.75 s > | ^^^^^^^^^^^^^^ unknown field
  893. 306.75 s > |
  894. 306.75 s > = note: available fields are: `particle_pdgs`, `cut_id`, `graph_id`, `graph_group_id`, `orientation_id` ... and 2 others
  895. 306.75 s >
  896. 306.75 s > For more information about this error, try `rustc --explain E0609`.
  897. 306.75 s > error: could not compile `gammaloop-integration-tests` (test "test_runs") due to 2 previous errors
  898. 306.75 s For full logs, run:
  899. 306.75 s nix log /nix/store/01wv2cvlxmkwk15rfvw73pimfsfm321c-gammaloop-workspace-check-0.1.0.drv
  900. 306.79 s Build failed.