0.01 s
$ /nix/store/9ypz3flqsrl5xl495mm8h645gadjsxi1-coreutils-9.11/bin/timeout --kill-after=15s 7200s /nix/store/23zk8sgzamrbmj1fday15szf7f2279s8-nix-2.34.7/bin/nix --extra-experimental-features nix-command --extra-experimental-features flakes --log-format internal-json build --no-link --print-out-paths git+https://github.com/alphal00p/gammaloop?ref=advanced_sampling&rev=f2f64fb17dd5dab588eca298dc61f1100fa4962d&shallow=1#checks.x86_64-linux.gammaloop-check --print-build-logs
0.50 s
error (ignored): SQLite database '/var/cache/nix-ci-worker/eval-cache-v6/454083ca2d64c2bd9f46e959c6679698e2592f99823f5dd1778cef1bf40b2ddb.sqlite ' is busy
2.73 s
3.79 s
Building /nix/store/01wv2cvlxmkwk15rfvw73pimfsfm321c-gammaloop-workspace-check-0.1.0.drv
3.92 s
[gammaloop-workspace-check] Phase: unpackPhase
3.92 s
[gammaloop-workspace-check] unpacking source archive /nix/store/p4kvydb95jp9jm0ylgbb2r217q4zaj95-source
4.07 s
[gammaloop-workspace-check] source root is source
4.11 s
[gammaloop-workspace-check] Phase: patchPhase
4.11 s
[gammaloop-workspace-check] Executing configureCargoCommonVars
4.11 s
[gammaloop-workspace-check] decompressing cargo artifacts from /nix/store/50vpxlcgfxf2d57i27v3d10zjwxxbm2r-gammaloop-workspace-deps-deps-0.1.0/target.tar.zst to target
6.54 s
[gammaloop-workspace-check] Phase: updateAutotoolsGnuConfigScriptsPhase
6.58 s
[gammaloop-workspace-check] Phase: configurePhase
6.58 s
[gammaloop-workspace-check] will append /build/source/.cargo-home/config.toml with contents of /nix/store/5drf77x6km4ky7gwlrzdx9bbd6fz09g3-vendor-cargo-deps/config.toml
6.58 s
[gammaloop-workspace-check] default configurePhase, nothing to do
6.59 s
[gammaloop-workspace-check] Phase: buildPhase
6.59 s
[gammaloop-workspace-check] +++ command cargo --version
6.59 s
[gammaloop-workspace-check] cargo 1.97.0 (c980f4866 2026-06-30)
6.62 s
[gammaloop-workspace-check] +++ command cargo check --profile ci-optim --locked --workspace --features gammaloop-tracing-filter/clap,gammaloop-tracing-filter/symbolica,idenso/bincode,idenso/reference-cases,linnet/bincode,linnet/drawing,linnet/rkyv,linnet/serde,linnet/symbolica,spenso-macros/shadowing,spenso/shadowing,symbolica/tracing_max_level_info,three-dimensional-reps/display,three-dimensional-reps/eval,three-dimensional-reps/serde --all-targets
7.13 s
[gammaloop-workspace-check] Checking cfg-if v1.0.4
7.13 s
[gammaloop-workspace-check] Checking memchr v2.8.0
7.13 s
[gammaloop-workspace-check] Checking once_cell v1.21.4
7.13 s
[gammaloop-workspace-check] Checking either v1.15.0
7.14 s
[gammaloop-workspace-check] Checking serde_core v1.0.228
7.14 s
[gammaloop-workspace-check] Checking libc v0.2.186
7.15 s
[gammaloop-workspace-check] Checking libm v0.2.16
7.16 s
[gammaloop-workspace-check] Checking itoa v1.0.18
7.16 s
[gammaloop-workspace-check] Checking log v0.4.29
7.18 s
[gammaloop-workspace-check] Checking regex-syntax v0.8.10
7.19 s
[gammaloop-workspace-check] Checking zerocopy v0.8.48
7.20 s
[gammaloop-workspace-check] Checking crossbeam-utils v0.8.21
7.20 s
[gammaloop-workspace-check] Checking equivalent v1.0.2
7.20 s
[gammaloop-workspace-check] Checking zmij v1.0.21
7.20 s
[gammaloop-workspace-check] Checking lazy_static v1.5.0
7.21 s
[gammaloop-workspace-check] Checking bytemuck v1.25.0
7.21 s
[gammaloop-workspace-check] Compiling target-lexicon v0.13.5
7.31 s
[gammaloop-workspace-check] Checking arrayvec v0.7.6
7.31 s
[gammaloop-workspace-check] Checking powerfmt v0.2.0
7.31 s
[gammaloop-workspace-check] Checking pin-project-lite v0.2.17
7.31 s
[gammaloop-workspace-check] Checking safe_arch v0.7.4
7.41 s
[gammaloop-workspace-check] Checking time-core v0.1.8
7.44 s
[gammaloop-workspace-check] Checking num_threads v0.1.7
7.45 s
[gammaloop-workspace-check] Checking itertools v0.14.0
7.45 s
[gammaloop-workspace-check] Checking num-conv v0.2.1
7.45 s
[gammaloop-workspace-check] Checking foldhash v0.2.0
7.51 s
[gammaloop-workspace-check] Checking allocator-api2 v0.2.21
7.52 s
[gammaloop-workspace-check] Checking deranged v0.5.8
7.60 s
[gammaloop-workspace-check] Checking const-random v0.1.18
7.60 s
[gammaloop-workspace-check] Checking winnow v1.0.2
7.60 s
[gammaloop-workspace-check] Checking nu-ansi-term v0.50.3
7.64 s
[gammaloop-workspace-check] Checking wide v0.7.33
7.69 s
[gammaloop-workspace-check] Checking tracing-core v0.1.36
7.71 s
[gammaloop-workspace-check] Checking static_assertions v1.1.0
7.77 s
[gammaloop-workspace-check] Checking unty v0.0.4
7.82 s
[gammaloop-workspace-check] Checking sharded-slab v0.1.7
7.96 s
[gammaloop-workspace-check] Checking safe_arch v1.0.0
7.97 s
[gammaloop-workspace-check] Checking hashbrown v0.16.1
8.19 s
[gammaloop-workspace-check] Checking aho-corasick v1.1.4
8.35 s
[gammaloop-workspace-check] Checking crossbeam-epoch v0.9.18
8.45 s
[gammaloop-workspace-check] Checking tracing v0.1.44
8.58 s
[gammaloop-workspace-check] Checking tracing-log v0.2.0
8.64 s
[gammaloop-workspace-check] Checking crossbeam-deque v0.8.6
8.73 s
[gammaloop-workspace-check] Checking thread_local v1.1.9
8.75 s
[gammaloop-workspace-check] Checking indenter v0.3.4
8.86 s
[gammaloop-workspace-check] Checking az v1.3.0
8.91 s
[gammaloop-workspace-check] Checking toml_writer v1.1.1+spec-1.1.0
8.91 s
[gammaloop-workspace-check] Checking wide v1.3.0
8.93 s
[gammaloop-workspace-check] Checking rayon-core v1.13.0
8.97 s
[gammaloop-workspace-check] Compiling phf_shared v0.11.3
9.10 s
[gammaloop-workspace-check] Checking anyhow v1.0.102
9.28 s
[gammaloop-workspace-check] Checking rawpointer v0.2.1
9.30 s
[gammaloop-workspace-check] Checking toml_parser v1.1.2+spec-1.1.0
9.34 s
[gammaloop-workspace-check] Checking dyn-clone v1.0.20
9.34 s
[gammaloop-workspace-check] Checking utf8parse v0.2.2
9.43 s
[gammaloop-workspace-check] Checking alloc-no-stdlib v2.0.4
9.43 s
[gammaloop-workspace-check] Checking anstyle-parse v1.0.0
9.52 s
[gammaloop-workspace-check] Checking alloc-stdlib v0.2.2
9.53 s
[gammaloop-workspace-check] Checking matrixmultiply v0.3.10
9.54 s
[gammaloop-workspace-check] Checking rayon v1.12.0
9.59 s
[gammaloop-workspace-check] Checking colorchoice v1.0.5
9.64 s
[gammaloop-workspace-check] Checking anstyle-query v1.1.5
9.66 s
[gammaloop-workspace-check] Checking anstyle v1.0.14
9.69 s
[gammaloop-workspace-check] Checking colored v3.1.1
9.80 s
[gammaloop-workspace-check] Checking is_terminal_polyfill v1.70.2
9.86 s
[gammaloop-workspace-check] Checking anstream v1.0.0
9.89 s
[gammaloop-workspace-check] Compiling phf_generator v0.11.3
9.92 s
[gammaloop-workspace-check] Checking eyre v0.6.12
10.11 s
[gammaloop-workspace-check] Checking serde v1.0.228
10.11 s
[gammaloop-workspace-check] Checking serde_json v1.0.149
10.25 s
[gammaloop-workspace-check] Compiling pyo3-build-config v0.28.3
10.26 s
[gammaloop-workspace-check] Checking bitflags v2.11.1
10.35 s
[gammaloop-workspace-check] Checking serde_spanned v1.1.1
10.36 s
[gammaloop-workspace-check] Checking toml_datetime v1.1.1+spec-1.1.0
10.44 s
[gammaloop-workspace-check] Checking bitflags v1.3.2
10.48 s
[gammaloop-workspace-check] Checking unicode-width v0.2.2
10.49 s
[gammaloop-workspace-check] Compiling phf_codegen v0.11.3
10.55 s
[gammaloop-workspace-check] Checking num-traits v0.2.19
10.56 s
[gammaloop-workspace-check] Checking getrandom v0.3.4
10.57 s
[gammaloop-workspace-check] Checking time v0.3.47
10.60 s
[gammaloop-workspace-check] Checking gmp-mpfr-sys v1.7.1
10.63 s
[gammaloop-workspace-check] Checking hugepage-rs v0.1.1
10.69 s
[gammaloop-workspace-check] Checking region v3.0.2
10.71 s
[gammaloop-workspace-check] Checking wasmtime-jit-icache-coherence v34.0.2
10.77 s
[gammaloop-workspace-check] Checking brotli-decompressor v5.0.0
10.78 s
[gammaloop-workspace-check] Checking inventory v0.3.24
10.83 s
[gammaloop-workspace-check] Checking smallvec v1.15.1
11.01 s
[gammaloop-workspace-check] Checking tracing-serde v0.2.0
11.02 s
[gammaloop-workspace-check] Checking regex-automata v0.4.14
11.02 s
[gammaloop-workspace-check] Checking rand_core v0.9.5
11.04 s
[gammaloop-workspace-check] Checking bincode v2.0.1
11.04 s
[gammaloop-workspace-check] Checking toml v1.1.2+spec-1.1.0
11.05 s
[gammaloop-workspace-check] Checking spec_math v0.1.6
11.06 s
[gammaloop-workspace-check] Checking smartstring v1.0.1
11.16 s
[gammaloop-workspace-check] Checking thiserror v2.0.18
11.20 s
[gammaloop-workspace-check] Compiling getopts v0.2.24
11.21 s
[gammaloop-workspace-check] Checking libloading v0.9.0
11.24 s
[gammaloop-workspace-check] Checking append-only-vec v0.1.8
11.41 s
[gammaloop-workspace-check] Checking self_cell v1.2.2
11.42 s
[gammaloop-workspace-check] Checking tinyjson v2.5.1
11.44 s
[gammaloop-workspace-check] Checking bytes v1.11.1
11.47 s
[gammaloop-workspace-check] Checking byteorder v1.5.0
11.55 s
[gammaloop-workspace-check] Checking linux-raw-sys v0.12.1
11.63 s
[gammaloop-workspace-check] Checking num-complex v0.4.6
11.83 s
[gammaloop-workspace-check] Checking approx v0.5.1
11.85 s
[gammaloop-workspace-check] Checking num-integer v0.1.46
11.88 s
[gammaloop-workspace-check] Compiling unicode_names2_generator v1.3.0
11.92 s
[gammaloop-workspace-check] Compiling unic-char-range v0.9.0
11.97 s
[gammaloop-workspace-check] Checking brotli v8.0.2
12.05 s
[gammaloop-workspace-check] Compiling unic-common v0.9.0
12.10 s
[gammaloop-workspace-check] Compiling unic-char-property v0.9.0
12.11 s
[gammaloop-workspace-check] Checking rustix v1.1.4
12.12 s
[gammaloop-workspace-check] Compiling is-macro v0.3.7
12.20 s
[gammaloop-workspace-check] Compiling unic-ucd-version v0.9.0
12.24 s
[gammaloop-workspace-check] Compiling rustpython-parser-vendored v0.4.0
12.25 s
[gammaloop-workspace-check] Checking iana-time-zone v0.1.65
12.30 s
[gammaloop-workspace-check] Checking simba v0.9.1
12.32 s
[gammaloop-workspace-check] Compiling rustpython-parser v0.4.0
12.39 s
[gammaloop-workspace-check] Checking chrono v0.4.44
12.39 s
[gammaloop-workspace-check] Compiling phf v0.11.3
12.55 s
[gammaloop-workspace-check] Checking rustc-hash v2.1.2
12.62 s
[gammaloop-workspace-check] Checking ndarray v0.17.2
12.71 s
[gammaloop-workspace-check] Compiling unic-ucd-ident v0.9.0
12.95 s
[gammaloop-workspace-check] Compiling unic-emoji-char v0.9.0
12.97 s
[gammaloop-workspace-check] Compiling rustc-hash v1.1.0
12.98 s
[gammaloop-workspace-check] Compiling lalrpop-util v0.20.2
12.99 s
[gammaloop-workspace-check] Checking ppv-lite86 v0.2.21
13.03 s
[gammaloop-workspace-check] Checking ahash v0.8.12
13.11 s
[gammaloop-workspace-check] Checking rug v1.30.0
13.23 s
[gammaloop-workspace-check] Compiling symbolica v2.2.0 (https://github.com/alphal00p/symbolica?rev=a277a8dadbaae5a8d6605f2f381991a601e1f345#a277a8da)
13.26 s
[gammaloop-workspace-check] Checking unicode-segmentation v1.13.2
13.27 s
[gammaloop-workspace-check] Checking typenum v1.20.0
13.28 s
[gammaloop-workspace-check] Checking getrandom v0.2.17
13.30 s
[gammaloop-workspace-check] Checking rand_chacha v0.9.0
13.46 s
[gammaloop-workspace-check] Checking rand v0.9.4
13.48 s
[gammaloop-workspace-check] Checking scopeguard v1.2.0
13.53 s
[gammaloop-workspace-check] Checking lock_api v0.4.14
13.60 s
[gammaloop-workspace-check] Checking parking_lot_core v0.9.12
13.72 s
[gammaloop-workspace-check] Checking unicode-ident v1.0.24
13.76 s
[gammaloop-workspace-check] Checking hashbrown v0.17.0
13.79 s
[gammaloop-workspace-check] Checking errno v0.3.14
13.81 s
[gammaloop-workspace-check] Checking parking_lot v0.12.5
13.81 s
[gammaloop-workspace-check] Checking clap_lex v1.1.0
13.91 s
[gammaloop-workspace-check] Checking symjit v2.21.0
13.91 s
[gammaloop-workspace-check] Checking strsim v0.11.1
13.98 s
[gammaloop-workspace-check] Checking unicase v2.9.0
14.05 s
[gammaloop-workspace-check] Checking signal-hook-registry v1.4.8
14.06 s
[gammaloop-workspace-check] Checking vte v0.14.1
14.07 s
[gammaloop-workspace-check] Checking same-file v1.0.6
14.18 s
[gammaloop-workspace-check] Checking walkdir v2.5.0
14.20 s
[gammaloop-workspace-check] Checking generic-array v0.14.7
14.21 s
[gammaloop-workspace-check] Checking half v2.7.1
14.22 s
[gammaloop-workspace-check] Checking terminal_size v0.4.4
14.35 s
[gammaloop-workspace-check] Checking clap_builder v4.6.0
14.35 s
[gammaloop-workspace-check] Checking signal-hook v0.3.18
14.35 s
[gammaloop-workspace-check] Checking mio v1.2.0
14.38 s
[gammaloop-workspace-check] Checking indexmap v2.14.0
14.44 s
[gammaloop-workspace-check] Checking ciborium-io v0.2.2
14.51 s
[gammaloop-workspace-check] Checking minimal-lexical v0.2.1
14.56 s
[gammaloop-workspace-check] Checking ciborium-ll v0.2.2
14.59 s
[gammaloop-workspace-check] Checking block-buffer v0.10.4
14.62 s
[gammaloop-workspace-check] Checking crypto-common v0.1.7
14.67 s
[gammaloop-workspace-check] Checking signal-hook-mio v0.2.5
14.68 s
[gammaloop-workspace-check] Checking digest v0.10.7
14.70 s
[gammaloop-workspace-check] Checking derive_more v2.1.1
14.72 s
[gammaloop-workspace-check] Checking nom v7.1.3
14.73 s
[gammaloop-workspace-check] Checking matchers v0.2.0
14.73 s
[gammaloop-workspace-check] Checking regex v1.12.3
14.75 s
[gammaloop-workspace-check] Checking num-bigint v0.4.6
14.80 s
[gammaloop-workspace-check] Checking console v0.16.3
14.85 s
[gammaloop-workspace-check] Checking tracing-subscriber v0.3.23
15.06 s
[gammaloop-workspace-check] Checking bstr v1.12.1
15.07 s
[gammaloop-workspace-check] Checking linux-raw-sys v0.4.15
15.13 s
[gammaloop-workspace-check] Checking cpufeatures v0.2.17
15.20 s
[gammaloop-workspace-check] Checking winnow v0.7.15
15.28 s
[gammaloop-workspace-check] Checking rustix v0.38.44
15.31 s
[gammaloop-workspace-check] Checking sha2 v0.10.9
15.36 s
[gammaloop-workspace-check] Checking globset v0.4.18
15.49 s
[gammaloop-workspace-check] Checking ciborium v0.2.2
15.72 s
[gammaloop-workspace-check] Checking getrandom v0.4.2
15.73 s
[gammaloop-workspace-check] Checking rand_core v0.6.4
15.74 s
[gammaloop-workspace-check] Checking ansitok v0.3.0
15.76 s
[gammaloop-workspace-check] Checking fastrand v2.4.1
15.82 s
[gammaloop-workspace-check] Checking fnv v1.0.7
15.83 s
[gammaloop-workspace-check] Compiling unicode_names2 v1.3.0
15.89 s
[gammaloop-workspace-check] Checking plotters-backend v0.3.7
15.90 s
[gammaloop-workspace-check] Checking tempfile v3.27.0
15.94 s
[gammaloop-workspace-check] Checking rust-embed-utils v8.11.0
16.00 s
[gammaloop-workspace-check] Checking crossterm v0.28.1
16.00 s
[gammaloop-workspace-check] Checking serde_spanned v0.6.9
16.00 s
[gammaloop-workspace-check] Checking toml_datetime v0.6.11
16.02 s
[gammaloop-workspace-check] Checking itertools v0.10.5
16.09 s
[gammaloop-workspace-check] Checking cast v0.3.0
16.11 s
[gammaloop-workspace-check] Checking plotters-svg v0.3.7
16.12 s
[gammaloop-workspace-check] Checking toml_write v0.1.2
16.13 s
[gammaloop-workspace-check] Checking tap v1.0.1
16.16 s
[gammaloop-workspace-check] Checking ansi-str v0.9.0
16.20 s
[gammaloop-workspace-check] Checking plotters v0.3.7
16.21 s
[gammaloop-workspace-check] Checking rand_chacha v0.3.1
16.23 s
[gammaloop-workspace-check] Checking wyz v0.5.1
16.25 s
[gammaloop-workspace-check] Checking radium v0.7.0
16.28 s
[gammaloop-workspace-check] Checking xprec v0.2.2
16.36 s
[gammaloop-workspace-check] Checking toml_edit v0.22.27
16.38 s
[gammaloop-workspace-check] Checking typeid v1.0.3
16.41 s
[gammaloop-workspace-check] Checking similar v2.7.0
16.43 s
[gammaloop-workspace-check] Checking tinytemplate v1.2.1
16.47 s
[gammaloop-workspace-check] Checking is-terminal v0.4.17
16.52 s
[gammaloop-workspace-check] Checking bytecount v0.6.9
16.53 s
[gammaloop-workspace-check] Checking anes v0.1.6
16.53 s
[gammaloop-workspace-check] Checking oorandom v11.1.5
16.60 s
[gammaloop-workspace-check] Checking funty v2.0.0
16.62 s
[gammaloop-workspace-check] Checking papergrid v0.17.0
16.63 s
[gammaloop-workspace-check] Checking ron v0.12.1
16.67 s
[gammaloop-workspace-check] Checking clap v4.6.1
16.73 s
[gammaloop-workspace-check] Checking rand v0.8.6
16.78 s
[gammaloop-workspace-check] Checking testing_table v0.3.0
16.81 s
[gammaloop-workspace-check] Checking env_filter v1.0.1
16.85 s
[gammaloop-workspace-check] Checking toml_edit v0.25.11+spec-1.1.0
16.87 s
[gammaloop-workspace-check] Checking uncased v0.9.10
16.98 s
[gammaloop-workspace-check] Checking jiff v0.2.24
16.98 s
[gammaloop-workspace-check] Checking ptr_meta v0.1.4
17.00 s
[gammaloop-workspace-check] Checking bitvec v1.0.1
17.00 s
[gammaloop-workspace-check] Checking simdutf8 v0.1.5
17.00 s
[gammaloop-workspace-check] Checking ucd-trie v0.1.7
17.03 s
[gammaloop-workspace-check] Checking criterion-plot v0.5.0
17.07 s
[gammaloop-workspace-check] Checking ahash v0.7.8
17.12 s
[gammaloop-workspace-check] Checking bytecheck v0.6.12
17.18 s
[gammaloop-workspace-check] Checking pest v2.8.6
17.23 s
[gammaloop-workspace-check] Checking hashbrown v0.12.3
17.27 s
[gammaloop-workspace-check] Checking criterion v0.5.1
17.33 s
[gammaloop-workspace-check] Checking approx v0.4.0
17.34 s
[gammaloop-workspace-check] Checking seahash v4.1.0
17.41 s
[gammaloop-workspace-check] Checking cgmath v0.18.0
17.45 s
[gammaloop-workspace-check] Checking num-rational v0.4.2
17.58 s
[gammaloop-workspace-check] Checking num-iter v0.1.45
17.60 s
[gammaloop-workspace-check] Checking rend v0.4.2
17.62 s
[gammaloop-workspace-check] Checking insta v1.47.2
17.63 s
[gammaloop-workspace-check] Checking ref-ops v0.2.5
17.66 s
[gammaloop-workspace-check] Checking toml v0.8.23
17.69 s
[gammaloop-workspace-check] Checking rand_xoshiro v0.6.0
17.80 s
[gammaloop-workspace-check] Checking tabled v0.20.0
17.89 s
[gammaloop-workspace-check] Compiling pyo3-ffi v0.28.3
17.91 s
[gammaloop-workspace-check] Compiling pyo3-macros-backend v0.28.3
17.94 s
[gammaloop-workspace-check] Compiling pyo3 v0.28.3
17.95 s
[gammaloop-workspace-check] Compiling numpy v0.28.0
17.99 s
[gammaloop-workspace-check] Checking figment v0.10.19
18.34 s
[gammaloop-workspace-check] Checking num v0.4.3
18.37 s
[gammaloop-workspace-check] Checking features v0.10.0
18.38 s
[gammaloop-workspace-check] Checking gat-lending-iterator v0.1.8
18.38 s
[gammaloop-workspace-check] Checking constcat v0.5.1
18.40 s
[gammaloop-workspace-check] Checking dot-parser v0.5.1
18.42 s
[gammaloop-workspace-check] Checking colored v2.2.0
18.43 s
[gammaloop-workspace-check] Checking cpufeatures v0.3.0
18.47 s
[gammaloop-workspace-check] Checking constant_time_eq v0.4.2
18.51 s
[gammaloop-workspace-check] Checking arrayref v0.3.9
18.53 s
[gammaloop-workspace-check] Checking base64 v0.22.1
18.54 s
[gammaloop-workspace-check] Checking siphasher v1.0.2
18.55 s
[gammaloop-workspace-check] Checking blake3 v1.8.5
18.59 s
[gammaloop-workspace-check] Checking joinery v2.1.0
18.66 s
[gammaloop-workspace-check] Checking subprocess v0.2.15
18.67 s
[gammaloop-workspace-check] Checking rust_lisp v0.18.0
18.68 s
[gammaloop-workspace-check] Checking phf_shared v0.13.1
18.71 s
[gammaloop-workspace-check] Checking titlecase v2.2.1
18.77 s
[gammaloop-workspace-check] Compiling vakint v0.1.2 (/build/source/crates/vakint)
18.78 s
[gammaloop-workspace-check] Checking version-compare v0.2.1
18.81 s
[gammaloop-workspace-check] Checking xpct v0.5.1
18.83 s
[gammaloop-workspace-check] Checking ryu v1.0.23
18.85 s
[gammaloop-workspace-check] Checking castaway v0.2.4
18.86 s
[gammaloop-workspace-check] Checking toml_datetime v0.7.5+spec-1.1.0
18.90 s
[gammaloop-workspace-check] Checking phf v0.13.1
18.93 s
[gammaloop-workspace-check] Checking strum v0.27.2
18.93 s
[gammaloop-workspace-check] Checking unicode-truncate v2.0.1
18.94 s
[gammaloop-workspace-check] Checking compact_str v0.9.0
18.99 s
[gammaloop-workspace-check] Checking kasuari v0.4.12
19.01 s
[gammaloop-workspace-check] Checking lru v0.16.4
19.02 s
[gammaloop-workspace-check] Checking vte v0.15.0
19.03 s
[gammaloop-workspace-check] Checking string-template-plus v0.4.3
19.03 s
[gammaloop-workspace-check] Checking portable-atomic v1.13.1
19.05 s
[gammaloop-workspace-check] Checking toml v0.9.12+spec-1.1.0
19.11 s
[gammaloop-workspace-check] Checking unit-prefix v0.5.2
19.13 s
[gammaloop-workspace-check] Checking vt100 v0.16.2
19.15 s
[gammaloop-workspace-check] Checking rand_distr v0.4.3
19.17 s
[gammaloop-workspace-check] Checking simba v0.6.0
19.18 s
[gammaloop-workspace-check] Checking line-clipping v0.3.7
19.20 s
[gammaloop-workspace-check] Compiling three-dimensional-reps v0.1.0 (/build/source/crates/three-dimensional-reps)
19.21 s
[gammaloop-workspace-check] Checking adler2 v2.0.1
19.27 s
[gammaloop-workspace-check] Checking gimli v0.32.3
19.30 s
[gammaloop-workspace-check] Checking thiserror v1.0.69
19.31 s
[gammaloop-workspace-check] Checking miniz_oxide v0.8.9
19.31 s
[gammaloop-workspace-check] Checking derive_builder v0.11.2
19.35 s
[gammaloop-workspace-check] Checking owo-colors v4.3.0
19.39 s
[gammaloop-workspace-check] Checking object v0.37.3
19.40 s
[gammaloop-workspace-check] Checking crossterm v0.29.0
19.44 s
[gammaloop-workspace-check] Checking env_logger v0.11.10
19.45 s
[gammaloop-workspace-check] Checking ratatui-core v0.1.0
19.46 s
[gammaloop-workspace-check] Checking tracing-error v0.2.1
19.49 s
[gammaloop-workspace-check] Checking indicatif v0.18.4
19.51 s
[gammaloop-workspace-check] Checking typed-index-collections v3.5.0
19.58 s
[gammaloop-workspace-check] Checking amd v0.2.2
19.61 s
[gammaloop-workspace-check] Checking serde-big-array v0.5.1
19.68 s
[gammaloop-workspace-check] Checking itertools v0.11.0
19.73 s
[gammaloop-workspace-check] Compiling gammaloop-tracing-filter-macros v0.1.0 (/build/source/crates/gammaloop-tracing-filter-macros)
19.78 s
[gammaloop-workspace-check] Checking rkyv v0.7.46
19.80 s
[gammaloop-workspace-check] Checking rustc-demangle v0.1.27
19.82 s
[gammaloop-workspace-check] Checking option-ext v0.2.0
19.85 s
[gammaloop-workspace-check] Checking ref-cast v1.0.25
19.86 s
[gammaloop-workspace-check] Compiling rustpython-parser-core v0.4.0
19.87 s
[gammaloop-workspace-check] Checking dirs-sys v0.5.0
19.91 s
[gammaloop-workspace-check] Checking color-spantrace v0.3.0
19.92 s
[gammaloop-workspace-check] Checking nix v0.31.2
20.00 s
[gammaloop-workspace-check] Checking integer-sqrt v0.1.5
20.01 s
[gammaloop-workspace-check] Checking brotli-decompressor v4.0.3
20.04 s
[gammaloop-workspace-check] Checking crossbeam-channel v0.5.15
20.06 s
[gammaloop-workspace-check] Checking itertools v0.12.1
20.06 s
[gammaloop-workspace-check] Checking unsafe-libyaml v0.2.11
20.14 s
[gammaloop-workspace-check] Compiling rustpython-ast v0.4.0
20.15 s
[gammaloop-workspace-check] Checking symlink v0.1.0
20.22 s
[gammaloop-workspace-check] Compiling gammalooprs v0.3.4 (/build/source/crates/gammalooprs)
20.23 s
[gammaloop-workspace-check] Checking include_dir v0.7.4
20.35 s
[gammaloop-workspace-check] Checking ratatui-widgets v0.3.0
20.36 s
[gammaloop-workspace-check] Checking ratatui-crossterm v0.1.0
20.49 s
[gammaloop-workspace-check] Checking ctrlc v3.5.2
20.51 s
[gammaloop-workspace-check] Checking pathfinding v4.15.0
20.52 s
[gammaloop-workspace-check] Checking clarabel v0.11.1
20.56 s
[gammaloop-workspace-check] Checking tracing-indicatif v0.3.14
20.59 s
[gammaloop-workspace-check] Checking dirs v6.0.0
20.60 s
[gammaloop-workspace-check] Checking tracing-appender v0.2.5
20.63 s
[gammaloop-workspace-check] Checking brotli v7.0.0
20.65 s
[gammaloop-workspace-check] Checking schemars v1.2.1
20.74 s
[gammaloop-workspace-check] Checking slotmap v1.1.1
20.83 s
[gammaloop-workspace-check] Checking serde_yaml v0.9.34+deprecated
20.88 s
[gammaloop-workspace-check] Checking json5 v0.4.1
20.95 s
[gammaloop-workspace-check] Checking vectorize v0.2.0
20.99 s
[gammaloop-workspace-check] Checking ringbuffer v0.16.0
21.10 s
[gammaloop-workspace-check] Checking addr2line v0.25.1
21.11 s
[gammaloop-workspace-check] Checking base62 v2.2.4
21.11 s
[gammaloop-workspace-check] Checking rust-embed v8.11.0
21.15 s
[gammaloop-workspace-check] Checking clap_complete v4.6.3
21.18 s
[gammaloop-workspace-check] Checking fd-lock v4.0.4
21.19 s
[gammaloop-workspace-check] Checking ratatui-macros v0.7.0
21.20 s
[gammaloop-workspace-check] Checking strip-ansi-escapes v0.2.1
21.24 s
[gammaloop-workspace-check] Compiling gammaloop-api v0.1.0 (/build/source/crates/gammaloop-api)
21.29 s
[gammaloop-workspace-check] Checking ratatui v0.30.0
21.30 s
[gammaloop-workspace-check] Checking itertools v0.13.0
21.31 s
[gammaloop-workspace-check] Checking strum v0.26.3
21.32 s
[gammaloop-workspace-check] Checking sysinfo v0.33.1
21.37 s
[gammaloop-workspace-check] Checking shlex v1.3.0
21.38 s
[gammaloop-workspace-check] Checking futures-task v0.3.32
21.46 s
[gammaloop-workspace-check] Checking futures-core v0.3.32
21.49 s
[gammaloop-workspace-check] Checking slab v0.4.12
21.55 s
[gammaloop-workspace-check] Checking clap_complete_nushell v4.6.0
21.56 s
[gammaloop-workspace-check] Checking sdd v3.0.10
21.57 s
[gammaloop-workspace-check] Compiling gammaloop-integration-tests v0.1.0 (/build/source/tests)
21.60 s
[gammaloop-workspace-check] Compiling test-log-core v0.2.20
21.61 s
[gammaloop-workspace-check] Checking futures-util v0.3.32
21.65 s
[gammaloop-workspace-check] Compiling rustc_version v0.4.1
21.71 s
[gammaloop-workspace-check] Checking which v8.0.2
21.72 s
[gammaloop-workspace-check] Checking bincode v1.3.3
21.80 s
[gammaloop-workspace-check] Checking scc v2.4.0
21.85 s
[gammaloop-workspace-check] Compiling numerica v2.2.0 (https://github.com/alphal00p/symbolica?rev=a277a8dadbaae5a8d6605f2f381991a601e1f345#a277a8da)
21.90 s
[gammaloop-workspace-check] Compiling gungraun-runner v0.18.2
22.42 s
[gammaloop-workspace-check] Checking nalgebra v0.29.0
22.45 s
[gammaloop-workspace-check] Checking backtrace v0.3.76
22.50 s
[gammaloop-workspace-check] Compiling gungraun-macros v0.8.0
22.53 s
[gammaloop-workspace-check] Checking reedline v0.42.0
22.78 s
[gammaloop-workspace-check] Checking color-eyre v0.6.5
22.95 s
[gammaloop-workspace-check] Checking proc-macro2 v1.0.106
23.01 s
[gammaloop-workspace-check] Checking futures-executor v0.3.32
23.13 s
[gammaloop-workspace-check] Checking serial_test v3.4.0
23.15 s
[gammaloop-workspace-check] Checking maplit v1.0.2
23.20 s
[gammaloop-workspace-check] Checking base64 v0.21.7
23.23 s
[gammaloop-workspace-check] Compiling iai-callgrind-runner v0.14.2
23.35 s
[gammaloop-workspace-check] Checking kurbo v0.13.0
23.37 s
[gammaloop-workspace-check] Checking quote v1.0.45
23.37 s
[gammaloop-workspace-check] Checking wait-timeout v0.2.1
23.46 s
[gammaloop-workspace-check] Checking bit-vec v0.8.0
23.46 s
[gammaloop-workspace-check] Checking ron v0.8.1
23.49 s
[gammaloop-workspace-check] Compiling iai-callgrind v0.14.2
23.57 s
[gammaloop-workspace-check] Checking quick-error v1.2.3
23.64 s
[gammaloop-workspace-check] Checking bit-set v0.8.0
23.65 s
[gammaloop-workspace-check] Checking rusty-fork v0.3.1
23.78 s
[gammaloop-workspace-check] Checking syn v2.0.117
23.82 s
[gammaloop-workspace-check] Compiling iai-callgrind-macros v0.5.1
23.90 s
[gammaloop-workspace-check] Compiling test-log-macros v0.2.20
23.90 s
[gammaloop-workspace-check] Checking rand_xorshift v0.4.0
23.98 s
[gammaloop-workspace-check] Checking console v0.15.11
24.02 s
[gammaloop-workspace-check] Checking unarray v0.1.4
24.04 s
[gammaloop-workspace-check] Checking pathdiff v0.2.3
24.09 s
[gammaloop-workspace-check] Checking proptest v1.11.0
24.11 s
[gammaloop-workspace-check] Checking clinnet v0.1.8 (/build/source/crates/clinnet)
24.40 s
[gammaloop-workspace-check] Checking similar-asserts v1.7.0
24.53 s
[gammaloop-workspace-check] Checking kurvst v0.1.0 (/build/source/crates/kurvst)
25.45 s
[gammaloop-workspace-check] Compiling graphica v2.1.0 (https://github.com/alphal00p/symbolica?rev=a277a8dadbaae5a8d6605f2f381991a601e1f345#a277a8da)
26.33 s
[gammaloop-workspace-check] Checking test-log v0.2.20
29.31 s
[gammaloop-workspace-check] Checking statrs v0.16.1
30.80 s
[gammaloop-workspace-check] Checking momtrop v0.3.0
33.74 s
[gammaloop-workspace-check] Checking gungraun v0.18.2
34.51 s
[gammaloop-workspace-check] Compiling pyo3-macros v0.28.3
35.55 s
[gammaloop-workspace-check] Compiling pyo3-stub-gen-derive v0.17.2
41.26 s
[gammaloop-workspace-check] Checking pyo3-stub-gen v0.17.2
48.07 s
[gammaloop-workspace-check] Checking symbolica-utils v0.1.0 (/build/source/crates/symbolica-utils)
48.07 s
[gammaloop-workspace-check] Checking spenso-macros v0.3.2 (/build/source/crates/spenso-macros)
241.79 s
[gammaloop-workspace-check] Compiling gammaloop-workspace-hack v0.1.0 (/build/source/crates/gammaloop-workspace-hack)
242.27 s
[gammaloop-workspace-check] Checking linnet v0.17.0 (/build/source/crates/linnet)
246.01 s
[gammaloop-workspace-check] Checking spenso v0.6.0 (/build/source/crates/spenso)
246.26 s
[gammaloop-workspace-check] Checking linnet-py v0.1.0 (/build/source/crates/linnet-py)
246.26 s
[gammaloop-workspace-check] Checking linnest v0.1.0 (/build/source/crates/linnest)
253.36 s
[gammaloop-workspace-check] Checking idenso v0.3.0 (/build/source/crates/idenso)
253.36 s
[gammaloop-workspace-check] Checking gammaloop-tracing-filter v0.1.0 (/build/source/crates/gammaloop-tracing-filter)
255.44 s
[gammaloop-workspace-check] Checking spenso-hep-lib v0.1.7 (/build/source/crates/spenso-hep-lib)
255.65 s
[gammaloop-workspace-check] Checking spynso3 v0.1.2 (/build/source/crates/spynso3)
305.84 s
[gammaloop-workspace-check] error[E0609] : no field `lmb_channel_id` on type `CutInfo`
305.84 s
[gammaloop-workspace-check] --> tests/tests/test_runs/utils.rs:568:36
305.84 s
[gammaloop-workspace-check] |
305.84 s
[gammaloop-workspace-check] 568 | event.cut_info.lmb_channel_id,
305.84 s
[gammaloop-workspace-check] | ^^^^^^^^^^^^^^ unknown field
305.84 s
[gammaloop-workspace-check] |
305.84 s
[gammaloop-workspace-check] = note : available fields are: `particle_pdgs`, `cut_id`, `graph_id`, `graph_group_id`, `orientation_id` ... and 2 others
305.84 s
[gammaloop-workspace-check]
305.84 s
[gammaloop-workspace-check] error[E0609] : no field `lmb_channel_id` on type `CutInfo`
305.84 s
[gammaloop-workspace-check] --> tests/tests/test_runs/utils.rs:580:36
305.84 s
[gammaloop-workspace-check] |
305.84 s
[gammaloop-workspace-check] 580 | event.cut_info.lmb_channel_id,
305.84 s
[gammaloop-workspace-check] | ^^^^^^^^^^^^^^ unknown field
305.84 s
[gammaloop-workspace-check] |
305.84 s
[gammaloop-workspace-check] = note : available fields are: `particle_pdgs`, `cut_id`, `graph_id`, `graph_group_id`, `orientation_id` ... and 2 others
305.84 s
[gammaloop-workspace-check]
306.30 s
[gammaloop-workspace-check] For more information about this error, try `rustc --explain E0609`.
306.32 s
[gammaloop-workspace-check] error : could not compile `gammaloop-integration-tests` (test "test_runs") due to 2 previous errors
306.74 s
Progress: 0 of 1 built (1 failed)
306.74 s
Failed to build gammaloop-workspace-check after 5m02s
306.75 s
Cannot build ' /nix/store/01wv2cvlxmkwk15rfvw73pimfsfm321c-gammaloop-workspace-check-0.1.0.drv '.
306.75 s
Reason: builder failed with exit code 101 .
306.75 s
Output paths:
306.75 s
/nix/store/yxmn18c7b66m3gq4ry6q3s28b9ipm4q2-gammaloop-workspace-check-0.1.0
306.75 s
Last 443 log lines:
306.75 s
> Running phase: unpackPhase
306.75 s
> unpacking source archive /nix/store/p4kvydb95jp9jm0ylgbb2r217q4zaj95-source
306.75 s
> source root is source
306.75 s
> Running phase: patchPhase
306.75 s
> Executing configureCargoCommonVars
306.75 s
> decompressing cargo artifacts from /nix/store/50vpxlcgfxf2d57i27v3d10zjwxxbm2r-gammaloop-workspace-deps-deps-0.1.0/target.tar.zst to target
306.75 s
> Running phase: updateAutotoolsGnuConfigScriptsPhase
306.75 s
> Running phase: configurePhase
306.75 s
> will append /build/source/.cargo-home/config.toml with contents of /nix/store/5drf77x6km4ky7gwlrzdx9bbd6fz09g3-vendor-cargo-deps/config.toml
306.75 s
> default configurePhase, nothing to do
306.75 s
> Running phase: buildPhase
306.75 s
> +++ command cargo --version
306.75 s
> cargo 1.97.0 (c980f4866 2026-06-30)
306.75 s
> +++ command cargo check --profile ci-optim --locked --workspace --features gammaloop-tracing-filter/clap,gammaloop-tracing-filter/symbolica,idenso/bincode,idenso/reference-cases,linnet/bincode,linnet/drawing,linnet/rkyv,linnet/serde,linnet/symbolica,spenso-macros/shadowing,spenso/shadowing,symbolica/tracing_max_level_info,three-dimensional-reps/display,three-dimensional-reps/eval,three-dimensional-reps/serde --all-targets
306.75 s
> Checking cfg-if v1.0.4
306.75 s
> Checking memchr v2.8.0
306.75 s
> Checking once_cell v1.21.4
306.75 s
> Checking either v1.15.0
306.75 s
> Checking serde_core v1.0.228
306.75 s
> Checking libc v0.2.186
306.75 s
> Checking libm v0.2.16
306.75 s
> Checking itoa v1.0.18
306.75 s
> Checking log v0.4.29
306.75 s
> Checking regex-syntax v0.8.10
306.75 s
> Checking zerocopy v0.8.48
306.75 s
> Checking crossbeam-utils v0.8.21
306.75 s
> Checking equivalent v1.0.2
306.75 s
> Checking zmij v1.0.21
306.75 s
> Checking lazy_static v1.5.0
306.75 s
> Checking bytemuck v1.25.0
306.75 s
> Compiling target-lexicon v0.13.5
306.75 s
> Checking arrayvec v0.7.6
306.75 s
> Checking powerfmt v0.2.0
306.75 s
> Checking pin-project-lite v0.2.17
306.75 s
> Checking safe_arch v0.7.4
306.75 s
> Checking time-core v0.1.8
306.75 s
> Checking num_threads v0.1.7
306.75 s
> Checking itertools v0.14.0
306.75 s
> Checking num-conv v0.2.1
306.75 s
> Checking foldhash v0.2.0
306.75 s
> Checking allocator-api2 v0.2.21
306.75 s
> Checking deranged v0.5.8
306.75 s
> Checking const-random v0.1.18
306.75 s
> Checking winnow v1.0.2
306.75 s
> Checking nu-ansi-term v0.50.3
306.75 s
> Checking wide v0.7.33
306.75 s
> Checking tracing-core v0.1.36
306.75 s
> Checking static_assertions v1.1.0
306.75 s
> Checking unty v0.0.4
306.75 s
> Checking sharded-slab v0.1.7
306.75 s
> Checking safe_arch v1.0.0
306.75 s
> Checking hashbrown v0.16.1
306.75 s
> Checking aho-corasick v1.1.4
306.75 s
> Checking crossbeam-epoch v0.9.18
306.75 s
> Checking tracing v0.1.44
306.75 s
> Checking tracing-log v0.2.0
306.75 s
> Checking crossbeam-deque v0.8.6
306.75 s
> Checking thread_local v1.1.9
306.75 s
> Checking indenter v0.3.4
306.75 s
> Checking az v1.3.0
306.75 s
> Checking toml_writer v1.1.1+spec-1.1.0
306.75 s
> Checking wide v1.3.0
306.75 s
> Checking rayon-core v1.13.0
306.75 s
> Compiling phf_shared v0.11.3
306.75 s
> Checking anyhow v1.0.102
306.75 s
> Checking rawpointer v0.2.1
306.75 s
> Checking toml_parser v1.1.2+spec-1.1.0
306.75 s
> Checking dyn-clone v1.0.20
306.75 s
> Checking utf8parse v0.2.2
306.75 s
> Checking alloc-no-stdlib v2.0.4
306.75 s
> Checking anstyle-parse v1.0.0
306.75 s
> Checking alloc-stdlib v0.2.2
306.75 s
> Checking matrixmultiply v0.3.10
306.75 s
> Checking rayon v1.12.0
306.75 s
> Checking colorchoice v1.0.5
306.75 s
> Checking anstyle-query v1.1.5
306.75 s
> Checking anstyle v1.0.14
306.75 s
> Checking colored v3.1.1
306.75 s
> Checking is_terminal_polyfill v1.70.2
306.75 s
> Checking anstream v1.0.0
306.75 s
> Compiling phf_generator v0.11.3
306.75 s
> Checking eyre v0.6.12
306.75 s
> Checking serde v1.0.228
306.75 s
> Checking serde_json v1.0.149
306.75 s
> Compiling pyo3-build-config v0.28.3
306.75 s
> Checking bitflags v2.11.1
306.75 s
> Checking serde_spanned v1.1.1
306.75 s
> Checking toml_datetime v1.1.1+spec-1.1.0
306.75 s
> Checking bitflags v1.3.2
306.75 s
> Checking unicode-width v0.2.2
306.75 s
> Compiling phf_codegen v0.11.3
306.75 s
> Checking num-traits v0.2.19
306.75 s
> Checking getrandom v0.3.4
306.75 s
> Checking time v0.3.47
306.75 s
> Checking gmp-mpfr-sys v1.7.1
306.75 s
> Checking hugepage-rs v0.1.1
306.75 s
> Checking region v3.0.2
306.75 s
> Checking wasmtime-jit-icache-coherence v34.0.2
306.75 s
> Checking brotli-decompressor v5.0.0
306.75 s
> Checking inventory v0.3.24
306.75 s
> Checking smallvec v1.15.1
306.75 s
> Checking tracing-serde v0.2.0
306.75 s
> Checking regex-automata v0.4.14
306.75 s
> Checking rand_core v0.9.5
306.75 s
> Checking bincode v2.0.1
306.75 s
> Checking toml v1.1.2+spec-1.1.0
306.75 s
> Checking spec_math v0.1.6
306.75 s
> Checking smartstring v1.0.1
306.75 s
> Checking thiserror v2.0.18
306.75 s
> Compiling getopts v0.2.24
306.75 s
> Checking libloading v0.9.0
306.75 s
> Checking append-only-vec v0.1.8
306.75 s
> Checking self_cell v1.2.2
306.75 s
> Checking tinyjson v2.5.1
306.75 s
> Checking bytes v1.11.1
306.75 s
> Checking byteorder v1.5.0
306.75 s
> Checking linux-raw-sys v0.12.1
306.75 s
> Checking num-complex v0.4.6
306.75 s
> Checking approx v0.5.1
306.75 s
> Checking num-integer v0.1.46
306.75 s
> Compiling unicode_names2_generator v1.3.0
306.75 s
> Compiling unic-char-range v0.9.0
306.75 s
> Checking brotli v8.0.2
306.75 s
> Compiling unic-common v0.9.0
306.75 s
> Compiling unic-char-property v0.9.0
306.75 s
> Checking rustix v1.1.4
306.75 s
> Compiling is-macro v0.3.7
306.75 s
> Compiling unic-ucd-version v0.9.0
306.75 s
> Compiling rustpython-parser-vendored v0.4.0
306.75 s
> Checking iana-time-zone v0.1.65
306.75 s
> Checking simba v0.9.1
306.75 s
> Compiling rustpython-parser v0.4.0
306.75 s
> Checking chrono v0.4.44
306.75 s
> Compiling phf v0.11.3
306.75 s
> Checking rustc-hash v2.1.2
306.75 s
> Checking ndarray v0.17.2
306.75 s
> Compiling unic-ucd-ident v0.9.0
306.75 s
> Compiling unic-emoji-char v0.9.0
306.75 s
> Compiling rustc-hash v1.1.0
306.75 s
> Compiling lalrpop-util v0.20.2
306.75 s
> Checking ppv-lite86 v0.2.21
306.75 s
> Checking ahash v0.8.12
306.75 s
> Checking rug v1.30.0
306.75 s
> Compiling symbolica v2.2.0 (https://github.com/alphal00p/symbolica?rev=a277a8dadbaae5a8d6605f2f381991a601e1f345#a277a8da)
306.75 s
> Checking unicode-segmentation v1.13.2
306.75 s
> Checking typenum v1.20.0
306.75 s
> Checking getrandom v0.2.17
306.75 s
> Checking rand_chacha v0.9.0
306.75 s
> Checking rand v0.9.4
306.75 s
> Checking scopeguard v1.2.0
306.75 s
> Checking lock_api v0.4.14
306.75 s
> Checking parking_lot_core v0.9.12
306.75 s
> Checking unicode-ident v1.0.24
306.75 s
> Checking hashbrown v0.17.0
306.75 s
> Checking errno v0.3.14
306.75 s
> Checking parking_lot v0.12.5
306.75 s
> Checking clap_lex v1.1.0
306.75 s
> Checking symjit v2.21.0
306.75 s
> Checking strsim v0.11.1
306.75 s
> Checking unicase v2.9.0
306.75 s
> Checking signal-hook-registry v1.4.8
306.75 s
> Checking vte v0.14.1
306.75 s
> Checking same-file v1.0.6
306.75 s
> Checking walkdir v2.5.0
306.75 s
> Checking generic-array v0.14.7
306.75 s
> Checking half v2.7.1
306.75 s
> Checking terminal_size v0.4.4
306.75 s
> Checking clap_builder v4.6.0
306.75 s
> Checking signal-hook v0.3.18
306.75 s
> Checking mio v1.2.0
306.75 s
> Checking indexmap v2.14.0
306.75 s
> Checking ciborium-io v0.2.2
306.75 s
> Checking minimal-lexical v0.2.1
306.75 s
> Checking ciborium-ll v0.2.2
306.75 s
> Checking block-buffer v0.10.4
306.75 s
> Checking crypto-common v0.1.7
306.75 s
> Checking signal-hook-mio v0.2.5
306.75 s
> Checking digest v0.10.7
306.75 s
> Checking derive_more v2.1.1
306.75 s
> Checking nom v7.1.3
306.75 s
> Checking matchers v0.2.0
306.75 s
> Checking regex v1.12.3
306.75 s
> Checking num-bigint v0.4.6
306.75 s
> Checking console v0.16.3
306.75 s
> Checking tracing-subscriber v0.3.23
306.75 s
> Checking bstr v1.12.1
306.75 s
> Checking linux-raw-sys v0.4.15
306.75 s
> Checking cpufeatures v0.2.17
306.75 s
> Checking winnow v0.7.15
306.75 s
> Checking rustix v0.38.44
306.75 s
> Checking sha2 v0.10.9
306.75 s
> Checking globset v0.4.18
306.75 s
> Checking ciborium v0.2.2
306.75 s
> Checking getrandom v0.4.2
306.75 s
> Checking rand_core v0.6.4
306.75 s
> Checking ansitok v0.3.0
306.75 s
> Checking fastrand v2.4.1
306.75 s
> Checking fnv v1.0.7
306.75 s
> Compiling unicode_names2 v1.3.0
306.75 s
> Checking plotters-backend v0.3.7
306.75 s
> Checking tempfile v3.27.0
306.75 s
> Checking rust-embed-utils v8.11.0
306.75 s
> Checking crossterm v0.28.1
306.75 s
> Checking serde_spanned v0.6.9
306.75 s
> Checking toml_datetime v0.6.11
306.75 s
> Checking itertools v0.10.5
306.75 s
> Checking cast v0.3.0
306.75 s
> Checking plotters-svg v0.3.7
306.75 s
> Checking toml_write v0.1.2
306.75 s
> Checking tap v1.0.1
306.75 s
> Checking ansi-str v0.9.0
306.75 s
> Checking plotters v0.3.7
306.75 s
> Checking rand_chacha v0.3.1
306.75 s
> Checking wyz v0.5.1
306.75 s
> Checking radium v0.7.0
306.75 s
> Checking xprec v0.2.2
306.75 s
> Checking toml_edit v0.22.27
306.75 s
> Checking typeid v1.0.3
306.75 s
> Checking similar v2.7.0
306.75 s
> Checking tinytemplate v1.2.1
306.75 s
> Checking is-terminal v0.4.17
306.75 s
> Checking bytecount v0.6.9
306.75 s
> Checking anes v0.1.6
306.75 s
> Checking oorandom v11.1.5
306.75 s
> Checking funty v2.0.0
306.75 s
> Checking papergrid v0.17.0
306.75 s
> Checking ron v0.12.1
306.75 s
> Checking clap v4.6.1
306.75 s
> Checking rand v0.8.6
306.75 s
> Checking testing_table v0.3.0
306.75 s
> Checking env_filter v1.0.1
306.75 s
> Checking toml_edit v0.25.11+spec-1.1.0
306.75 s
> Checking uncased v0.9.10
306.75 s
> Checking jiff v0.2.24
306.75 s
> Checking ptr_meta v0.1.4
306.75 s
> Checking bitvec v1.0.1
306.75 s
> Checking simdutf8 v0.1.5
306.75 s
> Checking ucd-trie v0.1.7
306.75 s
> Checking criterion-plot v0.5.0
306.75 s
> Checking ahash v0.7.8
306.75 s
> Checking bytecheck v0.6.12
306.75 s
> Checking pest v2.8.6
306.75 s
> Checking hashbrown v0.12.3
306.75 s
> Checking criterion v0.5.1
306.75 s
> Checking approx v0.4.0
306.75 s
> Checking seahash v4.1.0
306.75 s
> Checking cgmath v0.18.0
306.75 s
> Checking num-rational v0.4.2
306.75 s
> Checking num-iter v0.1.45
306.75 s
> Checking rend v0.4.2
306.75 s
> Checking insta v1.47.2
306.75 s
> Checking ref-ops v0.2.5
306.75 s
> Checking toml v0.8.23
306.75 s
> Checking rand_xoshiro v0.6.0
306.75 s
> Checking tabled v0.20.0
306.75 s
> Compiling pyo3-ffi v0.28.3
306.75 s
> Compiling pyo3-macros-backend v0.28.3
306.75 s
> Compiling pyo3 v0.28.3
306.75 s
> Compiling numpy v0.28.0
306.75 s
> Checking figment v0.10.19
306.75 s
> Checking num v0.4.3
306.75 s
> Checking features v0.10.0
306.75 s
> Checking gat-lending-iterator v0.1.8
306.75 s
> Checking constcat v0.5.1
306.75 s
> Checking dot-parser v0.5.1
306.75 s
> Checking colored v2.2.0
306.75 s
> Checking cpufeatures v0.3.0
306.75 s
> Checking constant_time_eq v0.4.2
306.75 s
> Checking arrayref v0.3.9
306.75 s
> Checking base64 v0.22.1
306.75 s
> Checking siphasher v1.0.2
306.75 s
> Checking blake3 v1.8.5
306.75 s
> Checking joinery v2.1.0
306.75 s
> Checking subprocess v0.2.15
306.75 s
> Checking rust_lisp v0.18.0
306.75 s
> Checking phf_shared v0.13.1
306.75 s
> Checking titlecase v2.2.1
306.75 s
> Compiling vakint v0.1.2 (/build/source/crates/vakint)
306.75 s
> Checking version-compare v0.2.1
306.75 s
> Checking xpct v0.5.1
306.75 s
> Checking ryu v1.0.23
306.75 s
> Checking castaway v0.2.4
306.75 s
> Checking toml_datetime v0.7.5+spec-1.1.0
306.75 s
> Checking phf v0.13.1
306.75 s
> Checking strum v0.27.2
306.75 s
> Checking unicode-truncate v2.0.1
306.75 s
> Checking compact_str v0.9.0
306.75 s
> Checking kasuari v0.4.12
306.75 s
> Checking lru v0.16.4
306.75 s
> Checking vte v0.15.0
306.75 s
> Checking string-template-plus v0.4.3
306.75 s
> Checking portable-atomic v1.13.1
306.75 s
> Checking toml v0.9.12+spec-1.1.0
306.75 s
> Checking unit-prefix v0.5.2
306.75 s
> Checking vt100 v0.16.2
306.75 s
> Checking rand_distr v0.4.3
306.75 s
> Checking simba v0.6.0
306.75 s
> Checking line-clipping v0.3.7
306.75 s
> Compiling three-dimensional-reps v0.1.0 (/build/source/crates/three-dimensional-reps)
306.75 s
> Checking adler2 v2.0.1
306.75 s
> Checking gimli v0.32.3
306.75 s
> Checking thiserror v1.0.69
306.75 s
> Checking miniz_oxide v0.8.9
306.75 s
> Checking derive_builder v0.11.2
306.75 s
> Checking owo-colors v4.3.0
306.75 s
> Checking object v0.37.3
306.75 s
> Checking crossterm v0.29.0
306.75 s
> Checking env_logger v0.11.10
306.75 s
> Checking ratatui-core v0.1.0
306.75 s
> Checking tracing-error v0.2.1
306.75 s
> Checking indicatif v0.18.4
306.75 s
> Checking typed-index-collections v3.5.0
306.75 s
> Checking amd v0.2.2
306.75 s
> Checking serde-big-array v0.5.1
306.75 s
> Checking itertools v0.11.0
306.75 s
> Compiling gammaloop-tracing-filter-macros v0.1.0 (/build/source/crates/gammaloop-tracing-filter-macros)
306.75 s
> Checking rkyv v0.7.46
306.75 s
> Checking rustc-demangle v0.1.27
306.75 s
> Checking option-ext v0.2.0
306.75 s
> Checking ref-cast v1.0.25
306.75 s
> Compiling rustpython-parser-core v0.4.0
306.75 s
> Checking dirs-sys v0.5.0
306.75 s
> Checking color-spantrace v0.3.0
306.75 s
> Checking nix v0.31.2
306.75 s
> Checking integer-sqrt v0.1.5
306.75 s
> Checking brotli-decompressor v4.0.3
306.75 s
> Checking crossbeam-channel v0.5.15
306.75 s
> Checking itertools v0.12.1
306.75 s
> Checking unsafe-libyaml v0.2.11
306.75 s
> Compiling rustpython-ast v0.4.0
306.75 s
> Checking symlink v0.1.0
306.75 s
> Compiling gammalooprs v0.3.4 (/build/source/crates/gammalooprs)
306.75 s
> Checking include_dir v0.7.4
306.75 s
> Checking ratatui-widgets v0.3.0
306.75 s
> Checking ratatui-crossterm v0.1.0
306.75 s
> Checking ctrlc v3.5.2
306.75 s
> Checking pathfinding v4.15.0
306.75 s
> Checking clarabel v0.11.1
306.75 s
> Checking tracing-indicatif v0.3.14
306.75 s
> Checking dirs v6.0.0
306.75 s
> Checking tracing-appender v0.2.5
306.75 s
> Checking brotli v7.0.0
306.75 s
> Checking schemars v1.2.1
306.75 s
> Checking slotmap v1.1.1
306.75 s
> Checking serde_yaml v0.9.34+deprecated
306.75 s
> Checking json5 v0.4.1
306.75 s
> Checking vectorize v0.2.0
306.75 s
> Checking ringbuffer v0.16.0
306.75 s
> Checking addr2line v0.25.1
306.75 s
> Checking base62 v2.2.4
306.75 s
> Checking rust-embed v8.11.0
306.75 s
> Checking clap_complete v4.6.3
306.75 s
> Checking fd-lock v4.0.4
306.75 s
> Checking ratatui-macros v0.7.0
306.75 s
> Checking strip-ansi-escapes v0.2.1
306.75 s
> Compiling gammaloop-api v0.1.0 (/build/source/crates/gammaloop-api)
306.75 s
> Checking ratatui v0.30.0
306.75 s
> Checking itertools v0.13.0
306.75 s
> Checking strum v0.26.3
306.75 s
> Checking sysinfo v0.33.1
306.75 s
> Checking shlex v1.3.0
306.75 s
> Checking futures-task v0.3.32
306.75 s
> Checking futures-core v0.3.32
306.75 s
> Checking slab v0.4.12
306.75 s
> Checking clap_complete_nushell v4.6.0
306.75 s
> Checking sdd v3.0.10
306.75 s
> Compiling gammaloop-integration-tests v0.1.0 (/build/source/tests)
306.75 s
> Compiling test-log-core v0.2.20
306.75 s
> Checking futures-util v0.3.32
306.75 s
> Compiling rustc_version v0.4.1
306.75 s
> Checking which v8.0.2
306.75 s
> Checking bincode v1.3.3
306.75 s
> Checking scc v2.4.0
306.75 s
> Compiling numerica v2.2.0 (https://github.com/alphal00p/symbolica?rev=a277a8dadbaae5a8d6605f2f381991a601e1f345#a277a8da)
306.75 s
> Compiling gungraun-runner v0.18.2
306.75 s
> Checking nalgebra v0.29.0
306.75 s
> Checking backtrace v0.3.76
306.75 s
> Compiling gungraun-macros v0.8.0
306.75 s
> Checking reedline v0.42.0
306.75 s
> Checking color-eyre v0.6.5
306.75 s
> Checking proc-macro2 v1.0.106
306.75 s
> Checking futures-executor v0.3.32
306.75 s
> Checking serial_test v3.4.0
306.75 s
> Checking maplit v1.0.2
306.75 s
> Checking base64 v0.21.7
306.75 s
> Compiling iai-callgrind-runner v0.14.2
306.75 s
> Checking kurbo v0.13.0
306.75 s
> Checking quote v1.0.45
306.75 s
> Checking wait-timeout v0.2.1
306.75 s
> Checking bit-vec v0.8.0
306.75 s
> Checking ron v0.8.1
306.75 s
> Compiling iai-callgrind v0.14.2
306.75 s
> Checking quick-error v1.2.3
306.75 s
> Checking bit-set v0.8.0
306.75 s
> Checking rusty-fork v0.3.1
306.75 s
> Checking syn v2.0.117
306.75 s
> Compiling iai-callgrind-macros v0.5.1
306.75 s
> Compiling test-log-macros v0.2.20
306.75 s
> Checking rand_xorshift v0.4.0
306.75 s
> Checking console v0.15.11
306.75 s
> Checking unarray v0.1.4
306.75 s
> Checking pathdiff v0.2.3
306.75 s
> Checking proptest v1.11.0
306.75 s
> Checking clinnet v0.1.8 (/build/source/crates/clinnet)
306.75 s
> Checking similar-asserts v1.7.0
306.75 s
> Checking kurvst v0.1.0 (/build/source/crates/kurvst)
306.75 s
> Compiling graphica v2.1.0 (https://github.com/alphal00p/symbolica?rev=a277a8dadbaae5a8d6605f2f381991a601e1f345#a277a8da)
306.75 s
> Checking test-log v0.2.20
306.75 s
> Checking statrs v0.16.1
306.75 s
> Checking momtrop v0.3.0
306.75 s
> Checking gungraun v0.18.2
306.75 s
> Compiling pyo3-macros v0.28.3
306.75 s
> Compiling pyo3-stub-gen-derive v0.17.2
306.75 s
> Checking pyo3-stub-gen v0.17.2
306.75 s
> Checking symbolica-utils v0.1.0 (/build/source/crates/symbolica-utils)
306.75 s
> Checking spenso-macros v0.3.2 (/build/source/crates/spenso-macros)
306.75 s
> Compiling gammaloop-workspace-hack v0.1.0 (/build/source/crates/gammaloop-workspace-hack)
306.75 s
> Checking linnet v0.17.0 (/build/source/crates/linnet)
306.75 s
> Checking spenso v0.6.0 (/build/source/crates/spenso)
306.75 s
> Checking linnet-py v0.1.0 (/build/source/crates/linnet-py)
306.75 s
> Checking linnest v0.1.0 (/build/source/crates/linnest)
306.75 s
> Checking idenso v0.3.0 (/build/source/crates/idenso)
306.75 s
> Checking gammaloop-tracing-filter v0.1.0 (/build/source/crates/gammaloop-tracing-filter)
306.75 s
> Checking spenso-hep-lib v0.1.7 (/build/source/crates/spenso-hep-lib)
306.75 s
> Checking spynso3 v0.1.2 (/build/source/crates/spynso3)
306.75 s
> error[E0609] : no field `lmb_channel_id` on type `CutInfo`
306.75 s
> --> tests/tests/test_runs/utils.rs:568:36
306.75 s
> |
306.75 s
> 568 | event.cut_info.lmb_channel_id,
306.75 s
> | ^^^^^^^^^^^^^^ unknown field
306.75 s
> |
306.75 s
> = note : available fields are: `particle_pdgs`, `cut_id`, `graph_id`, `graph_group_id`, `orientation_id` ... and 2 others
306.75 s
>
306.75 s
> error[E0609] : no field `lmb_channel_id` on type `CutInfo`
306.75 s
> --> tests/tests/test_runs/utils.rs:580:36
306.75 s
> |
306.75 s
> 580 | event.cut_info.lmb_channel_id,
306.75 s
> | ^^^^^^^^^^^^^^ unknown field
306.75 s
> |
306.75 s
> = note : available fields are: `particle_pdgs`, `cut_id`, `graph_id`, `graph_group_id`, `orientation_id` ... and 2 others
306.75 s
>
306.75 s
> For more information about this error, try `rustc --explain E0609`.
306.75 s
> error : could not compile `gammaloop-integration-tests` (test "test_runs") due to 2 previous errors
306.75 s
For full logs, run:
306.75 s
nix log /nix/store/01wv2cvlxmkwk15rfvw73pimfsfm321c-gammaloop-workspace-check-0.1.0.drv
306.79 s
Build failed.