build packages.x86_64-linux.crate-test-binaries-python-api-gammaloop-integration-tests
0.00 s
$ /nix/store/9ypz3flqsrl5xl495mm8h645gadjsxi1-coreutils-9.11/bin/timeout --kill-after=15s 7200s /nix/store/23zk8sgzamrbmj1fday15szf7f2279s8-nix-2.34.7/bin/nix --extra-experimental-features nix-command --extra-experimental-features flakes --log-format internal-json build --no-link --print-out-paths git+https://github.com/alphal00p/gammaloop?ref=advanced_sampling&rev=f2f64fb17dd5dab588eca298dc61f1100fa4962d&shallow=1#packages.x86_64-linux.crate-test-binaries-python-api-gammaloop-integration-tests --print-build-logs
8.91 s
9.19 s
Building /nix/store/0k9s3dg8zlxyd6l94ikbxf4sqdbyrpq6-gammaloop-crate-test-binaries-gammaloop-integration-tests-d6e55b48f8214f9c-deps-0.1.0.drv
9.25 s
[gammaloop-crate-test-binaries-gammaloop-integration-tests-d6e55b48f8214f9c-deps] Phase: unpackPhase
9.26 s
[gammaloop-crate-test-binaries-gammaloop-integration-tests-d6e55b48f8214f9c-deps] unpacking source archive /nix/store/mihhxhg81q7j5z719niswnivgvyvfkc5-source
9.36 s
[gammaloop-crate-test-binaries-gammaloop-integration-tests-d6e55b48f8214f9c-deps] source root is source
9.38 s
[gammaloop-crate-test-binaries-gammaloop-integration-tests-d6e55b48f8214f9c-deps] Phase: patchPhase
9.45 s
[gammaloop-crate-test-binaries-gammaloop-integration-tests-d6e55b48f8214f9c-deps] Executing configureCargoCommonVars
9.45 s
[gammaloop-crate-test-binaries-gammaloop-integration-tests-d6e55b48f8214f9c-deps] copying cargo artifacts from /nix/store/39vrxj0mbhbqrjhjrl796xxkwaprja72-gammaloop-crate-test-binaries-gammaloop-integration-tests-d6e55b48f8214f9c-inputs/target to target
9.45 s
[gammaloop-crate-test-binaries-gammaloop-integration-tests-d6e55b48f8214f9c-deps] will deep copy artifacts (instead of symlinking) as requested
11.82 s
[gammaloop-crate-test-binaries-gammaloop-integration-tests-d6e55b48f8214f9c-deps] Phase: updateAutotoolsGnuConfigScriptsPhase
11.86 s
[gammaloop-crate-test-binaries-gammaloop-integration-tests-d6e55b48f8214f9c-deps] Phase: configurePhase
11.86 s
[gammaloop-crate-test-binaries-gammaloop-integration-tests-d6e55b48f8214f9c-deps] will append /build/source/.cargo-home/config.toml with contents of /nix/store/5drf77x6km4ky7gwlrzdx9bbd6fz09g3-vendor-cargo-deps/config.toml
11.86 s
[gammaloop-crate-test-binaries-gammaloop-integration-tests-d6e55b48f8214f9c-deps] default configurePhase, nothing to do
11.87 s
[gammaloop-crate-test-binaries-gammaloop-integration-tests-d6e55b48f8214f9c-deps] Phase: buildPhase
11.87 s
[gammaloop-crate-test-binaries-gammaloop-integration-tests-d6e55b48f8214f9c-deps] +++ command cargo --version
11.87 s
[gammaloop-crate-test-binaries-gammaloop-integration-tests-d6e55b48f8214f9c-deps] cargo 1.97.0 (c980f4866 2026-06-30)
11.87 s
[gammaloop-crate-test-binaries-gammaloop-integration-tests-d6e55b48f8214f9c-deps] +++ command cargo test --profile ci-optim --no-run --offline -p gammaloop-integration-tests --features gammaloop-integration-tests/python-api-tests
12.31 s
[gammaloop-crate-test-binaries-gammaloop-integration-tests-d6e55b48f8214f9c-deps] Compiling gammaloop-integration-tests v0.1.0 (/build/source/tests)
13.43 s
[gammaloop-crate-test-binaries-gammaloop-integration-tests-d6e55b48f8214f9c-deps] error[E0609] : no field `lmb_channel_id` on type `CutInfo`
13.43 s
[gammaloop-crate-test-binaries-gammaloop-integration-tests-d6e55b48f8214f9c-deps] --> tests/tests/test_runs/utils.rs:568:36
13.43 s
[gammaloop-crate-test-binaries-gammaloop-integration-tests-d6e55b48f8214f9c-deps] |
13.43 s
[gammaloop-crate-test-binaries-gammaloop-integration-tests-d6e55b48f8214f9c-deps] 568 | event.cut_info.lmb_channel_id,
13.43 s
[gammaloop-crate-test-binaries-gammaloop-integration-tests-d6e55b48f8214f9c-deps] | ^^^^^^^^^^^^^^ unknown field
13.43 s
[gammaloop-crate-test-binaries-gammaloop-integration-tests-d6e55b48f8214f9c-deps] |
13.43 s
[gammaloop-crate-test-binaries-gammaloop-integration-tests-d6e55b48f8214f9c-deps] = note : available fields are: `particle_pdgs`, `cut_id`, `graph_id`, `graph_group_id`, `orientation_id` ... and 2 others
13.43 s
[gammaloop-crate-test-binaries-gammaloop-integration-tests-d6e55b48f8214f9c-deps]
13.43 s
[gammaloop-crate-test-binaries-gammaloop-integration-tests-d6e55b48f8214f9c-deps] error[E0609] : no field `lmb_channel_id` on type `CutInfo`
13.43 s
[gammaloop-crate-test-binaries-gammaloop-integration-tests-d6e55b48f8214f9c-deps] --> tests/tests/test_runs/utils.rs:580:36
13.43 s
[gammaloop-crate-test-binaries-gammaloop-integration-tests-d6e55b48f8214f9c-deps] |
13.43 s
[gammaloop-crate-test-binaries-gammaloop-integration-tests-d6e55b48f8214f9c-deps] 580 | event.cut_info.lmb_channel_id,
13.43 s
[gammaloop-crate-test-binaries-gammaloop-integration-tests-d6e55b48f8214f9c-deps] | ^^^^^^^^^^^^^^ unknown field
13.43 s
[gammaloop-crate-test-binaries-gammaloop-integration-tests-d6e55b48f8214f9c-deps] |
13.43 s
[gammaloop-crate-test-binaries-gammaloop-integration-tests-d6e55b48f8214f9c-deps] = note : available fields are: `particle_pdgs`, `cut_id`, `graph_id`, `graph_group_id`, `orientation_id` ... and 2 others
13.43 s
[gammaloop-crate-test-binaries-gammaloop-integration-tests-d6e55b48f8214f9c-deps]
14.13 s
[gammaloop-crate-test-binaries-gammaloop-integration-tests-d6e55b48f8214f9c-deps] For more information about this error, try `rustc --explain E0609`.
14.15 s
[gammaloop-crate-test-binaries-gammaloop-integration-tests-d6e55b48f8214f9c-deps] error : could not compile `gammaloop-integration-tests` (test "test_runs") due to 2 previous errors
14.15 s
[gammaloop-crate-test-binaries-gammaloop-integration-tests-d6e55b48f8214f9c-deps] warning : build failed, waiting for other jobs to finish...
75.41 s
Progress: 0 of 2 built (1 failed)
75.41 s
Failed to build gammaloop-crate-test-binaries-gammaloop-integration-tests-d6e55b48f8214f9c-deps after 1m06s
75.41 s
error: Cannot build '/nix/store/0k9s3dg8zlxyd6l94ikbxf4sqdbyrpq6-gammaloop-crate-test-binaries-gammaloop-integration-tests-d6e55b48f8214f9c-deps-0.1.0.drv '.
75.41 s
Reason: builder failed with exit code 101 .
75.41 s
Output paths:
75.41 s
/nix/store/jfhac9hw5259wrblprxqqavgbzsgz50i-gammaloop-crate-test-binaries-gammaloop-integration-tests-d6e55b48f8214f9c-deps-0.1.0
75.41 s
Last 35 log lines:
75.41 s
> Running phase: unpackPhase
75.41 s
> unpacking source archive /nix/store/mihhxhg81q7j5z719niswnivgvyvfkc5-source
75.41 s
> source root is source
75.41 s
> Running phase: patchPhase
75.41 s
> Executing configureCargoCommonVars
75.41 s
> copying cargo artifacts from /nix/store/39vrxj0mbhbqrjhjrl796xxkwaprja72-gammaloop-crate-test-binaries-gammaloop-integration-tests-d6e55b48f8214f9c-inputs/target to target
75.41 s
> will deep copy artifacts (instead of symlinking) as requested
75.41 s
> Running phase: updateAutotoolsGnuConfigScriptsPhase
75.41 s
> Running phase: configurePhase
75.41 s
> will append /build/source/.cargo-home/config.toml with contents of /nix/store/5drf77x6km4ky7gwlrzdx9bbd6fz09g3-vendor-cargo-deps/config.toml
75.41 s
> default configurePhase, nothing to do
75.41 s
> Running phase: buildPhase
75.41 s
> +++ command cargo --version
75.41 s
> cargo 1.97.0 (c980f4866 2026-06-30)
75.41 s
> +++ command cargo test --profile ci-optim --no-run --offline -p gammaloop-integration-tests --features gammaloop-integration-tests/python-api-tests
75.41 s
> Compiling gammaloop-integration-tests v0.1.0 (/build/source/tests)
75.41 s
> error[E0609] : no field `lmb_channel_id` on type `CutInfo`
75.41 s
> --> tests/tests/test_runs/utils.rs:568:36
75.41 s
> |
75.41 s
> 568 | event.cut_info.lmb_channel_id,
75.41 s
> | ^^^^^^^^^^^^^^ unknown field
75.41 s
> |
75.41 s
> = note : available fields are: `particle_pdgs`, `cut_id`, `graph_id`, `graph_group_id`, `orientation_id` ... and 2 others
75.41 s
>
75.41 s
> error[E0609] : no field `lmb_channel_id` on type `CutInfo`
75.41 s
> --> tests/tests/test_runs/utils.rs:580:36
75.41 s
> |
75.41 s
> 580 | event.cut_info.lmb_channel_id,
75.41 s
> | ^^^^^^^^^^^^^^ unknown field
75.41 s
> |
75.41 s
> = note : available fields are: `particle_pdgs`, `cut_id`, `graph_id`, `graph_group_id`, `orientation_id` ... and 2 others
75.41 s
>
75.41 s
> For more information about this error, try `rustc --explain E0609`.
75.41 s
> error : could not compile `gammaloop-integration-tests` (test "test_runs") due to 2 previous errors
75.41 s
> warning : build failed, waiting for other jobs to finish...
75.41 s
For full logs, run:
75.41 s
nix log /nix/store/0k9s3dg8zlxyd6l94ikbxf4sqdbyrpq6-gammaloop-crate-test-binaries-gammaloop-integration-tests-d6e55b48f8214f9c-deps-0.1.0.drv
75.41 s
error: Cannot build '/nix/store/8sh98ir2sg6kvd7rmph6yb4z4l2ch4h6-nix-ci-artifact-barrier-crate-test-binaries-python-api-gammaloop-integration-tests.drv '.
75.41 s
Reason: 1 dependency failed .
75.41 s
Output paths:
75.41 s
/nix/store/8fn8d26h1ygg045rq9i18qxj8j33idqm-nix-ci-artifact-barrier-crate-test-binaries-python-api-gammaloop-integration-tests
75.42 s
Build failed due to failed dependency
75.50 s
Build failed.