1. 0.00 s $ /nix/store/9ypz3flqsrl5xl495mm8h645gadjsxi1-coreutils-9.11/bin/timeout --kill-after=15s 7200s /nix/store/23zk8sgzamrbmj1fday15szf7f2279s8-nix-2.34.7/bin/nix --extra-experimental-features nix-command --extra-experimental-features flakes --log-format internal-json build --no-link --print-out-paths git+https://github.com/alphal00p/gammaloop?ref=advanced_sampling&rev=f2f64fb17dd5dab588eca298dc61f1100fa4962d&shallow=1#packages.x86_64-linux.crate-test-binaries-python-api-gammaloop-integration-tests --print-build-logs
  2. 8.91 s
  3. 9.19 s Building /nix/store/0k9s3dg8zlxyd6l94ikbxf4sqdbyrpq6-gammaloop-crate-test-binaries-gammaloop-integration-tests-d6e55b48f8214f9c-deps-0.1.0.drv
  4. 9.25 s [gammaloop-crate-test-binaries-gammaloop-integration-tests-d6e55b48f8214f9c-deps] Phase: unpackPhase
  5. 9.26 s [gammaloop-crate-test-binaries-gammaloop-integration-tests-d6e55b48f8214f9c-deps] unpacking source archive /nix/store/mihhxhg81q7j5z719niswnivgvyvfkc5-source
  6. 9.36 s [gammaloop-crate-test-binaries-gammaloop-integration-tests-d6e55b48f8214f9c-deps] source root is source
  7. 9.38 s [gammaloop-crate-test-binaries-gammaloop-integration-tests-d6e55b48f8214f9c-deps] Phase: patchPhase
  8. 9.45 s [gammaloop-crate-test-binaries-gammaloop-integration-tests-d6e55b48f8214f9c-deps] Executing configureCargoCommonVars
  9. 9.45 s [gammaloop-crate-test-binaries-gammaloop-integration-tests-d6e55b48f8214f9c-deps] copying cargo artifacts from /nix/store/39vrxj0mbhbqrjhjrl796xxkwaprja72-gammaloop-crate-test-binaries-gammaloop-integration-tests-d6e55b48f8214f9c-inputs/target to target
  10. 9.45 s [gammaloop-crate-test-binaries-gammaloop-integration-tests-d6e55b48f8214f9c-deps] will deep copy artifacts (instead of symlinking) as requested
  11. 11.82 s [gammaloop-crate-test-binaries-gammaloop-integration-tests-d6e55b48f8214f9c-deps] Phase: updateAutotoolsGnuConfigScriptsPhase
  12. 11.86 s [gammaloop-crate-test-binaries-gammaloop-integration-tests-d6e55b48f8214f9c-deps] Phase: configurePhase
  13. 11.86 s [gammaloop-crate-test-binaries-gammaloop-integration-tests-d6e55b48f8214f9c-deps] will append /build/source/.cargo-home/config.toml with contents of /nix/store/5drf77x6km4ky7gwlrzdx9bbd6fz09g3-vendor-cargo-deps/config.toml
  14. 11.86 s [gammaloop-crate-test-binaries-gammaloop-integration-tests-d6e55b48f8214f9c-deps] default configurePhase, nothing to do
  15. 11.87 s [gammaloop-crate-test-binaries-gammaloop-integration-tests-d6e55b48f8214f9c-deps] Phase: buildPhase
  16. 11.87 s [gammaloop-crate-test-binaries-gammaloop-integration-tests-d6e55b48f8214f9c-deps] +++ command cargo --version
  17. 11.87 s [gammaloop-crate-test-binaries-gammaloop-integration-tests-d6e55b48f8214f9c-deps] cargo 1.97.0 (c980f4866 2026-06-30)
  18. 11.87 s [gammaloop-crate-test-binaries-gammaloop-integration-tests-d6e55b48f8214f9c-deps] +++ command cargo test --profile ci-optim --no-run --offline -p gammaloop-integration-tests --features gammaloop-integration-tests/python-api-tests
  19. 12.31 s [gammaloop-crate-test-binaries-gammaloop-integration-tests-d6e55b48f8214f9c-deps] Compiling gammaloop-integration-tests v0.1.0 (/build/source/tests)
  20. 13.43 s [gammaloop-crate-test-binaries-gammaloop-integration-tests-d6e55b48f8214f9c-deps] error[E0609]: no field `lmb_channel_id` on type `CutInfo`
  21. 13.43 s [gammaloop-crate-test-binaries-gammaloop-integration-tests-d6e55b48f8214f9c-deps] --> tests/tests/test_runs/utils.rs:568:36
  22. 13.43 s [gammaloop-crate-test-binaries-gammaloop-integration-tests-d6e55b48f8214f9c-deps] |
  23. 13.43 s [gammaloop-crate-test-binaries-gammaloop-integration-tests-d6e55b48f8214f9c-deps] 568 | event.cut_info.lmb_channel_id,
  24. 13.43 s [gammaloop-crate-test-binaries-gammaloop-integration-tests-d6e55b48f8214f9c-deps] | ^^^^^^^^^^^^^^ unknown field
  25. 13.43 s [gammaloop-crate-test-binaries-gammaloop-integration-tests-d6e55b48f8214f9c-deps] |
  26. 13.43 s [gammaloop-crate-test-binaries-gammaloop-integration-tests-d6e55b48f8214f9c-deps] = note: available fields are: `particle_pdgs`, `cut_id`, `graph_id`, `graph_group_id`, `orientation_id` ... and 2 others
  27. 13.43 s [gammaloop-crate-test-binaries-gammaloop-integration-tests-d6e55b48f8214f9c-deps]
  28. 13.43 s [gammaloop-crate-test-binaries-gammaloop-integration-tests-d6e55b48f8214f9c-deps] error[E0609]: no field `lmb_channel_id` on type `CutInfo`
  29. 13.43 s [gammaloop-crate-test-binaries-gammaloop-integration-tests-d6e55b48f8214f9c-deps] --> tests/tests/test_runs/utils.rs:580:36
  30. 13.43 s [gammaloop-crate-test-binaries-gammaloop-integration-tests-d6e55b48f8214f9c-deps] |
  31. 13.43 s [gammaloop-crate-test-binaries-gammaloop-integration-tests-d6e55b48f8214f9c-deps] 580 | event.cut_info.lmb_channel_id,
  32. 13.43 s [gammaloop-crate-test-binaries-gammaloop-integration-tests-d6e55b48f8214f9c-deps] | ^^^^^^^^^^^^^^ unknown field
  33. 13.43 s [gammaloop-crate-test-binaries-gammaloop-integration-tests-d6e55b48f8214f9c-deps] |
  34. 13.43 s [gammaloop-crate-test-binaries-gammaloop-integration-tests-d6e55b48f8214f9c-deps] = note: available fields are: `particle_pdgs`, `cut_id`, `graph_id`, `graph_group_id`, `orientation_id` ... and 2 others
  35. 13.43 s [gammaloop-crate-test-binaries-gammaloop-integration-tests-d6e55b48f8214f9c-deps]
  36. 14.13 s [gammaloop-crate-test-binaries-gammaloop-integration-tests-d6e55b48f8214f9c-deps] For more information about this error, try `rustc --explain E0609`.
  37. 14.15 s [gammaloop-crate-test-binaries-gammaloop-integration-tests-d6e55b48f8214f9c-deps] error: could not compile `gammaloop-integration-tests` (test "test_runs") due to 2 previous errors
  38. 14.15 s [gammaloop-crate-test-binaries-gammaloop-integration-tests-d6e55b48f8214f9c-deps] warning: build failed, waiting for other jobs to finish...
  39. 75.41 s Progress: 0 of 2 built (1 failed)
  40. 75.41 s Failed to build gammaloop-crate-test-binaries-gammaloop-integration-tests-d6e55b48f8214f9c-deps after 1m06s
  41. 75.41 s error: Cannot build '/nix/store/0k9s3dg8zlxyd6l94ikbxf4sqdbyrpq6-gammaloop-crate-test-binaries-gammaloop-integration-tests-d6e55b48f8214f9c-deps-0.1.0.drv'.
  42. 75.41 s Reason: builder failed with exit code 101.
  43. 75.41 s Output paths:
  44. 75.41 s /nix/store/jfhac9hw5259wrblprxqqavgbzsgz50i-gammaloop-crate-test-binaries-gammaloop-integration-tests-d6e55b48f8214f9c-deps-0.1.0
  45. 75.41 s Last 35 log lines:
  46. 75.41 s > Running phase: unpackPhase
  47. 75.41 s > unpacking source archive /nix/store/mihhxhg81q7j5z719niswnivgvyvfkc5-source
  48. 75.41 s > source root is source
  49. 75.41 s > Running phase: patchPhase
  50. 75.41 s > Executing configureCargoCommonVars
  51. 75.41 s > copying cargo artifacts from /nix/store/39vrxj0mbhbqrjhjrl796xxkwaprja72-gammaloop-crate-test-binaries-gammaloop-integration-tests-d6e55b48f8214f9c-inputs/target to target
  52. 75.41 s > will deep copy artifacts (instead of symlinking) as requested
  53. 75.41 s > Running phase: updateAutotoolsGnuConfigScriptsPhase
  54. 75.41 s > Running phase: configurePhase
  55. 75.41 s > will append /build/source/.cargo-home/config.toml with contents of /nix/store/5drf77x6km4ky7gwlrzdx9bbd6fz09g3-vendor-cargo-deps/config.toml
  56. 75.41 s > default configurePhase, nothing to do
  57. 75.41 s > Running phase: buildPhase
  58. 75.41 s > +++ command cargo --version
  59. 75.41 s > cargo 1.97.0 (c980f4866 2026-06-30)
  60. 75.41 s > +++ command cargo test --profile ci-optim --no-run --offline -p gammaloop-integration-tests --features gammaloop-integration-tests/python-api-tests
  61. 75.41 s > Compiling gammaloop-integration-tests v0.1.0 (/build/source/tests)
  62. 75.41 s > error[E0609]: no field `lmb_channel_id` on type `CutInfo`
  63. 75.41 s > --> tests/tests/test_runs/utils.rs:568:36
  64. 75.41 s > |
  65. 75.41 s > 568 | event.cut_info.lmb_channel_id,
  66. 75.41 s > | ^^^^^^^^^^^^^^ unknown field
  67. 75.41 s > |
  68. 75.41 s > = note: available fields are: `particle_pdgs`, `cut_id`, `graph_id`, `graph_group_id`, `orientation_id` ... and 2 others
  69. 75.41 s >
  70. 75.41 s > error[E0609]: no field `lmb_channel_id` on type `CutInfo`
  71. 75.41 s > --> tests/tests/test_runs/utils.rs:580:36
  72. 75.41 s > |
  73. 75.41 s > 580 | event.cut_info.lmb_channel_id,
  74. 75.41 s > | ^^^^^^^^^^^^^^ unknown field
  75. 75.41 s > |
  76. 75.41 s > = note: available fields are: `particle_pdgs`, `cut_id`, `graph_id`, `graph_group_id`, `orientation_id` ... and 2 others
  77. 75.41 s >
  78. 75.41 s > For more information about this error, try `rustc --explain E0609`.
  79. 75.41 s > error: could not compile `gammaloop-integration-tests` (test "test_runs") due to 2 previous errors
  80. 75.41 s > warning: build failed, waiting for other jobs to finish...
  81. 75.41 s For full logs, run:
  82. 75.41 s nix log /nix/store/0k9s3dg8zlxyd6l94ikbxf4sqdbyrpq6-gammaloop-crate-test-binaries-gammaloop-integration-tests-d6e55b48f8214f9c-deps-0.1.0.drv
  83. 75.41 s error: Cannot build '/nix/store/8sh98ir2sg6kvd7rmph6yb4z4l2ch4h6-nix-ci-artifact-barrier-crate-test-binaries-python-api-gammaloop-integration-tests.drv'.
  84. 75.41 s Reason: 1 dependency failed.
  85. 75.41 s Output paths:
  86. 75.41 s /nix/store/8fn8d26h1ygg045rq9i18qxj8j33idqm-nix-ci-artifact-barrier-crate-test-binaries-python-api-gammaloop-integration-tests
  87. 75.42 s Build failed due to failed dependency
  88. 75.50 s Build failed.