1. 0.00 s $ /nix/store/9ypz3flqsrl5xl495mm8h645gadjsxi1-coreutils-9.11/bin/timeout --kill-after=15s 7200s /nix/store/23zk8sgzamrbmj1fday15szf7f2279s8-nix-2.34.7/bin/nix --extra-experimental-features nix-command --extra-experimental-features flakes --log-format internal-json build --no-link --print-out-paths git+https://github.com/alphal00p/gammaloop?ref=advanced_sampling&rev=f89addb17aa58fe7067932d90976b4f2b7c7d41d&shallow=1#packages.x86_64-linux.crate-test-binaries-python-api-gammaloop-integration-tests --print-build-logs
  2. 7.88 s
  3. 8.56 s Downloading cached gammaloop-python-module from https://cache.nix-ci.com
  4. 8.58 s Downloading cached gammaloop-crate-test-dependencies-d6e55b48f8214f9c-inputs from https://cache.nix-ci.com
  5. 9.88 s Downloaded cached gammaloop-python-module (148.1 MiB) in 1.3s
  6. 9.88 s Progress: 0 of 5 built, 1 of 3 downloaded from cache (1 downloading)
  7. 29.65 s Downloaded cached gammaloop-crate-test-dependencies-d6e55b48f8214f9c-inputs (3.2 GiB) in 21.0s
  8. 29.65 s Progress: 0 of 4 built, 2 of 3 downloaded from cache
  9. 29.65 s Downloading cached gammaloop-crate-test-dependencies-d6e55b48f8214f9c-deps from https://cache.nix-ci.com
  10. 29.90 s Downloaded cached gammaloop-crate-test-dependencies-d6e55b48f8214f9c-deps (30.1 MiB) in 249ms
  11. 29.90 s Progress: 0 of 4 built, 3 of 3 downloaded from cache
  12. 30.08 s Building /nix/store/jq0fjq315hvvj7gncm6x1j6dllf2jhm5-gammaloop-crate-test-binaries-gammaloop-integration-tests-d6e55b48f8214f9c-inputs.drv
  13. 43.51 s [gammaloop-crate-test-binaries-gammaloop-integration-tests-d6e55b48f8214f9c-inputs:post-build] Uploading to the NixCI cache: /nix/store/sb9n3ysl769s5phmbphlglrdpfn97wss-gammaloop-crate-test-binaries-gammaloop-integration-tests-d6e55b48f8214f9c-inputs
  14. 43.57 s [gammaloop-crate-test-binaries-gammaloop-integration-tests-d6e55b48f8214f9c-inputs:post-build] warning: 'warn-short-path-literals' is deprecated, use 'lint-short-path-literals = ignore' instead
  15. 43.63 s [gammaloop-crate-test-binaries-gammaloop-integration-tests-d6e55b48f8214f9c-inputs:post-build] copying 1 paths...
  16. 43.63 s [gammaloop-crate-test-binaries-gammaloop-integration-tests-d6e55b48f8214f9c-inputs:post-build] copying path '/nix/store/sb9n3ysl769s5phmbphlglrdpfn97wss-gammaloop-crate-test-binaries-gammaloop-integration-tests-d6e55b48f8214f9c-inputs' to 'https://cache.nix-ci.com'...
  17. 152.70 s [gammaloop-crate-test-binaries-gammaloop-integration-tests-d6e55b48f8214f9c-inputs:post-build] warning: 'warn-short-path-literals' is deprecated, use 'lint-short-path-literals = ignore' instead
  18. 153.00 s [gammaloop-crate-test-binaries-gammaloop-integration-tests-d6e55b48f8214f9c-inputs:post-build] copying 1 paths...
  19. 153.01 s [gammaloop-crate-test-binaries-gammaloop-integration-tests-d6e55b48f8214f9c-inputs:post-build] copying path '/nix/store/jq0fjq315hvvj7gncm6x1j6dllf2jhm5-gammaloop-crate-test-binaries-gammaloop-integration-tests-d6e55b48f8214f9c-inputs.drv' to 'https://cache.nix-ci.com'...
  20. 153.17 s Uploaded gammaloop-crate-test-binaries-gammaloop-integration-tests-d6e55b48f8214f9c-inputs in 1m49s
  21. 153.17 s Progress: 1 of 4 built, 3 of 3 downloaded from cache
  22. 153.17 s Built gammaloop-crate-test-binaries-gammaloop-integration-tests-d6e55b48f8214f9c-inputs in 2m03s
  23. 153.30 s Building /nix/store/cqmk3819ylgl7iwbrx13fza8wd26bj4p-gammaloop-crate-test-binaries-gammaloop-integration-tests-d6e55b48f8214f9c-deps-0.1.0.drv
  24. 153.42 s [gammaloop-crate-test-binaries-gammaloop-integration-tests-d6e55b48f8214f9c-deps] Phase: unpackPhase
  25. 153.42 s [gammaloop-crate-test-binaries-gammaloop-integration-tests-d6e55b48f8214f9c-deps] unpacking source archive /nix/store/yismii9yjwyhf5ykjk8fhai0ymy3bnl5-source
  26. 153.62 s [gammaloop-crate-test-binaries-gammaloop-integration-tests-d6e55b48f8214f9c-deps] source root is source
  27. 153.64 s [gammaloop-crate-test-binaries-gammaloop-integration-tests-d6e55b48f8214f9c-deps] Phase: patchPhase
  28. 153.76 s [gammaloop-crate-test-binaries-gammaloop-integration-tests-d6e55b48f8214f9c-deps] Executing configureCargoCommonVars
  29. 153.77 s [gammaloop-crate-test-binaries-gammaloop-integration-tests-d6e55b48f8214f9c-deps] copying cargo artifacts from /nix/store/sb9n3ysl769s5phmbphlglrdpfn97wss-gammaloop-crate-test-binaries-gammaloop-integration-tests-d6e55b48f8214f9c-inputs/target to target
  30. 153.77 s [gammaloop-crate-test-binaries-gammaloop-integration-tests-d6e55b48f8214f9c-deps] will deep copy artifacts (instead of symlinking) as requested
  31. 155.73 s [gammaloop-crate-test-binaries-gammaloop-integration-tests-d6e55b48f8214f9c-deps] Phase: updateAutotoolsGnuConfigScriptsPhase
  32. 155.77 s [gammaloop-crate-test-binaries-gammaloop-integration-tests-d6e55b48f8214f9c-deps] Phase: configurePhase
  33. 155.78 s [gammaloop-crate-test-binaries-gammaloop-integration-tests-d6e55b48f8214f9c-deps] will append /build/source/.cargo-home/config.toml with contents of /nix/store/5drf77x6km4ky7gwlrzdx9bbd6fz09g3-vendor-cargo-deps/config.toml
  34. 155.78 s [gammaloop-crate-test-binaries-gammaloop-integration-tests-d6e55b48f8214f9c-deps] default configurePhase, nothing to do
  35. 155.78 s [gammaloop-crate-test-binaries-gammaloop-integration-tests-d6e55b48f8214f9c-deps] Phase: buildPhase
  36. 155.79 s [gammaloop-crate-test-binaries-gammaloop-integration-tests-d6e55b48f8214f9c-deps] +++ command cargo --version
  37. 155.80 s [gammaloop-crate-test-binaries-gammaloop-integration-tests-d6e55b48f8214f9c-deps] cargo 1.97.0 (c980f4866 2026-06-30)
  38. 155.80 s [gammaloop-crate-test-binaries-gammaloop-integration-tests-d6e55b48f8214f9c-deps] +++ command cargo test --profile ci-optim --no-run --offline -p gammaloop-integration-tests --features gammaloop-integration-tests/python-api-tests
  39. 156.31 s [gammaloop-crate-test-binaries-gammaloop-integration-tests-d6e55b48f8214f9c-deps] Compiling gammaloop-integration-tests v0.1.0 (/build/source/tests)
  40. 158.31 s [gammaloop-crate-test-binaries-gammaloop-integration-tests-d6e55b48f8214f9c-deps] error[E0609]: no field `lmb_channel_id` on type `CutInfo`
  41. 158.31 s [gammaloop-crate-test-binaries-gammaloop-integration-tests-d6e55b48f8214f9c-deps] --> tests/tests/test_runs/utils.rs:568:36
  42. 158.31 s [gammaloop-crate-test-binaries-gammaloop-integration-tests-d6e55b48f8214f9c-deps] |
  43. 158.31 s [gammaloop-crate-test-binaries-gammaloop-integration-tests-d6e55b48f8214f9c-deps] 568 | event.cut_info.lmb_channel_id,
  44. 158.31 s [gammaloop-crate-test-binaries-gammaloop-integration-tests-d6e55b48f8214f9c-deps] | ^^^^^^^^^^^^^^ unknown field
  45. 158.31 s [gammaloop-crate-test-binaries-gammaloop-integration-tests-d6e55b48f8214f9c-deps] |
  46. 158.31 s [gammaloop-crate-test-binaries-gammaloop-integration-tests-d6e55b48f8214f9c-deps] = note: available fields are: `particle_pdgs`, `cut_id`, `graph_id`, `graph_group_id`, `orientation_id` ... and 2 others
  47. 158.31 s [gammaloop-crate-test-binaries-gammaloop-integration-tests-d6e55b48f8214f9c-deps]
  48. 158.32 s [gammaloop-crate-test-binaries-gammaloop-integration-tests-d6e55b48f8214f9c-deps] error[E0609]: no field `lmb_channel_id` on type `CutInfo`
  49. 158.32 s [gammaloop-crate-test-binaries-gammaloop-integration-tests-d6e55b48f8214f9c-deps] --> tests/tests/test_runs/utils.rs:580:36
  50. 158.32 s [gammaloop-crate-test-binaries-gammaloop-integration-tests-d6e55b48f8214f9c-deps] |
  51. 158.32 s [gammaloop-crate-test-binaries-gammaloop-integration-tests-d6e55b48f8214f9c-deps] 580 | event.cut_info.lmb_channel_id,
  52. 158.32 s [gammaloop-crate-test-binaries-gammaloop-integration-tests-d6e55b48f8214f9c-deps] | ^^^^^^^^^^^^^^ unknown field
  53. 158.32 s [gammaloop-crate-test-binaries-gammaloop-integration-tests-d6e55b48f8214f9c-deps] |
  54. 158.32 s [gammaloop-crate-test-binaries-gammaloop-integration-tests-d6e55b48f8214f9c-deps] = note: available fields are: `particle_pdgs`, `cut_id`, `graph_id`, `graph_group_id`, `orientation_id` ... and 2 others
  55. 158.32 s [gammaloop-crate-test-binaries-gammaloop-integration-tests-d6e55b48f8214f9c-deps]
  56. 159.60 s [gammaloop-crate-test-binaries-gammaloop-integration-tests-d6e55b48f8214f9c-deps] For more information about this error, try `rustc --explain E0609`.
  57. 159.64 s [gammaloop-crate-test-binaries-gammaloop-integration-tests-d6e55b48f8214f9c-deps] error: could not compile `gammaloop-integration-tests` (test "test_runs") due to 2 previous errors
  58. 159.64 s [gammaloop-crate-test-binaries-gammaloop-integration-tests-d6e55b48f8214f9c-deps] warning: build failed, waiting for other jobs to finish...
  59. 234.95 s Progress: 1 of 3 built (1 failed), 3 of 3 downloaded from cache
  60. 234.95 s Failed to build gammaloop-crate-test-binaries-gammaloop-integration-tests-d6e55b48f8214f9c-deps after 1m21s
  61. 234.95 s error: Cannot build '/nix/store/cqmk3819ylgl7iwbrx13fza8wd26bj4p-gammaloop-crate-test-binaries-gammaloop-integration-tests-d6e55b48f8214f9c-deps-0.1.0.drv'.
  62. 234.95 s Reason: builder failed with exit code 101.
  63. 234.95 s Output paths:
  64. 234.95 s /nix/store/ndlfva03an6aqp6bfkqgb29jas147yxa-gammaloop-crate-test-binaries-gammaloop-integration-tests-d6e55b48f8214f9c-deps-0.1.0
  65. 234.95 s Last 35 log lines:
  66. 234.95 s > Running phase: unpackPhase
  67. 234.95 s > unpacking source archive /nix/store/yismii9yjwyhf5ykjk8fhai0ymy3bnl5-source
  68. 234.95 s > source root is source
  69. 234.95 s > Running phase: patchPhase
  70. 234.95 s > Executing configureCargoCommonVars
  71. 234.95 s > copying cargo artifacts from /nix/store/sb9n3ysl769s5phmbphlglrdpfn97wss-gammaloop-crate-test-binaries-gammaloop-integration-tests-d6e55b48f8214f9c-inputs/target to target
  72. 234.95 s > will deep copy artifacts (instead of symlinking) as requested
  73. 234.95 s > Running phase: updateAutotoolsGnuConfigScriptsPhase
  74. 234.95 s > Running phase: configurePhase
  75. 234.95 s > will append /build/source/.cargo-home/config.toml with contents of /nix/store/5drf77x6km4ky7gwlrzdx9bbd6fz09g3-vendor-cargo-deps/config.toml
  76. 234.95 s > default configurePhase, nothing to do
  77. 234.95 s > Running phase: buildPhase
  78. 234.95 s > +++ command cargo --version
  79. 234.95 s > cargo 1.97.0 (c980f4866 2026-06-30)
  80. 234.95 s > +++ command cargo test --profile ci-optim --no-run --offline -p gammaloop-integration-tests --features gammaloop-integration-tests/python-api-tests
  81. 234.95 s > Compiling gammaloop-integration-tests v0.1.0 (/build/source/tests)
  82. 234.95 s > error[E0609]: no field `lmb_channel_id` on type `CutInfo`
  83. 234.95 s > --> tests/tests/test_runs/utils.rs:568:36
  84. 234.95 s > |
  85. 234.95 s > 568 | event.cut_info.lmb_channel_id,
  86. 234.95 s > | ^^^^^^^^^^^^^^ unknown field
  87. 234.95 s > |
  88. 234.95 s > = note: available fields are: `particle_pdgs`, `cut_id`, `graph_id`, `graph_group_id`, `orientation_id` ... and 2 others
  89. 234.95 s >
  90. 234.95 s > error[E0609]: no field `lmb_channel_id` on type `CutInfo`
  91. 234.95 s > --> tests/tests/test_runs/utils.rs:580:36
  92. 234.95 s > |
  93. 234.95 s > 580 | event.cut_info.lmb_channel_id,
  94. 234.95 s > | ^^^^^^^^^^^^^^ unknown field
  95. 234.95 s > |
  96. 234.95 s > = note: available fields are: `particle_pdgs`, `cut_id`, `graph_id`, `graph_group_id`, `orientation_id` ... and 2 others
  97. 234.95 s >
  98. 234.95 s > For more information about this error, try `rustc --explain E0609`.
  99. 234.95 s > error: could not compile `gammaloop-integration-tests` (test "test_runs") due to 2 previous errors
  100. 234.95 s > warning: build failed, waiting for other jobs to finish...
  101. 234.95 s For full logs, run:
  102. 234.95 s nix log /nix/store/cqmk3819ylgl7iwbrx13fza8wd26bj4p-gammaloop-crate-test-binaries-gammaloop-integration-tests-d6e55b48f8214f9c-deps-0.1.0.drv
  103. 234.95 s error: Cannot build '/nix/store/fk2zs7pgjvr8670960lab6s9x7y50qln-nix-ci-artifact-barrier-crate-test-binaries-python-api-gammaloop-integration-tests.drv'.
  104. 234.95 s Reason: 1 dependency failed.
  105. 234.95 s Output paths:
  106. 234.95 s /nix/store/084sijp9mkzpdgkkhg4srxh57qc7bbil-nix-ci-artifact-barrier-crate-test-binaries-python-api-gammaloop-integration-tests
  107. 234.95 s Build failed due to failed dependency
  108. 235.02 s Build failed.