1. 0.00 s $ /nix/store/9ypz3flqsrl5xl495mm8h645gadjsxi1-coreutils-9.11/bin/timeout --kill-after=15s 7200s /nix/store/23zk8sgzamrbmj1fday15szf7f2279s8-nix-2.34.7/bin/nix --extra-experimental-features nix-command --extra-experimental-features flakes --log-format internal-json build --no-link --print-out-paths git+https://github.com/alphal00p/gammaloop?ref=advanced_sampling&rev=f89addb17aa58fe7067932d90976b4f2b7c7d41d&shallow=1#packages.x86_64-linux.crate-test-binaries-python-api-gammaloop-integration-tests --print-build-logs
  2. 9.33 s
  3. 9.90 s Downloading cached gammaloop-crate-test-binaries-gammaloop-integration-tests-d6e55b48f8214f9c-inputs from https://cache.nix-ci.com
  4. 31.05 s Downloaded cached gammaloop-crate-test-binaries-gammaloop-integration-tests-d6e55b48f8214f9c-inputs (3.2 GiB) in 21.1s
  5. 31.05 s Progress: 0 of 3 built, 1 of 1 downloaded from cache
  6. 31.23 s Building /nix/store/cqmk3819ylgl7iwbrx13fza8wd26bj4p-gammaloop-crate-test-binaries-gammaloop-integration-tests-d6e55b48f8214f9c-deps-0.1.0.drv
  7. 31.33 s [gammaloop-crate-test-binaries-gammaloop-integration-tests-d6e55b48f8214f9c-deps] Phase: unpackPhase
  8. 31.34 s [gammaloop-crate-test-binaries-gammaloop-integration-tests-d6e55b48f8214f9c-deps] unpacking source archive /nix/store/yismii9yjwyhf5ykjk8fhai0ymy3bnl5-source
  9. 31.51 s [gammaloop-crate-test-binaries-gammaloop-integration-tests-d6e55b48f8214f9c-deps] source root is source
  10. 31.53 s [gammaloop-crate-test-binaries-gammaloop-integration-tests-d6e55b48f8214f9c-deps] Phase: patchPhase
  11. 31.64 s [gammaloop-crate-test-binaries-gammaloop-integration-tests-d6e55b48f8214f9c-deps] Executing configureCargoCommonVars
  12. 31.64 s [gammaloop-crate-test-binaries-gammaloop-integration-tests-d6e55b48f8214f9c-deps] copying cargo artifacts from /nix/store/sb9n3ysl769s5phmbphlglrdpfn97wss-gammaloop-crate-test-binaries-gammaloop-integration-tests-d6e55b48f8214f9c-inputs/target to target
  13. 31.64 s [gammaloop-crate-test-binaries-gammaloop-integration-tests-d6e55b48f8214f9c-deps] will deep copy artifacts (instead of symlinking) as requested
  14. 33.66 s [gammaloop-crate-test-binaries-gammaloop-integration-tests-d6e55b48f8214f9c-deps] Phase: updateAutotoolsGnuConfigScriptsPhase
  15. 34.06 s [gammaloop-crate-test-binaries-gammaloop-integration-tests-d6e55b48f8214f9c-deps] Phase: configurePhase
  16. 34.07 s [gammaloop-crate-test-binaries-gammaloop-integration-tests-d6e55b48f8214f9c-deps] will append /build/source/.cargo-home/config.toml with contents of /nix/store/5drf77x6km4ky7gwlrzdx9bbd6fz09g3-vendor-cargo-deps/config.toml
  17. 34.08 s [gammaloop-crate-test-binaries-gammaloop-integration-tests-d6e55b48f8214f9c-deps] default configurePhase, nothing to do
  18. 34.08 s [gammaloop-crate-test-binaries-gammaloop-integration-tests-d6e55b48f8214f9c-deps] Phase: buildPhase
  19. 34.12 s [gammaloop-crate-test-binaries-gammaloop-integration-tests-d6e55b48f8214f9c-deps] +++ command cargo --version
  20. 34.14 s [gammaloop-crate-test-binaries-gammaloop-integration-tests-d6e55b48f8214f9c-deps] cargo 1.97.0 (c980f4866 2026-06-30)
  21. 34.14 s [gammaloop-crate-test-binaries-gammaloop-integration-tests-d6e55b48f8214f9c-deps] +++ command cargo test --profile ci-optim --no-run --offline -p gammaloop-integration-tests --features gammaloop-integration-tests/python-api-tests
  22. 35.86 s [gammaloop-crate-test-binaries-gammaloop-integration-tests-d6e55b48f8214f9c-deps] Compiling gammaloop-integration-tests v0.1.0 (/build/source/tests)
  23. 37.80 s [gammaloop-crate-test-binaries-gammaloop-integration-tests-d6e55b48f8214f9c-deps] error[E0609]: no field `lmb_channel_id` on type `CutInfo`
  24. 37.80 s [gammaloop-crate-test-binaries-gammaloop-integration-tests-d6e55b48f8214f9c-deps] --> tests/tests/test_runs/utils.rs:568:36
  25. 37.80 s [gammaloop-crate-test-binaries-gammaloop-integration-tests-d6e55b48f8214f9c-deps] |
  26. 37.80 s [gammaloop-crate-test-binaries-gammaloop-integration-tests-d6e55b48f8214f9c-deps] 568 | event.cut_info.lmb_channel_id,
  27. 37.80 s [gammaloop-crate-test-binaries-gammaloop-integration-tests-d6e55b48f8214f9c-deps] | ^^^^^^^^^^^^^^ unknown field
  28. 37.80 s [gammaloop-crate-test-binaries-gammaloop-integration-tests-d6e55b48f8214f9c-deps] |
  29. 37.80 s [gammaloop-crate-test-binaries-gammaloop-integration-tests-d6e55b48f8214f9c-deps] = note: available fields are: `particle_pdgs`, `cut_id`, `graph_id`, `graph_group_id`, `orientation_id` ... and 2 others
  30. 37.80 s [gammaloop-crate-test-binaries-gammaloop-integration-tests-d6e55b48f8214f9c-deps]
  31. 37.80 s [gammaloop-crate-test-binaries-gammaloop-integration-tests-d6e55b48f8214f9c-deps] error[E0609]: no field `lmb_channel_id` on type `CutInfo`
  32. 37.80 s [gammaloop-crate-test-binaries-gammaloop-integration-tests-d6e55b48f8214f9c-deps] --> tests/tests/test_runs/utils.rs:580:36
  33. 37.80 s [gammaloop-crate-test-binaries-gammaloop-integration-tests-d6e55b48f8214f9c-deps] |
  34. 37.80 s [gammaloop-crate-test-binaries-gammaloop-integration-tests-d6e55b48f8214f9c-deps] 580 | event.cut_info.lmb_channel_id,
  35. 37.80 s [gammaloop-crate-test-binaries-gammaloop-integration-tests-d6e55b48f8214f9c-deps] | ^^^^^^^^^^^^^^ unknown field
  36. 37.80 s [gammaloop-crate-test-binaries-gammaloop-integration-tests-d6e55b48f8214f9c-deps] |
  37. 37.80 s [gammaloop-crate-test-binaries-gammaloop-integration-tests-d6e55b48f8214f9c-deps] = note: available fields are: `particle_pdgs`, `cut_id`, `graph_id`, `graph_group_id`, `orientation_id` ... and 2 others
  38. 37.80 s [gammaloop-crate-test-binaries-gammaloop-integration-tests-d6e55b48f8214f9c-deps]
  39. 39.31 s [gammaloop-crate-test-binaries-gammaloop-integration-tests-d6e55b48f8214f9c-deps] For more information about this error, try `rustc --explain E0609`.
  40. 39.35 s [gammaloop-crate-test-binaries-gammaloop-integration-tests-d6e55b48f8214f9c-deps] error: could not compile `gammaloop-integration-tests` (test "test_runs") due to 2 previous errors
  41. 39.35 s [gammaloop-crate-test-binaries-gammaloop-integration-tests-d6e55b48f8214f9c-deps] warning: build failed, waiting for other jobs to finish...
  42. 126.19 s Progress: 0 of 2 built (1 failed), 1 of 1 downloaded from cache
  43. 126.19 s Failed to build gammaloop-crate-test-binaries-gammaloop-integration-tests-d6e55b48f8214f9c-deps after 1m34s
  44. 126.19 s error: Cannot build '/nix/store/cqmk3819ylgl7iwbrx13fza8wd26bj4p-gammaloop-crate-test-binaries-gammaloop-integration-tests-d6e55b48f8214f9c-deps-0.1.0.drv'.
  45. 126.19 s Reason: builder failed with exit code 101.
  46. 126.19 s Output paths:
  47. 126.19 s /nix/store/ndlfva03an6aqp6bfkqgb29jas147yxa-gammaloop-crate-test-binaries-gammaloop-integration-tests-d6e55b48f8214f9c-deps-0.1.0
  48. 126.19 s Last 35 log lines:
  49. 126.19 s > Running phase: unpackPhase
  50. 126.19 s > unpacking source archive /nix/store/yismii9yjwyhf5ykjk8fhai0ymy3bnl5-source
  51. 126.19 s > source root is source
  52. 126.19 s > Running phase: patchPhase
  53. 126.19 s > Executing configureCargoCommonVars
  54. 126.19 s > copying cargo artifacts from /nix/store/sb9n3ysl769s5phmbphlglrdpfn97wss-gammaloop-crate-test-binaries-gammaloop-integration-tests-d6e55b48f8214f9c-inputs/target to target
  55. 126.19 s > will deep copy artifacts (instead of symlinking) as requested
  56. 126.19 s > Running phase: updateAutotoolsGnuConfigScriptsPhase
  57. 126.19 s > Running phase: configurePhase
  58. 126.19 s > will append /build/source/.cargo-home/config.toml with contents of /nix/store/5drf77x6km4ky7gwlrzdx9bbd6fz09g3-vendor-cargo-deps/config.toml
  59. 126.19 s > default configurePhase, nothing to do
  60. 126.19 s > Running phase: buildPhase
  61. 126.19 s > +++ command cargo --version
  62. 126.19 s > cargo 1.97.0 (c980f4866 2026-06-30)
  63. 126.19 s > +++ command cargo test --profile ci-optim --no-run --offline -p gammaloop-integration-tests --features gammaloop-integration-tests/python-api-tests
  64. 126.19 s > Compiling gammaloop-integration-tests v0.1.0 (/build/source/tests)
  65. 126.19 s > error[E0609]: no field `lmb_channel_id` on type `CutInfo`
  66. 126.19 s > --> tests/tests/test_runs/utils.rs:568:36
  67. 126.19 s > |
  68. 126.19 s > 568 | event.cut_info.lmb_channel_id,
  69. 126.19 s > | ^^^^^^^^^^^^^^ unknown field
  70. 126.19 s > |
  71. 126.19 s > = note: available fields are: `particle_pdgs`, `cut_id`, `graph_id`, `graph_group_id`, `orientation_id` ... and 2 others
  72. 126.19 s >
  73. 126.19 s > error[E0609]: no field `lmb_channel_id` on type `CutInfo`
  74. 126.19 s > --> tests/tests/test_runs/utils.rs:580:36
  75. 126.19 s > |
  76. 126.19 s > 580 | event.cut_info.lmb_channel_id,
  77. 126.19 s > | ^^^^^^^^^^^^^^ unknown field
  78. 126.19 s > |
  79. 126.19 s > = note: available fields are: `particle_pdgs`, `cut_id`, `graph_id`, `graph_group_id`, `orientation_id` ... and 2 others
  80. 126.19 s >
  81. 126.19 s > For more information about this error, try `rustc --explain E0609`.
  82. 126.19 s > error: could not compile `gammaloop-integration-tests` (test "test_runs") due to 2 previous errors
  83. 126.19 s > warning: build failed, waiting for other jobs to finish...
  84. 126.19 s For full logs, run:
  85. 126.19 s nix log /nix/store/cqmk3819ylgl7iwbrx13fza8wd26bj4p-gammaloop-crate-test-binaries-gammaloop-integration-tests-d6e55b48f8214f9c-deps-0.1.0.drv
  86. 126.19 s error: Cannot build '/nix/store/fk2zs7pgjvr8670960lab6s9x7y50qln-nix-ci-artifact-barrier-crate-test-binaries-python-api-gammaloop-integration-tests.drv'.
  87. 126.19 s Reason: 1 dependency failed.
  88. 126.19 s Output paths:
  89. 126.19 s /nix/store/084sijp9mkzpdgkkhg4srxh57qc7bbil-nix-ci-artifact-barrier-crate-test-binaries-python-api-gammaloop-integration-tests
  90. 126.20 s Build failed due to failed dependency
  91. 126.26 s Build failed.