build packages.x86_64-linux.crate-test-binaries-gammaloop-integration-tests

Reproduce this run
Retry Run
  1. 0.00 s $ /nix/store/9ypz3flqsrl5xl495mm8h645gadjsxi1-coreutils-9.11/bin/timeout --kill-after=15s 7200s /nix/store/23zk8sgzamrbmj1fday15szf7f2279s8-nix-2.34.7/bin/nix --extra-experimental-features nix-command --extra-experimental-features flakes --log-format internal-json build --no-link --print-out-paths git+https://github.com/alphal00p/gammaloop?ref=advanced_sampling&rev=f89addb17aa58fe7067932d90976b4f2b7c7d41d&shallow=1#packages.x86_64-linux.crate-test-binaries-gammaloop-integration-tests --print-build-logs
  2. 3.97 s
  3. 4.99 s Building /nix/store/xxlgsi96s1ac3h1vdy13ijv99ar3n51z-gammaloop-crate-test-binaries-gammaloop-integration-tests-b8cda0d438c96d4f-inputs.drv
  4. 14.95 s [gammaloop-crate-test-binaries-gammaloop-integration-tests-b8cda0d438c96d4f-inputs:post-build] Uploading to the NixCI cache: /nix/store/ckr683k3zz3s41dj6i3ll3xvlxpr48fx-gammaloop-crate-test-binaries-gammaloop-integration-tests-b8cda0d438c96d4f-inputs
  5. 14.99 s [gammaloop-crate-test-binaries-gammaloop-integration-tests-b8cda0d438c96d4f-inputs:post-build] warning: 'warn-short-path-literals' is deprecated, use 'lint-short-path-literals = ignore' instead
  6. 15.03 s [gammaloop-crate-test-binaries-gammaloop-integration-tests-b8cda0d438c96d4f-inputs:post-build] copying 1 paths...
  7. 15.03 s [gammaloop-crate-test-binaries-gammaloop-integration-tests-b8cda0d438c96d4f-inputs:post-build] copying path '/nix/store/ckr683k3zz3s41dj6i3ll3xvlxpr48fx-gammaloop-crate-test-binaries-gammaloop-integration-tests-b8cda0d438c96d4f-inputs' to 'https://cache.nix-ci.com'...
  8. 125.04 s [gammaloop-crate-test-binaries-gammaloop-integration-tests-b8cda0d438c96d4f-inputs:post-build] warning: 'warn-short-path-literals' is deprecated, use 'lint-short-path-literals = ignore' instead
  9. 125.29 s [gammaloop-crate-test-binaries-gammaloop-integration-tests-b8cda0d438c96d4f-inputs:post-build] copying 1 paths...
  10. 125.29 s [gammaloop-crate-test-binaries-gammaloop-integration-tests-b8cda0d438c96d4f-inputs:post-build] copying path '/nix/store/xxlgsi96s1ac3h1vdy13ijv99ar3n51z-gammaloop-crate-test-binaries-gammaloop-integration-tests-b8cda0d438c96d4f-inputs.drv' to 'https://cache.nix-ci.com'...
  11. 125.44 s Uploaded gammaloop-crate-test-binaries-gammaloop-integration-tests-b8cda0d438c96d4f-inputs in 1m50s
  12. 125.44 s Progress: 1 of 4 built
  13. 125.44 s Built gammaloop-crate-test-binaries-gammaloop-integration-tests-b8cda0d438c96d4f-inputs in 2m00s
  14. 125.50 s Building /nix/store/vsrwnl409r7dhq32445b233lwf4g3ap6-gammaloop-crate-test-binaries-gammaloop-integration-tests-b8cda0d438c96d4f-deps-0.1.0.drv
  15. 125.57 s [gammaloop-crate-test-binaries-gammaloop-integration-tests-b8cda0d438c96d4f-deps] Phase: unpackPhase
  16. 125.57 s [gammaloop-crate-test-binaries-gammaloop-integration-tests-b8cda0d438c96d4f-deps] unpacking source archive /nix/store/yismii9yjwyhf5ykjk8fhai0ymy3bnl5-source
  17. 125.63 s [gammaloop-crate-test-binaries-gammaloop-integration-tests-b8cda0d438c96d4f-deps] source root is source
  18. 125.64 s [gammaloop-crate-test-binaries-gammaloop-integration-tests-b8cda0d438c96d4f-deps] Phase: patchPhase
  19. 125.72 s [gammaloop-crate-test-binaries-gammaloop-integration-tests-b8cda0d438c96d4f-deps] Executing configureCargoCommonVars
  20. 125.72 s [gammaloop-crate-test-binaries-gammaloop-integration-tests-b8cda0d438c96d4f-deps] copying cargo artifacts from /nix/store/ckr683k3zz3s41dj6i3ll3xvlxpr48fx-gammaloop-crate-test-binaries-gammaloop-integration-tests-b8cda0d438c96d4f-inputs/target to target
  21. 125.72 s [gammaloop-crate-test-binaries-gammaloop-integration-tests-b8cda0d438c96d4f-deps] will deep copy artifacts (instead of symlinking) as requested
  22. 127.47 s [gammaloop-crate-test-binaries-gammaloop-integration-tests-b8cda0d438c96d4f-deps] Phase: updateAutotoolsGnuConfigScriptsPhase
  23. 127.51 s [gammaloop-crate-test-binaries-gammaloop-integration-tests-b8cda0d438c96d4f-deps] Phase: configurePhase
  24. 127.51 s [gammaloop-crate-test-binaries-gammaloop-integration-tests-b8cda0d438c96d4f-deps] will append /build/source/.cargo-home/config.toml with contents of /nix/store/5drf77x6km4ky7gwlrzdx9bbd6fz09g3-vendor-cargo-deps/config.toml
  25. 127.51 s [gammaloop-crate-test-binaries-gammaloop-integration-tests-b8cda0d438c96d4f-deps] default configurePhase, nothing to do
  26. 127.51 s [gammaloop-crate-test-binaries-gammaloop-integration-tests-b8cda0d438c96d4f-deps] Phase: buildPhase
  27. 127.52 s [gammaloop-crate-test-binaries-gammaloop-integration-tests-b8cda0d438c96d4f-deps] +++ command cargo --version
  28. 127.52 s [gammaloop-crate-test-binaries-gammaloop-integration-tests-b8cda0d438c96d4f-deps] cargo 1.97.0 (c980f4866 2026-06-30)
  29. 127.52 s [gammaloop-crate-test-binaries-gammaloop-integration-tests-b8cda0d438c96d4f-deps] +++ command cargo test --profile ci-optim --no-run --offline -p gammaloop-integration-tests
  30. 127.88 s [gammaloop-crate-test-binaries-gammaloop-integration-tests-b8cda0d438c96d4f-deps] Compiling gammaloop-integration-tests v0.1.0 (/build/source/tests)
  31. 128.98 s [gammaloop-crate-test-binaries-gammaloop-integration-tests-b8cda0d438c96d4f-deps] error[E0609]: no field `lmb_channel_id` on type `CutInfo`
  32. 128.98 s [gammaloop-crate-test-binaries-gammaloop-integration-tests-b8cda0d438c96d4f-deps] --> tests/tests/test_runs/utils.rs:568:36
  33. 128.98 s [gammaloop-crate-test-binaries-gammaloop-integration-tests-b8cda0d438c96d4f-deps] |
  34. 128.98 s [gammaloop-crate-test-binaries-gammaloop-integration-tests-b8cda0d438c96d4f-deps] 568 | event.cut_info.lmb_channel_id,
  35. 128.98 s [gammaloop-crate-test-binaries-gammaloop-integration-tests-b8cda0d438c96d4f-deps] | ^^^^^^^^^^^^^^ unknown field
  36. 128.98 s [gammaloop-crate-test-binaries-gammaloop-integration-tests-b8cda0d438c96d4f-deps] |
  37. 128.98 s [gammaloop-crate-test-binaries-gammaloop-integration-tests-b8cda0d438c96d4f-deps] = note: available fields are: `particle_pdgs`, `cut_id`, `graph_id`, `graph_group_id`, `orientation_id` ... and 2 others
  38. 128.98 s [gammaloop-crate-test-binaries-gammaloop-integration-tests-b8cda0d438c96d4f-deps]
  39. 128.98 s [gammaloop-crate-test-binaries-gammaloop-integration-tests-b8cda0d438c96d4f-deps] error[E0609]: no field `lmb_channel_id` on type `CutInfo`
  40. 128.98 s [gammaloop-crate-test-binaries-gammaloop-integration-tests-b8cda0d438c96d4f-deps] --> tests/tests/test_runs/utils.rs:580:36
  41. 128.98 s [gammaloop-crate-test-binaries-gammaloop-integration-tests-b8cda0d438c96d4f-deps] |
  42. 128.98 s [gammaloop-crate-test-binaries-gammaloop-integration-tests-b8cda0d438c96d4f-deps] 580 | event.cut_info.lmb_channel_id,
  43. 128.98 s [gammaloop-crate-test-binaries-gammaloop-integration-tests-b8cda0d438c96d4f-deps] | ^^^^^^^^^^^^^^ unknown field
  44. 128.98 s [gammaloop-crate-test-binaries-gammaloop-integration-tests-b8cda0d438c96d4f-deps] |
  45. 128.98 s [gammaloop-crate-test-binaries-gammaloop-integration-tests-b8cda0d438c96d4f-deps] = note: available fields are: `particle_pdgs`, `cut_id`, `graph_id`, `graph_group_id`, `orientation_id` ... and 2 others
  46. 128.98 s [gammaloop-crate-test-binaries-gammaloop-integration-tests-b8cda0d438c96d4f-deps]
  47. 129.95 s [gammaloop-crate-test-binaries-gammaloop-integration-tests-b8cda0d438c96d4f-deps] For more information about this error, try `rustc --explain E0609`.
  48. 129.97 s [gammaloop-crate-test-binaries-gammaloop-integration-tests-b8cda0d438c96d4f-deps] error: could not compile `gammaloop-integration-tests` (test "test_runs") due to 2 previous errors
  49. 129.97 s [gammaloop-crate-test-binaries-gammaloop-integration-tests-b8cda0d438c96d4f-deps] warning: build failed, waiting for other jobs to finish...
  50. 206.13 s Progress: 1 of 3 built (1 failed)
  51. 206.13 s Failed to build gammaloop-crate-test-binaries-gammaloop-integration-tests-b8cda0d438c96d4f-deps after 1m20s
  52. 206.13 s error: Cannot build '/nix/store/vsrwnl409r7dhq32445b233lwf4g3ap6-gammaloop-crate-test-binaries-gammaloop-integration-tests-b8cda0d438c96d4f-deps-0.1.0.drv'.
  53. 206.13 s Reason: builder failed with exit code 101.
  54. 206.13 s Output paths:
  55. 206.13 s /nix/store/g0ciy71yksvm17h8wf15mf4a2aqh9p5x-gammaloop-crate-test-binaries-gammaloop-integration-tests-b8cda0d438c96d4f-deps-0.1.0
  56. 206.13 s Last 35 log lines:
  57. 206.13 s > Running phase: unpackPhase
  58. 206.13 s > unpacking source archive /nix/store/yismii9yjwyhf5ykjk8fhai0ymy3bnl5-source
  59. 206.13 s > source root is source
  60. 206.13 s > Running phase: patchPhase
  61. 206.13 s > Executing configureCargoCommonVars
  62. 206.13 s > copying cargo artifacts from /nix/store/ckr683k3zz3s41dj6i3ll3xvlxpr48fx-gammaloop-crate-test-binaries-gammaloop-integration-tests-b8cda0d438c96d4f-inputs/target to target
  63. 206.13 s > will deep copy artifacts (instead of symlinking) as requested
  64. 206.13 s > Running phase: updateAutotoolsGnuConfigScriptsPhase
  65. 206.13 s > Running phase: configurePhase
  66. 206.13 s > will append /build/source/.cargo-home/config.toml with contents of /nix/store/5drf77x6km4ky7gwlrzdx9bbd6fz09g3-vendor-cargo-deps/config.toml
  67. 206.13 s > default configurePhase, nothing to do
  68. 206.13 s > Running phase: buildPhase
  69. 206.13 s > +++ command cargo --version
  70. 206.13 s > cargo 1.97.0 (c980f4866 2026-06-30)
  71. 206.13 s > +++ command cargo test --profile ci-optim --no-run --offline -p gammaloop-integration-tests
  72. 206.13 s > Compiling gammaloop-integration-tests v0.1.0 (/build/source/tests)
  73. 206.13 s > error[E0609]: no field `lmb_channel_id` on type `CutInfo`
  74. 206.13 s > --> tests/tests/test_runs/utils.rs:568:36
  75. 206.13 s > |
  76. 206.13 s > 568 | event.cut_info.lmb_channel_id,
  77. 206.13 s > | ^^^^^^^^^^^^^^ unknown field
  78. 206.13 s > |
  79. 206.13 s > = note: available fields are: `particle_pdgs`, `cut_id`, `graph_id`, `graph_group_id`, `orientation_id` ... and 2 others
  80. 206.13 s >
  81. 206.13 s > error[E0609]: no field `lmb_channel_id` on type `CutInfo`
  82. 206.13 s > --> tests/tests/test_runs/utils.rs:580:36
  83. 206.13 s > |
  84. 206.13 s > 580 | event.cut_info.lmb_channel_id,
  85. 206.13 s > | ^^^^^^^^^^^^^^ unknown field
  86. 206.13 s > |
  87. 206.13 s > = note: available fields are: `particle_pdgs`, `cut_id`, `graph_id`, `graph_group_id`, `orientation_id` ... and 2 others
  88. 206.13 s >
  89. 206.13 s > For more information about this error, try `rustc --explain E0609`.
  90. 206.13 s > error: could not compile `gammaloop-integration-tests` (test "test_runs") due to 2 previous errors
  91. 206.13 s > warning: build failed, waiting for other jobs to finish...
  92. 206.13 s For full logs, run:
  93. 206.13 s nix log /nix/store/vsrwnl409r7dhq32445b233lwf4g3ap6-gammaloop-crate-test-binaries-gammaloop-integration-tests-b8cda0d438c96d4f-deps-0.1.0.drv
  94. 206.13 s error: Cannot build '/nix/store/6pgn867lgl5lxiizzx0af4lm4b0hrdmp-nix-ci-artifact-barrier-crate-test-binaries-gammaloop-integration-tests.drv'.
  95. 206.13 s Reason: 1 dependency failed.
  96. 206.13 s Output paths:
  97. 206.13 s /nix/store/35xz2zm631dmciakjvzz98i2vr7wmb0r-nix-ci-artifact-barrier-crate-test-binaries-gammaloop-integration-tests
  98. 206.14 s Build failed due to failed dependency
  99. 206.20 s Build failed.