0.01 s
$ /nix/store/9ypz3flqsrl5xl495mm8h645gadjsxi1-coreutils-9.11/bin/timeout --kill-after=15s 7200s /nix/store/23zk8sgzamrbmj1fday15szf7f2279s8-nix-2.34.7/bin/nix --extra-experimental-features nix-command --extra-experimental-features flakes --log-format internal-json build --no-link --print-out-paths git+https://github.com/alphal00p/gammaloop?ref=advanced_sampling&rev=f89addb17aa58fe7067932d90976b4f2b7c7d41d&shallow=1#packages.x86_64-linux.crate-test-binaries-gammaloop-integration-tests --print-build-logs
0.68 s
error (ignored): SQLite database '/var/cache/nix-ci-worker/eval-cache-v6/a3ddb792a828d4b6dfbc5265ee58172bae4cbf82c9577d469ee1c9c3c94bd08d.sqlite ' is busy
5.41 s
6.13 s
Downloading cached gammaloop-crate-test-dependencies-b8cda0d438c96d4f-inputs from https://cache.nix-ci.com
29.39 s
Downloaded cached gammaloop-crate-test-dependencies-b8cda0d438c96d4f-inputs (3.2 GiB) in 23.2s
29.39 s
Progress: 0 of 3 built, 1 of 3 downloaded from cache
29.39 s
Downloading cached gammaloop-crate-test-dependencies-b8cda0d438c96d4f-deps from https://cache.nix-ci.com
29.56 s
Downloaded cached gammaloop-crate-test-dependencies-b8cda0d438c96d4f-deps (30.1 MiB) in 174ms
29.56 s
Progress: 0 of 3 built, 2 of 3 downloaded from cache
29.57 s
Downloading cached gammaloop-crate-test-binaries-gammaloop-integration-tests-b8cda0d438c96d4f-inputs from https://cache.nix-ci.com
51.12 s
Downloaded cached gammaloop-crate-test-binaries-gammaloop-integration-tests-b8cda0d438c96d4f-inputs (3.2 GiB) in 21.5s
51.12 s
Progress: 0 of 3 built, 3 of 3 downloaded from cache
51.26 s
Building /nix/store/vsrwnl409r7dhq32445b233lwf4g3ap6-gammaloop-crate-test-binaries-gammaloop-integration-tests-b8cda0d438c96d4f-deps-0.1.0.drv
51.32 s
[gammaloop-crate-test-binaries-gammaloop-integration-tests-b8cda0d438c96d4f-deps] Phase: unpackPhase
51.33 s
[gammaloop-crate-test-binaries-gammaloop-integration-tests-b8cda0d438c96d4f-deps] unpacking source archive /nix/store/yismii9yjwyhf5ykjk8fhai0ymy3bnl5-source
51.39 s
[gammaloop-crate-test-binaries-gammaloop-integration-tests-b8cda0d438c96d4f-deps] source root is source
51.40 s
[gammaloop-crate-test-binaries-gammaloop-integration-tests-b8cda0d438c96d4f-deps] Phase: patchPhase
51.48 s
[gammaloop-crate-test-binaries-gammaloop-integration-tests-b8cda0d438c96d4f-deps] Executing configureCargoCommonVars
51.48 s
[gammaloop-crate-test-binaries-gammaloop-integration-tests-b8cda0d438c96d4f-deps] copying cargo artifacts from /nix/store/ckr683k3zz3s41dj6i3ll3xvlxpr48fx-gammaloop-crate-test-binaries-gammaloop-integration-tests-b8cda0d438c96d4f-inputs/target to target
51.48 s
[gammaloop-crate-test-binaries-gammaloop-integration-tests-b8cda0d438c96d4f-deps] will deep copy artifacts (instead of symlinking) as requested
52.96 s
[gammaloop-crate-test-binaries-gammaloop-integration-tests-b8cda0d438c96d4f-deps] Phase: updateAutotoolsGnuConfigScriptsPhase
53.10 s
[gammaloop-crate-test-binaries-gammaloop-integration-tests-b8cda0d438c96d4f-deps] Phase: configurePhase
53.14 s
[gammaloop-crate-test-binaries-gammaloop-integration-tests-b8cda0d438c96d4f-deps] will append /build/source/.cargo-home/config.toml with contents of /nix/store/5drf77x6km4ky7gwlrzdx9bbd6fz09g3-vendor-cargo-deps/config.toml
53.14 s
[gammaloop-crate-test-binaries-gammaloop-integration-tests-b8cda0d438c96d4f-deps] default configurePhase, nothing to do
53.15 s
[gammaloop-crate-test-binaries-gammaloop-integration-tests-b8cda0d438c96d4f-deps] Phase: buildPhase
53.15 s
[gammaloop-crate-test-binaries-gammaloop-integration-tests-b8cda0d438c96d4f-deps] +++ command cargo --version
53.15 s
[gammaloop-crate-test-binaries-gammaloop-integration-tests-b8cda0d438c96d4f-deps] cargo 1.97.0 (c980f4866 2026-06-30)
53.16 s
[gammaloop-crate-test-binaries-gammaloop-integration-tests-b8cda0d438c96d4f-deps] +++ command cargo test --profile ci-optim --no-run --offline -p gammaloop-integration-tests
55.92 s
[gammaloop-crate-test-binaries-gammaloop-integration-tests-b8cda0d438c96d4f-deps] Compiling gammaloop-integration-tests v0.1.0 (/build/source/tests)
57.09 s
[gammaloop-crate-test-binaries-gammaloop-integration-tests-b8cda0d438c96d4f-deps] error[E0609] : no field `lmb_channel_id` on type `CutInfo`
57.09 s
[gammaloop-crate-test-binaries-gammaloop-integration-tests-b8cda0d438c96d4f-deps] --> tests/tests/test_runs/utils.rs:568:36
57.09 s
[gammaloop-crate-test-binaries-gammaloop-integration-tests-b8cda0d438c96d4f-deps] |
57.09 s
[gammaloop-crate-test-binaries-gammaloop-integration-tests-b8cda0d438c96d4f-deps] 568 | event.cut_info.lmb_channel_id,
57.09 s
[gammaloop-crate-test-binaries-gammaloop-integration-tests-b8cda0d438c96d4f-deps] | ^^^^^^^^^^^^^^ unknown field
57.09 s
[gammaloop-crate-test-binaries-gammaloop-integration-tests-b8cda0d438c96d4f-deps] |
57.09 s
[gammaloop-crate-test-binaries-gammaloop-integration-tests-b8cda0d438c96d4f-deps] = note : available fields are: `particle_pdgs`, `cut_id`, `graph_id`, `graph_group_id`, `orientation_id` ... and 2 others
57.09 s
[gammaloop-crate-test-binaries-gammaloop-integration-tests-b8cda0d438c96d4f-deps]
57.09 s
[gammaloop-crate-test-binaries-gammaloop-integration-tests-b8cda0d438c96d4f-deps] error[E0609] : no field `lmb_channel_id` on type `CutInfo`
57.09 s
[gammaloop-crate-test-binaries-gammaloop-integration-tests-b8cda0d438c96d4f-deps] --> tests/tests/test_runs/utils.rs:580:36
57.09 s
[gammaloop-crate-test-binaries-gammaloop-integration-tests-b8cda0d438c96d4f-deps] |
57.09 s
[gammaloop-crate-test-binaries-gammaloop-integration-tests-b8cda0d438c96d4f-deps] 580 | event.cut_info.lmb_channel_id,
57.09 s
[gammaloop-crate-test-binaries-gammaloop-integration-tests-b8cda0d438c96d4f-deps] | ^^^^^^^^^^^^^^ unknown field
57.09 s
[gammaloop-crate-test-binaries-gammaloop-integration-tests-b8cda0d438c96d4f-deps] |
57.09 s
[gammaloop-crate-test-binaries-gammaloop-integration-tests-b8cda0d438c96d4f-deps] = note : available fields are: `particle_pdgs`, `cut_id`, `graph_id`, `graph_group_id`, `orientation_id` ... and 2 others
57.09 s
[gammaloop-crate-test-binaries-gammaloop-integration-tests-b8cda0d438c96d4f-deps]
58.08 s
[gammaloop-crate-test-binaries-gammaloop-integration-tests-b8cda0d438c96d4f-deps] For more information about this error, try `rustc --explain E0609`.
58.11 s
[gammaloop-crate-test-binaries-gammaloop-integration-tests-b8cda0d438c96d4f-deps] error : could not compile `gammaloop-integration-tests` (test "test_runs") due to 2 previous errors
58.11 s
[gammaloop-crate-test-binaries-gammaloop-integration-tests-b8cda0d438c96d4f-deps] warning : build failed, waiting for other jobs to finish...
148.55 s
Progress: 0 of 2 built (1 failed), 3 of 3 downloaded from cache
148.55 s
Failed to build gammaloop-crate-test-binaries-gammaloop-integration-tests-b8cda0d438c96d4f-deps after 1m37s
148.55 s
error: Cannot build '/nix/store/vsrwnl409r7dhq32445b233lwf4g3ap6-gammaloop-crate-test-binaries-gammaloop-integration-tests-b8cda0d438c96d4f-deps-0.1.0.drv '.
148.55 s
Reason: builder failed with exit code 101 .
148.55 s
Output paths:
148.55 s
/nix/store/g0ciy71yksvm17h8wf15mf4a2aqh9p5x-gammaloop-crate-test-binaries-gammaloop-integration-tests-b8cda0d438c96d4f-deps-0.1.0
148.55 s
Last 35 log lines:
148.55 s
> Running phase: unpackPhase
148.55 s
> unpacking source archive /nix/store/yismii9yjwyhf5ykjk8fhai0ymy3bnl5-source
148.55 s
> source root is source
148.55 s
> Running phase: patchPhase
148.55 s
> Executing configureCargoCommonVars
148.55 s
> copying cargo artifacts from /nix/store/ckr683k3zz3s41dj6i3ll3xvlxpr48fx-gammaloop-crate-test-binaries-gammaloop-integration-tests-b8cda0d438c96d4f-inputs/target to target
148.55 s
> will deep copy artifacts (instead of symlinking) as requested
148.55 s
> Running phase: updateAutotoolsGnuConfigScriptsPhase
148.55 s
> Running phase: configurePhase
148.55 s
> will append /build/source/.cargo-home/config.toml with contents of /nix/store/5drf77x6km4ky7gwlrzdx9bbd6fz09g3-vendor-cargo-deps/config.toml
148.55 s
> default configurePhase, nothing to do
148.55 s
> Running phase: buildPhase
148.55 s
> +++ command cargo --version
148.55 s
> cargo 1.97.0 (c980f4866 2026-06-30)
148.55 s
> +++ command cargo test --profile ci-optim --no-run --offline -p gammaloop-integration-tests
148.55 s
> Compiling gammaloop-integration-tests v0.1.0 (/build/source/tests)
148.55 s
> error[E0609] : no field `lmb_channel_id` on type `CutInfo`
148.55 s
> --> tests/tests/test_runs/utils.rs:568:36
148.55 s
> |
148.55 s
> 568 | event.cut_info.lmb_channel_id,
148.55 s
> | ^^^^^^^^^^^^^^ unknown field
148.55 s
> |
148.55 s
> = note : available fields are: `particle_pdgs`, `cut_id`, `graph_id`, `graph_group_id`, `orientation_id` ... and 2 others
148.55 s
>
148.55 s
> error[E0609] : no field `lmb_channel_id` on type `CutInfo`
148.55 s
> --> tests/tests/test_runs/utils.rs:580:36
148.55 s
> |
148.55 s
> 580 | event.cut_info.lmb_channel_id,
148.55 s
> | ^^^^^^^^^^^^^^ unknown field
148.55 s
> |
148.55 s
> = note : available fields are: `particle_pdgs`, `cut_id`, `graph_id`, `graph_group_id`, `orientation_id` ... and 2 others
148.55 s
>
148.55 s
> For more information about this error, try `rustc --explain E0609`.
148.55 s
> error : could not compile `gammaloop-integration-tests` (test "test_runs") due to 2 previous errors
148.55 s
> warning : build failed, waiting for other jobs to finish...
148.55 s
For full logs, run:
148.55 s
nix log /nix/store/vsrwnl409r7dhq32445b233lwf4g3ap6-gammaloop-crate-test-binaries-gammaloop-integration-tests-b8cda0d438c96d4f-deps-0.1.0.drv
148.55 s
error: Cannot build '/nix/store/6pgn867lgl5lxiizzx0af4lm4b0hrdmp-nix-ci-artifact-barrier-crate-test-binaries-gammaloop-integration-tests.drv '.
148.55 s
Reason: 1 dependency failed .
148.55 s
Output paths:
148.55 s
/nix/store/35xz2zm631dmciakjvzz98i2vr7wmb0r-nix-ci-artifact-barrier-crate-test-binaries-gammaloop-integration-tests
148.56 s
Build failed due to failed dependency
148.61 s
Build failed.