build checks.x86_64-linux.gammaloop-check

Reproduce this run
Retry Run
  1. 0.00 s $ /nix/store/9ypz3flqsrl5xl495mm8h645gadjsxi1-coreutils-9.11/bin/timeout --kill-after=15s 7200s /nix/store/23zk8sgzamrbmj1fday15szf7f2279s8-nix-2.34.7/bin/nix --extra-experimental-features nix-command --extra-experimental-features flakes --log-format internal-json build --no-link --print-out-paths git+https://github.com/alphal00p/gammaloop?ref=advanced_sampling&rev=f991b56ff9e316a33c50dbe0152b84de28ffecfb&shallow=1#checks.x86_64-linux.gammaloop-check --print-build-logs
  2. 0.57 s error (ignored): SQLite database '/var/cache/nix-ci-worker/eval-cache-v6/45883fdbe20f65f2d11e335016d9f9ed4c494d06669aac44ae77adaef651c6b3.sqlite' is busy
  3. 2.82 s
  4. 3.25 s Building /nix/store/448zayigj0y6f3w7w36r7s3pw9rbgz07-gammaloop-workspace-check-0.1.0.drv
  5. 3.32 s [gammaloop-workspace-check] Phase: unpackPhase
  6. 3.33 s [gammaloop-workspace-check] unpacking source archive /nix/store/d6ym1w3z3dvqglkyhyd37z00vfsb641k-source
  7. 3.47 s [gammaloop-workspace-check] source root is source
  8. 3.50 s [gammaloop-workspace-check] Phase: patchPhase
  9. 3.50 s [gammaloop-workspace-check] Executing configureCargoCommonVars
  10. 3.50 s [gammaloop-workspace-check] decompressing cargo artifacts from /nix/store/50vpxlcgfxf2d57i27v3d10zjwxxbm2r-gammaloop-workspace-deps-deps-0.1.0/target.tar.zst to target
  11. 4.72 s [gammaloop-workspace-check] Phase: updateAutotoolsGnuConfigScriptsPhase
  12. 4.76 s [gammaloop-workspace-check] Phase: configurePhase
  13. 4.76 s [gammaloop-workspace-check] will append /build/source/.cargo-home/config.toml with contents of /nix/store/5drf77x6km4ky7gwlrzdx9bbd6fz09g3-vendor-cargo-deps/config.toml
  14. 4.76 s [gammaloop-workspace-check] default configurePhase, nothing to do
  15. 4.77 s [gammaloop-workspace-check] Phase: buildPhase
  16. 4.77 s [gammaloop-workspace-check] +++ command cargo --version
  17. 4.77 s [gammaloop-workspace-check] cargo 1.97.0 (c980f4866 2026-06-30)
  18. 4.80 s [gammaloop-workspace-check] +++ command cargo check --profile ci-optim --locked --workspace --features gammaloop-tracing-filter/clap,gammaloop-tracing-filter/symbolica,idenso/bincode,idenso/reference-cases,linnet/bincode,linnet/drawing,linnet/rkyv,linnet/serde,linnet/symbolica,spenso-macros/shadowing,spenso/shadowing,symbolica/tracing_max_level_info,three-dimensional-reps/display,three-dimensional-reps/eval,three-dimensional-reps/serde --all-targets
  19. 5.28 s [gammaloop-workspace-check] Checking cfg-if v1.0.4
  20. 5.28 s [gammaloop-workspace-check] Checking memchr v2.8.0
  21. 5.28 s [gammaloop-workspace-check] Checking once_cell v1.21.4
  22. 5.29 s [gammaloop-workspace-check] Checking either v1.15.0
  23. 5.29 s [gammaloop-workspace-check] Checking serde_core v1.0.228
  24. 5.29 s [gammaloop-workspace-check] Checking libc v0.2.186
  25. 5.30 s [gammaloop-workspace-check] Checking libm v0.2.16
  26. 5.31 s [gammaloop-workspace-check] Checking itoa v1.0.18
  27. 5.31 s [gammaloop-workspace-check] Checking log v0.4.29
  28. 5.31 s [gammaloop-workspace-check] Checking regex-syntax v0.8.10
  29. 5.32 s [gammaloop-workspace-check] Checking zerocopy v0.8.48
  30. 5.32 s [gammaloop-workspace-check] Checking crossbeam-utils v0.8.21
  31. 5.33 s [gammaloop-workspace-check] Checking equivalent v1.0.2
  32. 5.33 s [gammaloop-workspace-check] Checking zmij v1.0.21
  33. 5.35 s [gammaloop-workspace-check] Checking lazy_static v1.5.0
  34. 5.35 s [gammaloop-workspace-check] Checking bytemuck v1.25.0
  35. 5.35 s [gammaloop-workspace-check] Compiling target-lexicon v0.13.5
  36. 5.39 s [gammaloop-workspace-check] Checking arrayvec v0.7.6
  37. 5.41 s [gammaloop-workspace-check] Checking powerfmt v0.2.0
  38. 5.42 s [gammaloop-workspace-check] Checking time-core v0.1.8
  39. 5.42 s [gammaloop-workspace-check] Checking pin-project-lite v0.2.17
  40. 5.45 s [gammaloop-workspace-check] Checking itertools v0.14.0
  41. 5.47 s [gammaloop-workspace-check] Checking num_threads v0.1.7
  42. 5.52 s [gammaloop-workspace-check] Checking num-conv v0.2.1
  43. 5.53 s [gammaloop-workspace-check] Checking deranged v0.5.8
  44. 5.54 s [gammaloop-workspace-check] Checking tracing-core v0.1.36
  45. 5.54 s [gammaloop-workspace-check] Checking allocator-api2 v0.2.21
  46. 5.56 s [gammaloop-workspace-check] Checking safe_arch v0.7.4
  47. 5.58 s [gammaloop-workspace-check] Checking foldhash v0.2.0
  48. 5.61 s [gammaloop-workspace-check] Checking const-random v0.1.18
  49. 5.64 s [gammaloop-workspace-check] Checking static_assertions v1.1.0
  50. 5.66 s [gammaloop-workspace-check] Checking nu-ansi-term v0.50.3
  51. 5.67 s [gammaloop-workspace-check] Checking aho-corasick v1.1.4
  52. 5.70 s [gammaloop-workspace-check] Checking unty v0.0.4
  53. 5.70 s [gammaloop-workspace-check] Checking winnow v1.0.2
  54. 5.78 s [gammaloop-workspace-check] Checking safe_arch v1.0.0
  55. 5.79 s [gammaloop-workspace-check] Checking crossbeam-epoch v0.9.18
  56. 5.80 s [gammaloop-workspace-check] Checking hashbrown v0.16.1
  57. 5.84 s [gammaloop-workspace-check] Checking sharded-slab v0.1.7
  58. 5.87 s [gammaloop-workspace-check] Checking wide v0.7.33
  59. 5.94 s [gammaloop-workspace-check] Checking tracing-log v0.2.0
  60. 6.07 s [gammaloop-workspace-check] Checking crossbeam-deque v0.8.6
  61. 6.08 s [gammaloop-workspace-check] Checking tracing v0.1.44
  62. 6.22 s [gammaloop-workspace-check] Checking rayon-core v1.13.0
  63. 6.24 s [gammaloop-workspace-check] Checking thread_local v1.1.9
  64. 6.29 s [gammaloop-workspace-check] Checking toml_writer v1.1.1+spec-1.1.0
  65. 6.32 s [gammaloop-workspace-check] Checking az v1.3.0
  66. 6.33 s [gammaloop-workspace-check] Checking num-traits v0.2.19
  67. 6.36 s [gammaloop-workspace-check] Checking indenter v0.3.4
  68. 6.43 s [gammaloop-workspace-check] Checking wide v1.3.0
  69. 6.49 s [gammaloop-workspace-check] Compiling phf_shared v0.11.3
  70. 6.51 s [gammaloop-workspace-check] Checking getrandom v0.3.4
  71. 6.53 s [gammaloop-workspace-check] Checking gmp-mpfr-sys v1.7.1
  72. 6.53 s [gammaloop-workspace-check] Checking anyhow v1.0.102
  73. 6.57 s [gammaloop-workspace-check] Checking rayon v1.12.0
  74. 6.62 s [gammaloop-workspace-check] Checking alloc-no-stdlib v2.0.4
  75. 6.64 s [gammaloop-workspace-check] Checking rand_core v0.9.5
  76. 6.66 s [gammaloop-workspace-check] Checking utf8parse v0.2.2
  77. 6.70 s [gammaloop-workspace-check] Checking time v0.3.47
  78. 6.73 s [gammaloop-workspace-check] Checking dyn-clone v1.0.20
  79. 6.74 s [gammaloop-workspace-check] Checking rawpointer v0.2.1
  80. 6.75 s [gammaloop-workspace-check] Checking anstyle-parse v1.0.0
  81. 6.75 s [gammaloop-workspace-check] Checking alloc-stdlib v0.2.2
  82. 6.79 s [gammaloop-workspace-check] Checking is_terminal_polyfill v1.70.2
  83. 6.82 s [gammaloop-workspace-check] Checking matrixmultiply v0.3.10
  84. 6.84 s [gammaloop-workspace-check] Checking anstyle-query v1.1.5
  85. 6.85 s [gammaloop-workspace-check] Checking toml_parser v1.1.2+spec-1.1.0
  86. 6.86 s [gammaloop-workspace-check] Checking colored v3.1.1
  87. 6.87 s [gammaloop-workspace-check] Checking colorchoice v1.0.5
  88. 6.88 s [gammaloop-workspace-check] Checking approx v0.5.1
  89. 6.89 s [gammaloop-workspace-check] Checking num-integer v0.1.46
  90. 6.90 s [gammaloop-workspace-check] Checking anstyle v1.0.14
  91. 6.92 s [gammaloop-workspace-check] Compiling phf_generator v0.11.3
  92. 6.97 s [gammaloop-workspace-check] Checking eyre v0.6.12
  93. 7.03 s [gammaloop-workspace-check] Checking bitflags v1.3.2
  94. 7.06 s [gammaloop-workspace-check] Checking regex-automata v0.4.14
  95. 7.07 s [gammaloop-workspace-check] Checking anstream v1.0.0
  96. 7.08 s [gammaloop-workspace-check] Checking unicode-width v0.2.2
  97. 7.09 s [gammaloop-workspace-check] Compiling phf_codegen v0.11.3
  98. 7.15 s [gammaloop-workspace-check] Checking region v3.0.2
  99. 7.17 s [gammaloop-workspace-check] Checking brotli-decompressor v5.0.0
  100. 7.17 s [gammaloop-workspace-check] Checking wasmtime-jit-icache-coherence v34.0.2
  101. 7.20 s [gammaloop-workspace-check] Compiling pyo3-build-config v0.28.3
  102. 7.21 s [gammaloop-workspace-check] Checking hugepage-rs v0.1.1
  103. 7.25 s [gammaloop-workspace-check] Checking inventory v0.3.24
  104. 7.29 s [gammaloop-workspace-check] Checking spec_math v0.1.6
  105. 7.32 s [gammaloop-workspace-check] Checking thiserror v2.0.18
  106. 7.34 s [gammaloop-workspace-check] Compiling getopts v0.2.24
  107. 7.35 s [gammaloop-workspace-check] Checking libloading v0.9.0
  108. 7.37 s [gammaloop-workspace-check] Checking bytes v1.11.1
  109. 7.38 s [gammaloop-workspace-check] Checking self_cell v1.2.2
  110. 7.38 s [gammaloop-workspace-check] Checking append-only-vec v0.1.8
  111. 7.44 s [gammaloop-workspace-check] Checking byteorder v1.5.0
  112. 7.45 s [gammaloop-workspace-check] Checking tinyjson v2.5.1
  113. 7.49 s [gammaloop-workspace-check] Checking linux-raw-sys v0.12.1
  114. 7.53 s [gammaloop-workspace-check] Compiling unic-common v0.9.0
  115. 7.61 s [gammaloop-workspace-check] Compiling unicode_names2_generator v1.3.0
  116. 7.62 s [gammaloop-workspace-check] Compiling unic-char-range v0.9.0
  117. 7.66 s [gammaloop-workspace-check] Compiling unic-ucd-version v0.9.0
  118. 7.74 s [gammaloop-workspace-check] Compiling unic-char-property v0.9.0
  119. 7.75 s [gammaloop-workspace-check] Compiling is-macro v0.3.7
  120. 7.81 s [gammaloop-workspace-check] Compiling rustpython-parser-vendored v0.4.0
  121. 7.84 s [gammaloop-workspace-check] Checking iana-time-zone v0.1.65
  122. 7.85 s [gammaloop-workspace-check] Compiling rustpython-parser v0.4.0
  123. 7.88 s [gammaloop-workspace-check] Checking brotli v8.0.2
  124. 7.91 s [gammaloop-workspace-check] Compiling phf v0.11.3
  125. 7.97 s [gammaloop-workspace-check] Checking rustc-hash v2.1.2
  126. 8.03 s [gammaloop-workspace-check] Compiling unic-ucd-ident v0.9.0
  127. 8.07 s [gammaloop-workspace-check] Compiling unic-emoji-char v0.9.0
  128. 8.08 s [gammaloop-workspace-check] Compiling lalrpop-util v0.20.2
  129. 8.15 s [gammaloop-workspace-check] Checking serde v1.0.228
  130. 8.18 s [gammaloop-workspace-check] Checking serde_json v1.0.149
  131. 8.20 s [gammaloop-workspace-check] Checking bitflags v2.11.1
  132. 8.22 s [gammaloop-workspace-check] Checking serde_spanned v1.1.1
  133. 8.26 s [gammaloop-workspace-check] Checking toml_datetime v1.1.1+spec-1.1.0
  134. 8.29 s [gammaloop-workspace-check] Compiling rustc-hash v1.1.0
  135. 8.31 s [gammaloop-workspace-check] Checking unicode-segmentation v1.13.2
  136. 8.34 s [gammaloop-workspace-check] Checking rustix v1.1.4
  137. 8.38 s [gammaloop-workspace-check] Compiling symbolica v2.2.0 (https://github.com/alphal00p/symbolica?rev=a277a8dadbaae5a8d6605f2f381991a601e1f345#a277a8da)
  138. 8.40 s [gammaloop-workspace-check] Compiling rug v1.30.0
  139. 8.41 s [gammaloop-workspace-check] Checking typenum v1.20.0
  140. 8.42 s [gammaloop-workspace-check] Checking toml v1.1.2+spec-1.1.0
  141. 8.67 s [gammaloop-workspace-check] Checking getrandom v0.2.17
  142. 8.69 s [gammaloop-workspace-check] Checking smallvec v1.15.1
  143. 8.74 s [gammaloop-workspace-check] Checking num-complex v0.4.6
  144. 8.80 s [gammaloop-workspace-check] Checking bincode v2.0.1
  145. 8.81 s [gammaloop-workspace-check] Checking ppv-lite86 v0.2.21
  146. 8.84 s [gammaloop-workspace-check] Checking ahash v0.8.12
  147. 8.94 s [gammaloop-workspace-check] Checking tracing-serde v0.2.0
  148. 9.01 s [gammaloop-workspace-check] Checking smartstring v1.0.1
  149. 9.11 s [gammaloop-workspace-check] Checking chrono v0.4.44
  150. 9.12 s [gammaloop-workspace-check] Checking simba v0.9.1
  151. 9.13 s [gammaloop-workspace-check] Checking rand_chacha v0.9.0
  152. 9.15 s [gammaloop-workspace-check] Checking ndarray v0.17.2
  153. 9.21 s [gammaloop-workspace-check] Checking scopeguard v1.2.0
  154. 9.22 s [gammaloop-workspace-check] Checking parking_lot_core v0.9.12
  155. 9.27 s [gammaloop-workspace-check] Checking lock_api v0.4.14
  156. 9.32 s [gammaloop-workspace-check] Checking rand v0.9.4
  157. 9.36 s [gammaloop-workspace-check] Checking hashbrown v0.17.0
  158. 9.40 s [gammaloop-workspace-check] Checking unicode-ident v1.0.24
  159. 9.44 s [gammaloop-workspace-check] Checking generic-array v0.14.7
  160. 9.47 s [gammaloop-workspace-check] Checking parking_lot v0.12.5
  161. 9.50 s [gammaloop-workspace-check] Checking errno v0.3.14
  162. 9.51 s [gammaloop-workspace-check] Checking strsim v0.11.1
  163. 9.59 s [gammaloop-workspace-check] Checking unicase v2.9.0
  164. 9.64 s [gammaloop-workspace-check] Checking clap_lex v1.1.0
  165. 9.70 s [gammaloop-workspace-check] Checking signal-hook-registry v1.4.8
  166. 9.76 s [gammaloop-workspace-check] Checking symjit v2.21.0
  167. 9.78 s [gammaloop-workspace-check] Checking vte v0.14.1
  168. 9.78 s [gammaloop-workspace-check] Checking same-file v1.0.6
  169. 9.87 s [gammaloop-workspace-check] Checking signal-hook v0.3.18
  170. 9.92 s [gammaloop-workspace-check] Checking walkdir v2.5.0
  171. 9.98 s [gammaloop-workspace-check] Checking indexmap v2.14.0
  172. 10.05 s [gammaloop-workspace-check] Checking block-buffer v0.10.4
  173. 10.07 s [gammaloop-workspace-check] Checking matchers v0.2.0
  174. 10.09 s [gammaloop-workspace-check] Checking regex v1.12.3
  175. 10.12 s [gammaloop-workspace-check] Checking crypto-common v0.1.7
  176. 10.13 s [gammaloop-workspace-check] Checking half v2.7.1
  177. 10.17 s [gammaloop-workspace-check] Checking mio v1.2.0
  178. 10.20 s [gammaloop-workspace-check] Checking tracing-subscriber v0.3.23
  179. 10.26 s [gammaloop-workspace-check] Checking terminal_size v0.4.4
  180. 10.29 s [gammaloop-workspace-check] Checking ciborium-io v0.2.2
  181. 10.36 s [gammaloop-workspace-check] Checking minimal-lexical v0.2.1
  182. 10.40 s [gammaloop-workspace-check] Checking ciborium-ll v0.2.2
  183. 10.42 s [gammaloop-workspace-check] Checking clap_builder v4.6.0
  184. 10.48 s [gammaloop-workspace-check] Checking signal-hook-mio v0.2.5
  185. 10.51 s [gammaloop-workspace-check] Checking digest v0.10.7
  186. 10.53 s [gammaloop-workspace-check] Checking nom v7.1.3
  187. 10.57 s [gammaloop-workspace-check] Checking num-bigint v0.4.6
  188. 10.57 s [gammaloop-workspace-check] Checking derive_more v2.1.1
  189. 10.58 s [gammaloop-workspace-check] Checking console v0.16.3
  190. 10.64 s [gammaloop-workspace-check] Checking bstr v1.12.1
  191. 10.67 s [gammaloop-workspace-check] Checking linux-raw-sys v0.4.15
  192. 10.70 s [gammaloop-workspace-check] Checking winnow v0.7.15
  193. 10.95 s [gammaloop-workspace-check] Checking cpufeatures v0.2.17
  194. 10.95 s [gammaloop-workspace-check] Checking globset v0.4.18
  195. 10.98 s [gammaloop-workspace-check] Checking sha2 v0.10.9
  196. 10.99 s [gammaloop-workspace-check] Checking rustix v0.38.44
  197. 11.22 s [gammaloop-workspace-check] Checking ciborium v0.2.2
  198. 11.37 s [gammaloop-workspace-check] Checking getrandom v0.4.2
  199. 11.54 s [gammaloop-workspace-check] Checking rand_core v0.6.4
  200. 11.57 s [gammaloop-workspace-check] Compiling unicode_names2 v1.3.0
  201. 11.67 s [gammaloop-workspace-check] Checking fastrand v2.4.1
  202. 11.68 s [gammaloop-workspace-check] Checking plotters-backend v0.3.7
  203. 11.70 s [gammaloop-workspace-check] Checking fnv v1.0.7
  204. 11.73 s [gammaloop-workspace-check] Checking crossterm v0.28.1
  205. 11.82 s [gammaloop-workspace-check] Checking rust-embed-utils v8.11.0
  206. 11.86 s [gammaloop-workspace-check] Checking tempfile v3.27.0
  207. 11.92 s [gammaloop-workspace-check] Checking plotters-svg v0.3.7
  208. 11.95 s [gammaloop-workspace-check] Checking ansitok v0.3.0
  209. 11.96 s [gammaloop-workspace-check] Checking serde_spanned v0.6.9
  210. 11.98 s [gammaloop-workspace-check] Checking toml_datetime v0.6.11
  211. 12.08 s [gammaloop-workspace-check] Checking itertools v0.10.5
  212. 12.12 s [gammaloop-workspace-check] Checking tap v1.0.1
  213. 12.15 s [gammaloop-workspace-check] Checking clap v4.6.1
  214. 12.17 s [gammaloop-workspace-check] Checking toml_write v0.1.2
  215. 12.18 s [gammaloop-workspace-check] Checking cast v0.3.0
  216. 12.22 s [gammaloop-workspace-check] Checking wyz v0.5.1
  217. 12.25 s [gammaloop-workspace-check] Checking plotters v0.3.7
  218. 12.30 s [gammaloop-workspace-check] Checking rand_chacha v0.3.1
  219. 12.33 s [gammaloop-workspace-check] Checking radium v0.7.0
  220. 12.34 s [gammaloop-workspace-check] Checking typeid v1.0.3
  221. 12.38 s [gammaloop-workspace-check] Checking toml_edit v0.22.27
  222. 12.41 s [gammaloop-workspace-check] Checking tinytemplate v1.2.1
  223. 12.44 s [gammaloop-workspace-check] Checking ansi-str v0.9.0
  224. 12.47 s [gammaloop-workspace-check] Checking similar v2.7.0
  225. 12.54 s [gammaloop-workspace-check] Checking is-terminal v0.4.17
  226. 12.57 s [gammaloop-workspace-check] Checking bytecount v0.6.9
  227. 12.60 s [gammaloop-workspace-check] Checking funty v2.0.0
  228. 12.63 s [gammaloop-workspace-check] Checking oorandom v11.1.5
  229. 12.66 s [gammaloop-workspace-check] Checking anes v0.1.6
  230. 12.75 s [gammaloop-workspace-check] Checking papergrid v0.17.0
  231. 12.79 s [gammaloop-workspace-check] Checking rand v0.8.6
  232. 12.81 s [gammaloop-workspace-check] Checking testing_table v0.3.0
  233. 12.83 s [gammaloop-workspace-check] Checking ron v0.12.1
  234. 12.85 s [gammaloop-workspace-check] Checking toml_edit v0.25.11+spec-1.1.0
  235. 12.93 s [gammaloop-workspace-check] Checking env_filter v1.0.1
  236. 13.03 s [gammaloop-workspace-check] Checking bitvec v1.0.1
  237. 13.09 s [gammaloop-workspace-check] Checking uncased v0.9.10
  238. 13.17 s [gammaloop-workspace-check] Checking jiff v0.2.24
  239. 13.21 s [gammaloop-workspace-check] Checking ptr_meta v0.1.4
  240. 13.31 s [gammaloop-workspace-check] Checking ucd-trie v0.1.7
  241. 13.35 s [gammaloop-workspace-check] Checking simdutf8 v0.1.5
  242. 13.37 s [gammaloop-workspace-check] Checking criterion-plot v0.5.0
  243. 13.42 s [gammaloop-workspace-check] Checking ahash v0.7.8
  244. 13.46 s [gammaloop-workspace-check] Checking pest v2.8.6
  245. 13.51 s [gammaloop-workspace-check] Checking xprec v0.2.2
  246. 13.54 s [gammaloop-workspace-check] Checking hashbrown v0.12.3
  247. 13.55 s [gammaloop-workspace-check] Checking bytecheck v0.6.12
  248. 13.64 s [gammaloop-workspace-check] Checking criterion v0.5.1
  249. 13.70 s [gammaloop-workspace-check] Checking approx v0.4.0
  250. 13.79 s [gammaloop-workspace-check] Checking seahash v4.1.0
  251. 13.82 s [gammaloop-workspace-check] Checking cgmath v0.18.0
  252. 13.89 s [gammaloop-workspace-check] Checking rend v0.4.2
  253. 13.91 s [gammaloop-workspace-check] Checking tabled v0.20.0
  254. 13.92 s [gammaloop-workspace-check] Checking num-rational v0.4.2
  255. 14.01 s [gammaloop-workspace-check] Checking insta v1.47.2
  256. 14.06 s [gammaloop-workspace-check] Checking num-iter v0.1.45
  257. 14.19 s [gammaloop-workspace-check] Checking ref-ops v0.2.5
  258. 14.20 s [gammaloop-workspace-check] Checking num v0.4.3
  259. 14.22 s [gammaloop-workspace-check] Checking rand_xoshiro v0.6.0
  260. 14.26 s [gammaloop-workspace-check] Checking features v0.10.0
  261. 14.28 s [gammaloop-workspace-check] Checking constcat v0.5.1
  262. 14.29 s [gammaloop-workspace-check] Checking toml v0.8.23
  263. 14.31 s [gammaloop-workspace-check] Checking gat-lending-iterator v0.1.8
  264. 14.33 s [gammaloop-workspace-check] Checking colored v2.2.0
  265. 14.44 s [gammaloop-workspace-check] Checking arrayref v0.3.9
  266. 14.52 s [gammaloop-workspace-check] Checking cpufeatures v0.3.0
  267. 14.56 s [gammaloop-workspace-check] Compiling pyo3-macros-backend v0.28.3
  268. 14.59 s [gammaloop-workspace-check] Compiling pyo3-ffi v0.28.3
  269. 14.60 s [gammaloop-workspace-check] Compiling pyo3 v0.28.3
  270. 14.61 s [gammaloop-workspace-check] Compiling numpy v0.28.0
  271. 14.64 s [gammaloop-workspace-check] Checking dot-parser v0.5.1
  272. 14.71 s [gammaloop-workspace-check] Checking figment v0.10.19
  273. 15.02 s [gammaloop-workspace-check] Checking constant_time_eq v0.4.2
  274. 15.10 s [gammaloop-workspace-check] Checking base64 v0.22.1
  275. 15.10 s [gammaloop-workspace-check] Checking siphasher v1.0.2
  276. 15.13 s [gammaloop-workspace-check] Checking blake3 v1.8.5
  277. 15.33 s [gammaloop-workspace-check] Checking joinery v2.1.0
  278. 15.47 s [gammaloop-workspace-check] Checking phf_shared v0.13.1
  279. 15.48 s [gammaloop-workspace-check] Checking subprocess v0.2.15
  280. 15.52 s [gammaloop-workspace-check] Checking rust_lisp v0.18.0
  281. 15.54 s [gammaloop-workspace-check] Checking titlecase v2.2.1
  282. 15.65 s [gammaloop-workspace-check] Compiling vakint v0.1.2 (/build/source/crates/vakint)
  283. 15.75 s [gammaloop-workspace-check] Checking version-compare v0.2.1
  284. 15.76 s [gammaloop-workspace-check] Checking xpct v0.5.1
  285. 15.80 s [gammaloop-workspace-check] Checking ryu v1.0.23
  286. 15.84 s [gammaloop-workspace-check] Checking castaway v0.2.4
  287. 15.86 s [gammaloop-workspace-check] Checking toml_datetime v0.7.5+spec-1.1.0
  288. 15.87 s [gammaloop-workspace-check] Checking phf v0.13.1
  289. 15.96 s [gammaloop-workspace-check] Checking strum v0.27.2
  290. 15.99 s [gammaloop-workspace-check] Checking unicode-truncate v2.0.1
  291. 16.00 s [gammaloop-workspace-check] Checking compact_str v0.9.0
  292. 16.07 s [gammaloop-workspace-check] Checking kasuari v0.4.12
  293. 16.13 s [gammaloop-workspace-check] Checking lru v0.16.4
  294. 16.15 s [gammaloop-workspace-check] Checking vte v0.15.0
  295. 16.19 s [gammaloop-workspace-check] Checking portable-atomic v1.13.1
  296. 16.20 s [gammaloop-workspace-check] Checking toml v0.9.12+spec-1.1.0
  297. 16.23 s [gammaloop-workspace-check] Checking string-template-plus v0.4.3
  298. 16.26 s [gammaloop-workspace-check] Checking unit-prefix v0.5.2
  299. 16.31 s [gammaloop-workspace-check] Checking rand_distr v0.4.3
  300. 16.38 s [gammaloop-workspace-check] Checking simba v0.6.0
  301. 16.40 s [gammaloop-workspace-check] Checking vt100 v0.16.2
  302. 16.42 s [gammaloop-workspace-check] Checking line-clipping v0.3.7
  303. 16.48 s [gammaloop-workspace-check] Compiling three-dimensional-reps v0.1.0 (/build/source/crates/three-dimensional-reps)
  304. 16.53 s [gammaloop-workspace-check] Compiling rustpython-parser-core v0.4.0
  305. 16.60 s [gammaloop-workspace-check] Checking ratatui-core v0.1.0
  306. 16.61 s [gammaloop-workspace-check] Checking gimli v0.32.3
  307. 16.67 s [gammaloop-workspace-check] Checking adler2 v2.0.1
  308. 16.79 s [gammaloop-workspace-check] Compiling rustpython-ast v0.4.0
  309. 16.81 s [gammaloop-workspace-check] Checking miniz_oxide v0.8.9
  310. 16.85 s [gammaloop-workspace-check] Checking env_logger v0.11.10
  311. 16.86 s [gammaloop-workspace-check] Checking thiserror v1.0.69
  312. 16.90 s [gammaloop-workspace-check] Checking derive_builder v0.11.2
  313. 16.94 s [gammaloop-workspace-check] Checking owo-colors v4.3.0
  314. 16.96 s [gammaloop-workspace-check] Checking object v0.37.3
  315. 16.96 s [gammaloop-workspace-check] Checking indicatif v0.18.4
  316. 17.00 s [gammaloop-workspace-check] Checking crossterm v0.29.0
  317. 17.03 s [gammaloop-workspace-check] Checking tracing-error v0.2.1
  318. 17.10 s [gammaloop-workspace-check] Checking typed-index-collections v3.5.0
  319. 17.13 s [gammaloop-workspace-check] Checking serde-big-array v0.5.1
  320. 17.23 s [gammaloop-workspace-check] Checking amd v0.2.2
  321. 17.28 s [gammaloop-workspace-check] Checking itertools v0.11.0
  322. 17.29 s [gammaloop-workspace-check] Compiling gammaloop-tracing-filter-macros v0.1.0 (/build/source/crates/gammaloop-tracing-filter-macros)
  323. 17.44 s [gammaloop-workspace-check] Checking option-ext v0.2.0
  324. 17.51 s [gammaloop-workspace-check] Checking rustc-demangle v0.1.27
  325. 17.58 s [gammaloop-workspace-check] Checking dirs-sys v0.5.0
  326. 17.60 s [gammaloop-workspace-check] Checking ref-cast v1.0.25
  327. 17.69 s [gammaloop-workspace-check] Checking nix v0.31.2
  328. 17.77 s [gammaloop-workspace-check] Checking integer-sqrt v0.1.5
  329. 17.79 s [gammaloop-workspace-check] Checking rkyv v0.7.46
  330. 17.81 s [gammaloop-workspace-check] Checking brotli-decompressor v4.0.3
  331. 17.81 s [gammaloop-workspace-check] Checking crossbeam-channel v0.5.15
  332. 17.85 s [gammaloop-workspace-check] Checking ratatui-widgets v0.3.0
  333. 17.85 s [gammaloop-workspace-check] Checking itertools v0.12.1
  334. 17.87 s [gammaloop-workspace-check] Checking unsafe-libyaml v0.2.11
  335. 17.97 s [gammaloop-workspace-check] Checking color-spantrace v0.3.0
  336. 18.15 s [gammaloop-workspace-check] Checking ratatui-crossterm v0.1.0
  337. 18.24 s [gammaloop-workspace-check] Compiling gammalooprs v0.3.4 (/build/source/crates/gammalooprs)
  338. 18.37 s [gammaloop-workspace-check] Checking symlink v0.1.0
  339. 18.41 s [gammaloop-workspace-check] Checking include_dir v0.7.4
  340. 18.46 s [gammaloop-workspace-check] Checking tracing-appender v0.2.5
  341. 18.58 s [gammaloop-workspace-check] Checking pathfinding v4.15.0
  342. 18.62 s [gammaloop-workspace-check] Checking ctrlc v3.5.2
  343. 18.68 s [gammaloop-workspace-check] Checking dirs v6.0.0
  344. 18.79 s [gammaloop-workspace-check] Checking tracing-indicatif v0.3.14
  345. 18.82 s [gammaloop-workspace-check] Checking schemars v1.2.1
  346. 18.87 s [gammaloop-workspace-check] Checking slotmap v1.1.1
  347. 18.90 s [gammaloop-workspace-check] Checking clarabel v0.11.1
  348. 18.94 s [gammaloop-workspace-check] Checking serde_yaml v0.9.34+deprecated
  349. 19.10 s [gammaloop-workspace-check] Checking brotli v7.0.0
  350. 19.37 s [gammaloop-workspace-check] Checking json5 v0.4.1
  351. 19.43 s [gammaloop-workspace-check] Checking ratatui-macros v0.7.0
  352. 19.56 s [gammaloop-workspace-check] Checking ratatui v0.30.0
  353. 19.61 s [gammaloop-workspace-check] Checking vectorize v0.2.0
  354. 19.63 s [gammaloop-workspace-check] Checking base62 v2.2.4
  355. 19.69 s [gammaloop-workspace-check] Checking ringbuffer v0.16.0
  356. 19.72 s [gammaloop-workspace-check] Checking rust-embed v8.11.0
  357. 19.81 s [gammaloop-workspace-check] Checking clap_complete v4.6.3
  358. 19.87 s [gammaloop-workspace-check] Checking fd-lock v4.0.4
  359. 19.92 s [gammaloop-workspace-check] Checking addr2line v0.25.1
  360. 19.96 s [gammaloop-workspace-check] Checking strip-ansi-escapes v0.2.1
  361. 19.98 s [gammaloop-workspace-check] Compiling gammaloop-api v0.1.0 (/build/source/crates/gammaloop-api)
  362. 20.01 s [gammaloop-workspace-check] Checking itertools v0.13.0
  363. 20.02 s [gammaloop-workspace-check] Checking strum v0.26.3
  364. 20.07 s [gammaloop-workspace-check] Checking sysinfo v0.33.1
  365. 20.15 s [gammaloop-workspace-check] Checking shlex v1.3.0
  366. 20.31 s [gammaloop-workspace-check] Checking futures-task v0.3.32
  367. 20.37 s [gammaloop-workspace-check] Checking futures-core v0.3.32
  368. 20.42 s [gammaloop-workspace-check] Checking clap_complete_nushell v4.6.0
  369. 20.48 s [gammaloop-workspace-check] Checking slab v0.4.12
  370. 20.51 s [gammaloop-workspace-check] Checking sdd v3.0.10
  371. 20.51 s [gammaloop-workspace-check] Compiling gammaloop-integration-tests v0.1.0 (/build/source/tests)
  372. 20.59 s [gammaloop-workspace-check] Compiling test-log-core v0.2.20
  373. 20.62 s [gammaloop-workspace-check] Compiling rustc_version v0.4.1
  374. 20.71 s [gammaloop-workspace-check] Checking futures-util v0.3.32
  375. 20.75 s [gammaloop-workspace-check] Checking which v8.0.2
  376. 20.89 s [gammaloop-workspace-check] Checking scc v2.4.0
  377. 21.12 s [gammaloop-workspace-check] Checking bincode v1.3.3
  378. 21.26 s [gammaloop-workspace-check] Compiling numerica v2.2.0 (https://github.com/alphal00p/symbolica?rev=a277a8dadbaae5a8d6605f2f381991a601e1f345#a277a8da)
  379. 21.36 s [gammaloop-workspace-check] Compiling gungraun-runner v0.18.2
  380. 21.52 s [gammaloop-workspace-check] Checking backtrace v0.3.76
  381. 21.76 s [gammaloop-workspace-check] Checking nalgebra v0.29.0
  382. 22.14 s [gammaloop-workspace-check] Compiling gungraun-macros v0.8.0
  383. 22.16 s [gammaloop-workspace-check] Checking reedline v0.42.0
  384. 22.18 s [gammaloop-workspace-check] Checking color-eyre v0.6.5
  385. 22.67 s [gammaloop-workspace-check] Checking proc-macro2 v1.0.106
  386. 22.84 s [gammaloop-workspace-check] Checking maplit v1.0.2
  387. 22.94 s [gammaloop-workspace-check] Checking base64 v0.21.7
  388. 23.23 s [gammaloop-workspace-check] Checking quote v1.0.45
  389. 23.25 s [gammaloop-workspace-check] Checking futures-executor v0.3.32
  390. 23.27 s [gammaloop-workspace-check] Checking ron v0.8.1
  391. 23.29 s [gammaloop-workspace-check] Compiling iai-callgrind-runner v0.14.2
  392. 23.49 s [gammaloop-workspace-check] Checking kurbo v0.13.0
  393. 23.52 s [gammaloop-workspace-check] Checking wait-timeout v0.2.1
  394. 23.55 s [gammaloop-workspace-check] Checking serial_test v3.4.0
  395. 23.73 s [gammaloop-workspace-check] Checking bit-vec v0.8.0
  396. 23.76 s [gammaloop-workspace-check] Compiling iai-callgrind v0.14.2
  397. 23.79 s [gammaloop-workspace-check] Checking quick-error v1.2.3
  398. 23.86 s [gammaloop-workspace-check] Checking rusty-fork v0.3.1
  399. 24.00 s [gammaloop-workspace-check] Checking bit-set v0.8.0
  400. 24.37 s [gammaloop-workspace-check] Checking syn v2.0.117
  401. 24.39 s [gammaloop-workspace-check] Compiling test-log-macros v0.2.20
  402. 24.46 s [gammaloop-workspace-check] Compiling iai-callgrind-macros v0.5.1
  403. 24.51 s [gammaloop-workspace-check] Checking rand_xorshift v0.4.0
  404. 24.61 s [gammaloop-workspace-check] Checking console v0.15.11
  405. 24.77 s [gammaloop-workspace-check] Checking unarray v0.1.4
  406. 24.78 s [gammaloop-workspace-check] Checking pathdiff v0.2.3
  407. 24.91 s [gammaloop-workspace-check] Checking proptest v1.11.0
  408. 25.07 s [gammaloop-workspace-check] Checking kurvst v0.1.0 (/build/source/crates/kurvst)
  409. 25.09 s [gammaloop-workspace-check] Checking similar-asserts v1.7.0
  410. 25.98 s [gammaloop-workspace-check] Checking clinnet v0.1.8 (/build/source/crates/clinnet)
  411. 27.78 s [gammaloop-workspace-check] Checking test-log v0.2.20
  412. 28.48 s [gammaloop-workspace-check] Compiling graphica v2.1.0 (https://github.com/alphal00p/symbolica?rev=a277a8dadbaae5a8d6605f2f381991a601e1f345#a277a8da)
  413. 30.90 s [gammaloop-workspace-check] Checking statrs v0.16.1
  414. 31.83 s [gammaloop-workspace-check] Checking momtrop v0.3.0
  415. 33.11 s [gammaloop-workspace-check] Checking gungraun v0.18.2
  416. 36.10 s [gammaloop-workspace-check] Compiling pyo3-stub-gen-derive v0.17.2
  417. 36.29 s [gammaloop-workspace-check] Compiling pyo3-macros v0.28.3
  418. 44.18 s [gammaloop-workspace-check] Checking pyo3-stub-gen v0.17.2
  419. 53.51 s [gammaloop-workspace-check] Checking symbolica-utils v0.1.0 (/build/source/crates/symbolica-utils)
  420. 53.51 s [gammaloop-workspace-check] Checking spenso-macros v0.3.2 (/build/source/crates/spenso-macros)
  421. 341.07 s [gammaloop-workspace-check] Compiling gammaloop-workspace-hack v0.1.0 (/build/source/crates/gammaloop-workspace-hack)
  422. 341.54 s [gammaloop-workspace-check] Checking linnet v0.17.0 (/build/source/crates/linnet)
  423. 347.55 s [gammaloop-workspace-check] Checking spenso v0.6.0 (/build/source/crates/spenso)
  424. 347.79 s [gammaloop-workspace-check] Checking linnet-py v0.1.0 (/build/source/crates/linnet-py)
  425. 347.79 s [gammaloop-workspace-check] Checking linnest v0.1.0 (/build/source/crates/linnest)
  426. 355.63 s [gammaloop-workspace-check] Checking idenso v0.3.0 (/build/source/crates/idenso)
  427. 355.63 s [gammaloop-workspace-check] Checking gammaloop-tracing-filter v0.1.0 (/build/source/crates/gammaloop-tracing-filter)
  428. 358.42 s [gammaloop-workspace-check] Checking spenso-hep-lib v0.1.7 (/build/source/crates/spenso-hep-lib)
  429. 358.67 s [gammaloop-workspace-check] Checking spynso3 v0.1.2 (/build/source/crates/spynso3)
  430. 394.55 s [gammaloop-workspace-check] warning: method `reinterpret_loop_momenta_and_compute_prefactor` is never used
  431. 394.55 s [gammaloop-workspace-check] --> crates/gammalooprs/src/integrands/process/mod.rs:2681:19
  432. 394.55 s [gammaloop-workspace-check] |
  433. 394.55 s [gammaloop-workspace-check] 2144 | impl LmbMultiChannelingSetup {
  434. 394.55 s [gammaloop-workspace-check] | ---------------------------- method in this implementation
  435. 394.55 s [gammaloop-workspace-check] ...
  436. 394.55 s [gammaloop-workspace-check] 2681 | pub(crate) fn reinterpret_loop_momenta_and_compute_prefactor<T: FloatLike>(
  437. 394.55 s [gammaloop-workspace-check] | ^^^^^^^^^^^^^^^^^^^^^^^^^^^^^^^^^^^^^^^^^^^^^^
  438. 394.55 s [gammaloop-workspace-check] |
  439. 394.55 s [gammaloop-workspace-check] = note: `#[warn(dead_code)]` (part of `#[warn(unused)]`) on by default
  440. 394.55 s [gammaloop-workspace-check]
  441. 400.44 s [gammaloop-workspace-check] warning: `gammalooprs` (lib) generated 1 warning
  442. 402.07 s [gammaloop-workspace-check] warning: unused import: `GaussianReferenceFunction`
  443. 402.07 s [gammaloop-workspace-check] --> crates/gammaloop-api/src/state.rs:38:27
  444. 402.07 s [gammaloop-workspace-check] |
  445. 402.07 s [gammaloop-workspace-check] 38 | integrands::process::{GaussianReferenceFunction, ProcessIntegrand},
  446. 402.07 s [gammaloop-workspace-check] | ^^^^^^^^^^^^^^^^^^^^^^^^^
  447. 402.07 s [gammaloop-workspace-check] |
  448. 402.07 s [gammaloop-workspace-check] = note: `#[warn(unused_imports)]` (part of `#[warn(unused)]`) on by default
  449. 402.07 s [gammaloop-workspace-check]
  450. 407.95 s [gammaloop-workspace-check] warning: `gammalooprs` (lib test) generated 1 warning (1 duplicate)
  451. 413.27 s [gammaloop-workspace-check] warning: `gammaloop-api` (lib) generated 1 warning (run `cargo fix --lib -p gammaloop-api` to apply 1 suggestion)
  452. 414.16 s [gammaloop-workspace-check] error[E0560]: struct `CutInfo` has no field named `lmb_channel_id`
  453. 414.16 s [gammaloop-workspace-check] --> tests/tests/test_differential.rs:86:13
  454. 414.16 s [gammaloop-workspace-check] |
  455. 414.16 s [gammaloop-workspace-check] 86 | lmb_channel_id: None,
  456. 414.16 s [gammaloop-workspace-check] | ^^^^^^^^^^^^^^ `CutInfo` does not have this field
  457. 414.16 s [gammaloop-workspace-check] |
  458. 414.16 s [gammaloop-workspace-check] = note: available fields are: `sampling_channel_id`, `sampling_channel_edge_ids`
  459. 414.16 s [gammaloop-workspace-check]
  460. 414.16 s [gammaloop-workspace-check] error[E0560]: struct `CutInfo` has no field named `lmb_channel_edge_ids`
  461. 414.16 s [gammaloop-workspace-check] --> tests/tests/test_differential.rs:87:13
  462. 414.16 s [gammaloop-workspace-check] |
  463. 414.16 s [gammaloop-workspace-check] 87 | lmb_channel_edge_ids: None,
  464. 414.16 s [gammaloop-workspace-check] | ^^^^^^^^^^^^^^^^^^^^ `CutInfo` does not have this field
  465. 414.16 s [gammaloop-workspace-check] |
  466. 414.16 s [gammaloop-workspace-check] = note: available fields are: `sampling_channel_id`, `sampling_channel_edge_ids`
  467. 414.16 s [gammaloop-workspace-check]
  468. 414.44 s [gammaloop-workspace-check] For more information about this error, try `rustc --explain E0560`.
  469. 414.47 s [gammaloop-workspace-check] error: could not compile `gammaloop-integration-tests` (test "test_differential") due to 2 previous errors
  470. 414.48 s [gammaloop-workspace-check] warning: build failed, waiting for other jobs to finish...
  471. 414.64 s [gammaloop-workspace-check] error[E0609]: no field `lmb_channel_edge_ids` on type `CutInfo`
  472. 414.64 s [gammaloop-workspace-check] --> tests/tests/test_evaluation_api.rs:311:10
  473. 414.64 s [gammaloop-workspace-check] |
  474. 414.64 s [gammaloop-workspace-check] 311 | .lmb_channel_edge_ids
  475. 414.64 s [gammaloop-workspace-check] | ^^^^^^^^^^^^^^^^^^^^ unknown field
  476. 414.64 s [gammaloop-workspace-check] |
  477. 414.64 s [gammaloop-workspace-check] = note: available fields are: `particle_pdgs`, `cut_id`, `graph_id`, `graph_group_id`, `orientation_id` ... and 2 others
  478. 414.64 s [gammaloop-workspace-check]
  479. 414.67 s [gammaloop-workspace-check] error[E0609]: no field `lmb_channel_edge_ids` on type `CutInfo`
  480. 414.67 s [gammaloop-workspace-check] --> tests/tests/test_evaluation_api.rs:591:26
  481. 414.67 s [gammaloop-workspace-check] |
  482. 414.67 s [gammaloop-workspace-check] 591 | .lmb_channel_edge_ids
  483. 414.67 s [gammaloop-workspace-check] | ^^^^^^^^^^^^^^^^^^^^ unknown field
  484. 414.67 s [gammaloop-workspace-check] |
  485. 414.67 s [gammaloop-workspace-check] = note: available fields are: `particle_pdgs`, `cut_id`, `graph_id`, `graph_group_id`, `orientation_id` ... and 2 others
  486. 414.67 s [gammaloop-workspace-check]
  487. 414.73 s [gammaloop-workspace-check] error[E0609]: no field `lmb_channel_edge_ids` on type `CutInfo`
  488. 414.73 s [gammaloop-workspace-check] --> tests/tests/test_evaluation_api.rs:1177:18
  489. 414.73 s [gammaloop-workspace-check] |
  490. 414.73 s [gammaloop-workspace-check] 1177 | .lmb_channel_edge_ids
  491. 414.73 s [gammaloop-workspace-check] | ^^^^^^^^^^^^^^^^^^^^ unknown field
  492. 414.73 s [gammaloop-workspace-check] |
  493. 414.73 s [gammaloop-workspace-check] = note: available fields are: `particle_pdgs`, `cut_id`, `graph_id`, `graph_group_id`, `orientation_id` ... and 2 others
  494. 414.73 s [gammaloop-workspace-check]
  495. 415.09 s [gammaloop-workspace-check] error[E0609]: no field `lmb_channel_edge_ids` on type `CutInfo`
  496. 415.09 s [gammaloop-workspace-check] --> tests/tests/test_evaluation_api.rs:1222:22
  497. 415.09 s [gammaloop-workspace-check] |
  498. 415.09 s [gammaloop-workspace-check] 1222 | .lmb_channel_edge_ids
  499. 415.09 s [gammaloop-workspace-check] | ^^^^^^^^^^^^^^^^^^^^ unknown field
  500. 415.09 s [gammaloop-workspace-check] |
  501. 415.09 s [gammaloop-workspace-check] = note: available fields are: `particle_pdgs`, `cut_id`, `graph_id`, `graph_group_id`, `orientation_id` ... and 2 others
  502. 415.09 s [gammaloop-workspace-check]
  503. 415.10 s [gammaloop-workspace-check] error[E0609]: no field `lmb_channel_edge_ids` on type `CutInfo`
  504. 415.10 s [gammaloop-workspace-check] --> tests/tests/test_evaluation_api.rs:1281:14
  505. 415.10 s [gammaloop-workspace-check] |
  506. 415.10 s [gammaloop-workspace-check] 1281 | .lmb_channel_edge_ids
  507. 415.10 s [gammaloop-workspace-check] | ^^^^^^^^^^^^^^^^^^^^ unknown field
  508. 415.10 s [gammaloop-workspace-check] |
  509. 415.10 s [gammaloop-workspace-check] = note: available fields are: `particle_pdgs`, `cut_id`, `graph_id`, `graph_group_id`, `orientation_id` ... and 2 others
  510. 415.10 s [gammaloop-workspace-check]
  511. 415.24 s [gammaloop-workspace-check] error[E0609]: no field `lmb_channel_edge_ids` on type `CutInfo`
  512. 415.24 s [gammaloop-workspace-check] --> tests/tests/test_evaluation_api.rs:1428:18
  513. 415.24 s [gammaloop-workspace-check] |
  514. 415.24 s [gammaloop-workspace-check] 1428 | .lmb_channel_edge_ids
  515. 415.24 s [gammaloop-workspace-check] | ^^^^^^^^^^^^^^^^^^^^ unknown field
  516. 415.24 s [gammaloop-workspace-check] |
  517. 415.24 s [gammaloop-workspace-check] = note: available fields are: `particle_pdgs`, `cut_id`, `graph_id`, `graph_group_id`, `orientation_id` ... and 2 others
  518. 415.24 s [gammaloop-workspace-check]
  519. 415.41 s [gammaloop-workspace-check] For more information about this error, try `rustc --explain E0609`.
  520. 415.43 s [gammaloop-workspace-check] error: could not compile `gammaloop-integration-tests` (test "test_evaluation_api") due to 6 previous errors
  521. 416.58 s [gammaloop-workspace-check] error[E0609]: no field `lmb_channel_id` on type `CutInfo`
  522. 416.58 s [gammaloop-workspace-check] --> tests/tests/test_runs/utils.rs:568:36
  523. 416.58 s [gammaloop-workspace-check] |
  524. 416.58 s [gammaloop-workspace-check] 568 | event.cut_info.lmb_channel_id,
  525. 416.58 s [gammaloop-workspace-check] | ^^^^^^^^^^^^^^ unknown field
  526. 416.58 s [gammaloop-workspace-check] |
  527. 416.58 s [gammaloop-workspace-check] = note: available fields are: `particle_pdgs`, `cut_id`, `graph_id`, `graph_group_id`, `orientation_id` ... and 2 others
  528. 416.58 s [gammaloop-workspace-check]
  529. 416.59 s [gammaloop-workspace-check] error[E0609]: no field `lmb_channel_id` on type `CutInfo`
  530. 416.59 s [gammaloop-workspace-check] --> tests/tests/test_runs/utils.rs:580:36
  531. 416.59 s [gammaloop-workspace-check] |
  532. 416.59 s [gammaloop-workspace-check] 580 | event.cut_info.lmb_channel_id,
  533. 416.59 s [gammaloop-workspace-check] | ^^^^^^^^^^^^^^ unknown field
  534. 416.59 s [gammaloop-workspace-check] |
  535. 416.59 s [gammaloop-workspace-check] = note: available fields are: `particle_pdgs`, `cut_id`, `graph_id`, `graph_group_id`, `orientation_id` ... and 2 others
  536. 416.59 s [gammaloop-workspace-check]
  537. 417.59 s [gammaloop-workspace-check] error: could not compile `gammaloop-integration-tests` (test "test_runs") due to 2 previous errors
  538. 418.40 s Progress: 0 of 1 built (1 failed)
  539. 418.40 s Failed to build gammaloop-workspace-check after 6m55s
  540. 418.43 s Cannot build '/nix/store/448zayigj0y6f3w7w36r7s3pw9rbgz07-gammaloop-workspace-check-0.1.0.drv'.
  541. 418.43 s Reason: builder failed with exit code 101.
  542. 418.43 s Output paths:
  543. 418.43 s /nix/store/div758lndcl95y63brx79cijsifncqjz-gammaloop-workspace-check-0.1.0
  544. 418.43 s Last 533 log lines:
  545. 418.43 s > Running phase: unpackPhase
  546. 418.43 s > unpacking source archive /nix/store/d6ym1w3z3dvqglkyhyd37z00vfsb641k-source
  547. 418.43 s > source root is source
  548. 418.43 s > Running phase: patchPhase
  549. 418.43 s > Executing configureCargoCommonVars
  550. 418.43 s > decompressing cargo artifacts from /nix/store/50vpxlcgfxf2d57i27v3d10zjwxxbm2r-gammaloop-workspace-deps-deps-0.1.0/target.tar.zst to target
  551. 418.43 s > Running phase: updateAutotoolsGnuConfigScriptsPhase
  552. 418.43 s > Running phase: configurePhase
  553. 418.43 s > will append /build/source/.cargo-home/config.toml with contents of /nix/store/5drf77x6km4ky7gwlrzdx9bbd6fz09g3-vendor-cargo-deps/config.toml
  554. 418.43 s > default configurePhase, nothing to do
  555. 418.43 s > Running phase: buildPhase
  556. 418.43 s > +++ command cargo --version
  557. 418.43 s > cargo 1.97.0 (c980f4866 2026-06-30)
  558. 418.43 s > +++ command cargo check --profile ci-optim --locked --workspace --features gammaloop-tracing-filter/clap,gammaloop-tracing-filter/symbolica,idenso/bincode,idenso/reference-cases,linnet/bincode,linnet/drawing,linnet/rkyv,linnet/serde,linnet/symbolica,spenso-macros/shadowing,spenso/shadowing,symbolica/tracing_max_level_info,three-dimensional-reps/display,three-dimensional-reps/eval,three-dimensional-reps/serde --all-targets
  559. 418.43 s > Checking cfg-if v1.0.4
  560. 418.43 s > Checking memchr v2.8.0
  561. 418.43 s > Checking once_cell v1.21.4
  562. 418.43 s > Checking either v1.15.0
  563. 418.43 s > Checking serde_core v1.0.228
  564. 418.43 s > Checking libc v0.2.186
  565. 418.43 s > Checking libm v0.2.16
  566. 418.43 s > Checking itoa v1.0.18
  567. 418.43 s > Checking log v0.4.29
  568. 418.43 s > Checking regex-syntax v0.8.10
  569. 418.43 s > Checking zerocopy v0.8.48
  570. 418.43 s > Checking crossbeam-utils v0.8.21
  571. 418.43 s > Checking equivalent v1.0.2
  572. 418.43 s > Checking zmij v1.0.21
  573. 418.43 s > Checking lazy_static v1.5.0
  574. 418.43 s > Checking bytemuck v1.25.0
  575. 418.43 s > Compiling target-lexicon v0.13.5
  576. 418.43 s > Checking arrayvec v0.7.6
  577. 418.43 s > Checking powerfmt v0.2.0
  578. 418.43 s > Checking time-core v0.1.8
  579. 418.43 s > Checking pin-project-lite v0.2.17
  580. 418.43 s > Checking itertools v0.14.0
  581. 418.43 s > Checking num_threads v0.1.7
  582. 418.43 s > Checking num-conv v0.2.1
  583. 418.43 s > Checking deranged v0.5.8
  584. 418.43 s > Checking tracing-core v0.1.36
  585. 418.43 s > Checking allocator-api2 v0.2.21
  586. 418.43 s > Checking safe_arch v0.7.4
  587. 418.43 s > Checking foldhash v0.2.0
  588. 418.43 s > Checking const-random v0.1.18
  589. 418.43 s > Checking static_assertions v1.1.0
  590. 418.43 s > Checking nu-ansi-term v0.50.3
  591. 418.43 s > Checking aho-corasick v1.1.4
  592. 418.43 s > Checking unty v0.0.4
  593. 418.43 s > Checking winnow v1.0.2
  594. 418.43 s > Checking safe_arch v1.0.0
  595. 418.43 s > Checking crossbeam-epoch v0.9.18
  596. 418.43 s > Checking hashbrown v0.16.1
  597. 418.43 s > Checking sharded-slab v0.1.7
  598. 418.43 s > Checking wide v0.7.33
  599. 418.43 s > Checking tracing-log v0.2.0
  600. 418.43 s > Checking crossbeam-deque v0.8.6
  601. 418.43 s > Checking tracing v0.1.44
  602. 418.43 s > Checking rayon-core v1.13.0
  603. 418.43 s > Checking thread_local v1.1.9
  604. 418.43 s > Checking toml_writer v1.1.1+spec-1.1.0
  605. 418.43 s > Checking az v1.3.0
  606. 418.43 s > Checking num-traits v0.2.19
  607. 418.43 s > Checking indenter v0.3.4
  608. 418.43 s > Checking wide v1.3.0
  609. 418.43 s > Compiling phf_shared v0.11.3
  610. 418.43 s > Checking getrandom v0.3.4
  611. 418.43 s > Checking gmp-mpfr-sys v1.7.1
  612. 418.43 s > Checking anyhow v1.0.102
  613. 418.43 s > Checking rayon v1.12.0
  614. 418.43 s > Checking alloc-no-stdlib v2.0.4
  615. 418.43 s > Checking rand_core v0.9.5
  616. 418.43 s > Checking utf8parse v0.2.2
  617. 418.43 s > Checking time v0.3.47
  618. 418.43 s > Checking dyn-clone v1.0.20
  619. 418.43 s > Checking rawpointer v0.2.1
  620. 418.43 s > Checking anstyle-parse v1.0.0
  621. 418.43 s > Checking alloc-stdlib v0.2.2
  622. 418.43 s > Checking is_terminal_polyfill v1.70.2
  623. 418.43 s > Checking matrixmultiply v0.3.10
  624. 418.43 s > Checking anstyle-query v1.1.5
  625. 418.43 s > Checking toml_parser v1.1.2+spec-1.1.0
  626. 418.43 s > Checking colored v3.1.1
  627. 418.43 s > Checking colorchoice v1.0.5
  628. 418.43 s > Checking approx v0.5.1
  629. 418.43 s > Checking num-integer v0.1.46
  630. 418.43 s > Checking anstyle v1.0.14
  631. 418.43 s > Compiling phf_generator v0.11.3
  632. 418.43 s > Checking eyre v0.6.12
  633. 418.43 s > Checking bitflags v1.3.2
  634. 418.43 s > Checking regex-automata v0.4.14
  635. 418.43 s > Checking anstream v1.0.0
  636. 418.43 s > Checking unicode-width v0.2.2
  637. 418.43 s > Compiling phf_codegen v0.11.3
  638. 418.43 s > Checking region v3.0.2
  639. 418.43 s > Checking brotli-decompressor v5.0.0
  640. 418.43 s > Checking wasmtime-jit-icache-coherence v34.0.2
  641. 418.43 s > Compiling pyo3-build-config v0.28.3
  642. 418.43 s > Checking hugepage-rs v0.1.1
  643. 418.43 s > Checking inventory v0.3.24
  644. 418.43 s > Checking spec_math v0.1.6
  645. 418.43 s > Checking thiserror v2.0.18
  646. 418.43 s > Compiling getopts v0.2.24
  647. 418.43 s > Checking libloading v0.9.0
  648. 418.43 s > Checking bytes v1.11.1
  649. 418.43 s > Checking self_cell v1.2.2
  650. 418.43 s > Checking append-only-vec v0.1.8
  651. 418.43 s > Checking byteorder v1.5.0
  652. 418.43 s > Checking tinyjson v2.5.1
  653. 418.43 s > Checking linux-raw-sys v0.12.1
  654. 418.43 s > Compiling unic-common v0.9.0
  655. 418.43 s > Compiling unicode_names2_generator v1.3.0
  656. 418.43 s > Compiling unic-char-range v0.9.0
  657. 418.43 s > Compiling unic-ucd-version v0.9.0
  658. 418.43 s > Compiling unic-char-property v0.9.0
  659. 418.43 s > Compiling is-macro v0.3.7
  660. 418.43 s > Compiling rustpython-parser-vendored v0.4.0
  661. 418.43 s > Checking iana-time-zone v0.1.65
  662. 418.43 s > Compiling rustpython-parser v0.4.0
  663. 418.43 s > Checking brotli v8.0.2
  664. 418.43 s > Compiling phf v0.11.3
  665. 418.43 s > Checking rustc-hash v2.1.2
  666. 418.43 s > Compiling unic-ucd-ident v0.9.0
  667. 418.43 s > Compiling unic-emoji-char v0.9.0
  668. 418.43 s > Compiling lalrpop-util v0.20.2
  669. 418.43 s > Checking serde v1.0.228
  670. 418.43 s > Checking serde_json v1.0.149
  671. 418.43 s > Checking bitflags v2.11.1
  672. 418.43 s > Checking serde_spanned v1.1.1
  673. 418.43 s > Checking toml_datetime v1.1.1+spec-1.1.0
  674. 418.43 s > Compiling rustc-hash v1.1.0
  675. 418.43 s > Checking unicode-segmentation v1.13.2
  676. 418.43 s > Checking rustix v1.1.4
  677. 418.43 s > Compiling symbolica v2.2.0 (https://github.com/alphal00p/symbolica?rev=a277a8dadbaae5a8d6605f2f381991a601e1f345#a277a8da)
  678. 418.43 s > Compiling rug v1.30.0
  679. 418.43 s > Checking typenum v1.20.0
  680. 418.43 s > Checking toml v1.1.2+spec-1.1.0
  681. 418.43 s > Checking getrandom v0.2.17
  682. 418.43 s > Checking smallvec v1.15.1
  683. 418.43 s > Checking num-complex v0.4.6
  684. 418.43 s > Checking bincode v2.0.1
  685. 418.43 s > Checking ppv-lite86 v0.2.21
  686. 418.43 s > Checking ahash v0.8.12
  687. 418.43 s > Checking tracing-serde v0.2.0
  688. 418.43 s > Checking smartstring v1.0.1
  689. 418.43 s > Checking chrono v0.4.44
  690. 418.43 s > Checking simba v0.9.1
  691. 418.43 s > Checking rand_chacha v0.9.0
  692. 418.43 s > Checking ndarray v0.17.2
  693. 418.43 s > Checking scopeguard v1.2.0
  694. 418.43 s > Checking parking_lot_core v0.9.12
  695. 418.43 s > Checking lock_api v0.4.14
  696. 418.43 s > Checking rand v0.9.4
  697. 418.43 s > Checking hashbrown v0.17.0
  698. 418.43 s > Checking unicode-ident v1.0.24
  699. 418.43 s > Checking generic-array v0.14.7
  700. 418.43 s > Checking parking_lot v0.12.5
  701. 418.43 s > Checking errno v0.3.14
  702. 418.43 s > Checking strsim v0.11.1
  703. 418.43 s > Checking unicase v2.9.0
  704. 418.43 s > Checking clap_lex v1.1.0
  705. 418.43 s > Checking signal-hook-registry v1.4.8
  706. 418.43 s > Checking symjit v2.21.0
  707. 418.43 s > Checking vte v0.14.1
  708. 418.43 s > Checking same-file v1.0.6
  709. 418.43 s > Checking signal-hook v0.3.18
  710. 418.43 s > Checking walkdir v2.5.0
  711. 418.43 s > Checking indexmap v2.14.0
  712. 418.43 s > Checking block-buffer v0.10.4
  713. 418.43 s > Checking matchers v0.2.0
  714. 418.43 s > Checking regex v1.12.3
  715. 418.43 s > Checking crypto-common v0.1.7
  716. 418.43 s > Checking half v2.7.1
  717. 418.43 s > Checking mio v1.2.0
  718. 418.43 s > Checking tracing-subscriber v0.3.23
  719. 418.43 s > Checking terminal_size v0.4.4
  720. 418.43 s > Checking ciborium-io v0.2.2
  721. 418.43 s > Checking minimal-lexical v0.2.1
  722. 418.43 s > Checking ciborium-ll v0.2.2
  723. 418.43 s > Checking clap_builder v4.6.0
  724. 418.43 s > Checking signal-hook-mio v0.2.5
  725. 418.43 s > Checking digest v0.10.7
  726. 418.43 s > Checking nom v7.1.3
  727. 418.43 s > Checking num-bigint v0.4.6
  728. 418.43 s > Checking derive_more v2.1.1
  729. 418.43 s > Checking console v0.16.3
  730. 418.43 s > Checking bstr v1.12.1
  731. 418.43 s > Checking linux-raw-sys v0.4.15
  732. 418.43 s > Checking winnow v0.7.15
  733. 418.43 s > Checking cpufeatures v0.2.17
  734. 418.43 s > Checking globset v0.4.18
  735. 418.43 s > Checking sha2 v0.10.9
  736. 418.43 s > Checking rustix v0.38.44
  737. 418.43 s > Checking ciborium v0.2.2
  738. 418.43 s > Checking getrandom v0.4.2
  739. 418.43 s > Checking rand_core v0.6.4
  740. 418.43 s > Compiling unicode_names2 v1.3.0
  741. 418.43 s > Checking fastrand v2.4.1
  742. 418.43 s > Checking plotters-backend v0.3.7
  743. 418.43 s > Checking fnv v1.0.7
  744. 418.43 s > Checking crossterm v0.28.1
  745. 418.43 s > Checking rust-embed-utils v8.11.0
  746. 418.43 s > Checking tempfile v3.27.0
  747. 418.43 s > Checking plotters-svg v0.3.7
  748. 418.43 s > Checking ansitok v0.3.0
  749. 418.43 s > Checking serde_spanned v0.6.9
  750. 418.43 s > Checking toml_datetime v0.6.11
  751. 418.43 s > Checking itertools v0.10.5
  752. 418.43 s > Checking tap v1.0.1
  753. 418.43 s > Checking clap v4.6.1
  754. 418.43 s > Checking toml_write v0.1.2
  755. 418.43 s > Checking cast v0.3.0
  756. 418.43 s > Checking wyz v0.5.1
  757. 418.43 s > Checking plotters v0.3.7
  758. 418.43 s > Checking rand_chacha v0.3.1
  759. 418.43 s > Checking radium v0.7.0
  760. 418.43 s > Checking typeid v1.0.3
  761. 418.43 s > Checking toml_edit v0.22.27
  762. 418.43 s > Checking tinytemplate v1.2.1
  763. 418.43 s > Checking ansi-str v0.9.0
  764. 418.43 s > Checking similar v2.7.0
  765. 418.43 s > Checking is-terminal v0.4.17
  766. 418.43 s > Checking bytecount v0.6.9
  767. 418.43 s > Checking funty v2.0.0
  768. 418.43 s > Checking oorandom v11.1.5
  769. 418.43 s > Checking anes v0.1.6
  770. 418.43 s > Checking papergrid v0.17.0
  771. 418.43 s > Checking rand v0.8.6
  772. 418.43 s > Checking testing_table v0.3.0
  773. 418.43 s > Checking ron v0.12.1
  774. 418.43 s > Checking toml_edit v0.25.11+spec-1.1.0
  775. 418.43 s > Checking env_filter v1.0.1
  776. 418.43 s > Checking bitvec v1.0.1
  777. 418.43 s > Checking uncased v0.9.10
  778. 418.43 s > Checking jiff v0.2.24
  779. 418.43 s > Checking ptr_meta v0.1.4
  780. 418.43 s > Checking ucd-trie v0.1.7
  781. 418.43 s > Checking simdutf8 v0.1.5
  782. 418.43 s > Checking criterion-plot v0.5.0
  783. 418.43 s > Checking ahash v0.7.8
  784. 418.43 s > Checking pest v2.8.6
  785. 418.43 s > Checking xprec v0.2.2
  786. 418.43 s > Checking hashbrown v0.12.3
  787. 418.43 s > Checking bytecheck v0.6.12
  788. 418.43 s > Checking criterion v0.5.1
  789. 418.43 s > Checking approx v0.4.0
  790. 418.43 s > Checking seahash v4.1.0
  791. 418.43 s > Checking cgmath v0.18.0
  792. 418.43 s > Checking rend v0.4.2
  793. 418.43 s > Checking tabled v0.20.0
  794. 418.43 s > Checking num-rational v0.4.2
  795. 418.43 s > Checking insta v1.47.2
  796. 418.43 s > Checking num-iter v0.1.45
  797. 418.43 s > Checking ref-ops v0.2.5
  798. 418.43 s > Checking num v0.4.3
  799. 418.43 s > Checking rand_xoshiro v0.6.0
  800. 418.43 s > Checking features v0.10.0
  801. 418.43 s > Checking constcat v0.5.1
  802. 418.43 s > Checking toml v0.8.23
  803. 418.43 s > Checking gat-lending-iterator v0.1.8
  804. 418.43 s > Checking colored v2.2.0
  805. 418.43 s > Checking arrayref v0.3.9
  806. 418.43 s > Checking cpufeatures v0.3.0
  807. 418.43 s > Compiling pyo3-macros-backend v0.28.3
  808. 418.43 s > Compiling pyo3-ffi v0.28.3
  809. 418.43 s > Compiling pyo3 v0.28.3
  810. 418.43 s > Compiling numpy v0.28.0
  811. 418.43 s > Checking dot-parser v0.5.1
  812. 418.43 s > Checking figment v0.10.19
  813. 418.43 s > Checking constant_time_eq v0.4.2
  814. 418.43 s > Checking base64 v0.22.1
  815. 418.43 s > Checking siphasher v1.0.2
  816. 418.43 s > Checking blake3 v1.8.5
  817. 418.43 s > Checking joinery v2.1.0
  818. 418.43 s > Checking phf_shared v0.13.1
  819. 418.43 s > Checking subprocess v0.2.15
  820. 418.43 s > Checking rust_lisp v0.18.0
  821. 418.43 s > Checking titlecase v2.2.1
  822. 418.43 s > Compiling vakint v0.1.2 (/build/source/crates/vakint)
  823. 418.43 s > Checking version-compare v0.2.1
  824. 418.43 s > Checking xpct v0.5.1
  825. 418.43 s > Checking ryu v1.0.23
  826. 418.43 s > Checking castaway v0.2.4
  827. 418.43 s > Checking toml_datetime v0.7.5+spec-1.1.0
  828. 418.43 s > Checking phf v0.13.1
  829. 418.43 s > Checking strum v0.27.2
  830. 418.43 s > Checking unicode-truncate v2.0.1
  831. 418.43 s > Checking compact_str v0.9.0
  832. 418.43 s > Checking kasuari v0.4.12
  833. 418.43 s > Checking lru v0.16.4
  834. 418.43 s > Checking vte v0.15.0
  835. 418.43 s > Checking portable-atomic v1.13.1
  836. 418.43 s > Checking toml v0.9.12+spec-1.1.0
  837. 418.43 s > Checking string-template-plus v0.4.3
  838. 418.43 s > Checking unit-prefix v0.5.2
  839. 418.43 s > Checking rand_distr v0.4.3
  840. 418.43 s > Checking simba v0.6.0
  841. 418.43 s > Checking vt100 v0.16.2
  842. 418.43 s > Checking line-clipping v0.3.7
  843. 418.43 s > Compiling three-dimensional-reps v0.1.0 (/build/source/crates/three-dimensional-reps)
  844. 418.43 s > Compiling rustpython-parser-core v0.4.0
  845. 418.43 s > Checking ratatui-core v0.1.0
  846. 418.43 s > Checking gimli v0.32.3
  847. 418.43 s > Checking adler2 v2.0.1
  848. 418.43 s > Compiling rustpython-ast v0.4.0
  849. 418.43 s > Checking miniz_oxide v0.8.9
  850. 418.43 s > Checking env_logger v0.11.10
  851. 418.43 s > Checking thiserror v1.0.69
  852. 418.43 s > Checking derive_builder v0.11.2
  853. 418.43 s > Checking owo-colors v4.3.0
  854. 418.43 s > Checking object v0.37.3
  855. 418.43 s > Checking indicatif v0.18.4
  856. 418.43 s > Checking crossterm v0.29.0
  857. 418.43 s > Checking tracing-error v0.2.1
  858. 418.43 s > Checking typed-index-collections v3.5.0
  859. 418.43 s > Checking serde-big-array v0.5.1
  860. 418.43 s > Checking amd v0.2.2
  861. 418.43 s > Checking itertools v0.11.0
  862. 418.43 s > Compiling gammaloop-tracing-filter-macros v0.1.0 (/build/source/crates/gammaloop-tracing-filter-macros)
  863. 418.43 s > Checking option-ext v0.2.0
  864. 418.43 s > Checking rustc-demangle v0.1.27
  865. 418.43 s > Checking dirs-sys v0.5.0
  866. 418.43 s > Checking ref-cast v1.0.25
  867. 418.43 s > Checking nix v0.31.2
  868. 418.43 s > Checking integer-sqrt v0.1.5
  869. 418.43 s > Checking rkyv v0.7.46
  870. 418.43 s > Checking brotli-decompressor v4.0.3
  871. 418.43 s > Checking crossbeam-channel v0.5.15
  872. 418.43 s > Checking ratatui-widgets v0.3.0
  873. 418.43 s > Checking itertools v0.12.1
  874. 418.43 s > Checking unsafe-libyaml v0.2.11
  875. 418.43 s > Checking color-spantrace v0.3.0
  876. 418.43 s > Checking ratatui-crossterm v0.1.0
  877. 418.43 s > Compiling gammalooprs v0.3.4 (/build/source/crates/gammalooprs)
  878. 418.43 s > Checking symlink v0.1.0
  879. 418.43 s > Checking include_dir v0.7.4
  880. 418.43 s > Checking tracing-appender v0.2.5
  881. 418.43 s > Checking pathfinding v4.15.0
  882. 418.43 s > Checking ctrlc v3.5.2
  883. 418.43 s > Checking dirs v6.0.0
  884. 418.43 s > Checking tracing-indicatif v0.3.14
  885. 418.43 s > Checking schemars v1.2.1
  886. 418.43 s > Checking slotmap v1.1.1
  887. 418.43 s > Checking clarabel v0.11.1
  888. 418.43 s > Checking serde_yaml v0.9.34+deprecated
  889. 418.43 s > Checking brotli v7.0.0
  890. 418.43 s > Checking json5 v0.4.1
  891. 418.43 s > Checking ratatui-macros v0.7.0
  892. 418.43 s > Checking ratatui v0.30.0
  893. 418.43 s > Checking vectorize v0.2.0
  894. 418.43 s > Checking base62 v2.2.4
  895. 418.43 s > Checking ringbuffer v0.16.0
  896. 418.43 s > Checking rust-embed v8.11.0
  897. 418.43 s > Checking clap_complete v4.6.3
  898. 418.43 s > Checking fd-lock v4.0.4
  899. 418.43 s > Checking addr2line v0.25.1
  900. 418.43 s > Checking strip-ansi-escapes v0.2.1
  901. 418.43 s > Compiling gammaloop-api v0.1.0 (/build/source/crates/gammaloop-api)
  902. 418.43 s > Checking itertools v0.13.0
  903. 418.43 s > Checking strum v0.26.3
  904. 418.43 s > Checking sysinfo v0.33.1
  905. 418.43 s > Checking shlex v1.3.0
  906. 418.43 s > Checking futures-task v0.3.32
  907. 418.43 s > Checking futures-core v0.3.32
  908. 418.43 s > Checking clap_complete_nushell v4.6.0
  909. 418.43 s > Checking slab v0.4.12
  910. 418.43 s > Checking sdd v3.0.10
  911. 418.43 s > Compiling gammaloop-integration-tests v0.1.0 (/build/source/tests)
  912. 418.43 s > Compiling test-log-core v0.2.20
  913. 418.43 s > Compiling rustc_version v0.4.1
  914. 418.43 s > Checking futures-util v0.3.32
  915. 418.43 s > Checking which v8.0.2
  916. 418.43 s > Checking scc v2.4.0
  917. 418.43 s > Checking bincode v1.3.3
  918. 418.43 s > Compiling numerica v2.2.0 (https://github.com/alphal00p/symbolica?rev=a277a8dadbaae5a8d6605f2f381991a601e1f345#a277a8da)
  919. 418.43 s > Compiling gungraun-runner v0.18.2
  920. 418.43 s > Checking backtrace v0.3.76
  921. 418.43 s > Checking nalgebra v0.29.0
  922. 418.43 s > Compiling gungraun-macros v0.8.0
  923. 418.43 s > Checking reedline v0.42.0
  924. 418.43 s > Checking color-eyre v0.6.5
  925. 418.43 s > Checking proc-macro2 v1.0.106
  926. 418.43 s > Checking maplit v1.0.2
  927. 418.43 s > Checking base64 v0.21.7
  928. 418.43 s > Checking quote v1.0.45
  929. 418.43 s > Checking futures-executor v0.3.32
  930. 418.43 s > Checking ron v0.8.1
  931. 418.43 s > Compiling iai-callgrind-runner v0.14.2
  932. 418.43 s > Checking kurbo v0.13.0
  933. 418.43 s > Checking wait-timeout v0.2.1
  934. 418.43 s > Checking serial_test v3.4.0
  935. 418.43 s > Checking bit-vec v0.8.0
  936. 418.43 s > Compiling iai-callgrind v0.14.2
  937. 418.43 s > Checking quick-error v1.2.3
  938. 418.43 s > Checking rusty-fork v0.3.1
  939. 418.43 s > Checking bit-set v0.8.0
  940. 418.43 s > Checking syn v2.0.117
  941. 418.43 s > Compiling test-log-macros v0.2.20
  942. 418.43 s > Compiling iai-callgrind-macros v0.5.1
  943. 418.43 s > Checking rand_xorshift v0.4.0
  944. 418.43 s > Checking console v0.15.11
  945. 418.43 s > Checking unarray v0.1.4
  946. 418.43 s > Checking pathdiff v0.2.3
  947. 418.43 s > Checking proptest v1.11.0
  948. 418.43 s > Checking kurvst v0.1.0 (/build/source/crates/kurvst)
  949. 418.43 s > Checking similar-asserts v1.7.0
  950. 418.43 s > Checking clinnet v0.1.8 (/build/source/crates/clinnet)
  951. 418.43 s > Checking test-log v0.2.20
  952. 418.43 s > Compiling graphica v2.1.0 (https://github.com/alphal00p/symbolica?rev=a277a8dadbaae5a8d6605f2f381991a601e1f345#a277a8da)
  953. 418.43 s > Checking statrs v0.16.1
  954. 418.43 s > Checking momtrop v0.3.0
  955. 418.43 s > Checking gungraun v0.18.2
  956. 418.43 s > Compiling pyo3-stub-gen-derive v0.17.2
  957. 418.43 s > Compiling pyo3-macros v0.28.3
  958. 418.43 s > Checking pyo3-stub-gen v0.17.2
  959. 418.43 s > Checking symbolica-utils v0.1.0 (/build/source/crates/symbolica-utils)
  960. 418.43 s > Checking spenso-macros v0.3.2 (/build/source/crates/spenso-macros)
  961. 418.43 s > Compiling gammaloop-workspace-hack v0.1.0 (/build/source/crates/gammaloop-workspace-hack)
  962. 418.43 s > Checking linnet v0.17.0 (/build/source/crates/linnet)
  963. 418.43 s > Checking spenso v0.6.0 (/build/source/crates/spenso)
  964. 418.43 s > Checking linnet-py v0.1.0 (/build/source/crates/linnet-py)
  965. 418.43 s > Checking linnest v0.1.0 (/build/source/crates/linnest)
  966. 418.43 s > Checking idenso v0.3.0 (/build/source/crates/idenso)
  967. 418.43 s > Checking gammaloop-tracing-filter v0.1.0 (/build/source/crates/gammaloop-tracing-filter)
  968. 418.43 s > Checking spenso-hep-lib v0.1.7 (/build/source/crates/spenso-hep-lib)
  969. 418.43 s > Checking spynso3 v0.1.2 (/build/source/crates/spynso3)
  970. 418.43 s > warning: method `reinterpret_loop_momenta_and_compute_prefactor` is never used
  971. 418.43 s > --> crates/gammalooprs/src/integrands/process/mod.rs:2681:19
  972. 418.43 s > |
  973. 418.43 s > 2144 | impl LmbMultiChannelingSetup {
  974. 418.43 s > | ---------------------------- method in this implementation
  975. 418.43 s > ...
  976. 418.43 s > 2681 | pub(crate) fn reinterpret_loop_momenta_and_compute_prefactor<T: FloatLike>(
  977. 418.43 s > | ^^^^^^^^^^^^^^^^^^^^^^^^^^^^^^^^^^^^^^^^^^^^^^
  978. 418.43 s > |
  979. 418.43 s > = note: `#[warn(dead_code)]` (part of `#[warn(unused)]`) on by default
  980. 418.43 s >
  981. 418.43 s > warning: `gammalooprs` (lib) generated 1 warning
  982. 418.43 s > warning: unused import: `GaussianReferenceFunction`
  983. 418.43 s > --> crates/gammaloop-api/src/state.rs:38:27
  984. 418.43 s > |
  985. 418.43 s > 38 | integrands::process::{GaussianReferenceFunction, ProcessIntegrand},
  986. 418.43 s > | ^^^^^^^^^^^^^^^^^^^^^^^^^
  987. 418.43 s > |
  988. 418.43 s > = note: `#[warn(unused_imports)]` (part of `#[warn(unused)]`) on by default
  989. 418.43 s >
  990. 418.43 s > warning: `gammalooprs` (lib test) generated 1 warning (1 duplicate)
  991. 418.43 s > warning: `gammaloop-api` (lib) generated 1 warning (run `cargo fix --lib -p gammaloop-api` to apply 1 suggestion)
  992. 418.43 s > error[E0560]: struct `CutInfo` has no field named `lmb_channel_id`
  993. 418.43 s > --> tests/tests/test_differential.rs:86:13
  994. 418.43 s > |
  995. 418.43 s > 86 | lmb_channel_id: None,
  996. 418.43 s > | ^^^^^^^^^^^^^^ `CutInfo` does not have this field
  997. 418.43 s > |
  998. 418.43 s > = note: available fields are: `sampling_channel_id`, `sampling_channel_edge_ids`
  999. 418.43 s >
  1000. 418.43 s > error[E0560]: struct `CutInfo` has no field named `lmb_channel_edge_ids`
  1001. 418.43 s > --> tests/tests/test_differential.rs:87:13
  1002. 418.43 s > |
  1003. 418.43 s > 87 | lmb_channel_edge_ids: None,
  1004. 418.43 s > | ^^^^^^^^^^^^^^^^^^^^ `CutInfo` does not have this field
  1005. 418.43 s > |
  1006. 418.43 s > = note: available fields are: `sampling_channel_id`, `sampling_channel_edge_ids`
  1007. 418.43 s >
  1008. 418.43 s > For more information about this error, try `rustc --explain E0560`.
  1009. 418.43 s > error: could not compile `gammaloop-integration-tests` (test "test_differential") due to 2 previous errors
  1010. 418.43 s > warning: build failed, waiting for other jobs to finish...
  1011. 418.43 s > error[E0609]: no field `lmb_channel_edge_ids` on type `CutInfo`
  1012. 418.43 s > --> tests/tests/test_evaluation_api.rs:311:10
  1013. 418.43 s > |
  1014. 418.43 s > 311 | .lmb_channel_edge_ids
  1015. 418.43 s > | ^^^^^^^^^^^^^^^^^^^^ unknown field
  1016. 418.43 s > |
  1017. 418.43 s > = note: available fields are: `particle_pdgs`, `cut_id`, `graph_id`, `graph_group_id`, `orientation_id` ... and 2 others
  1018. 418.43 s >
  1019. 418.43 s > error[E0609]: no field `lmb_channel_edge_ids` on type `CutInfo`
  1020. 418.43 s > --> tests/tests/test_evaluation_api.rs:591:26
  1021. 418.43 s > |
  1022. 418.43 s > 591 | .lmb_channel_edge_ids
  1023. 418.43 s > | ^^^^^^^^^^^^^^^^^^^^ unknown field
  1024. 418.43 s > |
  1025. 418.43 s > = note: available fields are: `particle_pdgs`, `cut_id`, `graph_id`, `graph_group_id`, `orientation_id` ... and 2 others
  1026. 418.43 s >
  1027. 418.43 s > error[E0609]: no field `lmb_channel_edge_ids` on type `CutInfo`
  1028. 418.43 s > --> tests/tests/test_evaluation_api.rs:1177:18
  1029. 418.43 s > |
  1030. 418.43 s > 1177 | .lmb_channel_edge_ids
  1031. 418.43 s > | ^^^^^^^^^^^^^^^^^^^^ unknown field
  1032. 418.43 s > |
  1033. 418.43 s > = note: available fields are: `particle_pdgs`, `cut_id`, `graph_id`, `graph_group_id`, `orientation_id` ... and 2 others
  1034. 418.43 s >
  1035. 418.43 s > error[E0609]: no field `lmb_channel_edge_ids` on type `CutInfo`
  1036. 418.43 s > --> tests/tests/test_evaluation_api.rs:1222:22
  1037. 418.43 s > |
  1038. 418.43 s > 1222 | .lmb_channel_edge_ids
  1039. 418.43 s > | ^^^^^^^^^^^^^^^^^^^^ unknown field
  1040. 418.43 s > |
  1041. 418.43 s > = note: available fields are: `particle_pdgs`, `cut_id`, `graph_id`, `graph_group_id`, `orientation_id` ... and 2 others
  1042. 418.43 s >
  1043. 418.43 s > error[E0609]: no field `lmb_channel_edge_ids` on type `CutInfo`
  1044. 418.43 s > --> tests/tests/test_evaluation_api.rs:1281:14
  1045. 418.43 s > |
  1046. 418.43 s > 1281 | .lmb_channel_edge_ids
  1047. 418.43 s > | ^^^^^^^^^^^^^^^^^^^^ unknown field
  1048. 418.43 s > |
  1049. 418.43 s > = note: available fields are: `particle_pdgs`, `cut_id`, `graph_id`, `graph_group_id`, `orientation_id` ... and 2 others
  1050. 418.43 s >
  1051. 418.43 s > error[E0609]: no field `lmb_channel_edge_ids` on type `CutInfo`
  1052. 418.43 s > --> tests/tests/test_evaluation_api.rs:1428:18
  1053. 418.43 s > |
  1054. 418.43 s > 1428 | .lmb_channel_edge_ids
  1055. 418.43 s > | ^^^^^^^^^^^^^^^^^^^^ unknown field
  1056. 418.43 s > |
  1057. 418.43 s > = note: available fields are: `particle_pdgs`, `cut_id`, `graph_id`, `graph_group_id`, `orientation_id` ... and 2 others
  1058. 418.43 s >
  1059. 418.43 s > For more information about this error, try `rustc --explain E0609`.
  1060. 418.43 s > error: could not compile `gammaloop-integration-tests` (test "test_evaluation_api") due to 6 previous errors
  1061. 418.43 s > error[E0609]: no field `lmb_channel_id` on type `CutInfo`
  1062. 418.43 s > --> tests/tests/test_runs/utils.rs:568:36
  1063. 418.43 s > |
  1064. 418.43 s > 568 | event.cut_info.lmb_channel_id,
  1065. 418.43 s > | ^^^^^^^^^^^^^^ unknown field
  1066. 418.43 s > |
  1067. 418.43 s > = note: available fields are: `particle_pdgs`, `cut_id`, `graph_id`, `graph_group_id`, `orientation_id` ... and 2 others
  1068. 418.43 s >
  1069. 418.43 s > error[E0609]: no field `lmb_channel_id` on type `CutInfo`
  1070. 418.43 s > --> tests/tests/test_runs/utils.rs:580:36
  1071. 418.43 s > |
  1072. 418.43 s > 580 | event.cut_info.lmb_channel_id,
  1073. 418.43 s > | ^^^^^^^^^^^^^^ unknown field
  1074. 418.43 s > |
  1075. 418.43 s > = note: available fields are: `particle_pdgs`, `cut_id`, `graph_id`, `graph_group_id`, `orientation_id` ... and 2 others
  1076. 418.43 s >
  1077. 418.43 s > error: could not compile `gammaloop-integration-tests` (test "test_runs") due to 2 previous errors
  1078. 418.43 s For full logs, run:
  1079. 418.43 s nix log /nix/store/448zayigj0y6f3w7w36r7s3pw9rbgz07-gammaloop-workspace-check-0.1.0.drv
  1080. 418.53 s Build failed.