0.00 s
$ /nix/store/9ypz3flqsrl5xl495mm8h645gadjsxi1-coreutils-9.11/bin/timeout --kill-after=15s 7200s /nix/store/23zk8sgzamrbmj1fday15szf7f2279s8-nix-2.34.7/bin/nix --extra-experimental-features nix-command --extra-experimental-features flakes --log-format internal-json build --no-link --print-out-paths git+https://github.com/alphal00p/gammaloop?ref=advanced_sampling&rev=f991b56ff9e316a33c50dbe0152b84de28ffecfb&shallow=1#checks.x86_64-linux.gammaloop-check --print-build-logs
0.57 s
error (ignored): SQLite database '/var/cache/nix-ci-worker/eval-cache-v6/45883fdbe20f65f2d11e335016d9f9ed4c494d06669aac44ae77adaef651c6b3.sqlite ' is busy
2.82 s
3.25 s
Building /nix/store/448zayigj0y6f3w7w36r7s3pw9rbgz07-gammaloop-workspace-check-0.1.0.drv
3.32 s
[gammaloop-workspace-check] Phase: unpackPhase
3.33 s
[gammaloop-workspace-check] unpacking source archive /nix/store/d6ym1w3z3dvqglkyhyd37z00vfsb641k-source
3.47 s
[gammaloop-workspace-check] source root is source
3.50 s
[gammaloop-workspace-check] Phase: patchPhase
3.50 s
[gammaloop-workspace-check] Executing configureCargoCommonVars
3.50 s
[gammaloop-workspace-check] decompressing cargo artifacts from /nix/store/50vpxlcgfxf2d57i27v3d10zjwxxbm2r-gammaloop-workspace-deps-deps-0.1.0/target.tar.zst to target
4.72 s
[gammaloop-workspace-check] Phase: updateAutotoolsGnuConfigScriptsPhase
4.76 s
[gammaloop-workspace-check] Phase: configurePhase
4.76 s
[gammaloop-workspace-check] will append /build/source/.cargo-home/config.toml with contents of /nix/store/5drf77x6km4ky7gwlrzdx9bbd6fz09g3-vendor-cargo-deps/config.toml
4.76 s
[gammaloop-workspace-check] default configurePhase, nothing to do
4.77 s
[gammaloop-workspace-check] Phase: buildPhase
4.77 s
[gammaloop-workspace-check] +++ command cargo --version
4.77 s
[gammaloop-workspace-check] cargo 1.97.0 (c980f4866 2026-06-30)
4.80 s
[gammaloop-workspace-check] +++ command cargo check --profile ci-optim --locked --workspace --features gammaloop-tracing-filter/clap,gammaloop-tracing-filter/symbolica,idenso/bincode,idenso/reference-cases,linnet/bincode,linnet/drawing,linnet/rkyv,linnet/serde,linnet/symbolica,spenso-macros/shadowing,spenso/shadowing,symbolica/tracing_max_level_info,three-dimensional-reps/display,three-dimensional-reps/eval,three-dimensional-reps/serde --all-targets
5.28 s
[gammaloop-workspace-check] Checking cfg-if v1.0.4
5.28 s
[gammaloop-workspace-check] Checking memchr v2.8.0
5.28 s
[gammaloop-workspace-check] Checking once_cell v1.21.4
5.29 s
[gammaloop-workspace-check] Checking either v1.15.0
5.29 s
[gammaloop-workspace-check] Checking serde_core v1.0.228
5.29 s
[gammaloop-workspace-check] Checking libc v0.2.186
5.30 s
[gammaloop-workspace-check] Checking libm v0.2.16
5.31 s
[gammaloop-workspace-check] Checking itoa v1.0.18
5.31 s
[gammaloop-workspace-check] Checking log v0.4.29
5.31 s
[gammaloop-workspace-check] Checking regex-syntax v0.8.10
5.32 s
[gammaloop-workspace-check] Checking zerocopy v0.8.48
5.32 s
[gammaloop-workspace-check] Checking crossbeam-utils v0.8.21
5.33 s
[gammaloop-workspace-check] Checking equivalent v1.0.2
5.33 s
[gammaloop-workspace-check] Checking zmij v1.0.21
5.35 s
[gammaloop-workspace-check] Checking lazy_static v1.5.0
5.35 s
[gammaloop-workspace-check] Checking bytemuck v1.25.0
5.35 s
[gammaloop-workspace-check] Compiling target-lexicon v0.13.5
5.39 s
[gammaloop-workspace-check] Checking arrayvec v0.7.6
5.41 s
[gammaloop-workspace-check] Checking powerfmt v0.2.0
5.42 s
[gammaloop-workspace-check] Checking time-core v0.1.8
5.42 s
[gammaloop-workspace-check] Checking pin-project-lite v0.2.17
5.45 s
[gammaloop-workspace-check] Checking itertools v0.14.0
5.47 s
[gammaloop-workspace-check] Checking num_threads v0.1.7
5.52 s
[gammaloop-workspace-check] Checking num-conv v0.2.1
5.53 s
[gammaloop-workspace-check] Checking deranged v0.5.8
5.54 s
[gammaloop-workspace-check] Checking tracing-core v0.1.36
5.54 s
[gammaloop-workspace-check] Checking allocator-api2 v0.2.21
5.56 s
[gammaloop-workspace-check] Checking safe_arch v0.7.4
5.58 s
[gammaloop-workspace-check] Checking foldhash v0.2.0
5.61 s
[gammaloop-workspace-check] Checking const-random v0.1.18
5.64 s
[gammaloop-workspace-check] Checking static_assertions v1.1.0
5.66 s
[gammaloop-workspace-check] Checking nu-ansi-term v0.50.3
5.67 s
[gammaloop-workspace-check] Checking aho-corasick v1.1.4
5.70 s
[gammaloop-workspace-check] Checking unty v0.0.4
5.70 s
[gammaloop-workspace-check] Checking winnow v1.0.2
5.78 s
[gammaloop-workspace-check] Checking safe_arch v1.0.0
5.79 s
[gammaloop-workspace-check] Checking crossbeam-epoch v0.9.18
5.80 s
[gammaloop-workspace-check] Checking hashbrown v0.16.1
5.84 s
[gammaloop-workspace-check] Checking sharded-slab v0.1.7
5.87 s
[gammaloop-workspace-check] Checking wide v0.7.33
5.94 s
[gammaloop-workspace-check] Checking tracing-log v0.2.0
6.07 s
[gammaloop-workspace-check] Checking crossbeam-deque v0.8.6
6.08 s
[gammaloop-workspace-check] Checking tracing v0.1.44
6.22 s
[gammaloop-workspace-check] Checking rayon-core v1.13.0
6.24 s
[gammaloop-workspace-check] Checking thread_local v1.1.9
6.29 s
[gammaloop-workspace-check] Checking toml_writer v1.1.1+spec-1.1.0
6.32 s
[gammaloop-workspace-check] Checking az v1.3.0
6.33 s
[gammaloop-workspace-check] Checking num-traits v0.2.19
6.36 s
[gammaloop-workspace-check] Checking indenter v0.3.4
6.43 s
[gammaloop-workspace-check] Checking wide v1.3.0
6.49 s
[gammaloop-workspace-check] Compiling phf_shared v0.11.3
6.51 s
[gammaloop-workspace-check] Checking getrandom v0.3.4
6.53 s
[gammaloop-workspace-check] Checking gmp-mpfr-sys v1.7.1
6.53 s
[gammaloop-workspace-check] Checking anyhow v1.0.102
6.57 s
[gammaloop-workspace-check] Checking rayon v1.12.0
6.62 s
[gammaloop-workspace-check] Checking alloc-no-stdlib v2.0.4
6.64 s
[gammaloop-workspace-check] Checking rand_core v0.9.5
6.66 s
[gammaloop-workspace-check] Checking utf8parse v0.2.2
6.70 s
[gammaloop-workspace-check] Checking time v0.3.47
6.73 s
[gammaloop-workspace-check] Checking dyn-clone v1.0.20
6.74 s
[gammaloop-workspace-check] Checking rawpointer v0.2.1
6.75 s
[gammaloop-workspace-check] Checking anstyle-parse v1.0.0
6.75 s
[gammaloop-workspace-check] Checking alloc-stdlib v0.2.2
6.79 s
[gammaloop-workspace-check] Checking is_terminal_polyfill v1.70.2
6.82 s
[gammaloop-workspace-check] Checking matrixmultiply v0.3.10
6.84 s
[gammaloop-workspace-check] Checking anstyle-query v1.1.5
6.85 s
[gammaloop-workspace-check] Checking toml_parser v1.1.2+spec-1.1.0
6.86 s
[gammaloop-workspace-check] Checking colored v3.1.1
6.87 s
[gammaloop-workspace-check] Checking colorchoice v1.0.5
6.88 s
[gammaloop-workspace-check] Checking approx v0.5.1
6.89 s
[gammaloop-workspace-check] Checking num-integer v0.1.46
6.90 s
[gammaloop-workspace-check] Checking anstyle v1.0.14
6.92 s
[gammaloop-workspace-check] Compiling phf_generator v0.11.3
6.97 s
[gammaloop-workspace-check] Checking eyre v0.6.12
7.03 s
[gammaloop-workspace-check] Checking bitflags v1.3.2
7.06 s
[gammaloop-workspace-check] Checking regex-automata v0.4.14
7.07 s
[gammaloop-workspace-check] Checking anstream v1.0.0
7.08 s
[gammaloop-workspace-check] Checking unicode-width v0.2.2
7.09 s
[gammaloop-workspace-check] Compiling phf_codegen v0.11.3
7.15 s
[gammaloop-workspace-check] Checking region v3.0.2
7.17 s
[gammaloop-workspace-check] Checking brotli-decompressor v5.0.0
7.17 s
[gammaloop-workspace-check] Checking wasmtime-jit-icache-coherence v34.0.2
7.20 s
[gammaloop-workspace-check] Compiling pyo3-build-config v0.28.3
7.21 s
[gammaloop-workspace-check] Checking hugepage-rs v0.1.1
7.25 s
[gammaloop-workspace-check] Checking inventory v0.3.24
7.29 s
[gammaloop-workspace-check] Checking spec_math v0.1.6
7.32 s
[gammaloop-workspace-check] Checking thiserror v2.0.18
7.34 s
[gammaloop-workspace-check] Compiling getopts v0.2.24
7.35 s
[gammaloop-workspace-check] Checking libloading v0.9.0
7.37 s
[gammaloop-workspace-check] Checking bytes v1.11.1
7.38 s
[gammaloop-workspace-check] Checking self_cell v1.2.2
7.38 s
[gammaloop-workspace-check] Checking append-only-vec v0.1.8
7.44 s
[gammaloop-workspace-check] Checking byteorder v1.5.0
7.45 s
[gammaloop-workspace-check] Checking tinyjson v2.5.1
7.49 s
[gammaloop-workspace-check] Checking linux-raw-sys v0.12.1
7.53 s
[gammaloop-workspace-check] Compiling unic-common v0.9.0
7.61 s
[gammaloop-workspace-check] Compiling unicode_names2_generator v1.3.0
7.62 s
[gammaloop-workspace-check] Compiling unic-char-range v0.9.0
7.66 s
[gammaloop-workspace-check] Compiling unic-ucd-version v0.9.0
7.74 s
[gammaloop-workspace-check] Compiling unic-char-property v0.9.0
7.75 s
[gammaloop-workspace-check] Compiling is-macro v0.3.7
7.81 s
[gammaloop-workspace-check] Compiling rustpython-parser-vendored v0.4.0
7.84 s
[gammaloop-workspace-check] Checking iana-time-zone v0.1.65
7.85 s
[gammaloop-workspace-check] Compiling rustpython-parser v0.4.0
7.88 s
[gammaloop-workspace-check] Checking brotli v8.0.2
7.91 s
[gammaloop-workspace-check] Compiling phf v0.11.3
7.97 s
[gammaloop-workspace-check] Checking rustc-hash v2.1.2
8.03 s
[gammaloop-workspace-check] Compiling unic-ucd-ident v0.9.0
8.07 s
[gammaloop-workspace-check] Compiling unic-emoji-char v0.9.0
8.08 s
[gammaloop-workspace-check] Compiling lalrpop-util v0.20.2
8.15 s
[gammaloop-workspace-check] Checking serde v1.0.228
8.18 s
[gammaloop-workspace-check] Checking serde_json v1.0.149
8.20 s
[gammaloop-workspace-check] Checking bitflags v2.11.1
8.22 s
[gammaloop-workspace-check] Checking serde_spanned v1.1.1
8.26 s
[gammaloop-workspace-check] Checking toml_datetime v1.1.1+spec-1.1.0
8.29 s
[gammaloop-workspace-check] Compiling rustc-hash v1.1.0
8.31 s
[gammaloop-workspace-check] Checking unicode-segmentation v1.13.2
8.34 s
[gammaloop-workspace-check] Checking rustix v1.1.4
8.38 s
[gammaloop-workspace-check] Compiling symbolica v2.2.0 (https://github.com/alphal00p/symbolica?rev=a277a8dadbaae5a8d6605f2f381991a601e1f345#a277a8da)
8.40 s
[gammaloop-workspace-check] Compiling rug v1.30.0
8.41 s
[gammaloop-workspace-check] Checking typenum v1.20.0
8.42 s
[gammaloop-workspace-check] Checking toml v1.1.2+spec-1.1.0
8.67 s
[gammaloop-workspace-check] Checking getrandom v0.2.17
8.69 s
[gammaloop-workspace-check] Checking smallvec v1.15.1
8.74 s
[gammaloop-workspace-check] Checking num-complex v0.4.6
8.80 s
[gammaloop-workspace-check] Checking bincode v2.0.1
8.81 s
[gammaloop-workspace-check] Checking ppv-lite86 v0.2.21
8.84 s
[gammaloop-workspace-check] Checking ahash v0.8.12
8.94 s
[gammaloop-workspace-check] Checking tracing-serde v0.2.0
9.01 s
[gammaloop-workspace-check] Checking smartstring v1.0.1
9.11 s
[gammaloop-workspace-check] Checking chrono v0.4.44
9.12 s
[gammaloop-workspace-check] Checking simba v0.9.1
9.13 s
[gammaloop-workspace-check] Checking rand_chacha v0.9.0
9.15 s
[gammaloop-workspace-check] Checking ndarray v0.17.2
9.21 s
[gammaloop-workspace-check] Checking scopeguard v1.2.0
9.22 s
[gammaloop-workspace-check] Checking parking_lot_core v0.9.12
9.27 s
[gammaloop-workspace-check] Checking lock_api v0.4.14
9.32 s
[gammaloop-workspace-check] Checking rand v0.9.4
9.36 s
[gammaloop-workspace-check] Checking hashbrown v0.17.0
9.40 s
[gammaloop-workspace-check] Checking unicode-ident v1.0.24
9.44 s
[gammaloop-workspace-check] Checking generic-array v0.14.7
9.47 s
[gammaloop-workspace-check] Checking parking_lot v0.12.5
9.50 s
[gammaloop-workspace-check] Checking errno v0.3.14
9.51 s
[gammaloop-workspace-check] Checking strsim v0.11.1
9.59 s
[gammaloop-workspace-check] Checking unicase v2.9.0
9.64 s
[gammaloop-workspace-check] Checking clap_lex v1.1.0
9.70 s
[gammaloop-workspace-check] Checking signal-hook-registry v1.4.8
9.76 s
[gammaloop-workspace-check] Checking symjit v2.21.0
9.78 s
[gammaloop-workspace-check] Checking vte v0.14.1
9.78 s
[gammaloop-workspace-check] Checking same-file v1.0.6
9.87 s
[gammaloop-workspace-check] Checking signal-hook v0.3.18
9.92 s
[gammaloop-workspace-check] Checking walkdir v2.5.0
9.98 s
[gammaloop-workspace-check] Checking indexmap v2.14.0
10.05 s
[gammaloop-workspace-check] Checking block-buffer v0.10.4
10.07 s
[gammaloop-workspace-check] Checking matchers v0.2.0
10.09 s
[gammaloop-workspace-check] Checking regex v1.12.3
10.12 s
[gammaloop-workspace-check] Checking crypto-common v0.1.7
10.13 s
[gammaloop-workspace-check] Checking half v2.7.1
10.17 s
[gammaloop-workspace-check] Checking mio v1.2.0
10.20 s
[gammaloop-workspace-check] Checking tracing-subscriber v0.3.23
10.26 s
[gammaloop-workspace-check] Checking terminal_size v0.4.4
10.29 s
[gammaloop-workspace-check] Checking ciborium-io v0.2.2
10.36 s
[gammaloop-workspace-check] Checking minimal-lexical v0.2.1
10.40 s
[gammaloop-workspace-check] Checking ciborium-ll v0.2.2
10.42 s
[gammaloop-workspace-check] Checking clap_builder v4.6.0
10.48 s
[gammaloop-workspace-check] Checking signal-hook-mio v0.2.5
10.51 s
[gammaloop-workspace-check] Checking digest v0.10.7
10.53 s
[gammaloop-workspace-check] Checking nom v7.1.3
10.57 s
[gammaloop-workspace-check] Checking num-bigint v0.4.6
10.57 s
[gammaloop-workspace-check] Checking derive_more v2.1.1
10.58 s
[gammaloop-workspace-check] Checking console v0.16.3
10.64 s
[gammaloop-workspace-check] Checking bstr v1.12.1
10.67 s
[gammaloop-workspace-check] Checking linux-raw-sys v0.4.15
10.70 s
[gammaloop-workspace-check] Checking winnow v0.7.15
10.95 s
[gammaloop-workspace-check] Checking cpufeatures v0.2.17
10.95 s
[gammaloop-workspace-check] Checking globset v0.4.18
10.98 s
[gammaloop-workspace-check] Checking sha2 v0.10.9
10.99 s
[gammaloop-workspace-check] Checking rustix v0.38.44
11.22 s
[gammaloop-workspace-check] Checking ciborium v0.2.2
11.37 s
[gammaloop-workspace-check] Checking getrandom v0.4.2
11.54 s
[gammaloop-workspace-check] Checking rand_core v0.6.4
11.57 s
[gammaloop-workspace-check] Compiling unicode_names2 v1.3.0
11.67 s
[gammaloop-workspace-check] Checking fastrand v2.4.1
11.68 s
[gammaloop-workspace-check] Checking plotters-backend v0.3.7
11.70 s
[gammaloop-workspace-check] Checking fnv v1.0.7
11.73 s
[gammaloop-workspace-check] Checking crossterm v0.28.1
11.82 s
[gammaloop-workspace-check] Checking rust-embed-utils v8.11.0
11.86 s
[gammaloop-workspace-check] Checking tempfile v3.27.0
11.92 s
[gammaloop-workspace-check] Checking plotters-svg v0.3.7
11.95 s
[gammaloop-workspace-check] Checking ansitok v0.3.0
11.96 s
[gammaloop-workspace-check] Checking serde_spanned v0.6.9
11.98 s
[gammaloop-workspace-check] Checking toml_datetime v0.6.11
12.08 s
[gammaloop-workspace-check] Checking itertools v0.10.5
12.12 s
[gammaloop-workspace-check] Checking tap v1.0.1
12.15 s
[gammaloop-workspace-check] Checking clap v4.6.1
12.17 s
[gammaloop-workspace-check] Checking toml_write v0.1.2
12.18 s
[gammaloop-workspace-check] Checking cast v0.3.0
12.22 s
[gammaloop-workspace-check] Checking wyz v0.5.1
12.25 s
[gammaloop-workspace-check] Checking plotters v0.3.7
12.30 s
[gammaloop-workspace-check] Checking rand_chacha v0.3.1
12.33 s
[gammaloop-workspace-check] Checking radium v0.7.0
12.34 s
[gammaloop-workspace-check] Checking typeid v1.0.3
12.38 s
[gammaloop-workspace-check] Checking toml_edit v0.22.27
12.41 s
[gammaloop-workspace-check] Checking tinytemplate v1.2.1
12.44 s
[gammaloop-workspace-check] Checking ansi-str v0.9.0
12.47 s
[gammaloop-workspace-check] Checking similar v2.7.0
12.54 s
[gammaloop-workspace-check] Checking is-terminal v0.4.17
12.57 s
[gammaloop-workspace-check] Checking bytecount v0.6.9
12.60 s
[gammaloop-workspace-check] Checking funty v2.0.0
12.63 s
[gammaloop-workspace-check] Checking oorandom v11.1.5
12.66 s
[gammaloop-workspace-check] Checking anes v0.1.6
12.75 s
[gammaloop-workspace-check] Checking papergrid v0.17.0
12.79 s
[gammaloop-workspace-check] Checking rand v0.8.6
12.81 s
[gammaloop-workspace-check] Checking testing_table v0.3.0
12.83 s
[gammaloop-workspace-check] Checking ron v0.12.1
12.85 s
[gammaloop-workspace-check] Checking toml_edit v0.25.11+spec-1.1.0
12.93 s
[gammaloop-workspace-check] Checking env_filter v1.0.1
13.03 s
[gammaloop-workspace-check] Checking bitvec v1.0.1
13.09 s
[gammaloop-workspace-check] Checking uncased v0.9.10
13.17 s
[gammaloop-workspace-check] Checking jiff v0.2.24
13.21 s
[gammaloop-workspace-check] Checking ptr_meta v0.1.4
13.31 s
[gammaloop-workspace-check] Checking ucd-trie v0.1.7
13.35 s
[gammaloop-workspace-check] Checking simdutf8 v0.1.5
13.37 s
[gammaloop-workspace-check] Checking criterion-plot v0.5.0
13.42 s
[gammaloop-workspace-check] Checking ahash v0.7.8
13.46 s
[gammaloop-workspace-check] Checking pest v2.8.6
13.51 s
[gammaloop-workspace-check] Checking xprec v0.2.2
13.54 s
[gammaloop-workspace-check] Checking hashbrown v0.12.3
13.55 s
[gammaloop-workspace-check] Checking bytecheck v0.6.12
13.64 s
[gammaloop-workspace-check] Checking criterion v0.5.1
13.70 s
[gammaloop-workspace-check] Checking approx v0.4.0
13.79 s
[gammaloop-workspace-check] Checking seahash v4.1.0
13.82 s
[gammaloop-workspace-check] Checking cgmath v0.18.0
13.89 s
[gammaloop-workspace-check] Checking rend v0.4.2
13.91 s
[gammaloop-workspace-check] Checking tabled v0.20.0
13.92 s
[gammaloop-workspace-check] Checking num-rational v0.4.2
14.01 s
[gammaloop-workspace-check] Checking insta v1.47.2
14.06 s
[gammaloop-workspace-check] Checking num-iter v0.1.45
14.19 s
[gammaloop-workspace-check] Checking ref-ops v0.2.5
14.20 s
[gammaloop-workspace-check] Checking num v0.4.3
14.22 s
[gammaloop-workspace-check] Checking rand_xoshiro v0.6.0
14.26 s
[gammaloop-workspace-check] Checking features v0.10.0
14.28 s
[gammaloop-workspace-check] Checking constcat v0.5.1
14.29 s
[gammaloop-workspace-check] Checking toml v0.8.23
14.31 s
[gammaloop-workspace-check] Checking gat-lending-iterator v0.1.8
14.33 s
[gammaloop-workspace-check] Checking colored v2.2.0
14.44 s
[gammaloop-workspace-check] Checking arrayref v0.3.9
14.52 s
[gammaloop-workspace-check] Checking cpufeatures v0.3.0
14.56 s
[gammaloop-workspace-check] Compiling pyo3-macros-backend v0.28.3
14.59 s
[gammaloop-workspace-check] Compiling pyo3-ffi v0.28.3
14.60 s
[gammaloop-workspace-check] Compiling pyo3 v0.28.3
14.61 s
[gammaloop-workspace-check] Compiling numpy v0.28.0
14.64 s
[gammaloop-workspace-check] Checking dot-parser v0.5.1
14.71 s
[gammaloop-workspace-check] Checking figment v0.10.19
15.02 s
[gammaloop-workspace-check] Checking constant_time_eq v0.4.2
15.10 s
[gammaloop-workspace-check] Checking base64 v0.22.1
15.10 s
[gammaloop-workspace-check] Checking siphasher v1.0.2
15.13 s
[gammaloop-workspace-check] Checking blake3 v1.8.5
15.33 s
[gammaloop-workspace-check] Checking joinery v2.1.0
15.47 s
[gammaloop-workspace-check] Checking phf_shared v0.13.1
15.48 s
[gammaloop-workspace-check] Checking subprocess v0.2.15
15.52 s
[gammaloop-workspace-check] Checking rust_lisp v0.18.0
15.54 s
[gammaloop-workspace-check] Checking titlecase v2.2.1
15.65 s
[gammaloop-workspace-check] Compiling vakint v0.1.2 (/build/source/crates/vakint)
15.75 s
[gammaloop-workspace-check] Checking version-compare v0.2.1
15.76 s
[gammaloop-workspace-check] Checking xpct v0.5.1
15.80 s
[gammaloop-workspace-check] Checking ryu v1.0.23
15.84 s
[gammaloop-workspace-check] Checking castaway v0.2.4
15.86 s
[gammaloop-workspace-check] Checking toml_datetime v0.7.5+spec-1.1.0
15.87 s
[gammaloop-workspace-check] Checking phf v0.13.1
15.96 s
[gammaloop-workspace-check] Checking strum v0.27.2
15.99 s
[gammaloop-workspace-check] Checking unicode-truncate v2.0.1
16.00 s
[gammaloop-workspace-check] Checking compact_str v0.9.0
16.07 s
[gammaloop-workspace-check] Checking kasuari v0.4.12
16.13 s
[gammaloop-workspace-check] Checking lru v0.16.4
16.15 s
[gammaloop-workspace-check] Checking vte v0.15.0
16.19 s
[gammaloop-workspace-check] Checking portable-atomic v1.13.1
16.20 s
[gammaloop-workspace-check] Checking toml v0.9.12+spec-1.1.0
16.23 s
[gammaloop-workspace-check] Checking string-template-plus v0.4.3
16.26 s
[gammaloop-workspace-check] Checking unit-prefix v0.5.2
16.31 s
[gammaloop-workspace-check] Checking rand_distr v0.4.3
16.38 s
[gammaloop-workspace-check] Checking simba v0.6.0
16.40 s
[gammaloop-workspace-check] Checking vt100 v0.16.2
16.42 s
[gammaloop-workspace-check] Checking line-clipping v0.3.7
16.48 s
[gammaloop-workspace-check] Compiling three-dimensional-reps v0.1.0 (/build/source/crates/three-dimensional-reps)
16.53 s
[gammaloop-workspace-check] Compiling rustpython-parser-core v0.4.0
16.60 s
[gammaloop-workspace-check] Checking ratatui-core v0.1.0
16.61 s
[gammaloop-workspace-check] Checking gimli v0.32.3
16.67 s
[gammaloop-workspace-check] Checking adler2 v2.0.1
16.79 s
[gammaloop-workspace-check] Compiling rustpython-ast v0.4.0
16.81 s
[gammaloop-workspace-check] Checking miniz_oxide v0.8.9
16.85 s
[gammaloop-workspace-check] Checking env_logger v0.11.10
16.86 s
[gammaloop-workspace-check] Checking thiserror v1.0.69
16.90 s
[gammaloop-workspace-check] Checking derive_builder v0.11.2
16.94 s
[gammaloop-workspace-check] Checking owo-colors v4.3.0
16.96 s
[gammaloop-workspace-check] Checking object v0.37.3
16.96 s
[gammaloop-workspace-check] Checking indicatif v0.18.4
17.00 s
[gammaloop-workspace-check] Checking crossterm v0.29.0
17.03 s
[gammaloop-workspace-check] Checking tracing-error v0.2.1
17.10 s
[gammaloop-workspace-check] Checking typed-index-collections v3.5.0
17.13 s
[gammaloop-workspace-check] Checking serde-big-array v0.5.1
17.23 s
[gammaloop-workspace-check] Checking amd v0.2.2
17.28 s
[gammaloop-workspace-check] Checking itertools v0.11.0
17.29 s
[gammaloop-workspace-check] Compiling gammaloop-tracing-filter-macros v0.1.0 (/build/source/crates/gammaloop-tracing-filter-macros)
17.44 s
[gammaloop-workspace-check] Checking option-ext v0.2.0
17.51 s
[gammaloop-workspace-check] Checking rustc-demangle v0.1.27
17.58 s
[gammaloop-workspace-check] Checking dirs-sys v0.5.0
17.60 s
[gammaloop-workspace-check] Checking ref-cast v1.0.25
17.69 s
[gammaloop-workspace-check] Checking nix v0.31.2
17.77 s
[gammaloop-workspace-check] Checking integer-sqrt v0.1.5
17.79 s
[gammaloop-workspace-check] Checking rkyv v0.7.46
17.81 s
[gammaloop-workspace-check] Checking brotli-decompressor v4.0.3
17.81 s
[gammaloop-workspace-check] Checking crossbeam-channel v0.5.15
17.85 s
[gammaloop-workspace-check] Checking ratatui-widgets v0.3.0
17.85 s
[gammaloop-workspace-check] Checking itertools v0.12.1
17.87 s
[gammaloop-workspace-check] Checking unsafe-libyaml v0.2.11
17.97 s
[gammaloop-workspace-check] Checking color-spantrace v0.3.0
18.15 s
[gammaloop-workspace-check] Checking ratatui-crossterm v0.1.0
18.24 s
[gammaloop-workspace-check] Compiling gammalooprs v0.3.4 (/build/source/crates/gammalooprs)
18.37 s
[gammaloop-workspace-check] Checking symlink v0.1.0
18.41 s
[gammaloop-workspace-check] Checking include_dir v0.7.4
18.46 s
[gammaloop-workspace-check] Checking tracing-appender v0.2.5
18.58 s
[gammaloop-workspace-check] Checking pathfinding v4.15.0
18.62 s
[gammaloop-workspace-check] Checking ctrlc v3.5.2
18.68 s
[gammaloop-workspace-check] Checking dirs v6.0.0
18.79 s
[gammaloop-workspace-check] Checking tracing-indicatif v0.3.14
18.82 s
[gammaloop-workspace-check] Checking schemars v1.2.1
18.87 s
[gammaloop-workspace-check] Checking slotmap v1.1.1
18.90 s
[gammaloop-workspace-check] Checking clarabel v0.11.1
18.94 s
[gammaloop-workspace-check] Checking serde_yaml v0.9.34+deprecated
19.10 s
[gammaloop-workspace-check] Checking brotli v7.0.0
19.37 s
[gammaloop-workspace-check] Checking json5 v0.4.1
19.43 s
[gammaloop-workspace-check] Checking ratatui-macros v0.7.0
19.56 s
[gammaloop-workspace-check] Checking ratatui v0.30.0
19.61 s
[gammaloop-workspace-check] Checking vectorize v0.2.0
19.63 s
[gammaloop-workspace-check] Checking base62 v2.2.4
19.69 s
[gammaloop-workspace-check] Checking ringbuffer v0.16.0
19.72 s
[gammaloop-workspace-check] Checking rust-embed v8.11.0
19.81 s
[gammaloop-workspace-check] Checking clap_complete v4.6.3
19.87 s
[gammaloop-workspace-check] Checking fd-lock v4.0.4
19.92 s
[gammaloop-workspace-check] Checking addr2line v0.25.1
19.96 s
[gammaloop-workspace-check] Checking strip-ansi-escapes v0.2.1
19.98 s
[gammaloop-workspace-check] Compiling gammaloop-api v0.1.0 (/build/source/crates/gammaloop-api)
20.01 s
[gammaloop-workspace-check] Checking itertools v0.13.0
20.02 s
[gammaloop-workspace-check] Checking strum v0.26.3
20.07 s
[gammaloop-workspace-check] Checking sysinfo v0.33.1
20.15 s
[gammaloop-workspace-check] Checking shlex v1.3.0
20.31 s
[gammaloop-workspace-check] Checking futures-task v0.3.32
20.37 s
[gammaloop-workspace-check] Checking futures-core v0.3.32
20.42 s
[gammaloop-workspace-check] Checking clap_complete_nushell v4.6.0
20.48 s
[gammaloop-workspace-check] Checking slab v0.4.12
20.51 s
[gammaloop-workspace-check] Checking sdd v3.0.10
20.51 s
[gammaloop-workspace-check] Compiling gammaloop-integration-tests v0.1.0 (/build/source/tests)
20.59 s
[gammaloop-workspace-check] Compiling test-log-core v0.2.20
20.62 s
[gammaloop-workspace-check] Compiling rustc_version v0.4.1
20.71 s
[gammaloop-workspace-check] Checking futures-util v0.3.32
20.75 s
[gammaloop-workspace-check] Checking which v8.0.2
20.89 s
[gammaloop-workspace-check] Checking scc v2.4.0
21.12 s
[gammaloop-workspace-check] Checking bincode v1.3.3
21.26 s
[gammaloop-workspace-check] Compiling numerica v2.2.0 (https://github.com/alphal00p/symbolica?rev=a277a8dadbaae5a8d6605f2f381991a601e1f345#a277a8da)
21.36 s
[gammaloop-workspace-check] Compiling gungraun-runner v0.18.2
21.52 s
[gammaloop-workspace-check] Checking backtrace v0.3.76
21.76 s
[gammaloop-workspace-check] Checking nalgebra v0.29.0
22.14 s
[gammaloop-workspace-check] Compiling gungraun-macros v0.8.0
22.16 s
[gammaloop-workspace-check] Checking reedline v0.42.0
22.18 s
[gammaloop-workspace-check] Checking color-eyre v0.6.5
22.67 s
[gammaloop-workspace-check] Checking proc-macro2 v1.0.106
22.84 s
[gammaloop-workspace-check] Checking maplit v1.0.2
22.94 s
[gammaloop-workspace-check] Checking base64 v0.21.7
23.23 s
[gammaloop-workspace-check] Checking quote v1.0.45
23.25 s
[gammaloop-workspace-check] Checking futures-executor v0.3.32
23.27 s
[gammaloop-workspace-check] Checking ron v0.8.1
23.29 s
[gammaloop-workspace-check] Compiling iai-callgrind-runner v0.14.2
23.49 s
[gammaloop-workspace-check] Checking kurbo v0.13.0
23.52 s
[gammaloop-workspace-check] Checking wait-timeout v0.2.1
23.55 s
[gammaloop-workspace-check] Checking serial_test v3.4.0
23.73 s
[gammaloop-workspace-check] Checking bit-vec v0.8.0
23.76 s
[gammaloop-workspace-check] Compiling iai-callgrind v0.14.2
23.79 s
[gammaloop-workspace-check] Checking quick-error v1.2.3
23.86 s
[gammaloop-workspace-check] Checking rusty-fork v0.3.1
24.00 s
[gammaloop-workspace-check] Checking bit-set v0.8.0
24.37 s
[gammaloop-workspace-check] Checking syn v2.0.117
24.39 s
[gammaloop-workspace-check] Compiling test-log-macros v0.2.20
24.46 s
[gammaloop-workspace-check] Compiling iai-callgrind-macros v0.5.1
24.51 s
[gammaloop-workspace-check] Checking rand_xorshift v0.4.0
24.61 s
[gammaloop-workspace-check] Checking console v0.15.11
24.77 s
[gammaloop-workspace-check] Checking unarray v0.1.4
24.78 s
[gammaloop-workspace-check] Checking pathdiff v0.2.3
24.91 s
[gammaloop-workspace-check] Checking proptest v1.11.0
25.07 s
[gammaloop-workspace-check] Checking kurvst v0.1.0 (/build/source/crates/kurvst)
25.09 s
[gammaloop-workspace-check] Checking similar-asserts v1.7.0
25.98 s
[gammaloop-workspace-check] Checking clinnet v0.1.8 (/build/source/crates/clinnet)
27.78 s
[gammaloop-workspace-check] Checking test-log v0.2.20
28.48 s
[gammaloop-workspace-check] Compiling graphica v2.1.0 (https://github.com/alphal00p/symbolica?rev=a277a8dadbaae5a8d6605f2f381991a601e1f345#a277a8da)
30.90 s
[gammaloop-workspace-check] Checking statrs v0.16.1
31.83 s
[gammaloop-workspace-check] Checking momtrop v0.3.0
33.11 s
[gammaloop-workspace-check] Checking gungraun v0.18.2
36.10 s
[gammaloop-workspace-check] Compiling pyo3-stub-gen-derive v0.17.2
36.29 s
[gammaloop-workspace-check] Compiling pyo3-macros v0.28.3
44.18 s
[gammaloop-workspace-check] Checking pyo3-stub-gen v0.17.2
53.51 s
[gammaloop-workspace-check] Checking symbolica-utils v0.1.0 (/build/source/crates/symbolica-utils)
53.51 s
[gammaloop-workspace-check] Checking spenso-macros v0.3.2 (/build/source/crates/spenso-macros)
341.07 s
[gammaloop-workspace-check] Compiling gammaloop-workspace-hack v0.1.0 (/build/source/crates/gammaloop-workspace-hack)
341.54 s
[gammaloop-workspace-check] Checking linnet v0.17.0 (/build/source/crates/linnet)
347.55 s
[gammaloop-workspace-check] Checking spenso v0.6.0 (/build/source/crates/spenso)
347.79 s
[gammaloop-workspace-check] Checking linnet-py v0.1.0 (/build/source/crates/linnet-py)
347.79 s
[gammaloop-workspace-check] Checking linnest v0.1.0 (/build/source/crates/linnest)
355.63 s
[gammaloop-workspace-check] Checking idenso v0.3.0 (/build/source/crates/idenso)
355.63 s
[gammaloop-workspace-check] Checking gammaloop-tracing-filter v0.1.0 (/build/source/crates/gammaloop-tracing-filter)
358.42 s
[gammaloop-workspace-check] Checking spenso-hep-lib v0.1.7 (/build/source/crates/spenso-hep-lib)
358.67 s
[gammaloop-workspace-check] Checking spynso3 v0.1.2 (/build/source/crates/spynso3)
394.55 s
[gammaloop-workspace-check] warning : method `reinterpret_loop_momenta_and_compute_prefactor` is never used
394.55 s
[gammaloop-workspace-check] --> crates/gammalooprs/src/integrands/process/mod.rs:2681:19
394.55 s
[gammaloop-workspace-check] |
394.55 s
[gammaloop-workspace-check] 2144 | impl LmbMultiChannelingSetup {
394.55 s
[gammaloop-workspace-check] | ---------------------------- method in this implementation
394.55 s
[gammaloop-workspace-check] ...
394.55 s
[gammaloop-workspace-check] 2681 | pub(crate) fn reinterpret_loop_momenta_and_compute_prefactor<T: FloatLike>(
394.55 s
[gammaloop-workspace-check] | ^^^^^^^^^^^^^^^^^^^^^^^^^^^^^^^^^^^^^^^^^^^^^^
394.55 s
[gammaloop-workspace-check] |
394.55 s
[gammaloop-workspace-check] = note : `#[warn(dead_code)]` (part of `#[warn(unused)]`) on by default
394.55 s
[gammaloop-workspace-check]
400.44 s
[gammaloop-workspace-check] warning : `gammalooprs` (lib) generated 1 warning
402.07 s
[gammaloop-workspace-check] warning : unused import: `GaussianReferenceFunction`
402.07 s
[gammaloop-workspace-check] --> crates/gammaloop-api/src/state.rs:38:27
402.07 s
[gammaloop-workspace-check] |
402.07 s
[gammaloop-workspace-check] 38 | integrands::process::{GaussianReferenceFunction, ProcessIntegrand},
402.07 s
[gammaloop-workspace-check] | ^^^^^^^^^^^^^^^^^^^^^^^^^
402.07 s
[gammaloop-workspace-check] |
402.07 s
[gammaloop-workspace-check] = note : `#[warn(unused_imports)]` (part of `#[warn(unused)]`) on by default
402.07 s
[gammaloop-workspace-check]
407.95 s
[gammaloop-workspace-check] warning : `gammalooprs` (lib test) generated 1 warning (1 duplicate)
413.27 s
[gammaloop-workspace-check] warning : `gammaloop-api` (lib) generated 1 warning (run `cargo fix --lib -p gammaloop-api` to apply 1 suggestion)
414.16 s
[gammaloop-workspace-check] error[E0560] : struct `CutInfo` has no field named `lmb_channel_id`
414.16 s
[gammaloop-workspace-check] --> tests/tests/test_differential.rs:86:13
414.16 s
[gammaloop-workspace-check] |
414.16 s
[gammaloop-workspace-check] 86 | lmb_channel_id: None,
414.16 s
[gammaloop-workspace-check] | ^^^^^^^^^^^^^^ `CutInfo` does not have this field
414.16 s
[gammaloop-workspace-check] |
414.16 s
[gammaloop-workspace-check] = note : available fields are: `sampling_channel_id`, `sampling_channel_edge_ids`
414.16 s
[gammaloop-workspace-check]
414.16 s
[gammaloop-workspace-check] error[E0560] : struct `CutInfo` has no field named `lmb_channel_edge_ids`
414.16 s
[gammaloop-workspace-check] --> tests/tests/test_differential.rs:87:13
414.16 s
[gammaloop-workspace-check] |
414.16 s
[gammaloop-workspace-check] 87 | lmb_channel_edge_ids: None,
414.16 s
[gammaloop-workspace-check] | ^^^^^^^^^^^^^^^^^^^^ `CutInfo` does not have this field
414.16 s
[gammaloop-workspace-check] |
414.16 s
[gammaloop-workspace-check] = note : available fields are: `sampling_channel_id`, `sampling_channel_edge_ids`
414.16 s
[gammaloop-workspace-check]
414.44 s
[gammaloop-workspace-check] For more information about this error, try `rustc --explain E0560`.
414.47 s
[gammaloop-workspace-check] error : could not compile `gammaloop-integration-tests` (test "test_differential") due to 2 previous errors
414.48 s
[gammaloop-workspace-check] warning : build failed, waiting for other jobs to finish...
414.64 s
[gammaloop-workspace-check] error[E0609] : no field `lmb_channel_edge_ids` on type `CutInfo`
414.64 s
[gammaloop-workspace-check] --> tests/tests/test_evaluation_api.rs:311:10
414.64 s
[gammaloop-workspace-check] |
414.64 s
[gammaloop-workspace-check] 311 | .lmb_channel_edge_ids
414.64 s
[gammaloop-workspace-check] | ^^^^^^^^^^^^^^^^^^^^ unknown field
414.64 s
[gammaloop-workspace-check] |
414.64 s
[gammaloop-workspace-check] = note : available fields are: `particle_pdgs`, `cut_id`, `graph_id`, `graph_group_id`, `orientation_id` ... and 2 others
414.64 s
[gammaloop-workspace-check]
414.67 s
[gammaloop-workspace-check] error[E0609] : no field `lmb_channel_edge_ids` on type `CutInfo`
414.67 s
[gammaloop-workspace-check] --> tests/tests/test_evaluation_api.rs:591:26
414.67 s
[gammaloop-workspace-check] |
414.67 s
[gammaloop-workspace-check] 591 | .lmb_channel_edge_ids
414.67 s
[gammaloop-workspace-check] | ^^^^^^^^^^^^^^^^^^^^ unknown field
414.67 s
[gammaloop-workspace-check] |
414.67 s
[gammaloop-workspace-check] = note : available fields are: `particle_pdgs`, `cut_id`, `graph_id`, `graph_group_id`, `orientation_id` ... and 2 others
414.67 s
[gammaloop-workspace-check]
414.73 s
[gammaloop-workspace-check] error[E0609] : no field `lmb_channel_edge_ids` on type `CutInfo`
414.73 s
[gammaloop-workspace-check] --> tests/tests/test_evaluation_api.rs:1177:18
414.73 s
[gammaloop-workspace-check] |
414.73 s
[gammaloop-workspace-check] 1177 | .lmb_channel_edge_ids
414.73 s
[gammaloop-workspace-check] | ^^^^^^^^^^^^^^^^^^^^ unknown field
414.73 s
[gammaloop-workspace-check] |
414.73 s
[gammaloop-workspace-check] = note : available fields are: `particle_pdgs`, `cut_id`, `graph_id`, `graph_group_id`, `orientation_id` ... and 2 others
414.73 s
[gammaloop-workspace-check]
415.09 s
[gammaloop-workspace-check] error[E0609] : no field `lmb_channel_edge_ids` on type `CutInfo`
415.09 s
[gammaloop-workspace-check] --> tests/tests/test_evaluation_api.rs:1222:22
415.09 s
[gammaloop-workspace-check] |
415.09 s
[gammaloop-workspace-check] 1222 | .lmb_channel_edge_ids
415.09 s
[gammaloop-workspace-check] | ^^^^^^^^^^^^^^^^^^^^ unknown field
415.09 s
[gammaloop-workspace-check] |
415.09 s
[gammaloop-workspace-check] = note : available fields are: `particle_pdgs`, `cut_id`, `graph_id`, `graph_group_id`, `orientation_id` ... and 2 others
415.09 s
[gammaloop-workspace-check]
415.10 s
[gammaloop-workspace-check] error[E0609] : no field `lmb_channel_edge_ids` on type `CutInfo`
415.10 s
[gammaloop-workspace-check] --> tests/tests/test_evaluation_api.rs:1281:14
415.10 s
[gammaloop-workspace-check] |
415.10 s
[gammaloop-workspace-check] 1281 | .lmb_channel_edge_ids
415.10 s
[gammaloop-workspace-check] | ^^^^^^^^^^^^^^^^^^^^ unknown field
415.10 s
[gammaloop-workspace-check] |
415.10 s
[gammaloop-workspace-check] = note : available fields are: `particle_pdgs`, `cut_id`, `graph_id`, `graph_group_id`, `orientation_id` ... and 2 others
415.10 s
[gammaloop-workspace-check]
415.24 s
[gammaloop-workspace-check] error[E0609] : no field `lmb_channel_edge_ids` on type `CutInfo`
415.24 s
[gammaloop-workspace-check] --> tests/tests/test_evaluation_api.rs:1428:18
415.24 s
[gammaloop-workspace-check] |
415.24 s
[gammaloop-workspace-check] 1428 | .lmb_channel_edge_ids
415.24 s
[gammaloop-workspace-check] | ^^^^^^^^^^^^^^^^^^^^ unknown field
415.24 s
[gammaloop-workspace-check] |
415.24 s
[gammaloop-workspace-check] = note : available fields are: `particle_pdgs`, `cut_id`, `graph_id`, `graph_group_id`, `orientation_id` ... and 2 others
415.24 s
[gammaloop-workspace-check]
415.41 s
[gammaloop-workspace-check] For more information about this error, try `rustc --explain E0609`.
415.43 s
[gammaloop-workspace-check] error : could not compile `gammaloop-integration-tests` (test "test_evaluation_api") due to 6 previous errors
416.58 s
[gammaloop-workspace-check] error[E0609] : no field `lmb_channel_id` on type `CutInfo`
416.58 s
[gammaloop-workspace-check] --> tests/tests/test_runs/utils.rs:568:36
416.58 s
[gammaloop-workspace-check] |
416.58 s
[gammaloop-workspace-check] 568 | event.cut_info.lmb_channel_id,
416.58 s
[gammaloop-workspace-check] | ^^^^^^^^^^^^^^ unknown field
416.58 s
[gammaloop-workspace-check] |
416.58 s
[gammaloop-workspace-check] = note : available fields are: `particle_pdgs`, `cut_id`, `graph_id`, `graph_group_id`, `orientation_id` ... and 2 others
416.58 s
[gammaloop-workspace-check]
416.59 s
[gammaloop-workspace-check] error[E0609] : no field `lmb_channel_id` on type `CutInfo`
416.59 s
[gammaloop-workspace-check] --> tests/tests/test_runs/utils.rs:580:36
416.59 s
[gammaloop-workspace-check] |
416.59 s
[gammaloop-workspace-check] 580 | event.cut_info.lmb_channel_id,
416.59 s
[gammaloop-workspace-check] | ^^^^^^^^^^^^^^ unknown field
416.59 s
[gammaloop-workspace-check] |
416.59 s
[gammaloop-workspace-check] = note : available fields are: `particle_pdgs`, `cut_id`, `graph_id`, `graph_group_id`, `orientation_id` ... and 2 others
416.59 s
[gammaloop-workspace-check]
417.59 s
[gammaloop-workspace-check] error : could not compile `gammaloop-integration-tests` (test "test_runs") due to 2 previous errors
418.40 s
Progress: 0 of 1 built (1 failed)
418.40 s
Failed to build gammaloop-workspace-check after 6m55s
418.43 s
Cannot build ' /nix/store/448zayigj0y6f3w7w36r7s3pw9rbgz07-gammaloop-workspace-check-0.1.0.drv '.
418.43 s
Reason: builder failed with exit code 101 .
418.43 s
Output paths:
418.43 s
/nix/store/div758lndcl95y63brx79cijsifncqjz-gammaloop-workspace-check-0.1.0
418.43 s
Last 533 log lines:
418.43 s
> Running phase: unpackPhase
418.43 s
> unpacking source archive /nix/store/d6ym1w3z3dvqglkyhyd37z00vfsb641k-source
418.43 s
> source root is source
418.43 s
> Running phase: patchPhase
418.43 s
> Executing configureCargoCommonVars
418.43 s
> decompressing cargo artifacts from /nix/store/50vpxlcgfxf2d57i27v3d10zjwxxbm2r-gammaloop-workspace-deps-deps-0.1.0/target.tar.zst to target
418.43 s
> Running phase: updateAutotoolsGnuConfigScriptsPhase
418.43 s
> Running phase: configurePhase
418.43 s
> will append /build/source/.cargo-home/config.toml with contents of /nix/store/5drf77x6km4ky7gwlrzdx9bbd6fz09g3-vendor-cargo-deps/config.toml
418.43 s
> default configurePhase, nothing to do
418.43 s
> Running phase: buildPhase
418.43 s
> +++ command cargo --version
418.43 s
> cargo 1.97.0 (c980f4866 2026-06-30)
418.43 s
> +++ command cargo check --profile ci-optim --locked --workspace --features gammaloop-tracing-filter/clap,gammaloop-tracing-filter/symbolica,idenso/bincode,idenso/reference-cases,linnet/bincode,linnet/drawing,linnet/rkyv,linnet/serde,linnet/symbolica,spenso-macros/shadowing,spenso/shadowing,symbolica/tracing_max_level_info,three-dimensional-reps/display,three-dimensional-reps/eval,three-dimensional-reps/serde --all-targets
418.43 s
> Checking cfg-if v1.0.4
418.43 s
> Checking memchr v2.8.0
418.43 s
> Checking once_cell v1.21.4
418.43 s
> Checking either v1.15.0
418.43 s
> Checking serde_core v1.0.228
418.43 s
> Checking libc v0.2.186
418.43 s
> Checking libm v0.2.16
418.43 s
> Checking itoa v1.0.18
418.43 s
> Checking log v0.4.29
418.43 s
> Checking regex-syntax v0.8.10
418.43 s
> Checking zerocopy v0.8.48
418.43 s
> Checking crossbeam-utils v0.8.21
418.43 s
> Checking equivalent v1.0.2
418.43 s
> Checking zmij v1.0.21
418.43 s
> Checking lazy_static v1.5.0
418.43 s
> Checking bytemuck v1.25.0
418.43 s
> Compiling target-lexicon v0.13.5
418.43 s
> Checking arrayvec v0.7.6
418.43 s
> Checking powerfmt v0.2.0
418.43 s
> Checking time-core v0.1.8
418.43 s
> Checking pin-project-lite v0.2.17
418.43 s
> Checking itertools v0.14.0
418.43 s
> Checking num_threads v0.1.7
418.43 s
> Checking num-conv v0.2.1
418.43 s
> Checking deranged v0.5.8
418.43 s
> Checking tracing-core v0.1.36
418.43 s
> Checking allocator-api2 v0.2.21
418.43 s
> Checking safe_arch v0.7.4
418.43 s
> Checking foldhash v0.2.0
418.43 s
> Checking const-random v0.1.18
418.43 s
> Checking static_assertions v1.1.0
418.43 s
> Checking nu-ansi-term v0.50.3
418.43 s
> Checking aho-corasick v1.1.4
418.43 s
> Checking unty v0.0.4
418.43 s
> Checking winnow v1.0.2
418.43 s
> Checking safe_arch v1.0.0
418.43 s
> Checking crossbeam-epoch v0.9.18
418.43 s
> Checking hashbrown v0.16.1
418.43 s
> Checking sharded-slab v0.1.7
418.43 s
> Checking wide v0.7.33
418.43 s
> Checking tracing-log v0.2.0
418.43 s
> Checking crossbeam-deque v0.8.6
418.43 s
> Checking tracing v0.1.44
418.43 s
> Checking rayon-core v1.13.0
418.43 s
> Checking thread_local v1.1.9
418.43 s
> Checking toml_writer v1.1.1+spec-1.1.0
418.43 s
> Checking az v1.3.0
418.43 s
> Checking num-traits v0.2.19
418.43 s
> Checking indenter v0.3.4
418.43 s
> Checking wide v1.3.0
418.43 s
> Compiling phf_shared v0.11.3
418.43 s
> Checking getrandom v0.3.4
418.43 s
> Checking gmp-mpfr-sys v1.7.1
418.43 s
> Checking anyhow v1.0.102
418.43 s
> Checking rayon v1.12.0
418.43 s
> Checking alloc-no-stdlib v2.0.4
418.43 s
> Checking rand_core v0.9.5
418.43 s
> Checking utf8parse v0.2.2
418.43 s
> Checking time v0.3.47
418.43 s
> Checking dyn-clone v1.0.20
418.43 s
> Checking rawpointer v0.2.1
418.43 s
> Checking anstyle-parse v1.0.0
418.43 s
> Checking alloc-stdlib v0.2.2
418.43 s
> Checking is_terminal_polyfill v1.70.2
418.43 s
> Checking matrixmultiply v0.3.10
418.43 s
> Checking anstyle-query v1.1.5
418.43 s
> Checking toml_parser v1.1.2+spec-1.1.0
418.43 s
> Checking colored v3.1.1
418.43 s
> Checking colorchoice v1.0.5
418.43 s
> Checking approx v0.5.1
418.43 s
> Checking num-integer v0.1.46
418.43 s
> Checking anstyle v1.0.14
418.43 s
> Compiling phf_generator v0.11.3
418.43 s
> Checking eyre v0.6.12
418.43 s
> Checking bitflags v1.3.2
418.43 s
> Checking regex-automata v0.4.14
418.43 s
> Checking anstream v1.0.0
418.43 s
> Checking unicode-width v0.2.2
418.43 s
> Compiling phf_codegen v0.11.3
418.43 s
> Checking region v3.0.2
418.43 s
> Checking brotli-decompressor v5.0.0
418.43 s
> Checking wasmtime-jit-icache-coherence v34.0.2
418.43 s
> Compiling pyo3-build-config v0.28.3
418.43 s
> Checking hugepage-rs v0.1.1
418.43 s
> Checking inventory v0.3.24
418.43 s
> Checking spec_math v0.1.6
418.43 s
> Checking thiserror v2.0.18
418.43 s
> Compiling getopts v0.2.24
418.43 s
> Checking libloading v0.9.0
418.43 s
> Checking bytes v1.11.1
418.43 s
> Checking self_cell v1.2.2
418.43 s
> Checking append-only-vec v0.1.8
418.43 s
> Checking byteorder v1.5.0
418.43 s
> Checking tinyjson v2.5.1
418.43 s
> Checking linux-raw-sys v0.12.1
418.43 s
> Compiling unic-common v0.9.0
418.43 s
> Compiling unicode_names2_generator v1.3.0
418.43 s
> Compiling unic-char-range v0.9.0
418.43 s
> Compiling unic-ucd-version v0.9.0
418.43 s
> Compiling unic-char-property v0.9.0
418.43 s
> Compiling is-macro v0.3.7
418.43 s
> Compiling rustpython-parser-vendored v0.4.0
418.43 s
> Checking iana-time-zone v0.1.65
418.43 s
> Compiling rustpython-parser v0.4.0
418.43 s
> Checking brotli v8.0.2
418.43 s
> Compiling phf v0.11.3
418.43 s
> Checking rustc-hash v2.1.2
418.43 s
> Compiling unic-ucd-ident v0.9.0
418.43 s
> Compiling unic-emoji-char v0.9.0
418.43 s
> Compiling lalrpop-util v0.20.2
418.43 s
> Checking serde v1.0.228
418.43 s
> Checking serde_json v1.0.149
418.43 s
> Checking bitflags v2.11.1
418.43 s
> Checking serde_spanned v1.1.1
418.43 s
> Checking toml_datetime v1.1.1+spec-1.1.0
418.43 s
> Compiling rustc-hash v1.1.0
418.43 s
> Checking unicode-segmentation v1.13.2
418.43 s
> Checking rustix v1.1.4
418.43 s
> Compiling symbolica v2.2.0 (https://github.com/alphal00p/symbolica?rev=a277a8dadbaae5a8d6605f2f381991a601e1f345#a277a8da)
418.43 s
> Compiling rug v1.30.0
418.43 s
> Checking typenum v1.20.0
418.43 s
> Checking toml v1.1.2+spec-1.1.0
418.43 s
> Checking getrandom v0.2.17
418.43 s
> Checking smallvec v1.15.1
418.43 s
> Checking num-complex v0.4.6
418.43 s
> Checking bincode v2.0.1
418.43 s
> Checking ppv-lite86 v0.2.21
418.43 s
> Checking ahash v0.8.12
418.43 s
> Checking tracing-serde v0.2.0
418.43 s
> Checking smartstring v1.0.1
418.43 s
> Checking chrono v0.4.44
418.43 s
> Checking simba v0.9.1
418.43 s
> Checking rand_chacha v0.9.0
418.43 s
> Checking ndarray v0.17.2
418.43 s
> Checking scopeguard v1.2.0
418.43 s
> Checking parking_lot_core v0.9.12
418.43 s
> Checking lock_api v0.4.14
418.43 s
> Checking rand v0.9.4
418.43 s
> Checking hashbrown v0.17.0
418.43 s
> Checking unicode-ident v1.0.24
418.43 s
> Checking generic-array v0.14.7
418.43 s
> Checking parking_lot v0.12.5
418.43 s
> Checking errno v0.3.14
418.43 s
> Checking strsim v0.11.1
418.43 s
> Checking unicase v2.9.0
418.43 s
> Checking clap_lex v1.1.0
418.43 s
> Checking signal-hook-registry v1.4.8
418.43 s
> Checking symjit v2.21.0
418.43 s
> Checking vte v0.14.1
418.43 s
> Checking same-file v1.0.6
418.43 s
> Checking signal-hook v0.3.18
418.43 s
> Checking walkdir v2.5.0
418.43 s
> Checking indexmap v2.14.0
418.43 s
> Checking block-buffer v0.10.4
418.43 s
> Checking matchers v0.2.0
418.43 s
> Checking regex v1.12.3
418.43 s
> Checking crypto-common v0.1.7
418.43 s
> Checking half v2.7.1
418.43 s
> Checking mio v1.2.0
418.43 s
> Checking tracing-subscriber v0.3.23
418.43 s
> Checking terminal_size v0.4.4
418.43 s
> Checking ciborium-io v0.2.2
418.43 s
> Checking minimal-lexical v0.2.1
418.43 s
> Checking ciborium-ll v0.2.2
418.43 s
> Checking clap_builder v4.6.0
418.43 s
> Checking signal-hook-mio v0.2.5
418.43 s
> Checking digest v0.10.7
418.43 s
> Checking nom v7.1.3
418.43 s
> Checking num-bigint v0.4.6
418.43 s
> Checking derive_more v2.1.1
418.43 s
> Checking console v0.16.3
418.43 s
> Checking bstr v1.12.1
418.43 s
> Checking linux-raw-sys v0.4.15
418.43 s
> Checking winnow v0.7.15
418.43 s
> Checking cpufeatures v0.2.17
418.43 s
> Checking globset v0.4.18
418.43 s
> Checking sha2 v0.10.9
418.43 s
> Checking rustix v0.38.44
418.43 s
> Checking ciborium v0.2.2
418.43 s
> Checking getrandom v0.4.2
418.43 s
> Checking rand_core v0.6.4
418.43 s
> Compiling unicode_names2 v1.3.0
418.43 s
> Checking fastrand v2.4.1
418.43 s
> Checking plotters-backend v0.3.7
418.43 s
> Checking fnv v1.0.7
418.43 s
> Checking crossterm v0.28.1
418.43 s
> Checking rust-embed-utils v8.11.0
418.43 s
> Checking tempfile v3.27.0
418.43 s
> Checking plotters-svg v0.3.7
418.43 s
> Checking ansitok v0.3.0
418.43 s
> Checking serde_spanned v0.6.9
418.43 s
> Checking toml_datetime v0.6.11
418.43 s
> Checking itertools v0.10.5
418.43 s
> Checking tap v1.0.1
418.43 s
> Checking clap v4.6.1
418.43 s
> Checking toml_write v0.1.2
418.43 s
> Checking cast v0.3.0
418.43 s
> Checking wyz v0.5.1
418.43 s
> Checking plotters v0.3.7
418.43 s
> Checking rand_chacha v0.3.1
418.43 s
> Checking radium v0.7.0
418.43 s
> Checking typeid v1.0.3
418.43 s
> Checking toml_edit v0.22.27
418.43 s
> Checking tinytemplate v1.2.1
418.43 s
> Checking ansi-str v0.9.0
418.43 s
> Checking similar v2.7.0
418.43 s
> Checking is-terminal v0.4.17
418.43 s
> Checking bytecount v0.6.9
418.43 s
> Checking funty v2.0.0
418.43 s
> Checking oorandom v11.1.5
418.43 s
> Checking anes v0.1.6
418.43 s
> Checking papergrid v0.17.0
418.43 s
> Checking rand v0.8.6
418.43 s
> Checking testing_table v0.3.0
418.43 s
> Checking ron v0.12.1
418.43 s
> Checking toml_edit v0.25.11+spec-1.1.0
418.43 s
> Checking env_filter v1.0.1
418.43 s
> Checking bitvec v1.0.1
418.43 s
> Checking uncased v0.9.10
418.43 s
> Checking jiff v0.2.24
418.43 s
> Checking ptr_meta v0.1.4
418.43 s
> Checking ucd-trie v0.1.7
418.43 s
> Checking simdutf8 v0.1.5
418.43 s
> Checking criterion-plot v0.5.0
418.43 s
> Checking ahash v0.7.8
418.43 s
> Checking pest v2.8.6
418.43 s
> Checking xprec v0.2.2
418.43 s
> Checking hashbrown v0.12.3
418.43 s
> Checking bytecheck v0.6.12
418.43 s
> Checking criterion v0.5.1
418.43 s
> Checking approx v0.4.0
418.43 s
> Checking seahash v4.1.0
418.43 s
> Checking cgmath v0.18.0
418.43 s
> Checking rend v0.4.2
418.43 s
> Checking tabled v0.20.0
418.43 s
> Checking num-rational v0.4.2
418.43 s
> Checking insta v1.47.2
418.43 s
> Checking num-iter v0.1.45
418.43 s
> Checking ref-ops v0.2.5
418.43 s
> Checking num v0.4.3
418.43 s
> Checking rand_xoshiro v0.6.0
418.43 s
> Checking features v0.10.0
418.43 s
> Checking constcat v0.5.1
418.43 s
> Checking toml v0.8.23
418.43 s
> Checking gat-lending-iterator v0.1.8
418.43 s
> Checking colored v2.2.0
418.43 s
> Checking arrayref v0.3.9
418.43 s
> Checking cpufeatures v0.3.0
418.43 s
> Compiling pyo3-macros-backend v0.28.3
418.43 s
> Compiling pyo3-ffi v0.28.3
418.43 s
> Compiling pyo3 v0.28.3
418.43 s
> Compiling numpy v0.28.0
418.43 s
> Checking dot-parser v0.5.1
418.43 s
> Checking figment v0.10.19
418.43 s
> Checking constant_time_eq v0.4.2
418.43 s
> Checking base64 v0.22.1
418.43 s
> Checking siphasher v1.0.2
418.43 s
> Checking blake3 v1.8.5
418.43 s
> Checking joinery v2.1.0
418.43 s
> Checking phf_shared v0.13.1
418.43 s
> Checking subprocess v0.2.15
418.43 s
> Checking rust_lisp v0.18.0
418.43 s
> Checking titlecase v2.2.1
418.43 s
> Compiling vakint v0.1.2 (/build/source/crates/vakint)
418.43 s
> Checking version-compare v0.2.1
418.43 s
> Checking xpct v0.5.1
418.43 s
> Checking ryu v1.0.23
418.43 s
> Checking castaway v0.2.4
418.43 s
> Checking toml_datetime v0.7.5+spec-1.1.0
418.43 s
> Checking phf v0.13.1
418.43 s
> Checking strum v0.27.2
418.43 s
> Checking unicode-truncate v2.0.1
418.43 s
> Checking compact_str v0.9.0
418.43 s
> Checking kasuari v0.4.12
418.43 s
> Checking lru v0.16.4
418.43 s
> Checking vte v0.15.0
418.43 s
> Checking portable-atomic v1.13.1
418.43 s
> Checking toml v0.9.12+spec-1.1.0
418.43 s
> Checking string-template-plus v0.4.3
418.43 s
> Checking unit-prefix v0.5.2
418.43 s
> Checking rand_distr v0.4.3
418.43 s
> Checking simba v0.6.0
418.43 s
> Checking vt100 v0.16.2
418.43 s
> Checking line-clipping v0.3.7
418.43 s
> Compiling three-dimensional-reps v0.1.0 (/build/source/crates/three-dimensional-reps)
418.43 s
> Compiling rustpython-parser-core v0.4.0
418.43 s
> Checking ratatui-core v0.1.0
418.43 s
> Checking gimli v0.32.3
418.43 s
> Checking adler2 v2.0.1
418.43 s
> Compiling rustpython-ast v0.4.0
418.43 s
> Checking miniz_oxide v0.8.9
418.43 s
> Checking env_logger v0.11.10
418.43 s
> Checking thiserror v1.0.69
418.43 s
> Checking derive_builder v0.11.2
418.43 s
> Checking owo-colors v4.3.0
418.43 s
> Checking object v0.37.3
418.43 s
> Checking indicatif v0.18.4
418.43 s
> Checking crossterm v0.29.0
418.43 s
> Checking tracing-error v0.2.1
418.43 s
> Checking typed-index-collections v3.5.0
418.43 s
> Checking serde-big-array v0.5.1
418.43 s
> Checking amd v0.2.2
418.43 s
> Checking itertools v0.11.0
418.43 s
> Compiling gammaloop-tracing-filter-macros v0.1.0 (/build/source/crates/gammaloop-tracing-filter-macros)
418.43 s
> Checking option-ext v0.2.0
418.43 s
> Checking rustc-demangle v0.1.27
418.43 s
> Checking dirs-sys v0.5.0
418.43 s
> Checking ref-cast v1.0.25
418.43 s
> Checking nix v0.31.2
418.43 s
> Checking integer-sqrt v0.1.5
418.43 s
> Checking rkyv v0.7.46
418.43 s
> Checking brotli-decompressor v4.0.3
418.43 s
> Checking crossbeam-channel v0.5.15
418.43 s
> Checking ratatui-widgets v0.3.0
418.43 s
> Checking itertools v0.12.1
418.43 s
> Checking unsafe-libyaml v0.2.11
418.43 s
> Checking color-spantrace v0.3.0
418.43 s
> Checking ratatui-crossterm v0.1.0
418.43 s
> Compiling gammalooprs v0.3.4 (/build/source/crates/gammalooprs)
418.43 s
> Checking symlink v0.1.0
418.43 s
> Checking include_dir v0.7.4
418.43 s
> Checking tracing-appender v0.2.5
418.43 s
> Checking pathfinding v4.15.0
418.43 s
> Checking ctrlc v3.5.2
418.43 s
> Checking dirs v6.0.0
418.43 s
> Checking tracing-indicatif v0.3.14
418.43 s
> Checking schemars v1.2.1
418.43 s
> Checking slotmap v1.1.1
418.43 s
> Checking clarabel v0.11.1
418.43 s
> Checking serde_yaml v0.9.34+deprecated
418.43 s
> Checking brotli v7.0.0
418.43 s
> Checking json5 v0.4.1
418.43 s
> Checking ratatui-macros v0.7.0
418.43 s
> Checking ratatui v0.30.0
418.43 s
> Checking vectorize v0.2.0
418.43 s
> Checking base62 v2.2.4
418.43 s
> Checking ringbuffer v0.16.0
418.43 s
> Checking rust-embed v8.11.0
418.43 s
> Checking clap_complete v4.6.3
418.43 s
> Checking fd-lock v4.0.4
418.43 s
> Checking addr2line v0.25.1
418.43 s
> Checking strip-ansi-escapes v0.2.1
418.43 s
> Compiling gammaloop-api v0.1.0 (/build/source/crates/gammaloop-api)
418.43 s
> Checking itertools v0.13.0
418.43 s
> Checking strum v0.26.3
418.43 s
> Checking sysinfo v0.33.1
418.43 s
> Checking shlex v1.3.0
418.43 s
> Checking futures-task v0.3.32
418.43 s
> Checking futures-core v0.3.32
418.43 s
> Checking clap_complete_nushell v4.6.0
418.43 s
> Checking slab v0.4.12
418.43 s
> Checking sdd v3.0.10
418.43 s
> Compiling gammaloop-integration-tests v0.1.0 (/build/source/tests)
418.43 s
> Compiling test-log-core v0.2.20
418.43 s
> Compiling rustc_version v0.4.1
418.43 s
> Checking futures-util v0.3.32
418.43 s
> Checking which v8.0.2
418.43 s
> Checking scc v2.4.0
418.43 s
> Checking bincode v1.3.3
418.43 s
> Compiling numerica v2.2.0 (https://github.com/alphal00p/symbolica?rev=a277a8dadbaae5a8d6605f2f381991a601e1f345#a277a8da)
418.43 s
> Compiling gungraun-runner v0.18.2
418.43 s
> Checking backtrace v0.3.76
418.43 s
> Checking nalgebra v0.29.0
418.43 s
> Compiling gungraun-macros v0.8.0
418.43 s
> Checking reedline v0.42.0
418.43 s
> Checking color-eyre v0.6.5
418.43 s
> Checking proc-macro2 v1.0.106
418.43 s
> Checking maplit v1.0.2
418.43 s
> Checking base64 v0.21.7
418.43 s
> Checking quote v1.0.45
418.43 s
> Checking futures-executor v0.3.32
418.43 s
> Checking ron v0.8.1
418.43 s
> Compiling iai-callgrind-runner v0.14.2
418.43 s
> Checking kurbo v0.13.0
418.43 s
> Checking wait-timeout v0.2.1
418.43 s
> Checking serial_test v3.4.0
418.43 s
> Checking bit-vec v0.8.0
418.43 s
> Compiling iai-callgrind v0.14.2
418.43 s
> Checking quick-error v1.2.3
418.43 s
> Checking rusty-fork v0.3.1
418.43 s
> Checking bit-set v0.8.0
418.43 s
> Checking syn v2.0.117
418.43 s
> Compiling test-log-macros v0.2.20
418.43 s
> Compiling iai-callgrind-macros v0.5.1
418.43 s
> Checking rand_xorshift v0.4.0
418.43 s
> Checking console v0.15.11
418.43 s
> Checking unarray v0.1.4
418.43 s
> Checking pathdiff v0.2.3
418.43 s
> Checking proptest v1.11.0
418.43 s
> Checking kurvst v0.1.0 (/build/source/crates/kurvst)
418.43 s
> Checking similar-asserts v1.7.0
418.43 s
> Checking clinnet v0.1.8 (/build/source/crates/clinnet)
418.43 s
> Checking test-log v0.2.20
418.43 s
> Compiling graphica v2.1.0 (https://github.com/alphal00p/symbolica?rev=a277a8dadbaae5a8d6605f2f381991a601e1f345#a277a8da)
418.43 s
> Checking statrs v0.16.1
418.43 s
> Checking momtrop v0.3.0
418.43 s
> Checking gungraun v0.18.2
418.43 s
> Compiling pyo3-stub-gen-derive v0.17.2
418.43 s
> Compiling pyo3-macros v0.28.3
418.43 s
> Checking pyo3-stub-gen v0.17.2
418.43 s
> Checking symbolica-utils v0.1.0 (/build/source/crates/symbolica-utils)
418.43 s
> Checking spenso-macros v0.3.2 (/build/source/crates/spenso-macros)
418.43 s
> Compiling gammaloop-workspace-hack v0.1.0 (/build/source/crates/gammaloop-workspace-hack)
418.43 s
> Checking linnet v0.17.0 (/build/source/crates/linnet)
418.43 s
> Checking spenso v0.6.0 (/build/source/crates/spenso)
418.43 s
> Checking linnet-py v0.1.0 (/build/source/crates/linnet-py)
418.43 s
> Checking linnest v0.1.0 (/build/source/crates/linnest)
418.43 s
> Checking idenso v0.3.0 (/build/source/crates/idenso)
418.43 s
> Checking gammaloop-tracing-filter v0.1.0 (/build/source/crates/gammaloop-tracing-filter)
418.43 s
> Checking spenso-hep-lib v0.1.7 (/build/source/crates/spenso-hep-lib)
418.43 s
> Checking spynso3 v0.1.2 (/build/source/crates/spynso3)
418.43 s
> warning : method `reinterpret_loop_momenta_and_compute_prefactor` is never used
418.43 s
> --> crates/gammalooprs/src/integrands/process/mod.rs:2681:19
418.43 s
> |
418.43 s
> 2144 | impl LmbMultiChannelingSetup {
418.43 s
> | ---------------------------- method in this implementation
418.43 s
> ...
418.43 s
> 2681 | pub(crate) fn reinterpret_loop_momenta_and_compute_prefactor<T: FloatLike>(
418.43 s
> | ^^^^^^^^^^^^^^^^^^^^^^^^^^^^^^^^^^^^^^^^^^^^^^
418.43 s
> |
418.43 s
> = note : `#[warn(dead_code)]` (part of `#[warn(unused)]`) on by default
418.43 s
>
418.43 s
> warning : `gammalooprs` (lib) generated 1 warning
418.43 s
> warning : unused import: `GaussianReferenceFunction`
418.43 s
> --> crates/gammaloop-api/src/state.rs:38:27
418.43 s
> |
418.43 s
> 38 | integrands::process::{GaussianReferenceFunction, ProcessIntegrand},
418.43 s
> | ^^^^^^^^^^^^^^^^^^^^^^^^^
418.43 s
> |
418.43 s
> = note : `#[warn(unused_imports)]` (part of `#[warn(unused)]`) on by default
418.43 s
>
418.43 s
> warning : `gammalooprs` (lib test) generated 1 warning (1 duplicate)
418.43 s
> warning : `gammaloop-api` (lib) generated 1 warning (run `cargo fix --lib -p gammaloop-api` to apply 1 suggestion)
418.43 s
> error[E0560] : struct `CutInfo` has no field named `lmb_channel_id`
418.43 s
> --> tests/tests/test_differential.rs:86:13
418.43 s
> |
418.43 s
> 86 | lmb_channel_id: None,
418.43 s
> | ^^^^^^^^^^^^^^ `CutInfo` does not have this field
418.43 s
> |
418.43 s
> = note : available fields are: `sampling_channel_id`, `sampling_channel_edge_ids`
418.43 s
>
418.43 s
> error[E0560] : struct `CutInfo` has no field named `lmb_channel_edge_ids`
418.43 s
> --> tests/tests/test_differential.rs:87:13
418.43 s
> |
418.43 s
> 87 | lmb_channel_edge_ids: None,
418.43 s
> | ^^^^^^^^^^^^^^^^^^^^ `CutInfo` does not have this field
418.43 s
> |
418.43 s
> = note : available fields are: `sampling_channel_id`, `sampling_channel_edge_ids`
418.43 s
>
418.43 s
> For more information about this error, try `rustc --explain E0560`.
418.43 s
> error : could not compile `gammaloop-integration-tests` (test "test_differential") due to 2 previous errors
418.43 s
> warning : build failed, waiting for other jobs to finish...
418.43 s
> error[E0609] : no field `lmb_channel_edge_ids` on type `CutInfo`
418.43 s
> --> tests/tests/test_evaluation_api.rs:311:10
418.43 s
> |
418.43 s
> 311 | .lmb_channel_edge_ids
418.43 s
> | ^^^^^^^^^^^^^^^^^^^^ unknown field
418.43 s
> |
418.43 s
> = note : available fields are: `particle_pdgs`, `cut_id`, `graph_id`, `graph_group_id`, `orientation_id` ... and 2 others
418.43 s
>
418.43 s
> error[E0609] : no field `lmb_channel_edge_ids` on type `CutInfo`
418.43 s
> --> tests/tests/test_evaluation_api.rs:591:26
418.43 s
> |
418.43 s
> 591 | .lmb_channel_edge_ids
418.43 s
> | ^^^^^^^^^^^^^^^^^^^^ unknown field
418.43 s
> |
418.43 s
> = note : available fields are: `particle_pdgs`, `cut_id`, `graph_id`, `graph_group_id`, `orientation_id` ... and 2 others
418.43 s
>
418.43 s
> error[E0609] : no field `lmb_channel_edge_ids` on type `CutInfo`
418.43 s
> --> tests/tests/test_evaluation_api.rs:1177:18
418.43 s
> |
418.43 s
> 1177 | .lmb_channel_edge_ids
418.43 s
> | ^^^^^^^^^^^^^^^^^^^^ unknown field
418.43 s
> |
418.43 s
> = note : available fields are: `particle_pdgs`, `cut_id`, `graph_id`, `graph_group_id`, `orientation_id` ... and 2 others
418.43 s
>
418.43 s
> error[E0609] : no field `lmb_channel_edge_ids` on type `CutInfo`
418.43 s
> --> tests/tests/test_evaluation_api.rs:1222:22
418.43 s
> |
418.43 s
> 1222 | .lmb_channel_edge_ids
418.43 s
> | ^^^^^^^^^^^^^^^^^^^^ unknown field
418.43 s
> |
418.43 s
> = note : available fields are: `particle_pdgs`, `cut_id`, `graph_id`, `graph_group_id`, `orientation_id` ... and 2 others
418.43 s
>
418.43 s
> error[E0609] : no field `lmb_channel_edge_ids` on type `CutInfo`
418.43 s
> --> tests/tests/test_evaluation_api.rs:1281:14
418.43 s
> |
418.43 s
> 1281 | .lmb_channel_edge_ids
418.43 s
> | ^^^^^^^^^^^^^^^^^^^^ unknown field
418.43 s
> |
418.43 s
> = note : available fields are: `particle_pdgs`, `cut_id`, `graph_id`, `graph_group_id`, `orientation_id` ... and 2 others
418.43 s
>
418.43 s
> error[E0609] : no field `lmb_channel_edge_ids` on type `CutInfo`
418.43 s
> --> tests/tests/test_evaluation_api.rs:1428:18
418.43 s
> |
418.43 s
> 1428 | .lmb_channel_edge_ids
418.43 s
> | ^^^^^^^^^^^^^^^^^^^^ unknown field
418.43 s
> |
418.43 s
> = note : available fields are: `particle_pdgs`, `cut_id`, `graph_id`, `graph_group_id`, `orientation_id` ... and 2 others
418.43 s
>
418.43 s
> For more information about this error, try `rustc --explain E0609`.
418.43 s
> error : could not compile `gammaloop-integration-tests` (test "test_evaluation_api") due to 6 previous errors
418.43 s
> error[E0609] : no field `lmb_channel_id` on type `CutInfo`
418.43 s
> --> tests/tests/test_runs/utils.rs:568:36
418.43 s
> |
418.43 s
> 568 | event.cut_info.lmb_channel_id,
418.43 s
> | ^^^^^^^^^^^^^^ unknown field
418.43 s
> |
418.43 s
> = note : available fields are: `particle_pdgs`, `cut_id`, `graph_id`, `graph_group_id`, `orientation_id` ... and 2 others
418.43 s
>
418.43 s
> error[E0609] : no field `lmb_channel_id` on type `CutInfo`
418.43 s
> --> tests/tests/test_runs/utils.rs:580:36
418.43 s
> |
418.43 s
> 580 | event.cut_info.lmb_channel_id,
418.43 s
> | ^^^^^^^^^^^^^^ unknown field
418.43 s
> |
418.43 s
> = note : available fields are: `particle_pdgs`, `cut_id`, `graph_id`, `graph_group_id`, `orientation_id` ... and 2 others
418.43 s
>
418.43 s
> error : could not compile `gammaloop-integration-tests` (test "test_runs") due to 2 previous errors
418.43 s
For full logs, run:
418.43 s
nix log /nix/store/448zayigj0y6f3w7w36r7s3pw9rbgz07-gammaloop-workspace-check-0.1.0.drv
418.53 s
Build failed.