test packages.x86_64-linux.nix-ci-check-gammaloop-doctest
0.02 s
$ /nix/store/bhv6xyvqw6gjs3j488gi1z6wdv18bdpa-coreutils-9.11/bin/timeout --kill-after=15s 7200s /nix/store/bxgja2ppiqi6w2bgn0r07d7mgnl1k6k2-nix-2.34.8/bin/nix --extra-experimental-features nix-command --extra-experimental-features flakes flake clone git+https://github.com/alphal00p/gammaloop --dest /tmp/nix-ci-worker/stable-pwd/repo/
0.51 s
Cloning into '/tmp/nix-ci-worker/stable-pwd/repo'...
1.62 s
remote: Enumerating objects: 172470, done.
1.74 s
remote: Counting objects: 0% (1/14523)
remote: Counting objects: 1% (146/14523)
remote: Counting objects: 2% (291/14523)
remote: Counting objects: 3% (436/14523)
remote: Counting objects: 4% (581/14523)
remote: Counting objects: 5% (727/14523)
remote: Counting objects: 6% (872/14523)
remote: Counting objects: 7% (1017/14523)
remote: Counting objects: 8% (1162/14523)
remote: Counting objects: 9% (1308/14523)
remote: Counting objects: 10% (1453/14523)
remote: Counting objects: 11% (1598/14523)
remote: Counting objects: 12% (1743/14523)
remote: Counting objects: 13% (1888/14523)
remote: Counting objects: 14% (2034/14523)
remote: Counting objects: 15% (2179/14523)
remote: Counting objects: 16% (2324/14523)
remote: Counting objects: 17% (2469/14523)
remote: Counting objects: 18% (2615/14523)
remote: Counting objects: 19% (2760/14523)
remote: Counting objects: 20% (2905/14523)
remote: Counting objects: 21% (3050/14523)
remote: Counting objects: 22% (3196/14523)
remote: Counting objects: 23% (3341/14523)
remote: Counting objects: 24% (3486/14523)
remote: Counting objects: 25% (3631/14523)
remote: Counting objects: 26% (3776/14523)
remote: Counting objects: 27% (3922/14523)
remote: Counting objects: 28% (4067/14523)
remote: Counting objects: 29% (4212/14523)
remote: Counting objects: 30% (4357/14523)
remote: Counting objects: 31% (4503/14523)
remote: Counting objects: 32% (4648/14523)
remote: Counting objects: 33% (4793/14523)
remote: Counting objects: 34% (4938/14523)
remote: Counting objects: 35% (5084/14523)
remote: Counting objects: 36% (5229/14523)
remote: Counting objects: 37% (5374/14523)
remote: Counting objects: 38% (5519/14523)
remote: Counting objects: 39% (5664/14523)
remote: Counting objects: 40% (5810/14523)
remote: Counting objects: 41% (5955/14523)
remote: Counting objects: 42% (6100/14523)
remote: Counting objects: 43% (6245/14523)
remote: Counting objects: 44% (6391/14523)
remote: Counting objects: 45% (6536/14523)
remote: Counting objects: 46% (6681/14523)
remote: Counting objects: 47% (6826/14523)
remote: Counting objects: 48% (6972/14523)
remote: Counting objects: 49% (7117/14523)
remote: Counting objects: 50% (7262/14523)
remote: Counting objects: 51% (7407/14523)
remote: Counting objects: 52% (7552/14523)
remote: Counting objects: 53% (7698/14523)
remote: Counting objects: 54% (7843/14523)
remote: Counting objects: 55% (7988/14523)
remote: Counting objects: 56% (8133/14523)
remote: Counting objects: 57% (8279/14523)
remote: Counting objects: 58% (8424/14523)
remote: Counting objects: 59% (8569/14523)
remote: Counting objects: 60% (8714/14523)
remote: Counting objects: 61% (8860/14523)
remote: Counting objects: 62% (9005/14523)
remote: Counting objects: 63% (9150/14523)
remote: Counting objects: 64% (9295/14523)
remote: Counting objects: 65% (9440/14523)
remote: Counting objects: 66% (9586/14523)
remote: Counting objects: 67% (9731/14523)
remote: Counting objects: 68% (9876/14523)
remote: Counting objects: 69% (10021/14523)
remote: Counting objects: 70% (10167/14523)
remote: Counting objects: 71% (10312/14523)
remote: Counting objects: 72% (10457/14523)
remote: Counting objects: 73% (10602/14523)
remote: Counting objects: 74% (10748/14523)
remote: Counting objects: 75% (10893/14523)
remote: Counting objects: 76% (11038/14523)
remote: Counting objects: 77% (11183/14523)
remote: Counting objects: 78% (11328/14523)
remote: Counting objects: 79% (11474/14523)
remote: Counting objects: 80% (11619/14523)
remote: Counting objects: 81% (11764/14523)
remote: Counting objects: 82% (11909/14523)
remote: Counting objects: 83% (12055/14523)
remote: Counting objects: 84% (12200/14523)
remote: Counting objects: 85% (12345/14523)
remote: Counting objects: 86% (12490/14523)
remote: Counting objects: 87% (12636/14523)
remote: Counting objects: 88% (12781/14523)
remote: Counting objects: 89% (12926/14523)
remote: Counting objects: 90% (13071/14523)
remote: Counting objects: 91% (13216/14523)
remote: Counting objects: 92% (13362/14523)
remote: Counting objects: 93% (13507/14523)
remote: Counting objects: 94% (13652/14523)
remote: Counting objects: 95% (13797/14523)
remote: Counting objects: 96% (13943/14523)
remote: Counting objects: 97% (14088/14523)
remote: Counting objects: 98% (14233/14523)
remote: Counting objects: 99% (14378/14523)
remote: Counting objects: 100% (14523/14523)
remote: Counting objects: 100% (14523/14523), done.
6.70 s
remote: Compressing objects: 0% (1/2851)
remote: Compressing objects: 1% (29/2851)
remote: Compressing objects: 2% (58/2851)
remote: Compressing objects: 2% (78/2851)
remote: Compressing objects: 3% (86/2851)
remote: Compressing objects: 4% (115/2851)
remote: Compressing objects: 5% (143/2851)
remote: Compressing objects: 5% (149/2851)
remote: Compressing objects: 6% (172/2851)
remote: Compressing objects: 7% (200/2851)
remote: Compressing objects: 8% (229/2851)
remote: Compressing objects: 9% (257/2851)
remote: Compressing objects: 10% (286/2851)
remote: Compressing objects: 11% (314/2851)
remote: Compressing objects: 12% (343/2851)
remote: Compressing objects: 13% (371/2851)
remote: Compressing objects: 14% (400/2851)
remote: Compressing objects: 15% (428/2851)
remote: Compressing objects: 16% (457/2851)
remote: Compressing objects: 16% (473/2851)
remote: Compressing objects: 17% (485/2851)
remote: Compressing objects: 18% (514/2851)
remote: Compressing objects: 19% (542/2851)
remote: Compressing objects: 20% (571/2851)
remote: Compressing objects: 21% (599/2851)
remote: Compressing objects: 22% (628/2851)
remote: Compressing objects: 23% (656/2851)
remote: Compressing objects: 24% (685/2851)
remote: Compressing objects: 25% (713/2851)
remote: Compressing objects: 26% (742/2851)
remote: Compressing objects: 27% (770/2851)
remote: Compressing objects: 28% (799/2851)
remote: Compressing objects: 29% (827/2851)
remote: Compressing objects: 30% (856/2851)
remote: Compressing objects: 31% (884/2851)
remote: Compressing objects: 32% (913/2851)
remote: Compressing objects: 33% (941/2851)
remote: Compressing objects: 34% (970/2851)
remote: Compressing objects: 35% (998/2851)
remote: Compressing objects: 36% (1027/2851)
remote: Compressing objects: 37% (1055/2851)
remote: Compressing objects: 38% (1084/2851)
remote: Compressing objects: 39% (1112/2851)
remote: Compressing objects: 40% (1141/2851)
remote: Compressing objects: 41% (1169/2851)
remote: Compressing objects: 42% (1198/2851)
remote: Compressing objects: 42% (1200/2851)
remote: Compressing objects: 43% (1226/2851)
remote: Compressing objects: 44% (1255/2851)
remote: Compressing objects: 45% (1283/2851)
remote: Compressing objects: 46% (1312/2851)
remote: Compressing objects: 47% (1340/2851)
remote: Compressing objects: 48% (1369/2851)
remote: Compressing objects: 49% (1397/2851)
remote: Compressing objects: 50% (1426/2851)
remote: Compressing objects: 51% (1455/2851)
remote: Compressing objects: 52% (1483/2851)
remote: Compressing objects: 53% (1512/2851)
remote: Compressing objects: 54% (1540/2851)
remote: Compressing objects: 55% (1569/2851)
remote: Compressing objects: 56% (1597/2851)
remote: Compressing objects: 57% (1626/2851)
remote: Compressing objects: 58% (1654/2851)
remote: Compressing objects: 59% (1683/2851)
remote: Compressing objects: 60% (1711/2851)
remote: Compressing objects: 61% (1740/2851)
remote: Compressing objects: 62% (1768/2851)
remote: Compressing objects: 63% (1797/2851)
remote: Compressing objects: 64% (1825/2851)
remote: Compressing objects: 65% (1854/2851)
remote: Compressing objects: 66% (1882/2851)
remote: Compressing objects: 67% (1911/2851)
remote: Compressing objects: 68% (1939/2851)
remote: Compressing objects: 69% (1968/2851)
remote: Compressing objects: 70% (1996/2851)
remote: Compressing objects: 71% (2025/2851)
remote: Compressing objects: 72% (2053/2851)
remote: Compressing objects: 73% (2082/2851)
remote: Compressing objects: 74% (2110/2851)
remote: Compressing objects: 75% (2139/2851)
remote: Compressing objects: 76% (2167/2851)
remote: Compressing objects: 77% (2196/2851)
remote: Compressing objects: 78% (2224/2851)
remote: Compressing objects: 79% (2253/2851)
remote: Compressing objects: 80% (2281/2851)
remote: Compressing objects: 81% (2310/2851)
remote: Compressing objects: 82% (2338/2851)
remote: Compressing objects: 83% (2367/2851)
remote: Compressing objects: 84% (2395/2851)
remote: Compressing objects: 85% (2424/2851)
remote: Compressing objects: 86% (2452/2851)
remote: Compressing objects: 87% (2481/2851)
remote: Compressing objects: 88% (2509/2851)
remote: Compressing objects: 89% (2538/2851)
remote: Compressing objects: 90% (2566/2851)
remote: Compressing objects: 91% (2595/2851)
remote: Compressing objects: 92% (2623/2851)
remote: Compressing objects: 93% (2652/2851)
remote: Compressing objects: 94% (2680/2851)
remote: Compressing objects: 95% (2709/2851)
remote: Compressing objects: 96% (2737/2851)
remote: Compressing objects: 97% (2766/2851)
remote: Compressing objects: 98% (2794/2851)
remote: Compressing objects: 99% (2823/2851)
remote: Compressing objects: 100% (2851/2851)
remote: Compressing objects: 100% (2851/2851), done.
39.84 s
Receiving objects: 0% (1/172470)
Receiving objects: 1% (1725/172470), 4.48 MiB | 8.95 MiB/s
Receiving objects: 2% (3450/172470), 4.48 MiB | 8.95 MiB/s
Receiving objects: 2% (5020/172470), 4.48 MiB | 8.95 MiB/s
Receiving objects: 3% (5175/172470), 20.54 MiB | 20.54 MiB/s
Receiving objects: 4% (6899/172470), 20.54 MiB | 20.54 MiB/s
Receiving objects: 5% (8624/172470), 36.07 MiB | 23.95 MiB/s
Receiving objects: 6% (10349/172470), 36.07 MiB | 23.95 MiB/s
Receiving objects: 6% (11523/172470), 52.19 MiB | 26.01 MiB/s
Receiving objects: 7% (12073/172470), 52.19 MiB | 26.01 MiB/s
Receiving objects: 8% (13798/172470), 68.07 MiB | 27.16 MiB/s
Receiving objects: 9% (15523/172470), 68.07 MiB | 27.16 MiB/s
Receiving objects: 10% (17247/172470), 68.07 MiB | 27.16 MiB/s
Receiving objects: 10% (18513/172470), 68.07 MiB | 27.16 MiB/s
Receiving objects: 11% (18972/172470), 68.07 MiB | 27.16 MiB/s
Receiving objects: 12% (20697/172470), 75.80 MiB | 25.21 MiB/s
Receiving objects: 13% (22422/172470), 75.80 MiB | 25.21 MiB/s
Receiving objects: 14% (24146/172470), 75.80 MiB | 25.21 MiB/s
Receiving objects: 15% (25871/172470), 75.80 MiB | 25.21 MiB/s
Receiving objects: 16% (27596/172470), 75.80 MiB | 25.21 MiB/s
Receiving objects: 17% (29320/172470), 75.80 MiB | 25.21 MiB/s
Receiving objects: 18% (31045/172470), 75.80 MiB | 25.21 MiB/s
Receiving objects: 19% (32770/172470), 75.80 MiB | 25.21 MiB/s
Receiving objects: 20% (34494/172470), 75.80 MiB | 25.21 MiB/s
Receiving objects: 21% (36219/172470), 75.80 MiB | 25.21 MiB/s
Receiving objects: 22% (37944/172470), 75.80 MiB | 25.21 MiB/s
Receiving objects: 23% (39669/172470), 75.80 MiB | 25.21 MiB/s
Receiving objects: 24% (41393/172470), 92.03 MiB | 26.25 MiB/s
Receiving objects: 25% (43118/172470), 92.03 MiB | 26.25 MiB/s
Receiving objects: 26% (44843/172470), 92.03 MiB | 26.25 MiB/s
Receiving objects: 27% (46567/172470), 92.03 MiB | 26.25 MiB/s
Receiving objects: 28% (48292/172470), 92.03 MiB | 26.25 MiB/s
Receiving objects: 28% (49371/172470), 107.16 MiB | 26.75 MiB/s
Receiving objects: 29% (50017/172470), 107.16 MiB | 26.75 MiB/s
Receiving objects: 30% (51741/172470), 107.16 MiB | 26.75 MiB/s
Receiving objects: 31% (53466/172470), 107.16 MiB | 26.75 MiB/s
Receiving objects: 32% (55191/172470), 107.16 MiB | 26.75 MiB/s
Receiving objects: 33% (56916/172470), 107.16 MiB | 26.75 MiB/s
Receiving objects: 34% (58640/172470), 120.65 MiB | 26.77 MiB/s
Receiving objects: 35% (60365/172470), 120.65 MiB | 26.77 MiB/s
Receiving objects: 35% (61331/172470), 120.65 MiB | 26.77 MiB/s
Receiving objects: 36% (62090/172470), 133.96 MiB | 28.73 MiB/s
Receiving objects: 37% (63814/172470), 133.96 MiB | 28.73 MiB/s
Receiving objects: 38% (65539/172470), 133.96 MiB | 28.73 MiB/s
Receiving objects: 39% (67264/172470), 133.96 MiB | 28.73 MiB/s
Receiving objects: 39% (68210/172470), 161.83 MiB | 27.93 MiB/s
Receiving objects: 40% (68988/172470), 161.83 MiB | 27.93 MiB/s
Receiving objects: 41% (70713/172470), 161.83 MiB | 27.93 MiB/s
Receiving objects: 42% (72438/172470), 161.83 MiB | 27.93 MiB/s
Receiving objects: 43% (74163/172470), 161.83 MiB | 27.93 MiB/s
Receiving objects: 44% (75887/172470), 175.94 MiB | 27.47 MiB/s
Receiving objects: 45% (77612/172470), 175.94 MiB | 27.47 MiB/s
Receiving objects: 46% (79337/172470), 175.94 MiB | 27.47 MiB/s
Receiving objects: 47% (81061/172470), 175.94 MiB | 27.47 MiB/s
Receiving objects: 48% (82786/172470), 175.94 MiB | 27.47 MiB/s
Receiving objects: 48% (83354/172470), 175.94 MiB | 27.47 MiB/s
Receiving objects: 49% (84511/172470), 190.05 MiB | 27.08 MiB/s
Receiving objects: 50% (86235/172470), 190.05 MiB | 27.08 MiB/s
Receiving objects: 51% (87960/172470), 190.05 MiB | 27.08 MiB/s
Receiving objects: 52% (89685/172470), 190.05 MiB | 27.08 MiB/s
Receiving objects: 52% (89771/172470), 219.59 MiB | 28.32 MiB/s
Receiving objects: 52% (89807/172470), 249.40 MiB | 28.56 MiB/s
Receiving objects: 53% (91410/172470), 249.40 MiB | 28.56 MiB/s
Receiving objects: 54% (93134/172470), 265.17 MiB | 29.11 MiB/s
Receiving objects: 54% (94248/172470), 265.17 MiB | 29.11 MiB/s
Receiving objects: 55% (94859/172470), 281.33 MiB | 29.71 MiB/s
Receiving objects: 56% (96584/172470), 281.33 MiB | 29.71 MiB/s
Receiving objects: 57% (98308/172470), 281.33 MiB | 29.71 MiB/s
Receiving objects: 58% (100033/172470), 281.33 MiB | 29.71 MiB/s
Receiving objects: 59% (101758/172470), 281.33 MiB | 29.71 MiB/s
Receiving objects: 60% (103482/172470), 281.33 MiB | 29.71 MiB/s
Receiving objects: 61% (105207/172470), 281.33 MiB | 29.71 MiB/s
Receiving objects: 62% (106932/172470), 281.33 MiB | 29.71 MiB/s
Receiving objects: 63% (108657/172470), 281.33 MiB | 29.71 MiB/s
Receiving objects: 64% (110381/172470), 297.76 MiB | 30.17 MiB/s
Receiving objects: 65% (112106/172470), 297.76 MiB | 30.17 MiB/s
Receiving objects: 65% (113682/172470), 297.76 MiB | 30.17 MiB/s
Receiving objects: 66% (113831/172470), 314.29 MiB | 30.72 MiB/s
Receiving objects: 67% (115555/172470), 314.29 MiB | 30.72 MiB/s
Receiving objects: 68% (117280/172470), 314.29 MiB | 30.72 MiB/s
Receiving objects: 69% (119005/172470), 331.20 MiB | 31.35 MiB/s
Receiving objects: 70% (120729/172470), 331.20 MiB | 31.35 MiB/s
Receiving objects: 71% (122454/172470), 331.20 MiB | 31.35 MiB/s
Receiving objects: 71% (123942/172470), 348.37 MiB | 31.88 MiB/s
Receiving objects: 72% (124179/172470), 348.37 MiB | 31.88 MiB/s
Receiving objects: 73% (125904/172470), 364.59 MiB | 32.18 MiB/s
Receiving objects: 73% (126077/172470), 364.59 MiB | 32.18 MiB/s
Receiving objects: 74% (127628/172470), 380.20 MiB | 32.65 MiB/s
Receiving objects: 75% (129353/172470), 396.39 MiB | 32.59 MiB/s
Receiving objects: 76% (131078/172470), 396.39 MiB | 32.59 MiB/s
Receiving objects: 76% (132248/172470), 396.39 MiB | 32.59 MiB/s
Receiving objects: 77% (132802/172470), 427.14 MiB | 32.31 MiB/s
Receiving objects: 78% (134527/172470), 427.14 MiB | 32.31 MiB/s
Receiving objects: 78% (135638/172470), 440.44 MiB | 31.61 MiB/s
Receiving objects: 79% (136252/172470), 440.44 MiB | 31.61 MiB/s
Receiving objects: 80% (137976/172470), 440.44 MiB | 31.61 MiB/s
Receiving objects: 81% (139701/172470), 451.43 MiB | 30.38 MiB/s
Receiving objects: 81% (140321/172470), 451.43 MiB | 30.38 MiB/s
Receiving objects: 82% (141426/172470), 479.18 MiB | 29.00 MiB/s
Receiving objects: 82% (142003/172470), 479.18 MiB | 29.00 MiB/s
Receiving objects: 83% (143151/172470), 490.52 MiB | 27.91 MiB/s
Receiving objects: 83% (143937/172470), 508.69 MiB | 28.48 MiB/s
Receiving objects: 84% (144875/172470), 517.27 MiB | 26.83 MiB/s
Receiving objects: 85% (146600/172470), 528.94 MiB | 25.84 MiB/s
Receiving objects: 85% (147491/172470), 536.41 MiB | 24.22 MiB/s
Receiving objects: 85% (147532/172470), 545.29 MiB | 23.24 MiB/s
Receiving objects: 85% (147550/172470), 567.93 MiB | 19.62 MiB/s
Receiving objects: 85% (147550/172470), 583.99 MiB | 16.65 MiB/s
Receiving objects: 85% (147551/172470), 599.75 MiB | 15.67 MiB/s
Receiving objects: 85% (147552/172470), 616.79 MiB | 15.84 MiB/s
Receiving objects: 85% (147552/172470), 634.89 MiB | 16.54 MiB/s
Receiving objects: 85% (147553/172470), 653.62 MiB | 17.27 MiB/s
Receiving objects: 85% (147556/172470), 670.43 MiB | 17.42 MiB/s
Receiving objects: 85% (147565/172470), 688.24 MiB | 17.54 MiB/s
Receiving objects: 85% (147565/172470), 706.62 MiB | 17.89 MiB/s
Receiving objects: 85% (147565/172470), 727.38 MiB | 18.42 MiB/s
Receiving objects: 86% (148325/172470), 737.77 MiB | 18.56 MiB/s
Receiving objects: 87% (150049/172470), 737.77 MiB | 18.56 MiB/s
Receiving objects: 87% (150737/172470), 737.77 MiB | 18.56 MiB/s
Receiving objects: 88% (151774/172470), 748.54 MiB | 19.04 MiB/s
Receiving objects: 89% (153499/172470), 759.06 MiB | 19.55 MiB/s
Receiving objects: 89% (154438/172470), 759.06 MiB | 19.55 MiB/s
Receiving objects: 90% (155223/172470), 759.06 MiB | 19.55 MiB/s
Receiving objects: 91% (156948/172470), 770.09 MiB | 20.13 MiB/s
Receiving objects: 92% (158673/172470), 770.09 MiB | 20.13 MiB/s
Receiving objects: 93% (160398/172470), 770.09 MiB | 20.13 MiB/s
Receiving objects: 94% (162122/172470), 770.09 MiB | 20.13 MiB/s
Receiving objects: 95% (163847/172470), 770.09 MiB | 20.13 MiB/s
Receiving objects: 96% (165572/172470), 770.09 MiB | 20.13 MiB/s
Receiving objects: 97% (167296/172470), 770.09 MiB | 20.13 MiB/s
Receiving objects: 98% (169021/172470), 781.46 MiB | 20.59 MiB/s
Receiving objects: 99% (170746/172470), 781.46 MiB | 20.59 MiB/s
Receiving objects: 99% (172365/172470), 781.46 MiB | 20.59 MiB/s
remote: Total 172470 (delta 12689), reused 11700 (delta 11670), pack-reused 157947 (from 3)
39.84 s
Receiving objects: 100% (172470/172470), 792.51 MiB | 21.29 MiB/s
Receiving objects: 100% (172470/172470), 792.54 MiB | 23.93 MiB/s, done.
42.74 s
Resolving deltas: 0% (0/106268)
Resolving deltas: 1% (1063/106268)
Resolving deltas: 2% (2129/106268)
Resolving deltas: 3% (3189/106268)
Resolving deltas: 4% (4251/106268)
Resolving deltas: 5% (5314/106268)
Resolving deltas: 6% (6378/106268)
Resolving deltas: 7% (7442/106268)
Resolving deltas: 8% (8502/106268)
Resolving deltas: 9% (9565/106268)
Resolving deltas: 10% (10630/106268)
Resolving deltas: 11% (11690/106268)
Resolving deltas: 12% (12754/106268)
Resolving deltas: 13% (13815/106268)
Resolving deltas: 14% (14878/106268)
Resolving deltas: 15% (15941/106268)
Resolving deltas: 16% (17003/106268)
Resolving deltas: 17% (18066/106268)
Resolving deltas: 18% (19129/106268)
Resolving deltas: 19% (20191/106268)
Resolving deltas: 20% (21254/106268)
Resolving deltas: 21% (22317/106268)
Resolving deltas: 22% (23379/106268)
Resolving deltas: 23% (24442/106268)
Resolving deltas: 24% (25507/106268)
Resolving deltas: 25% (26567/106268)
Resolving deltas: 26% (27630/106268)
Resolving deltas: 27% (28695/106268)
Resolving deltas: 27% (29613/106268)
Resolving deltas: 28% (29756/106268)
Resolving deltas: 29% (30819/106268)
Resolving deltas: 30% (31881/106268)
Resolving deltas: 31% (32945/106268)
Resolving deltas: 32% (34006/106268)
Resolving deltas: 33% (35069/106268)
Resolving deltas: 34% (36133/106268)
Resolving deltas: 35% (37194/106268)
Resolving deltas: 36% (38257/106268)
Resolving deltas: 37% (39320/106268)
Resolving deltas: 38% (40382/106268)
Resolving deltas: 39% (41445/106268)
Resolving deltas: 40% (42508/106268)
Resolving deltas: 41% (43570/106268)
Resolving deltas: 42% (44633/106268)
Resolving deltas: 43% (45696/106268)
Resolving deltas: 44% (46758/106268)
Resolving deltas: 45% (47822/106268)
Resolving deltas: 46% (48884/106268)
Resolving deltas: 47% (49946/106268)
Resolving deltas: 48% (51014/106268)
Resolving deltas: 49% (52072/106268)
Resolving deltas: 50% (53134/106268)
Resolving deltas: 51% (54198/106268)
Resolving deltas: 52% (55260/106268)
Resolving deltas: 53% (56323/106268)
Resolving deltas: 54% (57385/106268)
Resolving deltas: 55% (58448/106268)
Resolving deltas: 56% (59511/106268)
Resolving deltas: 57% (60573/106268)
Resolving deltas: 58% (61636/106268)
Resolving deltas: 59% (62699/106268)
Resolving deltas: 60% (63761/106268)
Resolving deltas: 61% (64824/106268)
Resolving deltas: 62% (65887/106268)
Resolving deltas: 63% (66949/106268)
Resolving deltas: 64% (68012/106268)
Resolving deltas: 65% (69075/106268)
Resolving deltas: 66% (70138/106268)
Resolving deltas: 67% (71200/106268)
Resolving deltas: 68% (72263/106268)
Resolving deltas: 69% (73325/106268)
Resolving deltas: 69% (74179/106268)
Resolving deltas: 70% (74388/106268)
Resolving deltas: 71% (75452/106268)
Resolving deltas: 72% (76514/106268)
Resolving deltas: 73% (77576/106268)
Resolving deltas: 74% (78639/106268)
Resolving deltas: 75% (79701/106268)
Resolving deltas: 76% (80765/106268)
Resolving deltas: 77% (81827/106268)
Resolving deltas: 78% (82890/106268)
Resolving deltas: 79% (83952/106268)
Resolving deltas: 80% (85015/106268)
Resolving deltas: 81% (86078/106268)
Resolving deltas: 82% (87140/106268)
Resolving deltas: 83% (88203/106268)
Resolving deltas: 84% (89266/106268)
Resolving deltas: 85% (90328/106268)
Resolving deltas: 86% (91391/106268)
Resolving deltas: 87% (92457/106268)
Resolving deltas: 88% (93518/106268)
Resolving deltas: 89% (94579/106268)
Resolving deltas: 90% (95642/106268)
Resolving deltas: 91% (96704/106268)
Resolving deltas: 92% (97767/106268)
Resolving deltas: 93% (98831/106268)
Resolving deltas: 94% (99892/106268)
Resolving deltas: 95% (100955/106268)
Resolving deltas: 96% (102018/106268)
Resolving deltas: 97% (103080/106268)
Resolving deltas: 98% (104143/106268)
Resolving deltas: 99% (105206/106268)
Resolving deltas: 100% (106268/106268)
Resolving deltas: 100% (106268/106268), done.
43.25 s
Fetching commit d0b160f56fd8b9abbd0d4a6eb27e6b2a65bb689f for ci/feynkit-green ...
43.25 s
$ /nix/store/b1wn5clix1mz4vpfih7x9cnj9qfh7c6h-git-2.54.0/bin/git fetch origin d0b160f56fd8b9abbd0d4a6eb27e6b2a65bb689f
43.73 s
From https://github.com/alphal00p/gammaloop
43.73 s
* branch d0b160f56fd8b9abbd0d4a6eb27e6b2a65bb689f -> FETCH_HEAD
43.74 s
$ /nix/store/bhv6xyvqw6gjs3j488gi1z6wdv18bdpa-coreutils-9.11/bin/timeout --kill-after=15s 7200s /nix/store/b1wn5clix1mz4vpfih7x9cnj9qfh7c6h-git-2.54.0/bin/git -c advice.detachedHead=false checkout d0b160f56fd8b9abbd0d4a6eb27e6b2a65bb689f
44.19 s
HEAD is now at d0b160f56 docs: build the notebook host wheel against the vendored workspace
44.20 s
$ /nix/store/bhv6xyvqw6gjs3j488gi1z6wdv18bdpa-coreutils-9.11/bin/timeout --kill-after=15s 7200s /nix/store/bxgja2ppiqi6w2bgn0r07d7mgnl1k6k2-nix-2.34.8/bin/nix --extra-experimental-features nix-command --extra-experimental-features flakes --log-format internal-json run .#packages.x86_64-linux.nix-ci-check-gammaloop-doctest --print-build-logs
44.38 s
warning: ignoring untrusted flake configuration setting 'extra-substituters'.
44.38 s
Pass '--accept-flake-config' to trust it
44.38 s
warning: ignoring untrusted flake configuration setting 'extra-trusted-public-keys'.
44.38 s
Pass '--accept-flake-config' to trust it
66.68 s
66.99 s
Downloading cached boehm-gc from https://cache.nix-ci.com
66.99 s
Downloading cached busybox from https://cache.nix-ci.com
66.99 s
Downloading cached numactl from https://cache.nix-ci.com
66.99 s
Downloading cached aws-c-common from https://cache.nix-ci.com
66.99 s
Downloading cached brotli-1.2.0-lib from https://cache.nix-ci.com
66.99 s
Downloading cached editline-1.17.1-unstable-2025-05 from https://cache.nix-ci.com
66.99 s
Downloading cached json-c from https://cache.nix-ci.com
66.99 s
Downloading cached publicsuffix-list-0-unstable-2026-09 from https://cache.nix-ci.com
66.99 s
Downloading cached libcpuid from https://cache.nix-ci.com
66.99 s
Downloading cached libseccomp-2.6.1-lib from https://cache.nix-ci.com
66.99 s
Downloading cached libsodium-1.0.22-unstable-2026-08 from https://cache.nix-ci.com
66.99 s
Downloading cached libssh2 from https://cache.nix-ci.com
66.99 s
Downloading cached nghttp2-1.70.0-lib from https://cache.nix-ci.com
66.99 s
Downloading cached lowdown-3.0.1-lib from https://cache.nix-ci.com
66.99 s
Downloading cached ngtcp2 from https://cache.nix-ci.com
66.99 s
Downloading cached nghttp3 from https://cache.nix-ci.com
67.17 s
Downloaded cached numactl (269 KiB) in 181ms
67.17 s
Progress: 0 of 3 built, 1 of 53 downloaded from cache (15 downloading)
67.17 s
Downloading cached hwloc-2.14.0-lib from https://cache.nix-ci.com
67.18 s
Downloaded cached editline-1.17.1-unstable-2025-05 (58 KiB) in 193ms
67.18 s
Progress: 0 of 3 built, 2 of 53 downloaded from cache (15 downloading)
67.18 s
Downloading cached icu4c from https://cache.nix-ci.com
67.19 s
Downloaded cached libseccomp-2.6.1-lib (189 KiB) in 202ms
67.19 s
Progress: 0 of 3 built, 3 of 53 downloaded from cache (15 downloading)
67.19 s
Downloaded cached json-c (244 KiB) in 203ms
67.19 s
Downloading cached keyutils-1.6.3-lib from https://cache.nix-ci.com
67.19 s
Progress: 0 of 3 built, 4 of 53 downloaded from cache (15 downloading)
67.19 s
Downloading cached libxml2 from https://cache.nix-ci.com
67.20 s
Downloaded cached libcpuid (326 KiB) in 205ms
67.20 s
Progress: 0 of 3 built, 5 of 53 downloaded from cache (15 downloading)
67.20 s
Downloading cached llhttp from https://cache.nix-ci.com
67.20 s
Downloaded cached publicsuffix-list-0-unstable-2026-09 (330 KiB) in 206ms
67.20 s
Progress: 0 of 3 built, 6 of 53 downloaded from cache (15 downloading)
67.20 s
Downloading cached s2n-tls from https://cache.nix-ci.com
67.20 s
Downloaded cached nghttp3 (228 KiB) in 206ms
67.20 s
Progress: 0 of 3 built, 7 of 53 downloaded from cache (15 downloading)
67.20 s
Downloaded cached nghttp2-1.70.0-lib (225 KiB) in 207ms
67.20 s
Downloading cached libpsl from https://cache.nix-ci.com
67.20 s
Progress: 0 of 3 built, 8 of 53 downloaded from cache (15 downloading)
67.20 s
Downloaded cached boehm-gc (312 KiB) in 210ms
67.20 s
Progress: 0 of 3 built, 9 of 53 downloaded from cache (14 downloading)
67.20 s
Downloaded cached libssh2 (330 KiB) in 209ms
67.20 s
Progress: 0 of 3 built, 10 of 53 downloaded from cache (13 downloading)
67.20 s
Downloaded cached lowdown-3.0.1-lib (341 KiB) in 209ms
67.20 s
Progress: 0 of 3 built, 11 of 53 downloaded from cache (12 downloading)
67.20 s
Downloaded cached busybox (230 KiB) in 212ms
67.20 s
Progress: 0 of 3 built, 12 of 53 downloaded from cache (11 downloading)
67.20 s
Downloaded cached ngtcp2 (515 KiB) in 210ms
67.20 s
Progress: 0 of 3 built, 13 of 53 downloaded from cache (10 downloading)
67.20 s
Downloaded cached libsodium-1.0.22-unstable-2026-08 (669 KiB) in 212ms
67.20 s
Progress: 0 of 3 built, 14 of 53 downloaded from cache (9 downloading)
67.20 s
Downloaded cached brotli-1.2.0-lib (961 KiB) in 213ms
67.20 s
Progress: 0 of 3 built, 15 of 53 downloaded from cache (8 downloading)
67.21 s
Downloaded cached aws-c-common (1.1 MiB) in 214ms
67.21 s
Progress: 0 of 3 built, 16 of 53 downloaded from cache (7 downloading)
67.21 s
Downloading cached aws-c-cal from https://cache.nix-ci.com
67.21 s
Downloading cached aws-c-compression from https://cache.nix-ci.com
67.21 s
Downloading cached aws-c-sdkutils from https://cache.nix-ci.com
67.21 s
Downloading cached aws-checksums from https://cache.nix-ci.com
67.21 s
Downloaded cached hwloc-2.14.0-lib (458 KiB) in 42ms
67.21 s
Progress: 0 of 3 built, 17 of 53 downloaded from cache (10 downloading)
67.21 s
Downloading cached onetbb from https://cache.nix-ci.com
67.26 s
Downloaded cached keyutils-1.6.3-lib (41 KiB) in 68ms
67.26 s
Progress: 0 of 3 built, 18 of 53 downloaded from cache (10 downloading)
67.26 s
Downloading cached krb5-1.22.2-lib from https://cache.nix-ci.com
67.27 s
Downloaded cached llhttp (89 KiB) in 71ms
67.27 s
Progress: 0 of 3 built, 19 of 53 downloaded from cache (10 downloading)
67.27 s
Downloading cached libgit2-1.9.7-lib from https://cache.nix-ci.com
67.27 s
Downloaded cached libxml2 (1.4 MiB) in 74ms
67.27 s
Progress: 0 of 3 built, 20 of 53 downloaded from cache (10 downloading)
67.27 s
Downloading cached libarchive-3.8.9-lib from https://cache.nix-ci.com
67.27 s
Downloaded cached libpsl (114 KiB) in 73ms
67.27 s
Progress: 0 of 3 built, 21 of 53 downloaded from cache (10 downloading)
67.28 s
Downloaded cached aws-checksums (86 KiB) in 70ms
67.28 s
Downloaded cached aws-c-compression (31 KiB) in 70ms
67.28 s
Progress: 0 of 3 built, 22 of 53 downloaded from cache (9 downloading)
67.28 s
Progress: 0 of 3 built, 23 of 53 downloaded from cache (8 downloading)
67.28 s
Downloaded cached s2n-tls (1.3 MiB) in 78ms
67.28 s
Progress: 0 of 3 built, 24 of 53 downloaded from cache (7 downloading)
67.28 s
Downloaded cached aws-c-sdkutils (155 KiB) in 72ms
67.28 s
Progress: 0 of 3 built, 25 of 53 downloaded from cache (6 downloading)
67.28 s
Downloaded cached aws-c-cal (158 KiB) in 72ms
67.28 s
Progress: 0 of 3 built, 26 of 53 downloaded from cache (5 downloading)
67.28 s
Downloading cached aws-c-io from https://cache.nix-ci.com
67.28 s
Downloaded cached onetbb (626 KiB) in 71ms
67.28 s
Progress: 0 of 3 built, 27 of 53 downloaded from cache (5 downloading)
67.29 s
Downloading cached libblake3 from https://cache.nix-ci.com
67.35 s
Downloaded cached libblake3 (117 KiB) in 63ms
67.35 s
Progress: 0 of 3 built, 28 of 53 downloaded from cache (5 downloading)
67.35 s
Downloaded cached aws-c-io (648 KiB) in 71ms
67.35 s
Progress: 0 of 3 built, 29 of 53 downloaded from cache (4 downloading)
67.35 s
Downloaded cached libarchive-3.8.9-lib (961 KiB) in 80ms
67.35 s
Downloading cached aws-c-event-stream from https://cache.nix-ci.com
67.35 s
Downloading cached aws-c-http from https://cache.nix-ci.com
67.35 s
Progress: 0 of 3 built, 30 of 53 downloaded from cache (5 downloading)
67.36 s
Downloaded cached libgit2-1.9.7-lib (1.6 MiB) in 87ms
67.36 s
Progress: 0 of 3 built, 31 of 53 downloaded from cache (4 downloading)
67.36 s
Downloaded cached krb5-1.22.2-lib (2.7 MiB) in 94ms
67.36 s
Progress: 0 of 3 built, 32 of 53 downloaded from cache (3 downloading)
67.36 s
Downloading cached curl from https://cache.nix-ci.com
67.39 s
Downloaded cached aws-c-event-stream (176 KiB) in 40ms
67.39 s
Progress: 0 of 3 built, 33 of 53 downloaded from cache (3 downloading)
67.39 s
Downloaded cached aws-c-http (641 KiB) in 42ms
67.39 s
Progress: 0 of 3 built, 34 of 53 downloaded from cache (2 downloading)
67.39 s
Downloading cached aws-c-auth from https://cache.nix-ci.com
67.39 s
Downloading cached aws-c-mqtt from https://cache.nix-ci.com
67.40 s
Downloaded cached curl (1.2 MiB) in 41ms
67.40 s
Progress: 0 of 3 built, 35 of 53 downloaded from cache (3 downloading)
67.40 s
Downloading cached elfutils from https://cache.nix-ci.com
67.40 s
Downloaded cached icu4c (39.5 MiB) in 218ms
67.40 s
Progress: 0 of 3 built, 36 of 53 downloaded from cache (3 downloading)
67.40 s
Downloading cached boost from https://cache.nix-ci.com
67.44 s
Downloaded cached aws-c-mqtt (557 KiB) in 42ms
67.44 s
Progress: 0 of 3 built, 37 of 53 downloaded from cache (3 downloading)
67.44 s
Downloaded cached aws-c-auth (387 KiB) in 44ms
67.44 s
Progress: 0 of 3 built, 38 of 53 downloaded from cache (2 downloading)
67.44 s
Downloading cached aws-c-s3 from https://cache.nix-ci.com
67.46 s
Downloaded cached elfutils (4.1 MiB) in 58ms
67.46 s
Progress: 0 of 3 built, 39 of 53 downloaded from cache (2 downloading)
67.46 s
Downloading cached ShellCheck from https://cache.nix-ci.com
67.48 s
Downloaded cached aws-c-s3 (384 KiB) in 43ms
67.48 s
Progress: 0 of 3 built, 40 of 53 downloaded from cache (2 downloading)
67.48 s
Downloading cached aws-crt-cpp from https://cache.nix-ci.com
67.50 s
Downloaded cached boost (14.5 MiB) in 99ms
67.50 s
Progress: 0 of 3 built, 41 of 53 downloaded from cache (2 downloading)
67.50 s
Downloading cached nix-util from https://cache.nix-ci.com
67.53 s
Downloaded cached ShellCheck (7.5 MiB) in 65ms
67.53 s
Progress: 0 of 3 built, 42 of 53 downloaded from cache (2 downloading)
67.54 s
Downloaded cached aws-crt-cpp (979 KiB) in 52ms
67.54 s
Progress: 0 of 2 built, 43 of 53 downloaded from cache (1 downloading)
67.57 s
Downloaded cached nix-util (2.4 MiB) in 62ms
67.57 s
Progress: 0 of 2 built, 44 of 53 downloaded from cache
67.57 s
Downloading cached nix-store from https://cache.nix-ci.com
67.57 s
Downloading cached nix-nswrapper from https://cache.nix-ci.com
67.61 s
Downloaded cached nix-nswrapper (131 KiB) in 44ms
67.61 s
Progress: 0 of 2 built, 45 of 53 downloaded from cache (1 downloading)
67.64 s
Downloaded cached nix-store (5.8 MiB) in 73ms
67.64 s
Progress: 0 of 2 built, 46 of 53 downloaded from cache
67.64 s
Downloading cached nix-fetchers from https://cache.nix-ci.com
67.64 s
Downloading cached nix-main from https://cache.nix-ci.com
67.68 s
Downloaded cached nix-main (393 KiB) in 42ms
67.68 s
Progress: 0 of 2 built, 47 of 53 downloaded from cache (1 downloading)
67.69 s
Downloaded cached nix-fetchers (1.5 MiB) in 46ms
67.69 s
Progress: 0 of 2 built, 48 of 53 downloaded from cache
67.69 s
Downloading cached nix-expr from https://cache.nix-ci.com
67.74 s
Downloaded cached nix-expr (3.3 MiB) in 52ms
67.74 s
Progress: 0 of 2 built, 49 of 53 downloaded from cache
67.74 s
Downloading cached nix-flake from https://cache.nix-ci.com
67.78 s
Downloaded cached nix-flake (956 KiB) in 42ms
67.78 s
Progress: 0 of 2 built, 50 of 53 downloaded from cache
67.79 s
Downloading cached nix-cmd from https://cache.nix-ci.com
67.83 s
Downloaded cached nix-cmd (1 MiB) in 42ms
67.83 s
Progress: 0 of 2 built, 51 of 53 downloaded from cache
67.83 s
Downloading cached nix from https://cache.nix-ci.com
67.88 s
Downloaded cached nix (3.9 MiB) in 53ms
67.88 s
Progress: 0 of 2 built, 52 of 53 downloaded from cache
67.88 s
Downloading cached nix from https://cache.nix-ci.com
67.92 s
Downloaded cached nix (8848 B) in 40ms
67.92 s
Progress: 0 of 2 built, 53 of 53 downloaded from cache
68.05 s
Building /nix/store/szln1l8wm5vlpfi7g89ipndlc5458ghn-nix-ci-check-gammaloop-doctest.drv
68.06 s
[nix-ci-check-gammaloop-doctest] structuredAttrs is enabled
68.15 s
[nix-ci-check-gammaloop-doctest:post-build] Uploading to the NixCI cache: /nix/store/dg3l8vym68h58afh8dxnc9c56kjknhwh-nix-ci-check-gammaloop-doctest
68.25 s
[nix-ci-check-gammaloop-doctest:post-build] warning: 'warn-short-path-literals' is deprecated, use 'lint-short-path-literals = ignore' instead
68.29 s
[nix-ci-check-gammaloop-doctest:post-build] copying 1 paths...
68.29 s
[nix-ci-check-gammaloop-doctest:post-build] copying path '/nix/store/dg3l8vym68h58afh8dxnc9c56kjknhwh-nix-ci-check-gammaloop-doctest' to 'https://cache.nix-ci.com'...
68.51 s
[nix-ci-check-gammaloop-doctest:post-build] warning: 'warn-short-path-literals' is deprecated, use 'lint-short-path-literals = ignore' instead
69.13 s
[nix-ci-check-gammaloop-doctest:post-build] copying 0 paths...
69.16 s
Uploaded nix-ci-check-gammaloop-doctest in 1.0s
69.16 s
Progress: 1 of 2 built, 53 of 53 downloaded from cache
69.16 s
Built nix-ci-check-gammaloop-doctest in 1.1s
69.16 s
Progress: 2 of 2 built, 53 of 53 downloaded from cache
69.39 s
evaluating derivation 'gdo you want to allow configuration setting 'extra-substituters' to be set to 'https://cache.nix-ci.com ' (y/N)? do you want to permanently mark this value as untrusted (y/N)? warning: ignoring untrusted flake configuration setting 'extra-substituters'.
69.39 s
Pass '--accept-flake-config' to trust it
69.39 s
do you want to allow configuration setting 'extra-trusted-public-keys' to be set to 'nix-ci:g3xV5BDTLtIBZr/A00IU1x0EtKKlb7YLgBN2SgYgM6A= ' (y/N)? do you want to permanently mark this value as untrusted (y/N)? warning: ignoring untrusted flake configuration setting 'extra-trusted-public-keys'.
69.39 s
Pass '--accept-flake-config' to trust it
105.07 s
copying '/nix/store/639g
evaluating derivation 'g
copying '/nix/store/639g
evaluating derivation 'g
copying '/nix/store/639g
evaluating derivation 'g
copying '/nix/store/639g
evaluating derivation 'g
copying '/nix/store/639g
evaluating derivation 'g
copying '/nix/store/639g
evaluating derivation 'g
copying '/nix/store/639g
evaluating derivation 'g
copying '/nix/store/639g
evaluating derivation 'g
copying '/nix/store/639g
evaluating derivation 'g
copying '/nix/store/639g
evaluating derivation 'g
copying '/nix/store/639g
evaluating derivation 'g
copying '/nix/store/639g
evaluating derivation 'g
copying '/nix/store/639g
evaluating derivation 'g
copying '/nix/store/639g
evaluating derivation 'g
copying '/nix/store/639g
evaluating derivation 'g
copying '/nix/store/639g
evaluating derivation 'g
copying '/nix/store/639g
evaluating derivation 'g
copying '/nix/store/639g
evaluating derivation 'g
copying '/nix/store/639g
evaluating derivation 'g
copying '/nix/store/639g
evaluating derivation 'g
copying '/nix/store/639g
evaluating derivation 'g
copying '/nix/store/639g
evaluating derivation 'g
copying '/nix/store/639g
evaluating derivation 'g
copying '/nix/store/639g
evaluating derivation 'g
copying '/nix/store/639g
evaluating derivation 'g
copying '/nix/store/639g
evaluating derivation 'g
copying '/nix/store/639g
evaluating derivation 'g
copying '/nix/store/639g
evaluating derivation 'g
copying '/nix/store/639g
evaluating derivation 'g
copying '/nix/store/639g
evaluating derivation 'g
copying '/nix/store/639g
evaluating derivation 'g
copying '/nix/store/639g
evaluating derivation 'g
copying '/nix/store/639g
evaluating derivation 'g
copying '/nix/store/639g
evaluating derivation 'g
copying '/nix/store/639g
evaluating derivation 'g
copying '/nix/store/639g
evaluating derivation 'g
copying '/nix/store/639g
evaluating derivation 'g
copying '/nix/store/639g
evaluating derivation 'g
copying '/nix/store/639g
evaluating derivation 'g
copying '/nix/store/639g
evaluating derivation 'g
copying '/nix/store/639g
evaluating derivation 'g
copying '/nix/store/639g
evaluating derivation 'g
copying '/nix/store/639g
evaluating derivation 'g
copying '/nix/store/639g
evaluating derivation 'g
copying '/nix/store/639g
evaluating derivation 'g
copying '/nix/store/639g
evaluating derivation 'g
copying '/nix/store/639g
evaluating derivation 'g
copying '/nix/store/639g
evaluating derivation 'g
copying '/nix/store/639g
evaluating derivation 'g
copying '/nix/store/639g
evaluating derivation 'g
copying '/nix/store/639g
evaluating derivation 'g
copying '/nix/store/639g
evaluating derivation 'g
copying '/nix/store/639g
evaluating derivation 'g
copying '/nix/store/639g
evaluating derivation 'g
copying '/nix/store/639g
evaluating derivation 'g
copying '/nix/store/639g
evaluating derivation 'g
copying '/nix/store/639g
evaluating derivation 'g
copying '/nix/store/639g
evaluating derivation 'g
copying '/nix/store/639g
evaluating derivation 'g
copying '/nix/store/639g
evaluating derivation 'g
copying '/nix/store/639g
evaluating derivation 'g
copying '/nix/store/639g
evaluating derivation 'g
copying '/nix/store/639g
evaluating derivation 'g
copying '/nix/store/639g
evaluating derivation 'g
copying '/nix/store/639g
evaluating derivation 'g
copying '/nix/store/639g
evaluating derivation 'g
copying '/nix/store/639g
evaluating derivation 'g
copying '/nix/store/639g
evaluating derivation 'g
copying '/nix/store/639g
evaluating derivation 'g
copying '/nix/store/639g
evaluating derivation 'g
copying '/nix/store/639g
evaluating derivation 'g
copying '/nix/store/639g
evaluating derivation 'g
copying '/nix/store/639g
evaluating derivation 'g
copying '/nix/store/639g
evaluating derivation 'g
copying '/nix/store/639g
evaluating derivation 'g
copying '/nix/store/639g
evaluating derivation 'g
copying '/nix/store/639g
evaluating derivation 'g
copying '/nix/store/639g
evaluating derivation 'g
copying '/nix/store/639g
evaluating derivation 'g
copying '/nix/store/639g
evaluating derivation 'g
copying '/nix/store/639g
evaluating derivation 'g
copying '/nix/store/639g
evaluating derivation 'g
copying '/nix/store/639g
evaluating derivation 'g
copying '/nix/store/639g
evaluating derivation 'g
copying '/nix/store/639g
evaluating derivation 'g
copying '/nix/store/639g
evaluating derivation 'g
copying '/nix/store/639g
evaluating derivation 'g
copying '/nix/store/639g
evaluating derivation 'g
copying '/nix/store/639g
evaluating derivation 'g
copying '/nix/store/639g
evaluating derivation 'g
copying '/nix/store/639g
evaluating derivation 'g
copying '/nix/store/639g
evaluating derivation 'g
copying '/nix/store/639g
evaluating derivation 'g
copying '/nix/store/639g
evaluating derivation 'g
copying '/nix/store/639g
evaluating derivation 'g
copying '/nix/store/639g
evaluating derivation 'g
copying '/nix/store/639g
evaluating derivation 'g
copying '/nix/store/639g
evaluating derivation 'g
copying '/nix/store/639g
evaluating derivation 'g
copying '/nix/store/639g
evaluating derivation 'g
copying '/nix/store/639g
evaluating derivation 'g
copying '/nix/store/639g
evaluating derivation 'g
copying '/nix/store/639g
evaluating derivation 'g
copying '/nix/store/639g
evaluating derivation 'g
copying '/nix/store/639g
evaluating derivation 'g
copying '/nix/store/639g
evaluating derivation 'g
copying '/nix/store/639g
querying gammaloop-works
[0.0 KiB DL] querying ga
[0.5 KiB DL] querying ga
[0.5 KiB DL] querying in
[1.2 KiB DL] querying ga
[1.7 KiB DL] querying ga
[1.7 KiB DL] querying in
[3.2 KiB DL] querying ga
[4.2 KiB DL] querying ga
[4.2 KiB DL] querying so
[4.7 KiB DL] querying ga
[4.7 KiB DL]
[0 /19 built, 3 /0 /11 copi
[1 /0 /41 built, 13 /0 /13 c
[2 /0 /55 built, 13 /0 /13 c
[3 /0 /29 built, 14 /0 /14 cgammaloop-ci-consumer-gammaloop-api-Cargo.toml> structuredAttrs is enabled
105.07 s
[4 /0 /29 built, 14 /0 /14 cgammaloop-ci-consumer-gammaloop-api-Cargo.toml> structuredAttrs is enabled
105.07 s
gammaloop-ci-consumer-gammalooprs-Cargo.toml> structuredAttrs is enabled
105.09 s
gammaloop-ci-consumer-gammaloop-api-Cargo.toml (post)> Uploading to the NixCI cache: /nix/store/fyc9a9nck1ap59mrnx1x27f9mg7fn7hk-gammaloop-ci-consumer-gammaloop-api-Cargo.toml
105.14 s
gammaloop-ci-consumer-gammaloop-api-Cargo.toml (post)> warning: 'warn-short-path-literals' is deprecated, use 'lint-short-path-literals = ignore' instead
105.24 s
gammaloop-ci-consumer-gammaloop-api-Cargo.toml (post)> copying 0 paths...
105.34 s
gammaloop-ci-consumer-gammaloop-api-Cargo.toml (post)> warning: 'warn-short-path-literals' is deprecated, use 'lint-short-path-literals = ignore' instead
105.48 s
gammaloop-ci-consumer-gammaloop-api-Cargo.toml (post)> copying 0 paths...
105.52 s
[3 /1 /30 built, 14 /0 /14 cgammaloop-ci-consumer-gammaloop-api-Cargo.toml (post)> Uploading to the NixCI cache: /nix/store/sz9w4gfrsyp1nb3szq8mngnjfg8kjfa4-gammaloop-ci-consumer-gammaloop-api-Cargo.toml
105.58 s
gammaloop-ci-consumer-gammaloop-api-Cargo.toml (post)> warning: 'warn-short-path-literals' is deprecated, use 'lint-short-path-literals = ignore' instead
105.70 s
gammaloop-ci-consumer-gammaloop-api-Cargo.toml (post)> copying 0 paths...
105.83 s
gammaloop-ci-consumer-gammaloop-api-Cargo.toml (post)> warning: 'warn-short-path-literals' is deprecated, use 'lint-short-path-literals = ignore' instead
105.96 s
gammaloop-ci-consumer-gammaloop-api-Cargo.toml (post)> copying 0 paths...
106.00 s
gammaloop-ci-consumer-gammalooprs-Cargo.toml (post)> Uploading to the NixCI cache: /nix/store/8gyk134vhx91w23yqirsz8ddysga3zbw-gammaloop-ci-consumer-gammalooprs-Cargo.toml
106.05 s
[2 /2 /31 built, 14 /0 /14 cgammaloop-ci-consumer-gammalooprs-Cargo.toml (post)> warning: 'warn-short-path-literals' is deprecated, use 'lint-short-path-literals = ignore' instead
106.16 s
gammaloop-ci-consumer-gammalooprs-Cargo.toml (post)> copying 0 paths...
106.23 s
gammaloop-ci-consumer-gammalooprs-Cargo.toml (post)> warning: 'warn-short-path-literals' is deprecated, use 'lint-short-path-literals = ignore' instead
106.33 s
gammaloop-ci-consumer-gammalooprs-Cargo.toml (post)> copying 0 paths...
106.35 s
gammaloop-ci-consumer-gammalooprs-Cargo.toml> structuredAttrs is enabled
106.37 s
[1 /3 /29 built, 12 /2 /14 c
[1 /3 /27 built, 12 /2 /14 cgammaloop-ci-consumer-gammalooprs-Cargo.toml (post)> Uploading to the NixCI cache: /nix/store/vr50hjhrc6rxj3jylnf7srzl9a1vgk5l-gammaloop-ci-consumer-gammalooprs-Cargo.toml
106.43 s
gammaloop-ci-consumer-gammalooprs-Cargo.toml (post)> warning: 'warn-short-path-literals' is deprecated, use 'lint-short-path-literals = ignore' instead
106.54 s
gammaloop-ci-consumer-gammalooprs-Cargo.toml (post)> copying 0 paths...
106.61 s
gammaloop-ci-consumer-gammalooprs-Cargo.toml (post)> warning: 'warn-short-path-literals' is deprecated, use 'lint-short-path-literals = ignore' instead
106.72 s
gammaloop-ci-consumer-gammalooprs-Cargo.toml (post)> copying 0 paths...
107.47 s
[4 /26 built, 11 /3 /14 cop
[4 /25 built, 10 /4 /14 cop
[4 /24 built, 9 /5 /14 copi
120.92 s
[4 /23 built, 8 /6 /14 copi
134.28 s
[4 /22 built, 7 /7 /14 copi
156.01 s
[4 /21 built, 6 /8 /14 copi
166.36 s
[4 /20 built, 5 /9 /14 copi
192.23 s
[4 /19 built, 4 /10 /14 cop
211.50 s
[4 /18 built, 3 /11 /14 cop
243.50 s
[4 /17 built, 2 /12 /14 cop
[4 /16 built, 1 /13 /14 cop
[4 /15 built, 14 copied (
641.10 s
[1 /4 /14 built, 14 copied
811.41 s
gammaloop-crate-gammalooprs-dependency-deps-inputs> compressing and installing full archive of target to /nix/store/yz9b5n4diq9dx5viyxx8jfgqxrrhh4ry-gammaloop-crate-gammalooprs-dependency-deps-inputs/target.tar.zst as requested
816.16 s
gammaloop-crate-gammalooprs-dependency-deps-inputs> /*stdin*\ : 26.21% ( 3.91 GiB => 1.02 GiB, /nix/store/yz9b5n4diq9dx5viyxx8jfgqxrrhh4ry-gammaloop-crate-gammalooprs-dependency-deps-inputs/target.tar.zst)
817.90 s
gammaloop-crate-gammalooprs-dependency-deps-inputs (post)> Uploading to the NixCI cache: /nix/store/yz9b5n4diq9dx5viyxx8jfgqxrrhh4ry-gammaloop-crate-gammalooprs-dependency-deps-inputs
817.96 s
gammaloop-crate-gammalooprs-dependency-deps-inputs (post)> warning: 'warn-short-path-literals' is deprecated, use 'lint-short-path-literals = ignore' instead
818.00 s
gammaloop-crate-gammalooprs-dependency-deps-inputs (post)> copying 1 paths...
818.00 s
gammaloop-crate-gammalooprs-dependency-deps-inputs (post)> copying path '/nix/store/yz9b5n4diq9dx5viyxx8jfgqxrrhh4ry-gammaloop-crate-gammalooprs-dependency-deps-inputs' to 'https://cache.nix-ci.com'...
916.45 s
gammaloop-crate-gammalooprs-dependency-deps-inputs (post)> warning: 'warn-short-path-literals' is deprecated, use 'lint-short-path-literals = ignore' instead
916.68 s
gammaloop-crate-gammalooprs-dependency-deps-inputs (post)> copying 0 paths...
916.85 s
[5 /15 built, 14 copied (
[1 /5 /14 built, 14 copiedgammaloop-crate-gammalooprs-dependency-deps-deps> Running phase: unpackPhase
916.86 s
gammaloop-crate-gammalooprs-dependency-deps-deps> unpacking source archive /nix/store/0nl9f50sx1snwljv8vcl7h9gp09785ni-source
917.04 s
gammaloop-crate-gammalooprs-dependency-deps-deps> source root is source
917.06 s
gammaloop-crate-gammalooprs-dependency-deps-deps> Running phase: patchPhase
917.19 s
gammaloop-crate-gammalooprs-dependency-deps-deps> Executing configureCargoCommonVars
917.19 s
gammaloop-crate-gammalooprs-dependency-deps-deps> decompressing cargo artifacts from /nix/store/yz9b5n4diq9dx5viyxx8jfgqxrrhh4ry-gammaloop-crate-gammalooprs-dependency-deps-inputs/target.tar.zst to target
921.26 s
gammaloop-crate-gammalooprs-dependency-deps-deps> Running phase: updateAutotoolsGnuConfigScriptsPhase
921.45 s
gammaloop-crate-gammalooprs-dependency-deps-deps> Running phase: configurePhase
921.54 s
gammaloop-crate-gammalooprs-dependency-deps-deps> will append /build/source/.cargo-home/config.toml with contents of /nix/store/w72xdqk1lvxyqjazv52iqg1ir83d7798-vendor-cargo-deps/config.toml
921.54 s
gammaloop-crate-gammalooprs-dependency-deps-deps> default configurePhase, nothing to do
921.54 s
gammaloop-crate-gammalooprs-dependency-deps-deps> Running phase: buildPhase
921.72 s
gammaloop-crate-gammalooprs-dependency-deps-deps> +++ command cargo --version
921.72 s
gammaloop-crate-gammalooprs-dependency-deps-deps> cargo 1.98.1 (797e8a9bc 2026-08-05)
921.72 s
gammaloop-crate-gammalooprs-dependency-deps-deps> +++ command cargo build --profile ci-optim --offline -p gammaloop-ci-consumer-gammalooprs -p gammaloop-workspace-hack --features symbolica/tracing_max_level_info
922.78 s
gammaloop-crate-gammalooprs-dependency-deps-deps> warning : unused import: `super::super::traits::*`
922.78 s
gammaloop-crate-gammalooprs-dependency-deps-deps> --> vendor/clarabel/src/solver/core/solver.rs:470:9
922.78 s
gammaloop-crate-gammalooprs-dependency-deps-deps> |
922.78 s
gammaloop-crate-gammalooprs-dependency-deps-deps> 470 | use super::super::traits::*;
922.78 s
gammaloop-crate-gammalooprs-dependency-deps-deps> | ^^^^^^^^^^^^^^^^^^^^^^^
922.78 s
gammaloop-crate-gammalooprs-dependency-deps-deps> |
922.78 s
gammaloop-crate-gammalooprs-dependency-deps-deps> = note : `#[warn(unused_imports)]` (part of `#[warn(unused)]`) on by default
922.78 s
gammaloop-crate-gammalooprs-dependency-deps-deps>
922.78 s
gammaloop-crate-gammalooprs-dependency-deps-deps> warning : hiding a lifetime that's elided elsewhere is confusing
922.78 s
gammaloop-crate-gammalooprs-dependency-deps-deps> --> vendor/clarabel/src/solver/core/kktsolvers/direct/quasidef/datamaps.rs:26:39
922.78 s
gammaloop-crate-gammalooprs-dependency-deps-deps> |
922.78 s
gammaloop-crate-gammalooprs-dependency-deps-deps> 26 | pub(crate) fn to_sparse_expansion(&self) -> Option<SparseExpansionCone<T>> {
922.78 s
gammaloop-crate-gammalooprs-dependency-deps-deps> | ^^^^^ ^^^^^^^^^^^^^^^^^^^^^^ the same lifetime is hidden here
922.78 s
gammaloop-crate-gammalooprs-dependency-deps-deps> | |
922.78 s
gammaloop-crate-gammalooprs-dependency-deps-deps> | the lifetime is elided here
922.78 s
gammaloop-crate-gammalooprs-dependency-deps-deps> |
922.78 s
gammaloop-crate-gammalooprs-dependency-deps-deps> = help : the same lifetime is referred to in inconsistent ways, making the signature confusing
922.78 s
gammaloop-crate-gammalooprs-dependency-deps-deps> = note : `#[warn(mismatched_lifetime_syntaxes)]` on by default
922.78 s
gammaloop-crate-gammalooprs-dependency-deps-deps> help : use `'_` for type paths
922.78 s
gammaloop-crate-gammalooprs-dependency-deps-deps> |
922.78 s
gammaloop-crate-gammalooprs-dependency-deps-deps> 26 | pub(crate) fn to_sparse_expansion(&self) -> Option<SparseExpansionCone<'_, T>> {
922.78 s
gammaloop-crate-gammalooprs-dependency-deps-deps> | +++
922.78 s
gammaloop-crate-gammalooprs-dependency-deps-deps>
922.78 s
gammaloop-crate-gammalooprs-dependency-deps-deps> warning : `clarabel` (lib) generated 2 warnings (run `cargo fix --lib -p clarabel` to apply 2 suggestions)
922.78 s
gammaloop-crate-gammalooprs-dependency-deps-deps> Compiling spenso v0.6.0 (/build/source/crates/spenso)
922.78 s
gammaloop-crate-gammalooprs-dependency-deps-deps> Compiling three-dimensional-reps v0.1.0 (/build/source/crates/three-dimensional-reps)
931.89 s
gammaloop-crate-gammalooprs-dependency-deps-deps> Compiling idenso v0.3.0 (/build/source/crates/idenso)
931.89 s
gammaloop-crate-gammalooprs-dependency-deps-deps> Compiling feynkit-kinematics v0.1.0 (/build/source/crates/feynkit-kinematics)
931.89 s
gammaloop-crate-gammalooprs-dependency-deps-deps> Compiling gammaloop-tracing-filter v0.1.0 (/build/source/crates/gammaloop-tracing-filter)
946.14 s
gammaloop-crate-gammalooprs-dependency-deps-deps> Compiling feynkit-graph v0.1.0 (/build/source/crates/feynkit-graph)
946.14 s
gammaloop-crate-gammalooprs-dependency-deps-deps> Compiling spenso-hep-lib v0.1.7 (/build/source/crates/spenso-hep-lib)
958.93 s
gammaloop-crate-gammalooprs-dependency-deps-deps> Compiling feynkit-amplitude v0.1.0 (/build/source/crates/feynkit-amplitude)
958.93 s
gammaloop-crate-gammalooprs-dependency-deps-deps> Compiling feynkit-tensor v0.1.0 (/build/source/crates/feynkit-tensor)
958.93 s
gammaloop-crate-gammalooprs-dependency-deps-deps> Compiling feynkit-cff v0.1.0 (/build/source/crates/feynkit-cff)
972.50 s
gammaloop-crate-gammalooprs-dependency-deps-deps> Compiling vakint v0.1.2 (/build/source/crates/vakint)
981.28 s
gammaloop-crate-gammalooprs-dependency-deps-deps> Compiling feynkit-generator v0.1.0 (/build/source/crates/feynkit-generator)
1002.00 s
gammaloop-crate-gammalooprs-dependency-deps-deps> Compiling gammaloop-ci-consumer-gammalooprs v0.1.0 (/build/source/crates/gammaloop-ci-consumer-gammalooprs)
1097.48 s
gammaloop-crate-gammalooprs-dependency-deps-deps> Finished `ci-optim` profile [optimized] target(s) in 2m 55s
1099.02 s
gammaloop-crate-gammalooprs-dependency-deps-deps> buildPhase completed in 2 minutes 57 seconds
1099.02 s
gammaloop-crate-gammalooprs-dependency-deps-deps> Running phase: installPhase
1099.03 s
gammaloop-crate-gammalooprs-dependency-deps-deps> compressing and installing full archive of target to /nix/store/6cbkclc8ifhdlgmmsvxzwn80gzgdzs5h-gammaloop-crate-gammalooprs-dependency-deps-deps-0.1.0/target.tar.zst as requested
1105.69 s
gammaloop-crate-gammalooprs-dependency-deps-deps> /*stdin*\ : 26.47% ( 3.29 GiB => 893 MiB, /nix/store/6cbkclc8ifhdlgmmsvxzwn80gzgdzs5h-gammaloop-crate-gammalooprs-dependency-deps-deps-0.1.0/target.tar.zst)
1105.71 s
gammaloop-crate-gammalooprs-dependency-deps-deps> Running phase: fixupPhase
1105.72 s
gammaloop-crate-gammalooprs-dependency-deps-deps> shrinking RPATHs of ELF executables and libraries in /nix/store/6cbkclc8ifhdlgmmsvxzwn80gzgdzs5h-gammaloop-crate-gammalooprs-dependency-deps-deps-0.1.0
1105.72 s
gammaloop-crate-gammalooprs-dependency-deps-deps> checking for references to /build/ in /nix/store/6cbkclc8ifhdlgmmsvxzwn80gzgdzs5h-gammaloop-crate-gammalooprs-dependency-deps-deps-0.1.0...
1105.74 s
gammaloop-crate-gammalooprs-dependency-deps-deps> patching script interpreter paths in /nix/store/6cbkclc8ifhdlgmmsvxzwn80gzgdzs5h-gammaloop-crate-gammalooprs-dependency-deps-deps-0.1.0
1106.74 s
gammaloop-crate-gammalooprs-dependency-deps-deps (post)> Uploading to the NixCI cache: /nix/store/6cbkclc8ifhdlgmmsvxzwn80gzgdzs5h-gammaloop-crate-gammalooprs-dependency-deps-deps-0.1.0
1106.78 s
gammaloop-crate-gammalooprs-dependency-deps-deps (post)> warning: 'warn-short-path-literals' is deprecated, use 'lint-short-path-literals = ignore' instead
1106.82 s
gammaloop-crate-gammalooprs-dependency-deps-deps (post)> copying 1 paths...
1106.82 s
gammaloop-crate-gammalooprs-dependency-deps-deps (post)> copying path '/nix/store/6cbkclc8ifhdlgmmsvxzwn80gzgdzs5h-gammaloop-crate-gammalooprs-dependency-deps-deps-0.1.0' to 'https://cache.nix-ci.com'...
1211.17 s
gammaloop-crate-gammalooprs-dependency-deps-deps (post)> warning: 'warn-short-path-literals' is deprecated, use 'lint-short-path-literals = ignore' instead
1211.45 s
gammaloop-crate-gammalooprs-dependency-deps-deps (post)> copying 0 paths...
1211.74 s
[6 /15 built, 14 copied (
[1 /6 /14 built, 14 copied
1341.73 s
gammaloop-crate-gammalooprs-dependency-inputs> compressing and installing full archive of target to /nix/store/3cc1kzf5zdlmn0jfjrl0szscr7bily92-gammaloop-crate-gammalooprs-dependency-inputs/target.tar.zst as requested
1344.82 s
gammaloop-crate-gammalooprs-dependency-inputs> /*stdin*\ : 26.21% ( 3.91 GiB => 1.02 GiB, /nix/store/3cc1kzf5zdlmn0jfjrl0szscr7bily92-gammaloop-crate-gammalooprs-dependency-inputs/target.tar.zst)
1346.72 s
gammaloop-crate-gammalooprs-dependency-inputs (post)> Uploading to the NixCI cache: /nix/store/3cc1kzf5zdlmn0jfjrl0szscr7bily92-gammaloop-crate-gammalooprs-dependency-inputs
1346.76 s
gammaloop-crate-gammalooprs-dependency-inputs (post)> warning: 'warn-short-path-literals' is deprecated, use 'lint-short-path-literals = ignore' instead
1346.79 s
gammaloop-crate-gammalooprs-dependency-inputs (post)> copying 1 paths...
1346.79 s
gammaloop-crate-gammalooprs-dependency-inputs (post)> copying path '/nix/store/3cc1kzf5zdlmn0jfjrl0szscr7bily92-gammaloop-crate-gammalooprs-dependency-inputs' to 'https://cache.nix-ci.com'...
1433.50 s
gammaloop-crate-gammalooprs-dependency-inputs (post)> warning: 'warn-short-path-literals' is deprecated, use 'lint-short-path-literals = ignore' instead
1434.07 s
gammaloop-crate-gammalooprs-dependency-inputs (post)> copying 0 paths...
1434.90 s
[7 /15 built, 14 copied (
[1 /7 /14 built, 14 copiedgammaloop-crate-gammalooprs-dependency-deps> Running phase: unpackPhase
1434.91 s
gammaloop-crate-gammalooprs-dependency-deps> unpacking source archive /nix/store/c86gh57ixnq4aq2gd434m6sq844wg01d-source
1437.65 s
gammaloop-crate-gammalooprs-dependency-deps> source root is source
1437.71 s
gammaloop-crate-gammalooprs-dependency-deps> Running phase: patchPhase
1437.87 s
gammaloop-crate-gammalooprs-dependency-deps> Executing configureCargoCommonVars
1437.87 s
gammaloop-crate-gammalooprs-dependency-deps> decompressing cargo artifacts from /nix/store/3cc1kzf5zdlmn0jfjrl0szscr7bily92-gammaloop-crate-gammalooprs-dependency-inputs/target.tar.zst to target
1448.60 s
gammaloop-crate-gammalooprs-dependency-deps> Running phase: updateAutotoolsGnuConfigScriptsPhase
1448.67 s
gammaloop-crate-gammalooprs-dependency-deps> Running phase: configurePhase
1448.68 s
gammaloop-crate-gammalooprs-dependency-deps> will append /build/source/.cargo-home/config.toml with contents of /nix/store/w72xdqk1lvxyqjazv52iqg1ir83d7798-vendor-cargo-deps/config.toml
1448.68 s
gammaloop-crate-gammalooprs-dependency-deps> default configurePhase, nothing to do
1448.68 s
gammaloop-crate-gammalooprs-dependency-deps> Running phase: buildPhase
1448.72 s
gammaloop-crate-gammalooprs-dependency-deps> +++ command cargo --version
1448.72 s
gammaloop-crate-gammalooprs-dependency-deps> cargo 1.98.1 (797e8a9bc 2026-08-05)
1448.72 s
gammaloop-crate-gammalooprs-dependency-deps> +++ command cargo build --profile ci-optim --offline -p gammaloop-ci-consumer-gammalooprs -p gammaloop-workspace-hack --features symbolica/tracing_max_level_info
1449.29 s
gammaloop-crate-gammalooprs-dependency-deps> warning : unused import: `super::super::traits::*`
1449.29 s
gammaloop-crate-gammalooprs-dependency-deps> --> vendor/clarabel/src/solver/core/solver.rs:470:9
1449.29 s
gammaloop-crate-gammalooprs-dependency-deps> |
1449.29 s
gammaloop-crate-gammalooprs-dependency-deps> 470 | use super::super::traits::*;
1449.29 s
gammaloop-crate-gammalooprs-dependency-deps> | ^^^^^^^^^^^^^^^^^^^^^^^
1449.29 s
gammaloop-crate-gammalooprs-dependency-deps> |
1449.29 s
gammaloop-crate-gammalooprs-dependency-deps> = note : `#[warn(unused_imports)]` (part of `#[warn(unused)]`) on by default
1449.29 s
gammaloop-crate-gammalooprs-dependency-deps>
1449.29 s
gammaloop-crate-gammalooprs-dependency-deps> warning : hiding a lifetime that's elided elsewhere is confusing
1449.29 s
gammaloop-crate-gammalooprs-dependency-deps> --> vendor/clarabel/src/solver/core/kktsolvers/direct/quasidef/datamaps.rs:26:39
1449.29 s
gammaloop-crate-gammalooprs-dependency-deps> |
1449.29 s
gammaloop-crate-gammalooprs-dependency-deps> 26 | pub(crate) fn to_sparse_expansion(&self) -> Option<SparseExpansionCone<T>> {
1449.29 s
gammaloop-crate-gammalooprs-dependency-deps> | ^^^^^ ^^^^^^^^^^^^^^^^^^^^^^ the same lifetime is hidden here
1449.29 s
gammaloop-crate-gammalooprs-dependency-deps> | |
1449.29 s
gammaloop-crate-gammalooprs-dependency-deps> | the lifetime is elided here
1449.29 s
gammaloop-crate-gammalooprs-dependency-deps> |
1449.29 s
gammaloop-crate-gammalooprs-dependency-deps> = help : the same lifetime is referred to in inconsistent ways, making the signature confusing
1449.29 s
gammaloop-crate-gammalooprs-dependency-deps> = note : `#[warn(mismatched_lifetime_syntaxes)]` on by default
1449.29 s
gammaloop-crate-gammalooprs-dependency-deps> help : use `'_` for type paths
1449.29 s
gammaloop-crate-gammalooprs-dependency-deps> |
1449.29 s
gammaloop-crate-gammalooprs-dependency-deps> 26 | pub(crate) fn to_sparse_expansion(&self) -> Option<SparseExpansionCone<'_, T>> {
1449.29 s
gammaloop-crate-gammalooprs-dependency-deps> | +++
1449.29 s
gammaloop-crate-gammalooprs-dependency-deps>
1449.29 s
gammaloop-crate-gammalooprs-dependency-deps> warning : `clarabel` (lib) generated 2 warnings (run `cargo fix --lib -p clarabel` to apply 2 suggestions)
1449.29 s
gammaloop-crate-gammalooprs-dependency-deps> Compiling darling_core v0.23.0
1449.29 s
gammaloop-crate-gammalooprs-dependency-deps> Compiling strum_macros v0.28.0
1449.29 s
gammaloop-crate-gammalooprs-dependency-deps> Compiling kasuari v0.4.12
1449.29 s
gammaloop-crate-gammalooprs-dependency-deps> Compiling spenso v0.6.0 (/build/source/crates/spenso)
1449.30 s
gammaloop-crate-gammalooprs-dependency-deps> Compiling rand_distr v0.4.3
1449.31 s
gammaloop-crate-gammalooprs-dependency-deps> Compiling simba v0.6.0
1449.31 s
gammaloop-crate-gammalooprs-dependency-deps> Compiling three-dimensional-reps v0.1.0 (/build/source/crates/three-dimensional-reps)
1449.33 s
gammaloop-crate-gammalooprs-dependency-deps> Compiling crossterm v0.28.1
1449.33 s
gammaloop-crate-gammalooprs-dependency-deps> Compiling tracing-error v0.2.1
1449.34 s
gammaloop-crate-gammalooprs-dependency-deps> Compiling backtrace v0.3.76
1449.35 s
gammaloop-crate-gammalooprs-dependency-deps> Compiling deprecate-until v1.0.0
1449.35 s
gammaloop-crate-gammalooprs-dependency-deps> Compiling gammalooprs v0.3.4 (/build/source/crates/gammalooprs)
1449.35 s
gammaloop-crate-gammalooprs-dependency-deps> Compiling tracing-appender v0.2.5
1449.35 s
gammaloop-crate-gammalooprs-dependency-deps> Compiling serde_yaml v0.9.34+deprecated
1449.35 s
gammaloop-crate-gammalooprs-dependency-deps> Compiling tracing-indicatif v0.3.14
1449.35 s
gammaloop-crate-gammalooprs-dependency-deps> Compiling slotmap v1.1.1
1449.73 s
gammaloop-crate-gammalooprs-dependency-deps> Compiling color-spantrace v0.3.0
1449.95 s
gammaloop-crate-gammalooprs-dependency-deps> Compiling json5 v0.4.1
1450.82 s
gammaloop-crate-gammalooprs-dependency-deps> Compiling color-eyre v0.6.5
1451.28 s
gammaloop-crate-gammalooprs-dependency-deps> Compiling pathfinding v4.15.0
1457.90 s
gammaloop-crate-gammalooprs-dependency-deps> Compiling nalgebra v0.29.0
1460.05 s
gammaloop-crate-gammalooprs-dependency-deps> Compiling strum v0.28.0
1460.15 s
gammaloop-crate-gammalooprs-dependency-deps> Compiling ratatui-core v0.1.2
1461.22 s
gammaloop-crate-gammalooprs-dependency-deps> Compiling darling_macro v0.23.0
1464.30 s
gammaloop-crate-gammalooprs-dependency-deps> Compiling darling v0.23.0
1464.44 s
gammaloop-crate-gammalooprs-dependency-deps> Compiling instability v0.3.12
1469.59 s
gammaloop-crate-gammalooprs-dependency-deps> Compiling ratatui-widgets v0.3.2
1472.36 s
gammaloop-crate-gammalooprs-dependency-deps> Compiling ratatui-crossterm v0.1.2
1472.61 s
gammaloop-crate-gammalooprs-dependency-deps> Compiling statrs v0.16.1
1472.62 s
gammaloop-crate-gammalooprs-dependency-deps> Compiling ratatui v0.30.2
1473.95 s
gammaloop-crate-gammalooprs-dependency-deps> Compiling momtrop v0.3.1 (https://github.com/alphal00p/momtrop?rev=2c80fae4dfb0f136ee07f750efd225d84feff072#2c80fae4)
1474.16 s
gammaloop-crate-gammalooprs-dependency-deps> Compiling idenso v0.3.0 (/build/source/crates/idenso)
1474.16 s
gammaloop-crate-gammalooprs-dependency-deps> Compiling feynkit-kinematics v0.1.0 (/build/source/crates/feynkit-kinematics)
1474.16 s
gammaloop-crate-gammalooprs-dependency-deps> Compiling gammaloop-tracing-filter v0.1.0 (/build/source/crates/gammaloop-tracing-filter)
1493.02 s
gammaloop-crate-gammalooprs-dependency-deps> Compiling feynkit-graph v0.1.0 (/build/source/crates/feynkit-graph)
1493.02 s
gammaloop-crate-gammalooprs-dependency-deps> Compiling spenso-hep-lib v0.1.7 (/build/source/crates/spenso-hep-lib)
1504.87 s
gammaloop-crate-gammalooprs-dependency-deps> Compiling feynkit-amplitude v0.1.0 (/build/source/crates/feynkit-amplitude)
1504.91 s
gammaloop-crate-gammalooprs-dependency-deps> Compiling feynkit-tensor v0.1.0 (/build/source/crates/feynkit-tensor)
1505.01 s
gammaloop-crate-gammalooprs-dependency-deps> Compiling feynkit-cff v0.1.0 (/build/source/crates/feynkit-cff)
1509.28 s
gammaloop-crate-gammalooprs-dependency-deps> Compiling feynkit-generator v0.1.0 (/build/source/crates/feynkit-generator)
1515.97 s
gammaloop-crate-gammalooprs-dependency-deps> Compiling vakint v0.1.2 (/build/source/crates/vakint)
1597.73 s
gammaloop-crate-gammalooprs-dependency-deps> Compiling gammaloop-ci-consumer-gammalooprs v0.1.0 (/build/source/crates/gammaloop-ci-consumer-gammalooprs)
1674.84 s
gammaloop-crate-gammalooprs-dependency-deps> Finished `ci-optim` profile [optimized] target(s) in 3m 46s
1675.50 s
gammaloop-crate-gammalooprs-dependency-deps> buildPhase completed in 3 minutes 47 seconds
1675.50 s
gammaloop-crate-gammalooprs-dependency-deps> Running phase: installPhase
1675.51 s
gammaloop-crate-gammalooprs-dependency-deps> compressing and installing full archive of target to /nix/store/q0s1358i6rj0pb9sgl0iyjh7skyf608m-gammaloop-crate-gammalooprs-dependency-deps-0.1.0/target.tar.zst as requested
1678.84 s
gammaloop-crate-gammalooprs-dependency-deps> /*stdin*\ : 25.78% ( 4.48 GiB => 1.15 GiB, /nix/store/q0s1358i6rj0pb9sgl0iyjh7skyf608m-gammaloop-crate-gammalooprs-dependency-deps-0.1.0/target.tar.zst)
1678.87 s
gammaloop-crate-gammalooprs-dependency-deps> Running phase: fixupPhase
1678.88 s
gammaloop-crate-gammalooprs-dependency-deps> shrinking RPATHs of ELF executables and libraries in /nix/store/q0s1358i6rj0pb9sgl0iyjh7skyf608m-gammaloop-crate-gammalooprs-dependency-deps-0.1.0
1678.88 s
gammaloop-crate-gammalooprs-dependency-deps> checking for references to /build/ in /nix/store/q0s1358i6rj0pb9sgl0iyjh7skyf608m-gammaloop-crate-gammalooprs-dependency-deps-0.1.0...
1678.89 s
gammaloop-crate-gammalooprs-dependency-deps> patching script interpreter paths in /nix/store/q0s1358i6rj0pb9sgl0iyjh7skyf608m-gammaloop-crate-gammalooprs-dependency-deps-0.1.0
1680.77 s
gammaloop-crate-gammalooprs-dependency-deps (post)> Uploading to the NixCI cache: /nix/store/q0s1358i6rj0pb9sgl0iyjh7skyf608m-gammaloop-crate-gammalooprs-dependency-deps-0.1.0
1680.81 s
gammaloop-crate-gammalooprs-dependency-deps (post)> warning: 'warn-short-path-literals' is deprecated, use 'lint-short-path-literals = ignore' instead
1680.85 s
gammaloop-crate-gammalooprs-dependency-deps (post)> copying 1 paths...
1680.85 s
gammaloop-crate-gammalooprs-dependency-deps (post)> copying path '/nix/store/q0s1358i6rj0pb9sgl0iyjh7skyf608m-gammaloop-crate-gammalooprs-dependency-deps-0.1.0' to 'https://cache.nix-ci.com'...
1776.78 s
gammaloop-crate-gammalooprs-dependency-deps (post)> warning: 'warn-short-path-literals' is deprecated, use 'lint-short-path-literals = ignore' instead
1777.04 s
gammaloop-crate-gammalooprs-dependency-deps (post)> copying 0 paths...
1777.18 s
[8 /15 built, 14 copied (
[1 /8 /14 built, 14 copied
1885.57 s
gammaloop-crate-gammaloop-api-dependency-deps-inputs> compressing and installing full archive of target to /nix/store/mg39zmmkmjdsbxkqan7d1z0rx39nlngr-gammaloop-crate-gammaloop-api-dependency-deps-inputs/target.tar.zst as requested
1890.56 s
gammaloop-crate-gammaloop-api-dependency-deps-inputs> /*stdin*\ : 25.81% ( 4.48 GiB => 1.16 GiB, /nix/store/mg39zmmkmjdsbxkqan7d1z0rx39nlngr-gammaloop-crate-gammaloop-api-dependency-deps-inputs/target.tar.zst)
1893.24 s
gammaloop-crate-gammaloop-api-dependency-deps-inputs (post)> Uploading to the NixCI cache: /nix/store/mg39zmmkmjdsbxkqan7d1z0rx39nlngr-gammaloop-crate-gammaloop-api-dependency-deps-inputs
1893.30 s
gammaloop-crate-gammaloop-api-dependency-deps-inputs (post)> warning: 'warn-short-path-literals' is deprecated, use 'lint-short-path-literals = ignore' instead
1893.35 s
gammaloop-crate-gammaloop-api-dependency-deps-inputs (post)> copying 1 paths...
1893.35 s
gammaloop-crate-gammaloop-api-dependency-deps-inputs (post)> copying path '/nix/store/mg39zmmkmjdsbxkqan7d1z0rx39nlngr-gammaloop-crate-gammaloop-api-dependency-deps-inputs' to 'https://cache.nix-ci.com'...
1993.15 s
gammaloop-crate-gammaloop-api-dependency-deps-inputs (post)> warning: 'warn-short-path-literals' is deprecated, use 'lint-short-path-literals = ignore' instead
1993.33 s
gammaloop-crate-gammaloop-api-dependency-deps-inputs (post)> copying 0 paths...
1993.51 s
[9 /15 built, 14 copied (
[1 /9 /14 built, 14 copiedgammaloop-crate-gammaloop-api-dependency-deps-deps> Running phase: unpackPhase
1993.51 s
gammaloop-crate-gammaloop-api-dependency-deps-deps> unpacking source archive /nix/store/zx888cik9bi4g0v7gdd70ahjdp88234y-source
1993.74 s
gammaloop-crate-gammaloop-api-dependency-deps-deps> source root is source
1993.77 s
gammaloop-crate-gammaloop-api-dependency-deps-deps> Running phase: patchPhase
1993.90 s
gammaloop-crate-gammaloop-api-dependency-deps-deps> Executing configureCargoCommonVars
1993.91 s
gammaloop-crate-gammaloop-api-dependency-deps-deps> decompressing cargo artifacts from /nix/store/mg39zmmkmjdsbxkqan7d1z0rx39nlngr-gammaloop-crate-gammaloop-api-dependency-deps-inputs/target.tar.zst to target
1998.33 s
gammaloop-crate-gammaloop-api-dependency-deps-deps> Running phase: updateAutotoolsGnuConfigScriptsPhase
1998.39 s
gammaloop-crate-gammaloop-api-dependency-deps-deps> Running phase: configurePhase
1998.42 s
gammaloop-crate-gammaloop-api-dependency-deps-deps> will append /build/source/.cargo-home/config.toml with contents of /nix/store/w72xdqk1lvxyqjazv52iqg1ir83d7798-vendor-cargo-deps/config.toml
1998.42 s
gammaloop-crate-gammaloop-api-dependency-deps-deps> default configurePhase, nothing to do
1998.42 s
gammaloop-crate-gammaloop-api-dependency-deps-deps> Running phase: buildPhase
1998.45 s
gammaloop-crate-gammaloop-api-dependency-deps-deps> +++ command cargo --version
1998.46 s
gammaloop-crate-gammaloop-api-dependency-deps-deps> cargo 1.98.1 (797e8a9bc 2026-08-05)
1998.46 s
gammaloop-crate-gammaloop-api-dependency-deps-deps> +++ command cargo build --profile ci-optim --offline -p gammaloop-ci-consumer-gammaloop-api -p gammaloop-workspace-hack --features symbolica/tracing_max_level_info
1999.78 s
gammaloop-crate-gammaloop-api-dependency-deps-deps> warning : unused import: `super::super::traits::*`
1999.78 s
gammaloop-crate-gammaloop-api-dependency-deps-deps> --> vendor/clarabel/src/solver/core/solver.rs:470:9
1999.78 s
gammaloop-crate-gammaloop-api-dependency-deps-deps> |
1999.78 s
gammaloop-crate-gammaloop-api-dependency-deps-deps> 470 | use super::super::traits::*;
1999.78 s
gammaloop-crate-gammaloop-api-dependency-deps-deps> | ^^^^^^^^^^^^^^^^^^^^^^^
1999.78 s
gammaloop-crate-gammaloop-api-dependency-deps-deps> |
1999.78 s
gammaloop-crate-gammaloop-api-dependency-deps-deps> = note : `#[warn(unused_imports)]` (part of `#[warn(unused)]`) on by default
1999.78 s
gammaloop-crate-gammaloop-api-dependency-deps-deps>
1999.78 s
gammaloop-crate-gammaloop-api-dependency-deps-deps> warning : hiding a lifetime that's elided elsewhere is confusing
1999.78 s
gammaloop-crate-gammaloop-api-dependency-deps-deps> --> vendor/clarabel/src/solver/core/kktsolvers/direct/quasidef/datamaps.rs:26:39
1999.78 s
gammaloop-crate-gammaloop-api-dependency-deps-deps> |
1999.78 s
gammaloop-crate-gammaloop-api-dependency-deps-deps> 26 | pub(crate) fn to_sparse_expansion(&self) -> Option<SparseExpansionCone<T>> {
1999.78 s
gammaloop-crate-gammaloop-api-dependency-deps-deps> | ^^^^^ ^^^^^^^^^^^^^^^^^^^^^^ the same lifetime is hidden here
1999.78 s
gammaloop-crate-gammaloop-api-dependency-deps-deps> | |
1999.78 s
gammaloop-crate-gammaloop-api-dependency-deps-deps> | the lifetime is elided here
1999.78 s
gammaloop-crate-gammaloop-api-dependency-deps-deps> |
1999.78 s
gammaloop-crate-gammaloop-api-dependency-deps-deps> = help : the same lifetime is referred to in inconsistent ways, making the signature confusing
1999.78 s
gammaloop-crate-gammaloop-api-dependency-deps-deps> = note : `#[warn(mismatched_lifetime_syntaxes)]` on by default
1999.78 s
gammaloop-crate-gammaloop-api-dependency-deps-deps> help : use `'_` for type paths
1999.78 s
gammaloop-crate-gammaloop-api-dependency-deps-deps> |
1999.78 s
gammaloop-crate-gammaloop-api-dependency-deps-deps> 26 | pub(crate) fn to_sparse_expansion(&self) -> Option<SparseExpansionCone<'_, T>> {
1999.78 s
gammaloop-crate-gammaloop-api-dependency-deps-deps> | +++
1999.78 s
gammaloop-crate-gammaloop-api-dependency-deps-deps>
1999.78 s
gammaloop-crate-gammaloop-api-dependency-deps-deps> warning : `clarabel` (lib) generated 2 warnings (run `cargo fix --lib -p clarabel` to apply 2 suggestions)
1999.78 s
gammaloop-crate-gammaloop-api-dependency-deps-deps> Compiling feynkit-ufo v0.1.0 (/build/source/crates/feynkit-ufo)
2000.10 s
gammaloop-crate-gammaloop-api-dependency-deps-deps> Compiling gammaloop-ci-consumer-gammaloop-api v0.1.0 (/build/source/crates/gammaloop-ci-consumer-gammaloop-api)
2000.55 s
gammaloop-crate-gammaloop-api-dependency-deps-deps> Finished `ci-optim` profile [optimized] target(s) in 2.09s
2001.59 s
gammaloop-crate-gammaloop-api-dependency-deps-deps> Running phase: installPhase
2001.61 s
gammaloop-crate-gammaloop-api-dependency-deps-deps> compressing and installing full archive of target to /nix/store/n9dyz3270c5wqlp21lqnyl08nd6jp9vh-gammaloop-crate-gammaloop-api-dependency-deps-deps-0.1.0/target.tar.zst as requested
2004.19 s
gammaloop-crate-gammaloop-api-dependency-deps-deps> /*stdin*\ : 26.38% ( 3.39 GiB => 916 MiB, /nix/store/n9dyz3270c5wqlp21lqnyl08nd6jp9vh-gammaloop-crate-gammaloop-api-dependency-deps-deps-0.1.0/target.tar.zst)
2004.22 s
gammaloop-crate-gammaloop-api-dependency-deps-deps> Running phase: fixupPhase
2004.23 s
gammaloop-crate-gammaloop-api-dependency-deps-deps> shrinking RPATHs of ELF executables and libraries in /nix/store/n9dyz3270c5wqlp21lqnyl08nd6jp9vh-gammaloop-crate-gammaloop-api-dependency-deps-deps-0.1.0
2004.23 s
gammaloop-crate-gammaloop-api-dependency-deps-deps> checking for references to /build/ in /nix/store/n9dyz3270c5wqlp21lqnyl08nd6jp9vh-gammaloop-crate-gammaloop-api-dependency-deps-deps-0.1.0...
2004.24 s
gammaloop-crate-gammaloop-api-dependency-deps-deps> patching script interpreter paths in /nix/store/n9dyz3270c5wqlp21lqnyl08nd6jp9vh-gammaloop-crate-gammaloop-api-dependency-deps-deps-0.1.0
2005.72 s
gammaloop-crate-gammaloop-api-dependency-deps-deps (post)> Uploading to the NixCI cache: /nix/store/n9dyz3270c5wqlp21lqnyl08nd6jp9vh-gammaloop-crate-gammaloop-api-dependency-deps-deps-0.1.0
2005.76 s
gammaloop-crate-gammaloop-api-dependency-deps-deps (post)> warning: 'warn-short-path-literals' is deprecated, use 'lint-short-path-literals = ignore' instead
2005.79 s
gammaloop-crate-gammaloop-api-dependency-deps-deps (post)> copying 1 paths...
2005.79 s
gammaloop-crate-gammaloop-api-dependency-deps-deps (post)> copying path '/nix/store/n9dyz3270c5wqlp21lqnyl08nd6jp9vh-gammaloop-crate-gammaloop-api-dependency-deps-deps-0.1.0' to 'https://cache.nix-ci.com'...
2085.44 s
gammaloop-crate-gammaloop-api-dependency-deps-deps (post)> warning: 'warn-short-path-literals' is deprecated, use 'lint-short-path-literals = ignore' instead
2085.71 s
gammaloop-crate-gammaloop-api-dependency-deps-deps (post)> copying 0 paths...
2085.90 s
[10 /15 built, 14 copied
[1 /10 /14 built, 14 copie
2219.89 s
gammaloop-crate-gammaloop-api-dependency-inputs> compressing and installing full archive of target to /nix/store/5s4hyx5mg72i492f1pfv34pskxwgz7ml-gammaloop-crate-gammaloop-api-dependency-inputs/target.tar.zst as requested
2225.54 s
gammaloop-crate-gammaloop-api-dependency-inputs> /*stdin*\ : 25.81% ( 4.48 GiB => 1.16 GiB, /nix/store/5s4hyx5mg72i492f1pfv34pskxwgz7ml-gammaloop-crate-gammaloop-api-dependency-inputs/target.tar.zst)
2228.24 s
gammaloop-crate-gammaloop-api-dependency-inputs (post)> Uploading to the NixCI cache: /nix/store/5s4hyx5mg72i492f1pfv34pskxwgz7ml-gammaloop-crate-gammaloop-api-dependency-inputs
2228.30 s
gammaloop-crate-gammaloop-api-dependency-inputs (post)> warning: 'warn-short-path-literals' is deprecated, use 'lint-short-path-literals = ignore' instead
2228.35 s
gammaloop-crate-gammaloop-api-dependency-inputs (post)> copying 1 paths...
2228.35 s
gammaloop-crate-gammaloop-api-dependency-inputs (post)> copying path '/nix/store/5s4hyx5mg72i492f1pfv34pskxwgz7ml-gammaloop-crate-gammaloop-api-dependency-inputs' to 'https://cache.nix-ci.com'...
2330.83 s
gammaloop-crate-gammaloop-api-dependency-inputs (post)> warning: 'warn-short-path-literals' is deprecated, use 'lint-short-path-literals = ignore' instead
2331.24 s
gammaloop-crate-gammaloop-api-dependency-inputs (post)> copying 1 paths...
2331.24 s
gammaloop-crate-gammaloop-api-dependency-inputs (post)> copying path '/nix/store/fbmfwwdw39awj9fj35xi354z972ib0vs-gammaloop-crate-gammaloop-api-dependency-inputs.drv' to 'https://cache.nix-ci.com'...
2331.82 s
[11 /15 built, 14 copied
[1 /11 /14 built, 14 copiegammaloop-crate-gammaloop-api-dependency-deps> Running phase: unpackPhase
2331.83 s
gammaloop-crate-gammaloop-api-dependency-deps> unpacking source archive /nix/store/0km4zkws3gspai6spf5n2l19rx6ccnq3-source
2332.20 s
gammaloop-crate-gammaloop-api-dependency-deps> source root is source
2332.23 s
gammaloop-crate-gammaloop-api-dependency-deps> Running phase: patchPhase
2332.42 s
gammaloop-crate-gammaloop-api-dependency-deps> Executing configureCargoCommonVars
2332.43 s
gammaloop-crate-gammaloop-api-dependency-deps> decompressing cargo artifacts from /nix/store/5s4hyx5mg72i492f1pfv34pskxwgz7ml-gammaloop-crate-gammaloop-api-dependency-inputs/target.tar.zst to target
2340.16 s
gammaloop-crate-gammaloop-api-dependency-deps> Running phase: updateAutotoolsGnuConfigScriptsPhase
2340.26 s
gammaloop-crate-gammaloop-api-dependency-deps> Running phase: configurePhase
2340.26 s
gammaloop-crate-gammaloop-api-dependency-deps> will append /build/source/.cargo-home/config.toml with contents of /nix/store/w72xdqk1lvxyqjazv52iqg1ir83d7798-vendor-cargo-deps/config.toml
2340.26 s
gammaloop-crate-gammaloop-api-dependency-deps> default configurePhase, nothing to do
2340.27 s
gammaloop-crate-gammaloop-api-dependency-deps> Running phase: buildPhase
2340.33 s
gammaloop-crate-gammaloop-api-dependency-deps> +++ command cargo --version
2340.34 s
gammaloop-crate-gammaloop-api-dependency-deps> cargo 1.98.1 (797e8a9bc 2026-08-05)
2340.34 s
gammaloop-crate-gammaloop-api-dependency-deps> +++ command cargo build --profile ci-optim --offline -p gammaloop-ci-consumer-gammaloop-api -p gammaloop-workspace-hack --features symbolica/tracing_max_level_info
2341.18 s
gammaloop-crate-gammaloop-api-dependency-deps> Compiling toml_datetime v0.6.11
2341.18 s
gammaloop-crate-gammaloop-api-dependency-deps> Compiling serde_spanned v0.6.9
2341.19 s
gammaloop-crate-gammaloop-api-dependency-deps> warning : unused import: `super::super::traits::*`
2341.19 s
gammaloop-crate-gammaloop-api-dependency-deps> --> vendor/clarabel/src/solver/core/solver.rs:470:9
2341.19 s
gammaloop-crate-gammaloop-api-dependency-deps> |
2341.19 s
gammaloop-crate-gammaloop-api-dependency-deps> 470 | use super::super::traits::*;
2341.19 s
gammaloop-crate-gammaloop-api-dependency-deps> | ^^^^^^^^^^^^^^^^^^^^^^^
2341.19 s
gammaloop-crate-gammaloop-api-dependency-deps> |
2341.19 s
gammaloop-crate-gammaloop-api-dependency-deps> = note : `#[warn(unused_imports)]` (part of `#[warn(unused)]`) on by default
2341.19 s
gammaloop-crate-gammaloop-api-dependency-deps>
2341.19 s
gammaloop-crate-gammaloop-api-dependency-deps> warning : hiding a lifetime that's elided elsewhere is confusing
2341.19 s
gammaloop-crate-gammaloop-api-dependency-deps> --> vendor/clarabel/src/solver/core/kktsolvers/direct/quasidef/datamaps.rs:26:39
2341.19 s
gammaloop-crate-gammaloop-api-dependency-deps> |
2341.19 s
gammaloop-crate-gammaloop-api-dependency-deps> 26 | pub(crate) fn to_sparse_expansion(&self) -> Option<SparseExpansionCone<T>> {
2341.19 s
gammaloop-crate-gammaloop-api-dependency-deps> | ^^^^^ ^^^^^^^^^^^^^^^^^^^^^^ the same lifetime is hidden here
2341.19 s
gammaloop-crate-gammaloop-api-dependency-deps> | |
2341.19 s
gammaloop-crate-gammaloop-api-dependency-deps> | the lifetime is elided here
2341.19 s
gammaloop-crate-gammaloop-api-dependency-deps> |
2341.19 s
gammaloop-crate-gammaloop-api-dependency-deps> = help : the same lifetime is referred to in inconsistent ways, making the signature confusing
2341.19 s
gammaloop-crate-gammaloop-api-dependency-deps> = note : `#[warn(mismatched_lifetime_syntaxes)]` on by default
2341.19 s
gammaloop-crate-gammaloop-api-dependency-deps> help : use `'_` for type paths
2341.19 s
gammaloop-crate-gammaloop-api-dependency-deps> |
2341.19 s
gammaloop-crate-gammaloop-api-dependency-deps> 26 | pub(crate) fn to_sparse_expansion(&self) -> Option<SparseExpansionCone<'_, T>> {
2341.19 s
gammaloop-crate-gammaloop-api-dependency-deps> | +++
2341.19 s
gammaloop-crate-gammaloop-api-dependency-deps>
2341.19 s
gammaloop-crate-gammaloop-api-dependency-deps> warning : `clarabel` (lib) generated 2 warnings (run `cargo fix --lib -p clarabel` to apply 2 suggestions)
2341.20 s
gammaloop-crate-gammaloop-api-dependency-deps> Compiling rust-embed-impl v8.11.0
2341.20 s
gammaloop-crate-gammaloop-api-dependency-deps> Compiling strum_macros v0.26.4
2341.20 s
gammaloop-crate-gammaloop-api-dependency-deps> Compiling clap_complete v4.6.3
2341.20 s
gammaloop-crate-gammaloop-api-dependency-deps> Compiling gammaloop-api v0.1.0 (/build/source/crates/gammaloop-api)
2341.36 s
gammaloop-crate-gammaloop-api-dependency-deps> Compiling toml_edit v0.22.27
2341.65 s
gammaloop-crate-gammaloop-api-dependency-deps> Compiling clap_complete_nushell v4.6.0
2343.88 s
gammaloop-crate-gammaloop-api-dependency-deps> Compiling toml v0.8.23
2343.90 s
gammaloop-crate-gammaloop-api-dependency-deps> Compiling rust-embed v8.11.0
2344.52 s
gammaloop-crate-gammaloop-api-dependency-deps> Compiling figment v0.10.19
2345.21 s
gammaloop-crate-gammaloop-api-dependency-deps> Compiling reedline v0.44.0
2345.44 s
gammaloop-crate-gammaloop-api-dependency-deps> Compiling linnet v0.17.0 (/build/source/crates/linnet)
2353.87 s
gammaloop-crate-gammaloop-api-dependency-deps> Compiling spenso v0.6.0 (/build/source/crates/spenso)
2353.87 s
gammaloop-crate-gammaloop-api-dependency-deps> Compiling feynkit-model v0.1.0 (/build/source/crates/feynkit-model)
2353.87 s
gammaloop-crate-gammaloop-api-dependency-deps> Compiling three-dimensional-reps v0.1.0 (/build/source/crates/three-dimensional-reps)
2356.29 s
gammaloop-crate-gammaloop-api-dependency-deps> Compiling linnest v0.1.0 (/build/source/crates/linnest)
2356.97 s
gammaloop-crate-gammaloop-api-dependency-deps> Compiling feynkit-ufo v0.1.0 (/build/source/crates/feynkit-ufo)
2367.26 s
gammaloop-crate-gammaloop-api-dependency-deps> Compiling idenso v0.3.0 (/build/source/crates/idenso)
2367.26 s
gammaloop-crate-gammaloop-api-dependency-deps> Compiling feynkit-kinematics v0.1.0 (/build/source/crates/feynkit-kinematics)
2367.26 s
gammaloop-crate-gammaloop-api-dependency-deps> Compiling gammaloop-tracing-filter v0.1.0 (/build/source/crates/gammaloop-tracing-filter)
2382.52 s
gammaloop-crate-gammaloop-api-dependency-deps> Compiling spenso-hep-lib v0.1.7 (/build/source/crates/spenso-hep-lib)
2384.85 s
gammaloop-crate-gammaloop-api-dependency-deps> Compiling feynkit-graph v0.1.0 (/build/source/crates/feynkit-graph)
2399.91 s
gammaloop-crate-gammaloop-api-dependency-deps> Compiling feynkit-tensor v0.1.0 (/build/source/crates/feynkit-tensor)
2399.91 s
gammaloop-crate-gammaloop-api-dependency-deps> Compiling feynkit-amplitude v0.1.0 (/build/source/crates/feynkit-amplitude)
2399.92 s
gammaloop-crate-gammaloop-api-dependency-deps> Compiling feynkit-cff v0.1.0 (/build/source/crates/feynkit-cff)
2400.94 s
gammaloop-crate-gammaloop-api-dependency-deps> Compiling feynkit-generator v0.1.0 (/build/source/crates/feynkit-generator)
2404.03 s
gammaloop-crate-gammaloop-api-dependency-deps> Compiling vakint v0.1.2 (/build/source/crates/vakint)
2418.77 s
gammaloop-crate-gammaloop-api-dependency-deps> Compiling gammalooprs v0.3.4 (/build/source/crates/gammalooprs)
2617.67 s
gammaloop-crate-gammaloop-api-dependency-deps> Compiling gammaloop-ci-consumer-gammaloop-api v0.1.0 (/build/source/crates/gammaloop-ci-consumer-gammaloop-api)
2617.71 s
gammaloop-crate-gammaloop-api-dependency-deps> Finished `ci-optim` profile [optimized] target(s) in 4m 37s
2618.60 s
gammaloop-crate-gammaloop-api-dependency-deps> buildPhase completed in 4 minutes 39 seconds
2618.60 s
gammaloop-crate-gammaloop-api-dependency-deps> Running phase: installPhase
2618.61 s
gammaloop-crate-gammaloop-api-dependency-deps> compressing and installing full archive of target to /nix/store/cn2mirhkcjdvpp1n0rwci5a9mxhbid6g-gammaloop-crate-gammaloop-api-dependency-deps-0.1.0/target.tar.zst as requested
2623.42 s
gammaloop-crate-gammaloop-api-dependency-deps> /*stdin*\ : 25.47% ( 5.30 GiB => 1.35 GiB, /nix/store/cn2mirhkcjdvpp1n0rwci5a9mxhbid6g-gammaloop-crate-gammaloop-api-dependency-deps-0.1.0/target.tar.zst)
2623.45 s
gammaloop-crate-gammaloop-api-dependency-deps> Running phase: fixupPhase
2623.46 s
gammaloop-crate-gammaloop-api-dependency-deps> shrinking RPATHs of ELF executables and libraries in /nix/store/cn2mirhkcjdvpp1n0rwci5a9mxhbid6g-gammaloop-crate-gammaloop-api-dependency-deps-0.1.0
2623.47 s
gammaloop-crate-gammaloop-api-dependency-deps> checking for references to /build/ in /nix/store/cn2mirhkcjdvpp1n0rwci5a9mxhbid6g-gammaloop-crate-gammaloop-api-dependency-deps-0.1.0...
2623.48 s
gammaloop-crate-gammaloop-api-dependency-deps> patching script interpreter paths in /nix/store/cn2mirhkcjdvpp1n0rwci5a9mxhbid6g-gammaloop-crate-gammaloop-api-dependency-deps-0.1.0
2625.71 s
gammaloop-crate-gammaloop-api-dependency-deps (post)> Uploading to the NixCI cache: /nix/store/cn2mirhkcjdvpp1n0rwci5a9mxhbid6g-gammaloop-crate-gammaloop-api-dependency-deps-0.1.0
2625.74 s
gammaloop-crate-gammaloop-api-dependency-deps (post)> warning: 'warn-short-path-literals' is deprecated, use 'lint-short-path-literals = ignore' instead
2625.78 s
gammaloop-crate-gammaloop-api-dependency-deps (post)> copying 1 paths...
2625.78 s
gammaloop-crate-gammaloop-api-dependency-deps (post)> copying path '/nix/store/cn2mirhkcjdvpp1n0rwci5a9mxhbid6g-gammaloop-crate-gammaloop-api-dependency-deps-0.1.0' to 'https://cache.nix-ci.com'...
2735.29 s
gammaloop-crate-gammaloop-api-dependency-deps (post)> warning: 'warn-short-path-literals' is deprecated, use 'lint-short-path-literals = ignore' instead
2735.63 s
gammaloop-crate-gammaloop-api-dependency-deps (post)> copying 2 paths...
2735.64 s
gammaloop-crate-gammaloop-api-dependency-deps (post)> copying path '/nix/store/aqzblwmjz4csicbl4l2a58k0f573vjky-source.drv' to 'https://cache.nix-ci.com'...
2735.85 s
gammaloop-crate-gammaloop-api-dependency-deps (post)> copying path '/nix/store/0jf56qvsdin111ax7aq0q8fcqg19qpf3-gammaloop-crate-gammaloop-api-dependency-deps-0.1.0.drv' to 'https://cache.nix-ci.com'...
2736.24 s
[12 /15 built, 14 copied
[1 /12 /14 built, 14 copie
2749.11 s
gammaloop-workspace-doctest-inputs> compressing and installing full archive of target to /nix/store/bfj52hfq3nywm60hjzkcfqalxd3z141s-gammaloop-workspace-doctest-inputs/target.tar.zst as requested
2754.89 s
gammaloop-workspace-doctest-inputs> /*stdin*\ : 25.54% ( 5.86 GiB => 1.50 GiB, /nix/store/bfj52hfq3nywm60hjzkcfqalxd3z141s-gammaloop-workspace-doctest-inputs/target.tar.zst)
2757.96 s
gammaloop-workspace-doctest-inputs (post)> Uploading to the NixCI cache: /nix/store/bfj52hfq3nywm60hjzkcfqalxd3z141s-gammaloop-workspace-doctest-inputs
2758.01 s
gammaloop-workspace-doctest-inputs (post)> warning: 'warn-short-path-literals' is deprecated, use 'lint-short-path-literals = ignore' instead
2758.05 s
gammaloop-workspace-doctest-inputs (post)> copying 1 paths...
2758.05 s
gammaloop-workspace-doctest-inputs (post)> copying path '/nix/store/bfj52hfq3nywm60hjzkcfqalxd3z141s-gammaloop-workspace-doctest-inputs' to 'https://cache.nix-ci.com'...
2856.40 s
gammaloop-workspace-doctest-inputs (post)> warning: 'warn-short-path-literals' is deprecated, use 'lint-short-path-literals = ignore' instead
2856.76 s
gammaloop-workspace-doctest-inputs (post)> copying 1 paths...
2856.76 s
gammaloop-workspace-doctest-inputs (post)> copying path '/nix/store/5bl1idlvbxfw4sz8zk9x8s74xnnli6zm-gammaloop-workspace-doctest-inputs.drv' to 'https://cache.nix-ci.com'...
2857.25 s
[13 /15 built, 14 copied
[1 /13 /14 built, 14 copiegammaloop-workspace-doctest> Running phase: unpackPhase
2857.25 s
gammaloop-workspace-doctest> unpacking source archive /nix/store/5cf29grr2jrj54dgkkr1mjdqm2qk94vd-source
2857.90 s
gammaloop-workspace-doctest> source root is source
2857.95 s
gammaloop-workspace-doctest> Running phase: patchPhase
2857.96 s
gammaloop-workspace-doctest> Executing configureCargoCommonVars
2857.97 s
gammaloop-workspace-doctest> decompressing cargo artifacts from /nix/store/bfj52hfq3nywm60hjzkcfqalxd3z141s-gammaloop-workspace-doctest-inputs/target.tar.zst to target
2867.19 s
gammaloop-workspace-doctest> Running phase: updateAutotoolsGnuConfigScriptsPhase
2867.29 s
gammaloop-workspace-doctest> Running phase: configurePhase
2867.29 s
gammaloop-workspace-doctest> will append /build/source/.cargo-home/config.toml with contents of /nix/store/w72xdqk1lvxyqjazv52iqg1ir83d7798-vendor-cargo-deps/config.toml
2867.30 s
gammaloop-workspace-doctest> default configurePhase, nothing to do
2867.30 s
gammaloop-workspace-doctest> Running phase: buildPhase
2867.30 s
gammaloop-workspace-doctest> +++ command cargo --version
2867.31 s
gammaloop-workspace-doctest> cargo 1.98.1 (797e8a9bc 2026-08-05)
2867.42 s
gammaloop-workspace-doctest> +++ command cargo test --profile ci-optim --doc --locked --workspace --features feynkit-graph/svg,feynkit-py/python_stubgen,gammaloop-api/cli,gammaloop-api/python_stubgen,gammaloop-api/ufo_support,gammaloop-integration-tests/python-api-tests,gammaloop-tracing-filter/clap,gammaloop-tracing-filter/python,gammaloop-tracing-filter/symbolica,gammalooprs/python_stubgen,idenso/bincode,idenso/native,idenso/reference-cases,linnest/svg,linnet-py/python_stubgen,linnet/bincode,linnet/drawing,linnet/nodestore-vec,linnet/rkyv,linnet/serde,linnet/symbolica,pyo3-stub-gen/infer_signature,pyo3-stub-gen/numpy,pyo3/anyhow,pyo3/auto-initialize,pyo3/eyre,pyo3/multiple-pymethods,spenso-hep-lib/native,spenso/native,spenso/native-code-generation,spenso/portable-payload,spenso/python,spenso/python_stubgen,spenso/shadowing,spynso3/python_stubgen,symbolica-utils/native,symbolica/tracing_max_level_info,three-dimensional-reps/display,three-dimensional-reps/eval,three-dimensional-reps/json_schema,vakint/python_stubgen,vakint/symbolica_community_module --exclude alphal00p-docs-python-exporter
2868.05 s
gammaloop-workspace-doctest> Compiling gammaloop-workspace-hack v0.1.0 (/build/source/crates/gammaloop-workspace-hack)
2868.05 s
gammaloop-workspace-doctest> Compiling symbolica-utils v0.1.0 (/build/source/crates/symbolica-utils)
2868.06 s
gammaloop-workspace-doctest> Compiling clarabel v0.11.1 (/build/source/vendor/clarabel)
2868.06 s
gammaloop-workspace-doctest> Compiling spenso-macros v0.3.2 (/build/source/crates/spenso-macros)
2868.07 s
gammaloop-workspace-doctest> Compiling kurvst v0.1.0 (/build/source/crates/kurvst)
2868.08 s
gammaloop-workspace-doctest> Compiling symbolica-data v0.1.0 (/build/source/crates/symbolica-data)
2868.10 s
gammaloop-workspace-doctest> Compiling alphal00p-docs-macros v0.1.0 (/build/source/crates/alphal00p-docs-macros)
2868.10 s
gammaloop-workspace-doctest> Compiling alphal00p-docs-schema v0.1.0 (/build/source/crates/alphal00p-docs-schema)
2868.11 s
gammaloop-workspace-doctest> Compiling gammaloop-integration-tests v0.1.0 (/build/source/tests)
2868.12 s
gammaloop-workspace-doctest> Compiling clinnet v0.1.8 (/build/source/crates/clinnet)
2868.31 s
gammaloop-workspace-doctest> warning : unused import: `super::super::traits::*`
2868.31 s
gammaloop-workspace-doctest> --> vendor/clarabel/src/solver/core/solver.rs:470:9
2868.31 s
gammaloop-workspace-doctest> |
2868.31 s
gammaloop-workspace-doctest> 470 | use super::super::traits::*;
2868.31 s
gammaloop-workspace-doctest> | ^^^^^^^^^^^^^^^^^^^^^^^
2868.31 s
gammaloop-workspace-doctest> |
2868.31 s
gammaloop-workspace-doctest> = note : `#[warn(unused_imports)]` (part of `#[warn(unused)]`) on by default
2868.31 s
gammaloop-workspace-doctest>
2868.97 s
gammaloop-workspace-doctest> Compiling typst-renderer v0.1.0 (/build/source/crates/typst-renderer)
2869.00 s
gammaloop-workspace-doctest> Compiling spynso3 v0.1.2 (/build/source/crates/spynso3)
2869.91 s
gammaloop-workspace-doctest> Compiling alphal00p-docs-catalogs v0.1.0 (/build/source/crates/alphal00p-docs-catalogs)
2870.17 s
gammaloop-workspace-doctest> warning : hiding a lifetime that's elided elsewhere is confusing
2870.17 s
gammaloop-workspace-doctest> --> vendor/clarabel/src/solver/core/kktsolvers/direct/quasidef/datamaps.rs:26:39
2870.17 s
gammaloop-workspace-doctest> |
2870.17 s
gammaloop-workspace-doctest> 26 | pub(crate) fn to_sparse_expansion(&self) -> Option<SparseExpansionCone<T>> {
2870.17 s
gammaloop-workspace-doctest> | ^^^^^ ^^^^^^^^^^^^^^^^^^^^^^ the same lifetime is hidden here
2870.17 s
gammaloop-workspace-doctest> | |
2870.17 s
gammaloop-workspace-doctest> | the lifetime is elided here
2870.17 s
gammaloop-workspace-doctest> |
2870.17 s
gammaloop-workspace-doctest> = help : the same lifetime is referred to in inconsistent ways, making the signature confusing
2870.17 s
gammaloop-workspace-doctest> = note : `#[warn(mismatched_lifetime_syntaxes)]` on by default
2870.17 s
gammaloop-workspace-doctest> help : use `'_` for type paths
2870.17 s
gammaloop-workspace-doctest> |
2870.17 s
gammaloop-workspace-doctest> 26 | pub(crate) fn to_sparse_expansion(&self) -> Option<SparseExpansionCone<'_, T>> {
2870.17 s
gammaloop-workspace-doctest> | +++
2870.17 s
gammaloop-workspace-doctest>
2871.17 s
gammaloop-workspace-doctest> warning : `clarabel` (lib) generated 2 warnings (run `cargo fix --lib -p clarabel` to apply 2 suggestions)
2871.17 s
gammaloop-workspace-doctest> Compiling linnet v0.17.0 (/build/source/crates/linnet)
2871.17 s
gammaloop-workspace-doctest> Compiling momtrop v0.3.1 (https://github.com/alphal00p/momtrop?rev=2c80fae4dfb0f136ee07f750efd225d84feff072#2c80fae4)
2873.74 s
gammaloop-workspace-doctest> Compiling alphal00p-docs-examples v0.1.0 (/build/source/crates/alphal00p-docs-examples)
2878.79 s
gammaloop-workspace-doctest> Compiling spenso v0.6.0 (/build/source/crates/spenso)
2878.79 s
gammaloop-workspace-doctest> Compiling feynkit-model v0.1.0 (/build/source/crates/feynkit-model)
2878.79 s
gammaloop-workspace-doctest> Compiling three-dimensional-reps v0.1.0 (/build/source/crates/three-dimensional-reps)
2881.50 s
gammaloop-workspace-doctest> Compiling linnest v0.1.0 (/build/source/crates/linnest)
2881.93 s
gammaloop-workspace-doctest> Compiling feynkit-ufo v0.1.0 (/build/source/crates/feynkit-ufo)
2891.29 s
gammaloop-workspace-doctest> Compiling idenso v0.3.0 (/build/source/crates/idenso)
2891.29 s
gammaloop-workspace-doctest> Compiling feynkit-kinematics v0.1.0 (/build/source/crates/feynkit-kinematics)
2891.29 s
gammaloop-workspace-doctest> Compiling gammaloop-tracing-filter v0.1.0 (/build/source/crates/gammaloop-tracing-filter)
2906.21 s
gammaloop-workspace-doctest> Compiling spenso-hep-lib v0.1.7 (/build/source/crates/spenso-hep-lib)
2908.24 s
gammaloop-workspace-doctest> Compiling feynkit-graph v0.1.0 (/build/source/crates/feynkit-graph)
2908.24 s
gammaloop-workspace-doctest> Compiling linnet-render-py v0.1.0 (/build/source/crates/linnet-render-py)
2908.24 s
gammaloop-workspace-doctest> Compiling alphal00p-docs-builder v0.1.0 (/build/source/crates/alphal00p-docs-builder)
2918.91 s
gammaloop-workspace-doctest> Compiling feynkit-tensor v0.1.0 (/build/source/crates/feynkit-tensor)
2925.72 s
gammaloop-workspace-doctest> Compiling feynkit-amplitude v0.1.0 (/build/source/crates/feynkit-amplitude)
2925.72 s
gammaloop-workspace-doctest> Compiling feynkit-cff v0.1.0 (/build/source/crates/feynkit-cff)
2925.73 s
gammaloop-workspace-doctest> Compiling vakint v0.1.2 (/build/source/crates/vakint)
2928.62 s
gammaloop-workspace-doctest> Compiling feynkit-generator v0.1.0 (/build/source/crates/feynkit-generator)
2928.86 s
gammaloop-workspace-doctest> Compiling linnet-py v0.1.0 (/build/source/crates/linnet-py)
2939.29 s
gammaloop-workspace-doctest> Compiling feynkit v0.1.0 (/build/source/crates/feynkit)
2946.21 s
gammaloop-workspace-doctest> Compiling gammalooprs v0.3.4 (/build/source/crates/gammalooprs)
2946.22 s
gammaloop-workspace-doctest> Compiling feynkit-py v0.1.0 (/build/source/crates/feynkit-py)
3094.52 s
gammaloop-workspace-doctest> Compiling gammaloop-api v0.1.0 (/build/source/crates/gammaloop-api)
3162.85 s
gammaloop-workspace-doctest> Finished `ci-optim` profile [optimized] target(s) in 4m 55s
3162.99 s
gammaloop-workspace-doctest> warning : the following packages contain code that will be rejected by a future version of Rust: proc-macro-error2 v2.0.1
3162.99 s
gammaloop-workspace-doctest> note : to see what the problems were, use the option `--future-incompat-report`, or run `cargo report future-incompatibilities --id 1`
3163.03 s
gammaloop-workspace-doctest> Doc-tests alphal00p_docs_builder
3163.19 s
gammaloop-workspace-doctest>
3163.19 s
gammaloop-workspace-doctest> running 0 tests
3163.19 s
gammaloop-workspace-doctest>
3163.19 s
gammaloop-workspace-doctest> test result: ok. 0 passed; 0 failed; 0 ignored; 0 measured; 0 filtered out; finished in 0.00s
3163.19 s
gammaloop-workspace-doctest>
3163.20 s
gammaloop-workspace-doctest> Doc-tests alphal00p_docs_catalogs
3164.66 s
gammaloop-workspace-doctest>
3164.66 s
gammaloop-workspace-doctest> running 0 tests
3164.66 s
gammaloop-workspace-doctest>
3164.66 s
gammaloop-workspace-doctest> test result: ok. 0 passed; 0 failed; 0 ignored; 0 measured; 0 filtered out; finished in 0.00s
3164.66 s
gammaloop-workspace-doctest>
3164.66 s
gammaloop-workspace-doctest> Doc-tests alphal00p_docs_examples
3164.68 s
gammaloop-workspace-doctest>
3164.68 s
gammaloop-workspace-doctest> running 0 tests
3164.68 s
gammaloop-workspace-doctest>
3164.68 s
gammaloop-workspace-doctest> test result: ok. 0 passed; 0 failed; 0 ignored; 0 measured; 0 filtered out; finished in 0.00s
3164.68 s
gammaloop-workspace-doctest>
3164.68 s
gammaloop-workspace-doctest> Doc-tests alphal00p_docs
3164.74 s
gammaloop-workspace-doctest>
3164.74 s
gammaloop-workspace-doctest> running 0 tests
3164.74 s
gammaloop-workspace-doctest>
3164.74 s
gammaloop-workspace-doctest> test result: ok. 0 passed; 0 failed; 0 ignored; 0 measured; 0 filtered out; finished in 0.00s
3164.74 s
gammaloop-workspace-doctest>
3164.74 s
gammaloop-workspace-doctest> Doc-tests alphal00p_docs_schema
3164.81 s
gammaloop-workspace-doctest>
3164.81 s
gammaloop-workspace-doctest> running 0 tests
3164.81 s
gammaloop-workspace-doctest>
3164.81 s
gammaloop-workspace-doctest> test result: ok. 0 passed; 0 failed; 0 ignored; 0 measured; 0 filtered out; finished in 0.00s
3164.81 s
gammaloop-workspace-doctest>
3164.82 s
gammaloop-workspace-doctest> Doc-tests clinnet
3164.85 s
gammaloop-workspace-doctest>
3164.85 s
gammaloop-workspace-doctest> running 0 tests
3164.85 s
gammaloop-workspace-doctest>
3164.85 s
gammaloop-workspace-doctest> test result: ok. 0 passed; 0 failed; 0 ignored; 0 measured; 0 filtered out; finished in 0.00s
3164.85 s
gammaloop-workspace-doctest>
3164.85 s
gammaloop-workspace-doctest> Doc-tests feynkit
3164.89 s
gammaloop-workspace-doctest>
3164.89 s
gammaloop-workspace-doctest> running 0 tests
3164.89 s
gammaloop-workspace-doctest>
3164.89 s
gammaloop-workspace-doctest> test result: ok. 0 passed; 0 failed; 0 ignored; 0 measured; 0 filtered out; finished in 0.00s
3164.89 s
gammaloop-workspace-doctest>
3164.89 s
gammaloop-workspace-doctest> Doc-tests feynkit_amplitude
3164.94 s
gammaloop-workspace-doctest>
3164.94 s
gammaloop-workspace-doctest> running 0 tests
3164.94 s
gammaloop-workspace-doctest>
3164.94 s
gammaloop-workspace-doctest> test result: ok. 0 passed; 0 failed; 0 ignored; 0 measured; 0 filtered out; finished in 0.00s
3164.94 s
gammaloop-workspace-doctest>
3164.95 s
gammaloop-workspace-doctest> Doc-tests feynkit_cff
3167.56 s
gammaloop-workspace-doctest>
3167.56 s
gammaloop-workspace-doctest> running 1 test
3167.56 s
gammaloop-workspace-doctest> test crates/feynkit-cff/src/lib.rs - (line 10) ... ok
3167.56 s
gammaloop-workspace-doctest>
3167.56 s
gammaloop-workspace-doctest> test result: ok. 1 passed; 0 failed; 0 ignored; 0 measured; 0 filtered out; finished in 0.00s
3167.56 s
gammaloop-workspace-doctest>
3167.57 s
gammaloop-workspace-doctest> all doctests ran in 2.51s; merged doctests compilation took 2.50s
3167.58 s
gammaloop-workspace-doctest> Doc-tests feynkit_generator
3167.72 s
gammaloop-workspace-doctest>
3167.72 s
gammaloop-workspace-doctest> running 0 tests
3167.72 s
gammaloop-workspace-doctest>
3167.72 s
gammaloop-workspace-doctest> test result: ok. 0 passed; 0 failed; 0 ignored; 0 measured; 0 filtered out; finished in 0.00s
3167.72 s
gammaloop-workspace-doctest>
3167.73 s
gammaloop-workspace-doctest> Doc-tests feynkit_graph
3167.88 s
gammaloop-workspace-doctest>
3167.88 s
gammaloop-workspace-doctest> running 0 tests
3167.88 s
gammaloop-workspace-doctest>
3167.88 s
gammaloop-workspace-doctest> test result: ok. 0 passed; 0 failed; 0 ignored; 0 measured; 0 filtered out; finished in 0.00s
3167.88 s
gammaloop-workspace-doctest>
3167.89 s
gammaloop-workspace-doctest> Doc-tests feynkit_kinematics
3167.96 s
gammaloop-workspace-doctest>
3167.96 s
gammaloop-workspace-doctest> running 0 tests
3167.96 s
gammaloop-workspace-doctest>
3167.96 s
gammaloop-workspace-doctest> test result: ok. 0 passed; 0 failed; 0 ignored; 0 measured; 0 filtered out; finished in 0.00s
3167.96 s
gammaloop-workspace-doctest>
3167.96 s
gammaloop-workspace-doctest> Doc-tests feynkit_model
3168.07 s
gammaloop-workspace-doctest>
3168.07 s
gammaloop-workspace-doctest> running 0 tests
3168.07 s
gammaloop-workspace-doctest>
3168.07 s
gammaloop-workspace-doctest> test result: ok. 0 passed; 0 failed; 0 ignored; 0 measured; 0 filtered out; finished in 0.00s
3168.07 s
gammaloop-workspace-doctest>
3168.07 s
gammaloop-workspace-doctest> Doc-tests feynkit_py
3168.87 s
gammaloop-workspace-doctest>
3168.87 s
gammaloop-workspace-doctest> running 0 tests
3168.87 s
gammaloop-workspace-doctest>
3168.87 s
gammaloop-workspace-doctest> test result: ok. 0 passed; 0 failed; 0 ignored; 0 measured; 0 filtered out; finished in 0.00s
3168.87 s
gammaloop-workspace-doctest>
3168.87 s
gammaloop-workspace-doctest> Doc-tests feynkit_tensor
3171.63 s
gammaloop-workspace-doctest>
3171.63 s
gammaloop-workspace-doctest> running 17 tests
3171.63 s
gammaloop-workspace-doctest> test crates/feynkit-tensor/src/reduction.rs - reduction::FeynmanDiagramTensorExt (line 1094) - compile ... ok
3171.63 s
gammaloop-workspace-doctest> test crates/feynkit-tensor/src/reduction.rs - reduction::ContractionOrbit (line 79) - compile ... ok
3171.63 s
gammaloop-workspace-doctest> test crates/feynkit-tensor/src/reduction.rs - reduction::TensorReducer (line 303) - compile ... ok
3171.63 s
gammaloop-workspace-doctest> test crates/feynkit-tensor/src/reduction.rs - reduction::TensorReduction::expression (line 267) - compile ... ok
3171.63 s
gammaloop-workspace-doctest> test crates/feynkit-tensor/src/reduction.rs - reduction::TensorReduction (line 220) - compile ... ok
3171.63 s
gammaloop-workspace-doctest> test crates/feynkit-tensor/src/reduction.rs - reduction::TensorReducer::reduce (line 475) - compile ... ok
3171.63 s
gammaloop-workspace-doctest> test crates/feynkit-tensor/src/reduction.rs - reduction::TensorReductionTerm (line 160) - compile ... ok
3171.63 s
gammaloop-workspace-doctest> test crates/feynkit-tensor/src/weingarten.rs - weingarten::OrthogonalWeingarten (line 199) - compile ... ok
3171.63 s
gammaloop-workspace-doctest> test crates/feynkit-tensor/src/weingarten.rs - weingarten::OrthogonalWeingarten::for_rank (line 275) - compile ... ok
3171.63 s
gammaloop-workspace-doctest> test crates/feynkit-tensor/src/weingarten.rs - weingarten::OrthogonalWeingarten::coefficient (line 309) - compile ... ok
3171.63 s
gammaloop-workspace-doctest> test crates/feynkit-tensor/src/weingarten.rs - weingarten::OrthogonalWeingarten::new (line 231) - compile ... ok
3171.64 s
gammaloop-workspace-doctest> test crates/feynkit-tensor/src/weingarten.rs - weingarten::CosetType (line 34) ... ok
3171.64 s
gammaloop-workspace-doctest> test crates/feynkit-tensor/src/weingarten.rs - weingarten::CosetType::between_matchings (line 92) ... ok
3171.64 s
gammaloop-workspace-doctest> test crates/feynkit-tensor/src/weingarten.rs - weingarten::CosetType::new (line 55) ... ok
3171.64 s
gammaloop-workspace-doctest> test crates/feynkit-tensor/src/weingarten.rs - weingarten::CosetType::class_size (line 152) ... ok
3171.64 s
gammaloop-workspace-doctest> test crates/feynkit-tensor/src/weingarten.rs - weingarten::OrthogonalWeingarten::isotropic_pairing_coefficient (line 345) ... ok
3171.64 s
gammaloop-workspace-doctest> test crates/feynkit-tensor/src/weingarten.rs - weingarten::WeingartenError (line 409) ... ok
3171.64 s
gammaloop-workspace-doctest>
3171.64 s
gammaloop-workspace-doctest> test result: ok. 17 passed; 0 failed; 0 ignored; 0 measured; 0 filtered out; finished in 0.01s
3171.64 s
gammaloop-workspace-doctest>
3171.64 s
gammaloop-workspace-doctest> all doctests ran in 2.70s; merged doctests compilation took 2.69s
3171.64 s
gammaloop-workspace-doctest> Doc-tests feynkit_ufo
3171.68 s
gammaloop-workspace-doctest>
3171.68 s
gammaloop-workspace-doctest> running 0 tests
3171.68 s
gammaloop-workspace-doctest>
3171.68 s
gammaloop-workspace-doctest> test result: ok. 0 passed; 0 failed; 0 ignored; 0 measured; 0 filtered out; finished in 0.00s
3171.68 s
gammaloop-workspace-doctest>
3171.68 s
gammaloop-workspace-doctest> Doc-tests gammaloop_api
3172.70 s
gammaloop-workspace-doctest>
3172.70 s
gammaloop-workspace-doctest> running 2 tests
3172.77 s
gammaloop-workspace-doctest> test crates/gammaloop-api/src/lib.rs - (line 18) - compile ... ok
3179.16 s
gammaloop-workspace-doctest> test crates/gammaloop-api/src/commands/evaluate_samples.rs - commands::evaluate_samples::EvaluateSamples (line 51) ... ok
3179.16 s
gammaloop-workspace-doctest>
3179.16 s
gammaloop-workspace-doctest> test result: ok. 2 passed; 0 failed; 0 ignored; 0 measured; 0 filtered out; finished in 6.46s
3179.16 s
gammaloop-workspace-doctest>
3179.17 s
gammaloop-workspace-doctest> Doc-tests gammaloop_integration_tests
3179.22 s
gammaloop-workspace-doctest>
3179.22 s
gammaloop-workspace-doctest> running 0 tests
3179.22 s
gammaloop-workspace-doctest>
3179.22 s
gammaloop-workspace-doctest> test result: ok. 0 passed; 0 failed; 0 ignored; 0 measured; 0 filtered out; finished in 0.00s
3179.22 s
gammaloop-workspace-doctest>
3179.22 s
gammaloop-workspace-doctest> Doc-tests gammaloop_tracing_filter
3179.28 s
gammaloop-workspace-doctest>
3179.28 s
gammaloop-workspace-doctest> running 0 tests
3179.28 s
gammaloop-workspace-doctest>
3179.28 s
gammaloop-workspace-doctest> test result: ok. 0 passed; 0 failed; 0 ignored; 0 measured; 0 filtered out; finished in 0.00s
3179.28 s
gammaloop-workspace-doctest>
3179.28 s
gammaloop-workspace-doctest> Doc-tests gammaloop_tracing_filter_macros
3179.53 s
gammaloop-workspace-doctest>
3179.53 s
gammaloop-workspace-doctest> running 2 tests
3179.53 s
gammaloop-workspace-doctest> test crates/gammaloop-tracing-filter-macros/src/lib.rs - debug_instrument (line 14) ... ignored
3179.53 s
gammaloop-workspace-doctest> test crates/gammaloop-tracing-filter-macros/src/lib.rs - debug_instrument (line 8) ... ignored
3179.53 s
gammaloop-workspace-doctest>
3179.53 s
gammaloop-workspace-doctest> test result: ok. 0 passed; 0 failed; 2 ignored; 0 measured; 0 filtered out; finished in 0.00s
3179.53 s
gammaloop-workspace-doctest>
3179.53 s
gammaloop-workspace-doctest> all doctests ran in 0.22s; merged doctests compilation took 0.22s
3179.53 s
gammaloop-workspace-doctest> Doc-tests gammaloop_workspace_hack
3179.55 s
gammaloop-workspace-doctest>
3179.55 s
gammaloop-workspace-doctest> running 0 tests
3179.55 s
gammaloop-workspace-doctest>
3179.55 s
gammaloop-workspace-doctest> test result: ok. 0 passed; 0 failed; 0 ignored; 0 measured; 0 filtered out; finished in 0.00s
3179.55 s
gammaloop-workspace-doctest>
3179.55 s
gammaloop-workspace-doctest> Doc-tests gammalooprs
3184.72 s
gammaloop-workspace-doctest>
3184.72 s
gammaloop-workspace-doctest> running 2 tests
3184.72 s
gammaloop-workspace-doctest> test crates/gammalooprs/src/integrands/process/mod.rs - integrands::process::ProcessIntegrandImpl::signal_external_momenta_changed (line 3391) ... ignored
3184.73 s
gammaloop-workspace-doctest> test crates/gammalooprs/src/utils/linnet_ext.rs - utils::linnet_ext::Permutation::from_mappings (line 27) ... ok
3184.73 s
gammaloop-workspace-doctest>
3184.73 s
gammaloop-workspace-doctest> test result: ok. 1 passed; 0 failed; 1 ignored; 0 measured; 0 filtered out; finished in 0.00s
3184.73 s
gammaloop-workspace-doctest>
3184.74 s
gammaloop-workspace-doctest> all doctests ran in 1.72s; merged doctests compilation took 1.70s
3184.74 s
gammaloop-workspace-doctest> Doc-tests idenso
3185.31 s
gammaloop-workspace-doctest>
3185.31 s
gammaloop-workspace-doctest> running 5 tests
3185.31 s
gammaloop-workspace-doctest> test crates/idenso/src/color/macros.rs - color::macros::color_f (line 109) ... ignored
3185.31 s
gammaloop-workspace-doctest> test crates/idenso/src/color/macros.rs - color::macros::color_t (line 18) ... ignored
3185.31 s
gammaloop-workspace-doctest> test crates/idenso/src/dirac/macros.rs - dirac::macros::gamma (line 28) ... ignored
3185.31 s
gammaloop-workspace-doctest> test crates/idenso/src/dirac/macros.rs - dirac::macros::gamma0 (line 259) ... ignored
3185.31 s
gammaloop-workspace-doctest> test crates/idenso/src/dirac/macros.rs - dirac::macros::u (line 155) ... ignored
3185.31 s
gammaloop-workspace-doctest>
3185.31 s
gammaloop-workspace-doctest> test result: ok. 0 passed; 0 failed; 5 ignored; 0 measured; 0 filtered out; finished in 0.00s
3185.31 s
gammaloop-workspace-doctest>
3185.32 s
gammaloop-workspace-doctest> all doctests ran in 0.23s; merged doctests compilation took 0.23s
3185.32 s
gammaloop-workspace-doctest> Doc-tests kurvst
3185.40 s
gammaloop-workspace-doctest>
3185.40 s
gammaloop-workspace-doctest> running 0 tests
3185.40 s
gammaloop-workspace-doctest>
3185.40 s
gammaloop-workspace-doctest> test result: ok. 0 passed; 0 failed; 0 ignored; 0 measured; 0 filtered out; finished in 0.00s
3185.40 s
gammaloop-workspace-doctest>
3185.41 s
gammaloop-workspace-doctest> Doc-tests linnest
3185.80 s
gammaloop-workspace-doctest>
3185.80 s
gammaloop-workspace-doctest> running 0 tests
3185.80 s
gammaloop-workspace-doctest>
3185.80 s
gammaloop-workspace-doctest> test result: ok. 0 passed; 0 failed; 0 ignored; 0 measured; 0 filtered out; finished in 0.00s
3185.80 s
gammaloop-workspace-doctest>
3185.81 s
gammaloop-workspace-doctest> Doc-tests linnet
3186.31 s
gammaloop-workspace-doctest>
3186.31 s
gammaloop-workspace-doctest> running 46 tests
3186.32 s
gammaloop-workspace-doctest> test crates/linnet/src/half_edge/algorithms/transitive_ops.rs - half_edge::algorithms::transitive_ops::HedgeGraph<E,V,H,N>::transitive_closure (line 164) ... ignored
3186.32 s
gammaloop-workspace-doctest> test crates/linnet/src/half_edge/algorithms/transitive_ops.rs - half_edge::algorithms::transitive_ops::HedgeGraph<E,V,H,N>::transitive_reduction (line 300) ... ignored
3186.32 s
gammaloop-workspace-doctest> test crates/linnet/src/half_edge/builder.rs - half_edge::builder::HedgeGraphBuilder (line 110) ... ignored
3189.02 s
gammaloop-workspace-doctest> test crates/linnet/src/half_edge/algorithms/trace_unfold.rs - half_edge::algorithms::trace_unfold::TraceKey<O,D>::iter_levels_bottom_up (line 1194) ... ok
3189.02 s
gammaloop-workspace-doctest> test crates/linnet/src/half_edge/algorithms/trace_unfold.rs - half_edge::algorithms::trace_unfold::TraceKey<O,D>::write_foata_like (line 1356) ... ok
3189.02 s
gammaloop-workspace-doctest> test crates/linnet/src/half_edge/algorithms/trace_unfold.rs - half_edge::algorithms::trace_unfold::TraceKey<O,D>::iter_leaf_ops (line 1222) ... ok
3189.03 s
gammaloop-workspace-doctest> test crates/linnet/src/half_edge/algorithms/trace_unfold.rs - half_edge::algorithms::trace_unfold::TraceKey<O,D>::is_empty (line 1136) ... ok
3189.09 s
gammaloop-workspace-doctest> test crates/linnet/src/half_edge/algorithms/trace_unfold.rs - half_edge::algorithms::trace_unfold::TraceKey<O,D>::from_levels (line 1089) ... ok
3189.10 s
gammaloop-workspace-doctest> test crates/linnet/src/half_edge/algorithms/trace_unfold.rs - half_edge::algorithms::trace_unfold::TraceKeyView (line 872) ... ok
3189.10 s
gammaloop-workspace-doctest> test crates/linnet/src/half_edge/algorithms/trace_unfold.rs - half_edge::algorithms::trace_unfold::TraceKeyView<'a,O,D>::to_owned (line 979) ... ok
3189.12 s
gammaloop-workspace-doctest> test crates/linnet/src/half_edge/algorithms/trace_unfold.rs - half_edge::algorithms::trace_unfold::TraceKey<O,D>::iter_levels_top_down (line 1164) ... ok
3189.12 s
gammaloop-workspace-doctest> test crates/linnet/src/half_edge/algorithms/trace_unfold.rs - half_edge::algorithms::trace_unfold::TraceKey<O,D>::empty (line 1071) ... ok
3189.13 s
gammaloop-workspace-doctest> test crates/linnet/src/half_edge/algorithms/trace_unfold.rs - half_edge::algorithms::trace_unfold::TraceKey (line 1029) ... ok
3189.14 s
gammaloop-workspace-doctest> test crates/linnet/src/half_edge/algorithms/trace_unfold.rs - half_edge::algorithms::trace_unfold::TraceKey<O,D>::push (line 1253) ... ok
3189.32 s
gammaloop-workspace-doctest> test crates/linnet/src/half_edge/algorithms/trace_unfold.rs - half_edge::algorithms::trace_unfold::TraceUnfold::realizations_for_op (line 213) ... ok
3189.34 s
gammaloop-workspace-doctest> test crates/linnet/src/half_edge/algorithms/trace_unfold.rs - half_edge::algorithms::trace_unfold::TraceUnfold (line 127) ... ok
3189.44 s
gammaloop-workspace-doctest> test crates/linnet/src/parser/mod.rs - parser (line 17) ... ok
3189.45 s
gammaloop-workspace-doctest> test crates/linnet/src/half_edge/algorithms/trace_unfold.rs - half_edge::algorithms::trace_unfold::TraceKey<O,D>::view (line 1110) ... ok
3189.53 s
gammaloop-workspace-doctest> test crates/linnet/src/permutation.rs - permutation::Permutation (line 61) ... ok
3191.79 s
gammaloop-workspace-doctest> test crates/linnet/src/permutation.rs - permutation::Permutation::apply_slice_in_place (line 488) ... ok
3191.81 s
gammaloop-workspace-doctest> test crates/linnet/src/permutation.rs - permutation::Permutation::apply_slice (line 451) ... ok
3191.83 s
gammaloop-workspace-doctest> test crates/linnet/src/permutation.rs - permutation::Permutation::apply_slice_inv (line 469) ... ok
3191.87 s
gammaloop-workspace-doctest> test crates/linnet/src/permutation.rs - permutation::Permutation::cycle_to_transpositions (line 713) ... ok
3191.90 s
gammaloop-workspace-doctest> test crates/linnet/src/permutation.rs - permutation::Permutation::find_cycles (line 680) ... ok
3191.92 s
gammaloop-workspace-doctest> test crates/linnet/src/permutation.rs - permutation::Permutation::apply_slice_in_place_inv (line 510) ... ok
3191.94 s
gammaloop-workspace-doctest> test crates/linnet/src/permutation.rs - permutation::Permutation::from_disjoint_cycles (line 978) ... ok
3191.95 s
gammaloop-workspace-doctest> test crates/linnet/src/permutation.rs - permutation::Permutation::from_cycles (line 1069) ... ok
3191.98 s
gammaloop-workspace-doctest> test crates/linnet/src/permutation.rs - permutation::Permutation::from_prefix_sources (line 266) ... ok
3192.00 s
gammaloop-workspace-doctest> test crates/linnet/src/permutation.rs - permutation::Permutation::id (line 96) ... ok
3192.01 s
gammaloop-workspace-doctest> test crates/linnet/src/permutation.rs - permutation::Permutation::inv (line 416) ... ok
3192.10 s
gammaloop-workspace-doctest> test crates/linnet/src/permutation.rs - permutation::Permutation::inverse (line 434) ... ok
3192.11 s
gammaloop-workspace-doctest> test crates/linnet/src/permutation.rs - permutation::Permutation::iter_slice (line 543) ... ok
3192.11 s
gammaloop-workspace-doctest> test crates/linnet/src/permutation.rs - permutation::Permutation::iter_slice_inv (line 562) ... ok
3192.31 s
gammaloop-workspace-doctest> test crates/linnet/src/permutation.rs - permutation::Permutation::from_map (line 113) ... ok
3192.60 s
gammaloop-workspace-doctest> test crates/linnet/src/permutation.rs - permutation::Permutation::is_identity (line 851) ... ok
3194.00 s
gammaloop-workspace-doctest> test crates/linnet/src/permutation.rs - permutation::Permutation::iter_slice_inv_mut (line 615) ... ok
3194.14 s
gammaloop-workspace-doctest> test crates/linnet/src/permutation.rs - permutation::Permutation::myrvold_ruskey_unrank1 (line 782) ... ok
3194.14 s
gammaloop-workspace-doctest> test crates/linnet/src/permutation.rs - permutation::Permutation::myrvold_ruskey_unrank2 (line 828) ... ok
3194.17 s
gammaloop-workspace-doctest> test crates/linnet/src/permutation.rs - permutation::Permutation::iter_slice_mut (line 588) ... ok
3194.20 s
gammaloop-workspace-doctest> test crates/linnet/src/permutation.rs - permutation::Permutation::sign (line 869) ... ok
3194.22 s
gammaloop-workspace-doctest> test crates/linnet/src/permutation.rs - permutation::Permutation::myrvold_ruskey_rank1 (line 760) ... ok
3194.25 s
gammaloop-workspace-doctest> test crates/linnet/src/permutation.rs - permutation::Permutation::map (line 402) ... ok
3194.28 s
gammaloop-workspace-doctest> test crates/linnet/src/permutation.rs - permutation::Permutation::transpositions (line 733) ... ok
3194.28 s
gammaloop-workspace-doctest> test crates/linnet/src/permutation.rs - permutation::Permutation::myrvold_ruskey_rank2 (line 805) ... ok
3194.28 s
gammaloop-workspace-doctest> test crates/linnet/src/permutation.rs - permutation::Permutation::pow (line 896) ... ok
3194.30 s
gammaloop-workspace-doctest> test crates/linnet/src/permutation.rs - permutation::Permutation::sort (line 640) ... ok
3194.30 s
gammaloop-workspace-doctest>
3194.30 s
gammaloop-workspace-doctest> test result: ok. 43 passed; 0 failed; 3 ignored; 0 measured; 0 filtered out; finished in 7.98s
3194.30 s
gammaloop-workspace-doctest>
3194.30 s
gammaloop-workspace-doctest> Doc-tests linnet_py
3194.60 s
gammaloop-workspace-doctest>
3194.60 s
gammaloop-workspace-doctest> running 0 tests
3194.60 s
gammaloop-workspace-doctest>
3194.60 s
gammaloop-workspace-doctest> test result: ok. 0 passed; 0 failed; 0 ignored; 0 measured; 0 filtered out; finished in 0.00s
3194.60 s
gammaloop-workspace-doctest>
3194.61 s
gammaloop-workspace-doctest> Doc-tests linnet_render_py
3195.00 s
gammaloop-workspace-doctest>
3195.00 s
gammaloop-workspace-doctest> running 0 tests
3195.00 s
gammaloop-workspace-doctest>
3195.00 s
gammaloop-workspace-doctest> test result: ok. 0 passed; 0 failed; 0 ignored; 0 measured; 0 filtered out; finished in 0.00s
3195.00 s
gammaloop-workspace-doctest>
3195.01 s
gammaloop-workspace-doctest> Doc-tests spenso
3198.89 s
gammaloop-workspace-doctest>
3198.89 s
gammaloop-workspace-doctest> running 9 tests
3198.89 s
gammaloop-workspace-doctest> test crates/spenso/src/shadowing/macros.rs - shadowing::macros::antisym (line 341) ... ignored
3198.89 s
gammaloop-workspace-doctest> test crates/spenso/src/shadowing/macros.rs - shadowing::macros::chain (line 391) ... ignored
3198.89 s
gammaloop-workspace-doctest> test crates/spenso/src/shadowing/macros.rs - shadowing::macros::cyclic (line 365) ... ignored
3198.89 s
gammaloop-workspace-doctest> test crates/spenso/src/shadowing/macros.rs - shadowing::macros::slot (line 24) ... ignored
3198.89 s
gammaloop-workspace-doctest> test crates/spenso/src/shadowing/macros.rs - shadowing::macros::sym (line 317) ... ignored
3198.89 s
gammaloop-workspace-doctest> test crates/spenso/src/shadowing/macros.rs - shadowing::macros::tensor (line 110) ... ignored
3198.89 s
gammaloop-workspace-doctest> test crates/spenso/src/shadowing/macros.rs - shadowing::macros::trace (line 448) ... ignored
3198.89 s
gammaloop-workspace-doctest> test crates/spenso/src/shadowing/macros.rs - shadowing::macros::trace_sym (line 500) ... ignored
3198.89 s
gammaloop-workspace-doctest> test crates/spenso/src/network/mod.rs - network::Network (line 1715) ... ok
3198.89 s
gammaloop-workspace-doctest>
3198.89 s
gammaloop-workspace-doctest> test result: ok. 1 passed; 0 failed; 8 ignored; 0 measured; 0 filtered out; finished in 0.00s
3198.89 s
gammaloop-workspace-doctest>
3198.90 s
gammaloop-workspace-doctest> all doctests ran in 3.29s; merged doctests compilation took 3.28s
3198.91 s
gammaloop-workspace-doctest> Doc-tests spenso_hep_lib
3198.95 s
gammaloop-workspace-doctest>
3198.95 s
gammaloop-workspace-doctest> running 0 tests
3198.95 s
gammaloop-workspace-doctest>
3198.95 s
gammaloop-workspace-doctest> test result: ok. 0 passed; 0 failed; 0 ignored; 0 measured; 0 filtered out; finished in 0.00s
3198.95 s
gammaloop-workspace-doctest>
3198.96 s
gammaloop-workspace-doctest> Doc-tests spenso_macros
3199.00 s
gammaloop-workspace-doctest>
3199.00 s
gammaloop-workspace-doctest> running 0 tests
3199.00 s
gammaloop-workspace-doctest>
3199.00 s
gammaloop-workspace-doctest> test result: ok. 0 passed; 0 failed; 0 ignored; 0 measured; 0 filtered out; finished in 0.00s
3199.00 s
gammaloop-workspace-doctest>
3199.00 s
gammaloop-workspace-doctest> Doc-tests spynso3
3199.66 s
gammaloop-workspace-doctest>
3199.66 s
gammaloop-workspace-doctest> running 1 test
3199.67 s
gammaloop-workspace-doctest> test crates/spynso3/src/expression.rs - expression::TensorExpression::simplify_algebra (line 2336) ... FAILED
3199.67 s
gammaloop-workspace-doctest>
3199.67 s
gammaloop-workspace-doctest> failures:
3199.67 s
gammaloop-workspace-doctest>
3199.67 s
gammaloop-workspace-doctest> ---- crates/spynso3/src/expression.rs - expression::TensorExpression::simplify_algebra (line 2336) stdout ----
3199.67 s
gammaloop-workspace-doctest> error: expected item, found `-`
3199.67 s
gammaloop-workspace-doctest> --> crates/spynso3/src/expression.rs:2337:1
3199.67 s
gammaloop-workspace-doctest> |
3199.67 s
gammaloop-workspace-doctest> 2337 | - "fully": contract compatible metrics/identities and vectors, collect
3199.67 s
gammaloop-workspace-doctest> | ^ expected item
3199.67 s
gammaloop-workspace-doctest> |
3199.67 s
gammaloop-workspace-doctest> = note: for a full list of items that can appear in modules, see <https://doc.rust-lang.org/reference/items.html>
3199.67 s
gammaloop-workspace-doctest>
3199.67 s
gammaloop-workspace-doctest> error: aborting due to 1 previous error
3199.67 s
gammaloop-workspace-doctest>
3199.67 s
gammaloop-workspace-doctest> Couldn't compile the test.
3199.67 s
gammaloop-workspace-doctest>
3199.67 s
gammaloop-workspace-doctest> failures:
3199.67 s
gammaloop-workspace-doctest> crates/spynso3/src/expression.rs - expression::TensorExpression::simplify_algebra (line 2336)
3199.67 s
gammaloop-workspace-doctest>
3199.67 s
gammaloop-workspace-doctest> test result: FAILED. 0 passed; 1 failed; 0 ignored; 0 measured; 0 filtered out; finished in 0.02s
3199.67 s
gammaloop-workspace-doctest>
3199.68 s
gammaloop-workspace-doctest> error : doctest failed, to rerun pass `-p spynso3 --doc`
3201.52 s
error: Cannot build '/nix/store/6klybbspcwdrsi00vn5bipxdrnnls219-gammaloop-workspace-doctest-0.1.0.drv '.
3201.52 s
Reason: builder failed with exit code 101 .
3201.52 s
Output paths:
3201.52 s
/nix/store/6064c5jqj6rp725hp7fg9lvbhfpxl5cz-gammaloop-workspace-doctest-0.1.0
3201.52 s
Last 381 log lines:
3201.52 s
> Running phase: unpackPhase
3201.52 s
> unpacking source archive /nix/store/5cf29grr2jrj54dgkkr1mjdqm2qk94vd-source
3201.52 s
> source root is source
3201.52 s
> Running phase: patchPhase
3201.52 s
> Executing configureCargoCommonVars
3201.52 s
> decompressing cargo artifacts from /nix/store/bfj52hfq3nywm60hjzkcfqalxd3z141s-gammaloop-workspace-doctest-inputs/target.tar.zst to target
3201.52 s
> Running phase: updateAutotoolsGnuConfigScriptsPhase
3201.52 s
> Running phase: configurePhase
3201.52 s
> will append /build/source/.cargo-home/config.toml with contents of /nix/store/w72xdqk1lvxyqjazv52iqg1ir83d7798-vendor-cargo-deps/config.toml
3201.52 s
> default configurePhase, nothing to do
3201.52 s
> Running phase: buildPhase
3201.52 s
> +++ command cargo --version
3201.52 s
> cargo 1.98.1 (797e8a9bc 2026-08-05)
3201.52 s
> +++ command cargo test --profile ci-optim --doc --locked --workspace --features feynkit-graph/svg,feynkit-py/python_stubgen,gammaloop-api/cli,gammaloop-api/python_stubgen,gammaloop-api/ufo_support,gammaloop-integration-tests/python-api-tests,gammaloop-tracing-filter/clap,gammaloop-tracing-filter/python,gammaloop-tracing-filter/symbolica,gammalooprs/python_stubgen,idenso/bincode,idenso/native,idenso/reference-cases,linnest/svg,linnet-py/python_stubgen,linnet/bincode,linnet/drawing,linnet/nodestore-vec,linnet/rkyv,linnet/serde,linnet/symbolica,pyo3-stub-gen/infer_signature,pyo3-stub-gen/numpy,pyo3/anyhow,pyo3/auto-initialize,pyo3/eyre,pyo3/multiple-pymethods,spenso-hep-lib/native,spenso/native,spenso/native-code-generation,spenso/portable-payload,spenso/python,spenso/python_stubgen,spenso/shadowing,spynso3/python_stubgen,symbolica-utils/native,symbolica/tracing_max_level_info,three-dimensional-reps/display,three-dimensional-reps/eval,three-dimensional-reps/json_schema,vakint/python_stubgen,vakint/symbolica_community_module --exclude alphal00p-docs-python-exporter
3201.52 s
> Compiling gammaloop-workspace-hack v0.1.0 (/build/source/crates/gammaloop-workspace-hack)
3201.52 s
> Compiling symbolica-utils v0.1.0 (/build/source/crates/symbolica-utils)
3201.52 s
> Compiling clarabel v0.11.1 (/build/source/vendor/clarabel)
3201.52 s
> Compiling spenso-macros v0.3.2 (/build/source/crates/spenso-macros)
3201.52 s
> Compiling kurvst v0.1.0 (/build/source/crates/kurvst)
3201.52 s
> Compiling symbolica-data v0.1.0 (/build/source/crates/symbolica-data)
3201.52 s
> Compiling alphal00p-docs-macros v0.1.0 (/build/source/crates/alphal00p-docs-macros)
3201.52 s
> Compiling alphal00p-docs-schema v0.1.0 (/build/source/crates/alphal00p-docs-schema)
3201.52 s
> Compiling gammaloop-integration-tests v0.1.0 (/build/source/tests)
3201.52 s
> Compiling clinnet v0.1.8 (/build/source/crates/clinnet)
3201.52 s
> warning : unused import: `super::super::traits::*`
3201.52 s
> --> vendor/clarabel/src/solver/core/solver.rs:470:9
3201.52 s
> |
3201.52 s
> 470 | use super::super::traits::*;
3201.52 s
> | ^^^^^^^^^^^^^^^^^^^^^^^
3201.52 s
> |
3201.52 s
> = note : `#[warn(unused_imports)]` (part of `#[warn(unused)]`) on by default
3201.52 s
>
3201.52 s
> Compiling typst-renderer v0.1.0 (/build/source/crates/typst-renderer)
3201.52 s
> Compiling spynso3 v0.1.2 (/build/source/crates/spynso3)
3201.52 s
> Compiling alphal00p-docs-catalogs v0.1.0 (/build/source/crates/alphal00p-docs-catalogs)
3201.52 s
> warning : hiding a lifetime that's elided elsewhere is confusing
3201.52 s
> --> vendor/clarabel/src/solver/core/kktsolvers/direct/quasidef/datamaps.rs:26:39
3201.52 s
> |
3201.52 s
> 26 | pub(crate) fn to_sparse_expansion(&self) -> Option<SparseExpansionCone<T>> {
3201.52 s
> | ^^^^^ ^^^^^^^^^^^^^^^^^^^^^^ the same lifetime is hidden here
3201.52 s
> | |
3201.52 s
> | the lifetime is elided here
3201.52 s
> |
3201.52 s
> = help : the same lifetime is referred to in inconsistent ways, making the signature confusing
3201.52 s
> = note : `#[warn(mismatched_lifetime_syntaxes)]` on by default
3201.52 s
> help : use `'_` for type paths
3201.52 s
> |
3201.52 s
> 26 | pub(crate) fn to_sparse_expansion(&self) -> Option<SparseExpansionCone<'_, T>> {
3201.52 s
> | +++
3201.52 s
>
3201.52 s
> warning : `clarabel` (lib) generated 2 warnings (run `cargo fix --lib -p clarabel` to apply 2 suggestions)
3201.52 s
> Compiling linnet v0.17.0 (/build/source/crates/linnet)
3201.52 s
> Compiling momtrop v0.3.1 (https://github.com/alphal00p/momtrop?rev=2c80fae4dfb0f136ee07f750efd225d84feff072#2c80fae4)
3201.52 s
> Compiling alphal00p-docs-examples v0.1.0 (/build/source/crates/alphal00p-docs-examples)
3201.52 s
> Compiling spenso v0.6.0 (/build/source/crates/spenso)
3201.52 s
> Compiling feynkit-model v0.1.0 (/build/source/crates/feynkit-model)
3201.52 s
> Compiling three-dimensional-reps v0.1.0 (/build/source/crates/three-dimensional-reps)
3201.52 s
> Compiling linnest v0.1.0 (/build/source/crates/linnest)
3201.52 s
> Compiling feynkit-ufo v0.1.0 (/build/source/crates/feynkit-ufo)
3201.52 s
> Compiling idenso v0.3.0 (/build/source/crates/idenso)
3201.52 s
> Compiling feynkit-kinematics v0.1.0 (/build/source/crates/feynkit-kinematics)
3201.52 s
> Compiling gammaloop-tracing-filter v0.1.0 (/build/source/crates/gammaloop-tracing-filter)
3201.52 s
> Compiling spenso-hep-lib v0.1.7 (/build/source/crates/spenso-hep-lib)
3201.52 s
> Compiling feynkit-graph v0.1.0 (/build/source/crates/feynkit-graph)
3201.52 s
> Compiling linnet-render-py v0.1.0 (/build/source/crates/linnet-render-py)
3201.52 s
> Compiling alphal00p-docs-builder v0.1.0 (/build/source/crates/alphal00p-docs-builder)
3201.52 s
> Compiling feynkit-tensor v0.1.0 (/build/source/crates/feynkit-tensor)
3201.52 s
> Compiling feynkit-amplitude v0.1.0 (/build/source/crates/feynkit-amplitude)
3201.52 s
> Compiling feynkit-cff v0.1.0 (/build/source/crates/feynkit-cff)
3201.52 s
> Compiling vakint v0.1.2 (/build/source/crates/vakint)
3201.52 s
> Compiling feynkit-generator v0.1.0 (/build/source/crates/feynkit-generator)
3201.52 s
> Compiling linnet-py v0.1.0 (/build/source/crates/linnet-py)
3201.52 s
> Compiling feynkit v0.1.0 (/build/source/crates/feynkit)
3201.52 s
> Compiling gammalooprs v0.3.4 (/build/source/crates/gammalooprs)
3201.52 s
> Compiling feynkit-py v0.1.0 (/build/source/crates/feynkit-py)
3201.52 s
> Compiling gammaloop-api v0.1.0 (/build/source/crates/gammaloop-api)
3201.52 s
> Finished `ci-optim` profile [optimized] target(s) in 4m 55s
3201.52 s
> warning : the following packages contain code that will be rejected by a future version of Rust: proc-macro-error2 v2.0.1
3201.52 s
> note : to see what the problems were, use the option `--future-incompat-report`, or run `cargo report future-incompatibilities --id 1`
3201.52 s
> Doc-tests alphal00p_docs_builder
3201.52 s
>
3201.52 s
> running 0 tests
3201.52 s
>
3201.52 s
> test result: ok. 0 passed; 0 failed; 0 ignored; 0 measured; 0 filtered out; finished in 0.00s
3201.52 s
>
3201.52 s
> Doc-tests alphal00p_docs_catalogs
3201.52 s
>
3201.52 s
> running 0 tests
3201.52 s
>
3201.52 s
> test result: ok. 0 passed; 0 failed; 0 ignored; 0 measured; 0 filtered out; finished in 0.00s
3201.52 s
>
3201.52 s
> Doc-tests alphal00p_docs_examples
3201.52 s
>
3201.52 s
> running 0 tests
3201.52 s
>
3201.52 s
> test result: ok. 0 passed; 0 failed; 0 ignored; 0 measured; 0 filtered out; finished in 0.00s
3201.52 s
>
3201.52 s
> Doc-tests alphal00p_docs
3201.52 s
>
3201.52 s
> running 0 tests
3201.52 s
>
3201.52 s
> test result: ok. 0 passed; 0 failed; 0 ignored; 0 measured; 0 filtered out; finished in 0.00s
3201.52 s
>
3201.52 s
> Doc-tests alphal00p_docs_schema
3201.52 s
>
3201.52 s
> running 0 tests
3201.52 s
>
3201.52 s
> test result: ok. 0 passed; 0 failed; 0 ignored; 0 measured; 0 filtered out; finished in 0.00s
3201.52 s
>
3201.52 s
> Doc-tests clinnet
3201.52 s
>
3201.52 s
> running 0 tests
3201.52 s
>
3201.52 s
> test result: ok. 0 passed; 0 failed; 0 ignored; 0 measured; 0 filtered out; finished in 0.00s
3201.52 s
>
3201.52 s
> Doc-tests feynkit
3201.52 s
>
3201.52 s
> running 0 tests
3201.52 s
>
3201.52 s
> test result: ok. 0 passed; 0 failed; 0 ignored; 0 measured; 0 filtered out; finished in 0.00s
3201.52 s
>
3201.52 s
> Doc-tests feynkit_amplitude
3201.52 s
>
3201.52 s
> running 0 tests
3201.52 s
>
3201.52 s
> test result: ok. 0 passed; 0 failed; 0 ignored; 0 measured; 0 filtered out; finished in 0.00s
3201.52 s
>
3201.52 s
> Doc-tests feynkit_cff
3201.52 s
>
3201.52 s
> running 1 test
3201.52 s
> test crates/feynkit-cff/src/lib.rs - (line 10) ... ok
3201.52 s
>
3201.52 s
> test result: ok. 1 passed; 0 failed; 0 ignored; 0 measured; 0 filtered out; finished in 0.00s
3201.52 s
>
3201.52 s
> all doctests ran in 2.51s; merged doctests compilation took 2.50s
3201.52 s
> Doc-tests feynkit_generator
3201.52 s
>
3201.52 s
> running 0 tests
3201.52 s
>
3201.52 s
> test result: ok. 0 passed; 0 failed; 0 ignored; 0 measured; 0 filtered out; finished in 0.00s
3201.52 s
>
3201.52 s
> Doc-tests feynkit_graph
3201.52 s
>
3201.52 s
> running 0 tests
3201.52 s
>
3201.52 s
> test result: ok. 0 passed; 0 failed; 0 ignored; 0 measured; 0 filtered out; finished in 0.00s
3201.52 s
>
3201.52 s
> Doc-tests feynkit_kinematics
3201.52 s
>
3201.52 s
> running 0 tests
3201.52 s
>
3201.52 s
> test result: ok. 0 passed; 0 failed; 0 ignored; 0 measured; 0 filtered out; finished in 0.00s
3201.52 s
>
3201.52 s
> Doc-tests feynkit_model
3201.52 s
>
3201.52 s
> running 0 tests
3201.52 s
>
3201.52 s
> test result: ok. 0 passed; 0 failed; 0 ignored; 0 measured; 0 filtered out; finished in 0.00s
3201.52 s
>
3201.52 s
> Doc-tests feynkit_py
3201.52 s
>
3201.52 s
> running 0 tests
3201.52 s
>
3201.52 s
> test result: ok. 0 passed; 0 failed; 0 ignored; 0 measured; 0 filtered out; finished in 0.00s
3201.52 s
>
3201.52 s
> Doc-tests feynkit_tensor
3201.52 s
>
3201.52 s
> running 17 tests
3201.52 s
> test crates/feynkit-tensor/src/reduction.rs - reduction::FeynmanDiagramTensorExt (line 1094) - compile ... ok
3201.52 s
> test crates/feynkit-tensor/src/reduction.rs - reduction::ContractionOrbit (line 79) - compile ... ok
3201.52 s
> test crates/feynkit-tensor/src/reduction.rs - reduction::TensorReducer (line 303) - compile ... ok
3201.52 s
> test crates/feynkit-tensor/src/reduction.rs - reduction::TensorReduction::expression (line 267) - compile ... ok
3201.52 s
> test crates/feynkit-tensor/src/reduction.rs - reduction::TensorReduction (line 220) - compile ... ok
3201.52 s
> test crates/feynkit-tensor/src/reduction.rs - reduction::TensorReducer::reduce (line 475) - compile ... ok
3201.52 s
> test crates/feynkit-tensor/src/reduction.rs - reduction::TensorReductionTerm (line 160) - compile ... ok
3201.52 s
> test crates/feynkit-tensor/src/weingarten.rs - weingarten::OrthogonalWeingarten (line 199) - compile ... ok
3201.52 s
> test crates/feynkit-tensor/src/weingarten.rs - weingarten::OrthogonalWeingarten::for_rank (line 275) - compile ... ok
3201.52 s
> test crates/feynkit-tensor/src/weingarten.rs - weingarten::OrthogonalWeingarten::coefficient (line 309) - compile ... ok
3201.52 s
> test crates/feynkit-tensor/src/weingarten.rs - weingarten::OrthogonalWeingarten::new (line 231) - compile ... ok
3201.52 s
> test crates/feynkit-tensor/src/weingarten.rs - weingarten::CosetType (line 34) ... ok
3201.52 s
> test crates/feynkit-tensor/src/weingarten.rs - weingarten::CosetType::between_matchings (line 92) ... ok
3201.52 s
> test crates/feynkit-tensor/src/weingarten.rs - weingarten::CosetType::new (line 55) ... ok
3201.52 s
> test crates/feynkit-tensor/src/weingarten.rs - weingarten::CosetType::class_size (line 152) ... ok
3201.52 s
> test crates/feynkit-tensor/src/weingarten.rs - weingarten::OrthogonalWeingarten::isotropic_pairing_coefficient (line 345) ... ok
3201.52 s
> test crates/feynkit-tensor/src/weingarten.rs - weingarten::WeingartenError (line 409) ... ok
3201.52 s
>
3201.52 s
> test result: ok. 17 passed; 0 failed; 0 ignored; 0 measured; 0 filtered out; finished in 0.01s
3201.52 s
>
3201.52 s
> all doctests ran in 2.70s; merged doctests compilation took 2.69s
3201.52 s
> Doc-tests feynkit_ufo
3201.52 s
>
3201.52 s
> running 0 tests
3201.52 s
>
3201.52 s
> test result: ok. 0 passed; 0 failed; 0 ignored; 0 measured; 0 filtered out; finished in 0.00s
3201.52 s
>
3201.52 s
> Doc-tests gammaloop_api
3201.52 s
>
3201.52 s
> running 2 tests
3201.52 s
> test crates/gammaloop-api/src/lib.rs - (line 18) - compile ... ok
3201.52 s
> test crates/gammaloop-api/src/commands/evaluate_samples.rs - commands::evaluate_samples::EvaluateSamples (line 51) ... ok
3201.52 s
>
3201.52 s
> test result: ok. 2 passed; 0 failed; 0 ignored; 0 measured; 0 filtered out; finished in 6.46s
3201.52 s
>
3201.52 s
> Doc-tests gammaloop_integration_tests
3201.52 s
>
3201.52 s
> running 0 tests
3201.52 s
>
3201.52 s
> test result: ok. 0 passed; 0 failed; 0 ignored; 0 measured; 0 filtered out; finished in 0.00s
3201.52 s
>
3201.52 s
> Doc-tests gammaloop_tracing_filter
3201.52 s
>
3201.52 s
> running 0 tests
3201.52 s
>
3201.52 s
> test result: ok. 0 passed; 0 failed; 0 ignored; 0 measured; 0 filtered out; finished in 0.00s
3201.52 s
>
3201.52 s
> Doc-tests gammaloop_tracing_filter_macros
3201.52 s
>
3201.52 s
> running 2 tests
3201.52 s
> test crates/gammaloop-tracing-filter-macros/src/lib.rs - debug_instrument (line 14) ... ignored
3201.52 s
> test crates/gammaloop-tracing-filter-macros/src/lib.rs - debug_instrument (line 8) ... ignored
3201.52 s
>
3201.52 s
> test result: ok. 0 passed; 0 failed; 2 ignored; 0 measured; 0 filtered out; finished in 0.00s
3201.52 s
>
3201.52 s
> all doctests ran in 0.22s; merged doctests compilation took 0.22s
3201.52 s
> Doc-tests gammaloop_workspace_hack
3201.52 s
>
3201.52 s
> running 0 tests
3201.52 s
>
3201.52 s
> test result: ok. 0 passed; 0 failed; 0 ignored; 0 measured; 0 filtered out; finished in 0.00s
3201.52 s
>
3201.52 s
> Doc-tests gammalooprs
3201.52 s
>
3201.52 s
> running 2 tests
3201.52 s
> test crates/gammalooprs/src/integrands/process/mod.rs - integrands::process::ProcessIntegrandImpl::signal_external_momenta_changed (line 3391) ... ignored
3201.52 s
> test crates/gammalooprs/src/utils/linnet_ext.rs - utils::linnet_ext::Permutation::from_mappings (line 27) ... ok
3201.52 s
>
3201.52 s
> test result: ok. 1 passed; 0 failed; 1 ignored; 0 measured; 0 filtered out; finished in 0.00s
3201.52 s
>
3201.52 s
> all doctests ran in 1.72s; merged doctests compilation took 1.70s
3201.52 s
> Doc-tests idenso
3201.52 s
>
3201.52 s
> running 5 tests
3201.52 s
> test crates/idenso/src/color/macros.rs - color::macros::color_f (line 109) ... ignored
3201.52 s
> test crates/idenso/src/color/macros.rs - color::macros::color_t (line 18) ... ignored
3201.52 s
> test crates/idenso/src/dirac/macros.rs - dirac::macros::gamma (line 28) ... ignored
3201.52 s
> test crates/idenso/src/dirac/macros.rs - dirac::macros::gamma0 (line 259) ... ignored
3201.52 s
> test crates/idenso/src/dirac/macros.rs - dirac::macros::u (line 155) ... ignored
3201.52 s
>
3201.52 s
> test result: ok. 0 passed; 0 failed; 5 ignored; 0 measured; 0 filtered out; finished in 0.00s
3201.52 s
>
3201.52 s
> all doctests ran in 0.23s; merged doctests compilation took 0.23s
3201.52 s
> Doc-tests kurvst
3201.52 s
>
3201.52 s
> running 0 tests
3201.52 s
>
3201.52 s
> test result: ok. 0 passed; 0 failed; 0 ignored; 0 measured; 0 filtered out; finished in 0.00s
3201.52 s
>
3201.52 s
> Doc-tests linnest
3201.52 s
>
3201.52 s
> running 0 tests
3201.52 s
>
3201.52 s
> test result: ok. 0 passed; 0 failed; 0 ignored; 0 measured; 0 filtered out; finished in 0.00s
3201.52 s
>
3201.52 s
> Doc-tests linnet
3201.52 s
>
3201.52 s
> running 46 tests
3201.52 s
> test crates/linnet/src/half_edge/algorithms/transitive_ops.rs - half_edge::algorithms::transitive_ops::HedgeGraph<E,V,H,N>::transitive_closure (line 164) ... ignored
3201.52 s
> test crates/linnet/src/half_edge/algorithms/transitive_ops.rs - half_edge::algorithms::transitive_ops::HedgeGraph<E,V,H,N>::transitive_reduction (line 300) ... ignored
3201.52 s
> test crates/linnet/src/half_edge/builder.rs - half_edge::builder::HedgeGraphBuilder (line 110) ... ignored
3201.52 s
> test crates/linnet/src/half_edge/algorithms/trace_unfold.rs - half_edge::algorithms::trace_unfold::TraceKey<O,D>::iter_levels_bottom_up (line 1194) ... ok
3201.52 s
> test crates/linnet/src/half_edge/algorithms/trace_unfold.rs - half_edge::algorithms::trace_unfold::TraceKey<O,D>::write_foata_like (line 1356) ... ok
3201.52 s
> test crates/linnet/src/half_edge/algorithms/trace_unfold.rs - half_edge::algorithms::trace_unfold::TraceKey<O,D>::iter_leaf_ops (line 1222) ... ok
3201.52 s
> test crates/linnet/src/half_edge/algorithms/trace_unfold.rs - half_edge::algorithms::trace_unfold::TraceKey<O,D>::is_empty (line 1136) ... ok
3201.52 s
> test crates/linnet/src/half_edge/algorithms/trace_unfold.rs - half_edge::algorithms::trace_unfold::TraceKey<O,D>::from_levels (line 1089) ... ok
3201.52 s
> test crates/linnet/src/half_edge/algorithms/trace_unfold.rs - half_edge::algorithms::trace_unfold::TraceKeyView (line 872) ... ok
3201.52 s
> test crates/linnet/src/half_edge/algorithms/trace_unfold.rs - half_edge::algorithms::trace_unfold::TraceKeyView<'a,O,D>::to_owned (line 979) ... ok
3201.52 s
> test crates/linnet/src/half_edge/algorithms/trace_unfold.rs - half_edge::algorithms::trace_unfold::TraceKey<O,D>::iter_levels_top_down (line 1164) ... ok
3201.52 s
> test crates/linnet/src/half_edge/algorithms/trace_unfold.rs - half_edge::algorithms::trace_unfold::TraceKey<O,D>::empty (line 1071) ... ok
3201.52 s
> test crates/linnet/src/half_edge/algorithms/trace_unfold.rs - half_edge::algorithms::trace_unfold::TraceKey (line 1029) ... ok
3201.52 s
> test crates/linnet/src/half_edge/algorithms/trace_unfold.rs - half_edge::algorithms::trace_unfold::TraceKey<O,D>::push (line 1253) ... ok
3201.52 s
> test crates/linnet/src/half_edge/algorithms/trace_unfold.rs - half_edge::algorithms::trace_unfold::TraceUnfold::realizations_for_op (line 213) ... ok
3201.52 s
> test crates/linnet/src/half_edge/algorithms/trace_unfold.rs - half_edge::algorithms::trace_unfold::TraceUnfold (line 127) ... ok
3201.52 s
> test crates/linnet/src/parser/mod.rs - parser (line 17) ... ok
3201.52 s
> test crates/linnet/src/half_edge/algorithms/trace_unfold.rs - half_edge::algorithms::trace_unfold::TraceKey<O,D>::view (line 1110) ... ok
3201.52 s
> test crates/linnet/src/permutation.rs - permutation::Permutation (line 61) ... ok
3201.52 s
> test crates/linnet/src/permutation.rs - permutation::Permutation::apply_slice_in_place (line 488) ... ok
3201.52 s
> test crates/linnet/src/permutation.rs - permutation::Permutation::apply_slice (line 451) ... ok
3201.52 s
> test crates/linnet/src/permutation.rs - permutation::Permutation::apply_slice_inv (line 469) ... ok
3201.52 s
> test crates/linnet/src/permutation.rs - permutation::Permutation::cycle_to_transpositions (line 713) ... ok
3201.52 s
> test crates/linnet/src/permutation.rs - permutation::Permutation::find_cycles (line 680) ... ok
3201.52 s
> test crates/linnet/src/permutation.rs - permutation::Permutation::apply_slice_in_place_inv (line 510) ... ok
3201.52 s
> test crates/linnet/src/permutation.rs - permutation::Permutation::from_disjoint_cycles (line 978) ... ok
3201.52 s
> test crates/linnet/src/permutation.rs - permutation::Permutation::from_cycles (line 1069) ... ok
3201.52 s
> test crates/linnet/src/permutation.rs - permutation::Permutation::from_prefix_sources (line 266) ... ok
3201.52 s
> test crates/linnet/src/permutation.rs - permutation::Permutation::id (line 96) ... ok
3201.52 s
> test crates/linnet/src/permutation.rs - permutation::Permutation::inv (line 416) ... ok
3201.52 s
> test crates/linnet/src/permutation.rs - permutation::Permutation::inverse (line 434) ... ok
3201.52 s
> test crates/linnet/src/permutation.rs - permutation::Permutation::iter_slice (line 543) ... ok
3201.52 s
> test crates/linnet/src/permutation.rs - permutation::Permutation::iter_slice_inv (line 562) ... ok
3201.52 s
> test crates/linnet/src/permutation.rs - permutation::Permutation::from_map (line 113) ... ok
3201.52 s
> test crates/linnet/src/permutation.rs - permutation::Permutation::is_identity (line 851) ... ok
3201.52 s
> test crates/linnet/src/permutation.rs - permutation::Permutation::iter_slice_inv_mut (line 615) ... ok
3201.52 s
> test crates/linnet/src/permutation.rs - permutation::Permutation::myrvold_ruskey_unrank1 (line 782) ... ok
3201.52 s
> test crates/linnet/src/permutation.rs - permutation::Permutation::myrvold_ruskey_unrank2 (line 828) ... ok
3201.52 s
> test crates/linnet/src/permutation.rs - permutation::Permutation::iter_slice_mut (line 588) ... ok
3201.52 s
> test crates/linnet/src/permutation.rs - permutation::Permutation::sign (line 869) ... ok
3201.52 s
> test crates/linnet/src/permutation.rs - permutation::Permutation::myrvold_ruskey_rank1 (line 760) ... ok
3201.52 s
> test crates/linnet/src/permutation.rs - permutation::Permutation::map (line 402) ... ok
3201.52 s
> test crates/linnet/src/permutation.rs - permutation::Permutation::transpositions (line 733) ... ok
3201.52 s
> test crates/linnet/src/permutation.rs - permutation::Permutation::myrvold_ruskey_rank2 (line 805) ... ok
3201.52 s
> test crates/linnet/src/permutation.rs - permutation::Permutation::pow (line 896) ... ok
3201.52 s
> test crates/linnet/src/permutation.rs - permutation::Permutation::sort (line 640) ... ok
3201.52 s
>
3201.52 s
> test result: ok. 43 passed; 0 failed; 3 ignored; 0 measured; 0 filtered out; finished in 7.98s
3201.52 s
>
3201.52 s
> Doc-tests linnet_py
3201.52 s
>
3201.52 s
> running 0 tests
3201.52 s
>
3201.52 s
> test result: ok. 0 passed; 0 failed; 0 ignored; 0 measured; 0 filtered out; finished in 0.00s
3201.52 s
>
3201.52 s
> Doc-tests linnet_render_py
3201.52 s
>
3201.52 s
> running 0 tests
3201.52 s
>
3201.52 s
> test result: ok. 0 passed; 0 failed; 0 ignored; 0 measured; 0 filtered out; finished in 0.00s
3201.52 s
>
3201.52 s
> Doc-tests spenso
3201.52 s
>
3201.52 s
> running 9 tests
3201.52 s
> test crates/spenso/src/shadowing/macros.rs - shadowing::macros::antisym (line 341) ... ignored
3201.52 s
> test crates/spenso/src/shadowing/macros.rs - shadowing::macros::chain (line 391) ... ignored
3201.52 s
> test crates/spenso/src/shadowing/macros.rs - shadowing::macros::cyclic (line 365) ... ignored
3201.52 s
> test crates/spenso/src/shadowing/macros.rs - shadowing::macros::slot (line 24) ... ignored
3201.52 s
> test crates/spenso/src/shadowing/macros.rs - shadowing::macros::sym (line 317) ... ignored
3201.52 s
> test crates/spenso/src/shadowing/macros.rs - shadowing::macros::tensor (line 110) ... ignored
3201.52 s
> test crates/spenso/src/shadowing/macros.rs - shadowing::macros::trace (line 448) ... ignored
3201.52 s
> test crates/spenso/src/shadowing/macros.rs - shadowing::macros::trace_sym (line 500) ... ignored
3201.52 s
> test crates/spenso/src/network/mod.rs - network::Network (line 1715) ... ok
3201.52 s
>
3201.52 s
> test result: ok. 1 passed; 0 failed; 8 ignored; 0 measured; 0 filtered out; finished in 0.00s
3201.52 s
>
3201.52 s
> all doctests ran in 3.29s; merged doctests compilation took 3.28s
3201.52 s
> Doc-tests spenso_hep_lib
3201.52 s
>
3201.52 s
> running 0 tests
3201.52 s
>
3201.52 s
> test result: ok. 0 passed; 0 failed; 0 ignored; 0 measured; 0 filtered out; finished in 0.00s
3201.52 s
>
3201.52 s
> Doc-tests spenso_macros
3201.52 s
>
3201.52 s
> running 0 tests
3201.52 s
>
3201.52 s
> test result: ok. 0 passed; 0 failed; 0 ignored; 0 measured; 0 filtered out; finished in 0.00s
3201.52 s
>
3201.52 s
> Doc-tests spynso3
3201.52 s
>
3201.52 s
> running 1 test
3201.52 s
> test crates/spynso3/src/expression.rs - expression::TensorExpression::simplify_algebra (line 2336) ... FAILED
3201.52 s
>
3201.52 s
> failures:
3201.52 s
>
3201.52 s
> ---- crates/spynso3/src/expression.rs - expression::TensorExpression::simplify_algebra (line 2336) stdout ----
3201.52 s
> error: expected item, found `-`
3201.52 s
> --> crates/spynso3/src/expression.rs:2337:1
3201.52 s
> |
3201.52 s
> 2337 | - "fully": contract compatible metrics/identities and vectors, collect
3201.52 s
> | ^ expected item
3201.52 s
> |
3201.52 s
> = note: for a full list of items that can appear in modules, see <https://doc.rust-lang.org/reference/items.html>
3201.52 s
>
3201.52 s
> error: aborting due to 1 previous error
3201.52 s
>
3201.52 s
> Couldn't compile the test.
3201.52 s
>
3201.52 s
> failures:
3201.52 s
> crates/spynso3/src/expression.rs - expression::TensorExpression::simplify_algebra (line 2336)
3201.52 s
>
3201.52 s
> test result: FAILED. 0 passed; 1 failed; 0 ignored; 0 measured; 0 filtered out; finished in 0.02s
3201.52 s
>
3201.52 s
> error : doctest failed, to rerun pass `-p spynso3 --doc`
3201.52 s
For full logs, run:
3201.52 s
nix log /nix/store/6klybbspcwdrsi00vn5bipxdrnnls219-gammaloop-workspace-doctest-0.1.0.drv
3201.83 s
[13 built (1 failed ), 14 Run failed.