0.01 s
$ /nix/store/bhv6xyvqw6gjs3j488gi1z6wdv18bdpa-coreutils-9.11/bin/timeout --kill-after=15s 7200s /nix/store/bxgja2ppiqi6w2bgn0r07d7mgnl1k6k2-nix-2.34.8/bin/nix --extra-experimental-features nix-command --extra-experimental-features flakes flake clone git+https://github.com/alphal00p/gammaloop --dest /tmp/nix-ci-worker/stable-pwd/repo/
0.11 s
Cloning into '/tmp/nix-ci-worker/stable-pwd/repo'...
3.29 s
remote: Enumerating objects: 170808
remote: Enumerating objects: 172470, done.
3.40 s
remote: Counting objects: 0% (1/1662)
remote: Counting objects: 1% (17/1662)
remote: Counting objects: 2% (34/1662)
remote: Counting objects: 3% (50/1662)
remote: Counting objects: 4% (67/1662)
remote: Counting objects: 5% (84/1662)
remote: Counting objects: 6% (100/1662)
remote: Counting objects: 7% (117/1662)
remote: Counting objects: 8% (133/1662)
remote: Counting objects: 9% (150/1662)
remote: Counting objects: 10% (167/1662)
remote: Counting objects: 11% (183/1662)
remote: Counting objects: 12% (200/1662)
remote: Counting objects: 13% (217/1662)
remote: Counting objects: 14% (233/1662)
remote: Counting objects: 15% (250/1662)
remote: Counting objects: 16% (266/1662)
remote: Counting objects: 17% (283/1662)
remote: Counting objects: 18% (300/1662)
remote: Counting objects: 19% (316/1662)
remote: Counting objects: 20% (333/1662)
remote: Counting objects: 21% (350/1662)
remote: Counting objects: 22% (366/1662)
remote: Counting objects: 23% (383/1662)
remote: Counting objects: 24% (399/1662)
remote: Counting objects: 25% (416/1662)
remote: Counting objects: 26% (433/1662)
remote: Counting objects: 27% (449/1662)
remote: Counting objects: 28% (466/1662)
remote: Counting objects: 29% (482/1662)
remote: Counting objects: 30% (499/1662)
remote: Counting objects: 31% (516/1662)
remote: Counting objects: 32% (532/1662)
remote: Counting objects: 33% (549/1662)
remote: Counting objects: 34% (566/1662)
remote: Counting objects: 35% (582/1662)
remote: Counting objects: 36% (599/1662)
remote: Counting objects: 37% (615/1662)
remote: Counting objects: 38% (632/1662)
remote: Counting objects: 39% (649/1662)
remote: Counting objects: 40% (665/1662)
remote: Counting objects: 41% (682/1662)
remote: Counting objects: 42% (699/1662)
remote: Counting objects: 43% (715/1662)
remote: Counting objects: 44% (732/1662)
remote: Counting objects: 45% (748/1662)
remote: Counting objects: 46% (765/1662)
remote: Counting objects: 47% (782/1662)
remote: Counting objects: 48% (798/1662)
remote: Counting objects: 49% (815/1662)
remote: Counting objects: 50% (831/1662)
remote: Counting objects: 51% (848/1662)
remote: Counting objects: 52% (865/1662)
remote: Counting objects: 53% (881/1662)
remote: Counting objects: 54% (898/1662)
remote: Counting objects: 55% (915/1662)
remote: Counting objects: 56% (931/1662)
remote: Counting objects: 57% (948/1662)
remote: Counting objects: 58% (964/1662)
remote: Counting objects: 59% (981/1662)
remote: Counting objects: 60% (998/1662)
remote: Counting objects: 61% (1014/1662)
remote: Counting objects: 62% (1031/1662)
remote: Counting objects: 63% (1048/1662)
remote: Counting objects: 64% (1064/1662)
remote: Counting objects: 65% (1081/1662)
remote: Counting objects: 66% (1097/1662)
remote: Counting objects: 67% (1114/1662)
remote: Counting objects: 68% (1131/1662)
remote: Counting objects: 69% (1147/1662)
remote: Counting objects: 70% (1164/1662)
remote: Counting objects: 71% (1181/1662)
remote: Counting objects: 72% (1197/1662)
remote: Counting objects: 73% (1214/1662)
remote: Counting objects: 74% (1230/1662)
remote: Counting objects: 75% (1247/1662)
remote: Counting objects: 76% (1264/1662)
remote: Counting objects: 77% (1280/1662)
remote: Counting objects: 78% (1297/1662)
remote: Counting objects: 79% (1313/1662)
remote: Counting objects: 80% (1330/1662)
remote: Counting objects: 81% (1347/1662)
remote: Counting objects: 82% (1363/1662)
remote: Counting objects: 83% (1380/1662)
remote: Counting objects: 84% (1397/1662)
remote: Counting objects: 85% (1413/1662)
remote: Counting objects: 86% (1430/1662)
remote: Counting objects: 87% (1446/1662)
remote: Counting objects: 88% (1463/1662)
remote: Counting objects: 89% (1480/1662)
remote: Counting objects: 90% (1496/1662)
remote: Counting objects: 91% (1513/1662)
remote: Counting objects: 92% (1530/1662)
remote: Counting objects: 93% (1546/1662)
remote: Counting objects: 94% (1563/1662)
remote: Counting objects: 95% (1579/1662)
remote: Counting objects: 96% (1596/1662)
remote: Counting objects: 97% (1613/1662)
remote: Counting objects: 98% (1629/1662)
remote: Counting objects: 99% (1646/1662)
remote: Counting objects: 100% (1662/1662)
remote: Counting objects: 100% (1662/1662), done.
4.44 s
remote: Compressing objects: 0% (1/499)
remote: Compressing objects: 1% (5/499)
remote: Compressing objects: 2% (10/499)
remote: Compressing objects: 3% (15/499)
remote: Compressing objects: 4% (20/499)
remote: Compressing objects: 5% (25/499)
remote: Compressing objects: 6% (30/499)
remote: Compressing objects: 7% (35/499)
remote: Compressing objects: 8% (40/499)
remote: Compressing objects: 9% (45/499)
remote: Compressing objects: 10% (50/499)
remote: Compressing objects: 11% (55/499)
remote: Compressing objects: 12% (60/499)
remote: Compressing objects: 13% (65/499)
remote: Compressing objects: 14% (70/499)
remote: Compressing objects: 15% (75/499)
remote: Compressing objects: 16% (80/499)
remote: Compressing objects: 17% (85/499)
remote: Compressing objects: 18% (90/499)
remote: Compressing objects: 19% (95/499)
remote: Compressing objects: 20% (100/499)
remote: Compressing objects: 21% (105/499)
remote: Compressing objects: 22% (110/499)
remote: Compressing objects: 23% (115/499)
remote: Compressing objects: 24% (120/499)
remote: Compressing objects: 25% (125/499)
remote: Compressing objects: 26% (130/499)
remote: Compressing objects: 27% (135/499)
remote: Compressing objects: 28% (140/499)
remote: Compressing objects: 29% (145/499)
remote: Compressing objects: 30% (150/499)
remote: Compressing objects: 31% (155/499)
remote: Compressing objects: 32% (160/499)
remote: Compressing objects: 33% (165/499)
remote: Compressing objects: 34% (170/499)
remote: Compressing objects: 35% (175/499)
remote: Compressing objects: 36% (180/499)
remote: Compressing objects: 37% (185/499)
remote: Compressing objects: 38% (190/499)
remote: Compressing objects: 39% (195/499)
remote: Compressing objects: 40% (200/499)
remote: Compressing objects: 41% (205/499)
remote: Compressing objects: 42% (210/499)
remote: Compressing objects: 43% (215/499)
remote: Compressing objects: 44% (220/499)
remote: Compressing objects: 45% (225/499)
remote: Compressing objects: 46% (230/499)
remote: Compressing objects: 47% (235/499)
remote: Compressing objects: 48% (240/499)
remote: Compressing objects: 49% (245/499)
remote: Compressing objects: 50% (250/499)
remote: Compressing objects: 51% (255/499)
remote: Compressing objects: 52% (260/499)
remote: Compressing objects: 53% (265/499)
remote: Compressing objects: 54% (270/499)
remote: Compressing objects: 55% (275/499)
remote: Compressing objects: 56% (280/499)
remote: Compressing objects: 57% (285/499)
remote: Compressing objects: 58% (290/499)
remote: Compressing objects: 59% (295/499)
remote: Compressing objects: 60% (300/499)
remote: Compressing objects: 61% (305/499)
remote: Compressing objects: 62% (310/499)
remote: Compressing objects: 63% (315/499)
remote: Compressing objects: 64% (320/499)
remote: Compressing objects: 65% (325/499)
remote: Compressing objects: 66% (330/499)
remote: Compressing objects: 67% (335/499)
remote: Compressing objects: 68% (340/499)
remote: Compressing objects: 69% (345/499)
remote: Compressing objects: 70% (350/499)
remote: Compressing objects: 71% (355/499)
remote: Compressing objects: 72% (360/499)
remote: Compressing objects: 73% (365/499)
remote: Compressing objects: 74% (370/499)
remote: Compressing objects: 75% (375/499)
remote: Compressing objects: 76% (380/499)
remote: Compressing objects: 77% (385/499)
remote: Compressing objects: 78% (390/499)
remote: Compressing objects: 79% (395/499)
remote: Compressing objects: 80% (400/499)
remote: Compressing objects: 81% (405/499)
remote: Compressing objects: 82% (410/499)
remote: Compressing objects: 83% (415/499)
remote: Compressing objects: 84% (420/499)
remote: Compressing objects: 85% (425/499)
remote: Compressing objects: 86% (430/499)
remote: Compressing objects: 87% (435/499)
remote: Compressing objects: 88% (440/499)
remote: Compressing objects: 89% (445/499)
remote: Compressing objects: 90% (450/499)
remote: Compressing objects: 91% (455/499)
remote: Compressing objects: 92% (460/499)
remote: Compressing objects: 93% (465/499)
remote: Compressing objects: 94% (470/499)
remote: Compressing objects: 95% (475/499)
remote: Compressing objects: 96% (480/499)
remote: Compressing objects: 97% (485/499)
remote: Compressing objects: 98% (490/499)
remote: Compressing objects: 99% (495/499)
remote: Compressing objects: 100% (499/499)
remote: Compressing objects: 100% (499/499), done.
50.08 s
Receiving objects: 0% (1/172470)
Receiving objects: 1% (1725/172470)
Receiving objects: 2% (3450/172470)
Receiving objects: 3% (5175/172470)
Receiving objects: 4% (6899/172470), 11.39 MiB | 22.82 MiB/s
Receiving objects: 5% (8624/172470), 11.39 MiB | 22.82 MiB/s
Receiving objects: 5% (9915/172470), 32.03 MiB | 31.29 MiB/s
Receiving objects: 6% (10349/172470), 32.03 MiB | 31.29 MiB/s
Receiving objects: 7% (12073/172470), 32.03 MiB | 31.29 MiB/s
Receiving objects: 8% (13798/172470), 32.03 MiB | 31.29 MiB/s
Receiving objects: 9% (15523/172470), 32.03 MiB | 31.29 MiB/s
Receiving objects: 10% (17247/172470), 32.03 MiB | 31.29 MiB/s
Receiving objects: 10% (17879/172470), 47.42 MiB | 31.12 MiB/s
Receiving objects: 11% (18972/172470), 57.91 MiB | 28.62 MiB/s
Receiving objects: 12% (20697/172470), 57.91 MiB | 28.62 MiB/s
Receiving objects: 13% (22422/172470), 66.68 MiB | 26.41 MiB/s
Receiving objects: 14% (24146/172470), 66.68 MiB | 26.41 MiB/s
Receiving objects: 14% (24301/172470), 66.68 MiB | 26.41 MiB/s
Receiving objects: 15% (25871/172470), 75.94 MiB | 25.11 MiB/s
Receiving objects: 15% (27548/172470), 85.57 MiB | 24.28 MiB/s
Receiving objects: 16% (27596/172470), 85.57 MiB | 24.28 MiB/s
Receiving objects: 17% (29320/172470), 95.39 MiB | 23.70 MiB/s
Receiving objects: 18% (31045/172470), 105.40 MiB | 23.29 MiB/s
Receiving objects: 19% (32770/172470), 105.40 MiB | 23.29 MiB/s
Receiving objects: 19% (33820/172470), 105.40 MiB | 23.29 MiB/s
Receiving objects: 20% (34494/172470), 115.70 MiB | 23.04 MiB/s
Receiving objects: 21% (36219/172470), 115.70 MiB | 23.04 MiB/s
Receiving objects: 22% (37944/172470), 126.40 MiB | 20.96 MiB/s
Receiving objects: 22% (39097/172470), 126.40 MiB | 20.96 MiB/s
Receiving objects: 23% (39669/172470), 137.43 MiB | 19.99 MiB/s
Receiving objects: 24% (41393/172470), 137.43 MiB | 19.99 MiB/s
Receiving objects: 25% (43118/172470), 148.73 MiB | 20.17 MiB/s
Receiving objects: 26% (44843/172470), 148.73 MiB | 20.17 MiB/s
Receiving objects: 26% (45373/172470), 148.73 MiB | 20.17 MiB/s
Receiving objects: 27% (46567/172470), 160.32 MiB | 20.80 MiB/s
Receiving objects: 28% (48292/172470), 160.32 MiB | 20.80 MiB/s
Receiving objects: 29% (50017/172470), 160.32 MiB | 20.80 MiB/s
Receiving objects: 30% (51741/172470), 160.32 MiB | 20.80 MiB/s
Receiving objects: 31% (53466/172470), 160.32 MiB | 20.80 MiB/s
Receiving objects: 32% (55191/172470), 160.32 MiB | 20.80 MiB/s
Receiving objects: 33% (56916/172470), 160.32 MiB | 20.80 MiB/s
Receiving objects: 34% (58640/172470), 160.32 MiB | 20.80 MiB/s
Receiving objects: 35% (60365/172470), 172.23 MiB | 21.39 MiB/s
Receiving objects: 36% (62090/172470), 172.23 MiB | 21.39 MiB/s
Receiving objects: 37% (63814/172470), 172.23 MiB | 21.39 MiB/s
Receiving objects: 37% (64804/172470), 172.23 MiB | 21.39 MiB/s
Receiving objects: 38% (65539/172470), 184.51 MiB | 21.98 MiB/s
Receiving objects: 39% (67264/172470), 184.51 MiB | 21.98 MiB/s
Receiving objects: 40% (68988/172470), 184.51 MiB | 21.98 MiB/s
Receiving objects: 41% (70713/172470), 184.51 MiB | 21.98 MiB/s
Receiving objects: 42% (72438/172470), 197.11 MiB | 22.60 MiB/s
Receiving objects: 43% (74163/172470), 197.11 MiB | 22.60 MiB/s
Receiving objects: 44% (75887/172470), 197.11 MiB | 22.60 MiB/s
Receiving objects: 45% (77612/172470), 197.11 MiB | 22.60 MiB/s
Receiving objects: 45% (77846/172470), 209.04 MiB | 23.02 MiB/s
Receiving objects: 45% (77862/172470), 222.45 MiB | 21.34 MiB/s
Receiving objects: 45% (78083/172470), 229.68 MiB | 20.49 MiB/s
Receiving objects: 45% (78211/172470), 253.05 MiB | 17.95 MiB/s
Receiving objects: 45% (78213/172470), 270.21 MiB | 16.23 MiB/s
Receiving objects: 46% (79337/172470), 270.21 MiB | 16.23 MiB/s
Receiving objects: 47% (81061/172470), 270.21 MiB | 16.23 MiB/s
Receiving objects: 47% (81756/172470), 279.19 MiB | 15.58 MiB/s
Receiving objects: 48% (82786/172470), 293.90 MiB | 15.86 MiB/s
Receiving objects: 48% (83683/172470), 301.55 MiB | 15.96 MiB/s
Receiving objects: 48% (83693/172470), 313.45 MiB | 15.18 MiB/s
Receiving objects: 49% (84511/172470), 313.45 MiB | 15.18 MiB/s
Receiving objects: 50% (86235/172470), 317.99 MiB | 14.39 MiB/s
Receiving objects: 51% (87960/172470), 317.99 MiB | 14.39 MiB/s
Receiving objects: 51% (88278/172470), 322.87 MiB | 13.63 MiB/s
Receiving objects: 52% (89685/172470), 328.06 MiB | 12.83 MiB/s
Receiving objects: 53% (91410/172470), 328.06 MiB | 12.83 MiB/s
Receiving objects: 54% (93134/172470), 328.06 MiB | 12.83 MiB/s
Receiving objects: 55% (94859/172470), 328.06 MiB | 12.83 MiB/s
Receiving objects: 56% (96584/172470), 328.06 MiB | 12.83 MiB/s
Receiving objects: 56% (97700/172470), 328.06 MiB | 12.83 MiB/s
Receiving objects: 57% (98308/172470), 328.06 MiB | 12.83 MiB/s
Receiving objects: 58% (100033/172470), 332.74 MiB | 11.87 MiB/s
Receiving objects: 59% (101758/172470), 332.74 MiB | 11.87 MiB/s
Receiving objects: 60% (103482/172470), 332.74 MiB | 11.87 MiB/s
Receiving objects: 61% (105207/172470), 332.74 MiB | 11.87 MiB/s
Receiving objects: 62% (106932/172470), 332.74 MiB | 11.87 MiB/s
Receiving objects: 63% (108657/172470), 332.74 MiB | 11.87 MiB/s
Receiving objects: 64% (110381/172470), 332.74 MiB | 11.87 MiB/s
Receiving objects: 65% (112106/172470), 332.74 MiB | 11.87 MiB/s
Receiving objects: 66% (113831/172470), 338.45 MiB | 11.47 MiB/s
Receiving objects: 67% (115555/172470), 338.45 MiB | 11.47 MiB/s
Receiving objects: 68% (117280/172470), 338.45 MiB | 11.47 MiB/s
Receiving objects: 69% (119005/172470), 338.45 MiB | 11.47 MiB/s
Receiving objects: 70% (120729/172470), 338.45 MiB | 11.47 MiB/s
Receiving objects: 70% (122325/172470), 338.45 MiB | 11.47 MiB/s
Receiving objects: 71% (122454/172470), 344.57 MiB | 11.24 MiB/s
Receiving objects: 71% (124059/172470), 350.96 MiB | 10.94 MiB/s
Receiving objects: 72% (124179/172470), 350.96 MiB | 10.94 MiB/s
Receiving objects: 72% (125608/172470), 364.90 MiB | 11.40 MiB/s
Receiving objects: 73% (125904/172470), 372.29 MiB | 12.03 MiB/s
Receiving objects: 73% (126763/172470), 380.05 MiB | 12.67 MiB/s
Receiving objects: 74% (127628/172470), 396.53 MiB | 14.12 MiB/s
Receiving objects: 74% (127939/172470), 396.53 MiB | 14.12 MiB/s
Receiving objects: 75% (129353/172470), 414.29 MiB | 15.43 MiB/s
Receiving objects: 75% (130012/172470), 414.29 MiB | 15.43 MiB/s
Receiving objects: 76% (131078/172470), 423.67 MiB | 16.12 MiB/s
Receiving objects: 76% (132163/172470), 443.38 MiB | 17.42 MiB/s
Receiving objects: 76% (132319/172470), 453.77 MiB | 18.09 MiB/s
Receiving objects: 76% (132368/172470), 473.15 MiB | 16.99 MiB/s
Receiving objects: 76% (132375/172470), 482.55 MiB | 15.14 MiB/s
Receiving objects: 76% (132375/172470), 491.18 MiB | 12.74 MiB/s
Receiving objects: 76% (132375/172470), 495.89 MiB | 9.28 MiB/s
Receiving objects: 76% (132375/172470), 501.81 MiB | 7.24 MiB/s
Receiving objects: 76% (132376/172470), 509.16 MiB | 6.91 MiB/s
Receiving objects: 76% (132376/172470), 517.68 MiB | 6.55 MiB/s
Receiving objects: 76% (132376/172470), 527.54 MiB | 7.51 MiB/s
Receiving objects: 76% (132377/172470), 538.70 MiB | 8.83 MiB/s
Receiving objects: 76% (132377/172470), 551.10 MiB | 10.14 MiB/s
Receiving objects: 76% (132378/172470), 564.82 MiB | 11.43 MiB/s
Receiving objects: 76% (132378/172470), 579.89 MiB | 12.73 MiB/s
Receiving objects: 76% (132382/172470), 596.29 MiB | 14.06 MiB/s
Receiving objects: 76% (132390/172470), 613.94 MiB | 15.37 MiB/s
Receiving objects: 76% (132390/172470), 632.98 MiB | 16.70 MiB/s
Receiving objects: 76% (132391/172470), 643.66 MiB | 17.51 MiB/s
Receiving objects: 77% (132802/172470), 655.70 MiB | 18.54 MiB/s
Receiving objects: 78% (134527/172470), 655.70 MiB | 18.54 MiB/s
Receiving objects: 79% (136252/172470), 669.45 MiB | 19.90 MiB/s
Receiving objects: 79% (137166/172470), 669.45 MiB | 19.90 MiB/s
Receiving objects: 80% (137976/172470), 669.45 MiB | 19.90 MiB/s
Receiving objects: 81% (139701/172470), 684.91 MiB | 21.55 MiB/s
Receiving objects: 82% (141426/172470), 684.91 MiB | 21.55 MiB/s
Receiving objects: 83% (143151/172470), 684.91 MiB | 21.55 MiB/s
Receiving objects: 84% (144875/172470), 684.91 MiB | 21.55 MiB/s
Receiving objects: 85% (146600/172470), 684.91 MiB | 21.55 MiB/s
Receiving objects: 86% (148325/172470), 684.91 MiB | 21.55 MiB/s
Receiving objects: 87% (150049/172470), 684.91 MiB | 21.55 MiB/s
Receiving objects: 88% (151774/172470), 702.36 MiB | 23.57 MiB/s
Receiving objects: 88% (152905/172470), 702.36 MiB | 23.57 MiB/s
Receiving objects: 89% (153499/172470), 702.36 MiB | 23.57 MiB/s
Receiving objects: 90% (155223/172470), 702.36 MiB | 23.57 MiB/s
Receiving objects: 91% (156948/172470), 721.95 MiB | 25.98 MiB/s
Receiving objects: 92% (158673/172470), 721.95 MiB | 25.98 MiB/s
Receiving objects: 93% (160398/172470), 742.65 MiB | 28.59 MiB/s
Receiving objects: 94% (162122/172470), 742.65 MiB | 28.59 MiB/s
Receiving objects: 94% (163835/172470), 742.65 MiB | 28.59 MiB/s
Receiving objects: 95% (163847/172470), 742.65 MiB | 28.59 MiB/s
Receiving objects: 96% (165572/172470), 760.54 MiB | 30.50 MiB/s
Receiving objects: 97% (167296/172470), 760.54 MiB | 30.50 MiB/s
Receiving objects: 98% (169021/172470), 760.54 MiB | 30.50 MiB/s
Receiving objects: 99% (170746/172470), 760.54 MiB | 30.50 MiB/s
remote: Total 172470 (delta 1296), reused 1222 (delta 1161), pack-reused 170808 (from 2)
50.08 s
Receiving objects: 100% (172470/172470), 760.54 MiB | 30.50 MiB/s
Receiving objects: 100% (172470/172470), 777.16 MiB | 17.03 MiB/s, done.
52.60 s
Resolving deltas: 0% (0/106791)
Resolving deltas: 1% (1068/106791)
Resolving deltas: 2% (2136/106791)
Resolving deltas: 3% (3204/106791)
Resolving deltas: 4% (4272/106791)
Resolving deltas: 5% (5340/106791)
Resolving deltas: 6% (6408/106791)
Resolving deltas: 7% (7480/106791)
Resolving deltas: 8% (8544/106791)
Resolving deltas: 9% (9612/106791)
Resolving deltas: 10% (10680/106791)
Resolving deltas: 11% (11748/106791)
Resolving deltas: 12% (12815/106791)
Resolving deltas: 13% (13883/106791)
Resolving deltas: 14% (14951/106791)
Resolving deltas: 15% (16019/106791)
Resolving deltas: 16% (17087/106791)
Resolving deltas: 17% (18155/106791)
Resolving deltas: 18% (19223/106791)
Resolving deltas: 19% (20291/106791)
Resolving deltas: 20% (21359/106791)
Resolving deltas: 21% (22427/106791)
Resolving deltas: 22% (23495/106791)
Resolving deltas: 23% (24562/106791)
Resolving deltas: 24% (25633/106791)
Resolving deltas: 25% (26698/106791)
Resolving deltas: 26% (27766/106791)
Resolving deltas: 27% (28834/106791)
Resolving deltas: 28% (29902/106791)
Resolving deltas: 29% (30970/106791)
Resolving deltas: 30% (32038/106791)
Resolving deltas: 31% (33106/106791)
Resolving deltas: 32% (34175/106791)
Resolving deltas: 33% (35242/106791)
Resolving deltas: 34% (36309/106791)
Resolving deltas: 35% (37377/106791)
Resolving deltas: 36% (38445/106791)
Resolving deltas: 37% (39513/106791)
Resolving deltas: 38% (40582/106791)
Resolving deltas: 39% (41649/106791)
Resolving deltas: 40% (42718/106791)
Resolving deltas: 41% (43786/106791)
Resolving deltas: 42% (44853/106791)
Resolving deltas: 43% (45922/106791)
Resolving deltas: 44% (46990/106791)
Resolving deltas: 44% (47408/106791)
Resolving deltas: 45% (48056/106791)
Resolving deltas: 46% (49124/106791)
Resolving deltas: 47% (50192/106791)
Resolving deltas: 48% (51260/106791)
Resolving deltas: 49% (52328/106791)
Resolving deltas: 50% (53397/106791)
Resolving deltas: 51% (54464/106791)
Resolving deltas: 52% (55532/106791)
Resolving deltas: 53% (56600/106791)
Resolving deltas: 54% (57668/106791)
Resolving deltas: 55% (58741/106791)
Resolving deltas: 56% (59803/106791)
Resolving deltas: 57% (60871/106791)
Resolving deltas: 58% (61939/106791)
Resolving deltas: 59% (63008/106791)
Resolving deltas: 60% (64075/106791)
Resolving deltas: 61% (65143/106791)
Resolving deltas: 62% (66212/106791)
Resolving deltas: 63% (67279/106791)
Resolving deltas: 64% (68347/106791)
Resolving deltas: 65% (69415/106791)
Resolving deltas: 66% (70483/106791)
Resolving deltas: 67% (71550/106791)
Resolving deltas: 68% (72618/106791)
Resolving deltas: 69% (73686/106791)
Resolving deltas: 70% (74754/106791)
Resolving deltas: 71% (75822/106791)
Resolving deltas: 72% (76890/106791)
Resolving deltas: 73% (77958/106791)
Resolving deltas: 74% (79026/106791)
Resolving deltas: 75% (80094/106791)
Resolving deltas: 76% (81162/106791)
Resolving deltas: 77% (82230/106791)
Resolving deltas: 78% (83297/106791)
Resolving deltas: 79% (84365/106791)
Resolving deltas: 80% (85433/106791)
Resolving deltas: 81% (86501/106791)
Resolving deltas: 82% (87569/106791)
Resolving deltas: 83% (88637/106791)
Resolving deltas: 83% (89674/106791)
Resolving deltas: 84% (89705/106791)
Resolving deltas: 85% (90773/106791)
Resolving deltas: 86% (91842/106791)
Resolving deltas: 87% (92909/106791)
Resolving deltas: 88% (93977/106791)
Resolving deltas: 89% (95044/106791)
Resolving deltas: 90% (96113/106791)
Resolving deltas: 91% (97181/106791)
Resolving deltas: 92% (98248/106791)
Resolving deltas: 93% (99316/106791)
Resolving deltas: 94% (100384/106791)
Resolving deltas: 95% (101453/106791)
Resolving deltas: 96% (102521/106791)
Resolving deltas: 97% (103591/106791)
Resolving deltas: 98% (104658/106791)
Resolving deltas: 99% (105724/106791)
Resolving deltas: 100% (106791/106791)
Resolving deltas: 100% (106791/106791), done.
53.39 s
Fetching commit d0b160f56fd8b9abbd0d4a6eb27e6b2a65bb689f for ci/feynkit-green ...
53.39 s
$ /nix/store/b1wn5clix1mz4vpfih7x9cnj9qfh7c6h-git-2.54.0/bin/git fetch origin d0b160f56fd8b9abbd0d4a6eb27e6b2a65bb689f
53.85 s
From https://github.com/alphal00p/gammaloop
53.85 s
* branch d0b160f56fd8b9abbd0d4a6eb27e6b2a65bb689f -> FETCH_HEAD
53.87 s
$ /nix/store/bhv6xyvqw6gjs3j488gi1z6wdv18bdpa-coreutils-9.11/bin/timeout --kill-after=15s 7200s /nix/store/b1wn5clix1mz4vpfih7x9cnj9qfh7c6h-git-2.54.0/bin/git -c advice.detachedHead=false checkout d0b160f56fd8b9abbd0d4a6eb27e6b2a65bb689f
54.52 s
HEAD is now at d0b160f56 docs: build the notebook host wheel against the vendored workspace
54.53 s
$ /nix/store/bhv6xyvqw6gjs3j488gi1z6wdv18bdpa-coreutils-9.11/bin/timeout --kill-after=15s 7200s /nix/store/bxgja2ppiqi6w2bgn0r07d7mgnl1k6k2-nix-2.34.8/bin/nix --extra-experimental-features nix-command --extra-experimental-features flakes --log-format internal-json run .#packages.x86_64-linux.nix-ci-check-gammaloop-doctest --print-build-logs
54.75 s
warning: ignoring untrusted flake configuration setting 'extra-substituters'.
54.75 s
Pass '--accept-flake-config' to trust it
54.75 s
warning: ignoring untrusted flake configuration setting 'extra-trusted-public-keys'.
54.75 s
Pass '--accept-flake-config' to trust it
78.94 s
79.23 s
Downloading cached busybox from https://cache.nix-ci.com
79.23 s
Downloading cached libidn2 from https://cache.nix-ci.com
79.23 s
Downloading cached publicsuffix-list-0-unstable-2026-09 from https://cache.nix-ci.com
79.31 s
Downloaded cached publicsuffix-list-0-unstable-2026-09 (330 KiB) in 74ms
79.31 s
Progress: 0 of 1 built, 1 of 62 downloaded from cache (2 downloading)
79.32 s
Downloaded cached busybox (230 KiB) in 89ms
79.32 s
Progress: 0 of 1 built, 2 of 62 downloaded from cache (1 downloading)
79.33 s
Downloaded cached libidn2 (359 KiB) in 93ms
79.33 s
Progress: 0 of 1 built, 3 of 62 downloaded from cache
79.33 s
Downloading cached glibc-2.42 from https://cache.nix-ci.com
79.54 s
Downloaded cached glibc-2.42 (33.4 MiB) in 213ms
79.54 s
Progress: 0 of 1 built, 4 of 62 downloaded from cache
79.54 s
Downloading cached acl from https://cache.nix-ci.com
79.54 s
Downloading cached aws-c-common from https://cache.nix-ci.com
79.54 s
Downloading cached bash from https://cache.nix-ci.com
79.54 s
Downloading cached brotli-1.2.0-lib from https://cache.nix-ci.com
79.54 s
Downloading cached bzip2 from https://cache.nix-ci.com
79.54 s
Downloading cached editline-1.17.1-unstable-2025-05 from https://cache.nix-ci.com
79.54 s
Downloading cached gcc-15.3.0-lib from https://cache.nix-ci.com
79.54 s
Downloading cached hwloc-2.14.0-lib from https://cache.nix-ci.com
79.54 s
Downloading cached keyutils-1.6.3-lib from https://cache.nix-ci.com
79.54 s
Downloading cached libcpuid from https://cache.nix-ci.com
79.54 s
Downloading cached libpsl from https://cache.nix-ci.com
79.54 s
Downloading cached libsodium-1.0.22-unstable-2026-08 from https://cache.nix-ci.com
79.54 s
Downloading cached libxml2 from https://cache.nix-ci.com
79.54 s
Downloading cached llhttp from https://cache.nix-ci.com
79.54 s
Downloading cached libseccomp-2.6.1-lib from https://cache.nix-ci.com
79.54 s
Downloading cached lowdown-3.0.1-lib from https://cache.nix-ci.com
79.60 s
Downloaded cached libsodium-1.0.22-unstable-2026-08 (669 KiB) in 62ms
79.60 s
Progress: 0 of 1 built, 5 of 62 downloaded from cache (15 downloading)
79.60 s
Downloading cached nghttp2-1.70.0-lib from https://cache.nix-ci.com
79.60 s
Downloaded cached aws-c-common (1.1 MiB) in 63ms
79.61 s
Progress: 0 of 1 built, 6 of 62 downloaded from cache (15 downloading)
79.61 s
Downloading cached nghttp3 from https://cache.nix-ci.com
79.61 s
Downloaded cached brotli-1.2.0-lib (961 KiB) in 70ms
79.61 s
Progress: 0 of 1 built, 7 of 62 downloaded from cache (15 downloading)
79.61 s
Downloading cached aws-c-compression from https://cache.nix-ci.com
79.62 s
Downloaded cached acl (134 KiB) in 76ms
79.62 s
Progress: 0 of 1 built, 8 of 62 downloaded from cache (15 downloading)
79.62 s
Downloading cached aws-c-sdkutils from https://cache.nix-ci.com
79.66 s
Downloaded cached keyutils-1.6.3-lib (41 KiB) in 114ms
79.66 s
Progress: 0 of 1 built, 9 of 62 downloaded from cache (15 downloading)
79.66 s
Downloading cached aws-checksums from https://cache.nix-ci.com
79.66 s
Downloaded cached editline-1.17.1-unstable-2025-05 (58 KiB) in 119ms
79.66 s
Progress: 0 of 1 built, 10 of 62 downloaded from cache (15 downloading)
79.66 s
Downloading cached openssl from https://cache.nix-ci.com
79.66 s
Downloaded cached llhttp (89 KiB) in 120ms
79.66 s
Progress: 0 of 1 built, 11 of 62 downloaded from cache (15 downloading)
79.66 s
Downloading cached pcre2 from https://cache.nix-ci.com
79.66 s
Downloaded cached libseccomp-2.6.1-lib (189 KiB) in 122ms
79.67 s
Progress: 0 of 1 built, 12 of 62 downloaded from cache (15 downloading)
79.67 s
Downloading cached xz from https://cache.nix-ci.com
79.67 s
Downloaded cached bzip2 (86 KiB) in 126ms
79.67 s
Progress: 0 of 1 built, 13 of 62 downloaded from cache (15 downloading)
79.67 s
Downloading cached zlib from https://cache.nix-ci.com
79.67 s
Downloaded cached libcpuid (326 KiB) in 129ms
79.67 s
Progress: 0 of 1 built, 14 of 62 downloaded from cache (15 downloading)
79.67 s
Downloaded cached hwloc-2.14.0-lib (458 KiB) in 133ms
79.67 s
Progress: 0 of 1 built, 15 of 62 downloaded from cache (14 downloading)
79.68 s
Downloaded cached lowdown-3.0.1-lib (341 KiB) in 134ms
79.68 s
Progress: 0 of 1 built, 16 of 62 downloaded from cache (13 downloading)
79.69 s
Downloaded cached libpsl (114 KiB) in 148ms
79.69 s
Progress: 0 of 1 built, 17 of 62 downloaded from cache (12 downloading)
79.70 s
Downloaded cached libxml2 (1.4 MiB) in 155ms
79.70 s
Progress: 0 of 1 built, 18 of 62 downloaded from cache (11 downloading)
79.70 s
Downloaded cached bash (1.8 MiB) in 156ms
79.70 s
Progress: 0 of 1 built, 19 of 62 downloaded from cache (10 downloading)
79.72 s
Downloaded cached gcc-15.3.0-lib (9.8 MiB) in 174ms
79.72 s
Progress: 0 of 1 built, 20 of 62 downloaded from cache (9 downloading)
79.72 s
Downloading cached boehm-gc from https://cache.nix-ci.com
79.72 s
Downloading cached icu4c from https://cache.nix-ci.com
79.72 s
Downloading cached onetbb from https://cache.nix-ci.com
79.72 s
Downloading cached zstd from https://cache.nix-ci.com
79.72 s
Downloaded cached aws-c-compression (31 KiB) in 103ms
79.72 s
Progress: 0 of 1 built, 21 of 62 downloaded from cache (12 downloading)
79.72 s
Downloaded cached nghttp2-1.70.0-lib (225 KiB) in 116ms
79.72 s
Progress: 0 of 1 built, 22 of 62 downloaded from cache (11 downloading)
79.73 s
Downloaded cached nghttp3 (228 KiB) in 128ms
79.73 s
Progress: 0 of 1 built, 23 of 62 downloaded from cache (10 downloading)
79.73 s
Downloaded cached aws-c-sdkutils (155 KiB) in 117ms
79.73 s
Progress: 0 of 1 built, 24 of 62 downloaded from cache (9 downloading)
79.74 s
Downloaded cached aws-checksums (86 KiB) in 79ms
79.74 s
Progress: 0 of 1 built, 25 of 62 downloaded from cache (8 downloading)
79.78 s
Downloaded cached zlib (129 KiB) in 110ms
79.78 s
Progress: 0 of 1 built, 26 of 62 downloaded from cache (7 downloading)
79.78 s
Downloading cached sqlite from https://cache.nix-ci.com
79.81 s
Downloaded cached xz (837 KiB) in 145ms
79.81 s
Progress: 0 of 1 built, 27 of 62 downloaded from cache (7 downloading)
79.84 s
Downloaded cached boehm-gc (312 KiB) in 123ms
79.84 s
Progress: 0 of 1 built, 28 of 62 downloaded from cache (6 downloading)
79.85 s
Downloaded cached pcre2 (2 MiB) in 182ms
79.85 s
Progress: 0 of 1 built, 29 of 62 downloaded from cache (5 downloading)
79.86 s
Downloaded cached onetbb (626 KiB) in 137ms
79.86 s
Progress: 0 of 1 built, 30 of 62 downloaded from cache (4 downloading)
79.86 s
Downloading cached libblake3 from https://cache.nix-ci.com
79.88 s
Downloaded cached zstd (1.1 MiB) in 161ms
79.88 s
Progress: 0 of 1 built, 31 of 62 downloaded from cache (4 downloading)
79.94 s
Downloaded cached openssl (8.9 MiB) in 278ms
79.94 s
Progress: 0 of 1 built, 32 of 62 downloaded from cache (3 downloading)
79.94 s
Downloading cached aws-c-cal from https://cache.nix-ci.com
79.94 s
Downloading cached krb5-1.22.2-lib from https://cache.nix-ci.com
79.94 s
Downloading cached libssh2 from https://cache.nix-ci.com
79.94 s
Downloading cached s2n-tls from https://cache.nix-ci.com
79.94 s
Downloading cached libarchive-3.8.9-lib from https://cache.nix-ci.com
79.94 s
Downloading cached ngtcp2 from https://cache.nix-ci.com
79.96 s
Downloaded cached libblake3 (117 KiB) in 103ms
79.96 s
Progress: 0 of 1 built, 33 of 62 downloaded from cache (8 downloading)
80.02 s
Downloaded cached sqlite (5.7 MiB) in 243ms
80.02 s
Progress: 0 of 1 built, 34 of 62 downloaded from cache (7 downloading)
80.06 s
Downloaded cached aws-c-cal (158 KiB) in 116ms
80.06 s
Progress: 0 of 1 built, 35 of 62 downloaded from cache (6 downloading)
80.07 s
Downloaded cached libssh2 (330 KiB) in 126ms
80.07 s
Progress: 0 of 1 built, 36 of 62 downloaded from cache (5 downloading)
80.07 s
Downloading cached libgit2-1.9.7-lib from https://cache.nix-ci.com
80.08 s
Downloaded cached ngtcp2 (515 KiB) in 133ms
80.08 s
Progress: 0 of 1 built, 37 of 62 downloaded from cache (5 downloading)
80.10 s
Downloaded cached s2n-tls (1.3 MiB) in 157ms
80.10 s
Progress: 0 of 1 built, 38 of 62 downloaded from cache (4 downloading)
80.10 s
Downloading cached aws-c-io from https://cache.nix-ci.com
80.10 s
Downloaded cached libarchive-3.8.9-lib (961 KiB) in 160ms
80.10 s
Progress: 0 of 1 built, 39 of 62 downloaded from cache (4 downloading)
80.13 s
Downloaded cached krb5-1.22.2-lib (2.7 MiB) in 193ms
80.13 s
Progress: 0 of 1 built, 40 of 62 downloaded from cache (3 downloading)
80.13 s
Downloading cached curl from https://cache.nix-ci.com
80.20 s
Downloaded cached libgit2-1.9.7-lib (1.6 MiB) in 127ms
80.20 s
Progress: 0 of 1 built, 41 of 62 downloaded from cache (3 downloading)
80.20 s
Downloaded cached aws-c-io (648 KiB) in 103ms
80.20 s
Progress: 0 of 1 built, 42 of 62 downloaded from cache (2 downloading)
80.21 s
Downloading cached aws-c-event-stream from https://cache.nix-ci.com
80.21 s
Downloading cached aws-c-http from https://cache.nix-ci.com
80.25 s
Downloaded cached curl (1.2 MiB) in 117ms
80.25 s
Progress: 0 of 1 built, 43 of 62 downloaded from cache (3 downloading)
80.30 s
Downloaded cached aws-c-event-stream (176 KiB) in 93ms
80.30 s
Progress: 0 of 1 built, 44 of 62 downloaded from cache (2 downloading)
80.30 s
Downloaded cached aws-c-http (641 KiB) in 97ms
80.30 s
Progress: 0 of 1 built, 45 of 62 downloaded from cache (1 downloading)
80.30 s
Downloading cached aws-c-auth from https://cache.nix-ci.com
80.30 s
Downloading cached aws-c-mqtt from https://cache.nix-ci.com
80.39 s
Downloaded cached aws-c-auth (387 KiB) in 90ms
80.39 s
Progress: 0 of 1 built, 46 of 62 downloaded from cache (2 downloading)
80.40 s
Downloading cached aws-c-s3 from https://cache.nix-ci.com
80.40 s
Downloaded cached icu4c (39.5 MiB) in 678ms
80.40 s
Progress: 0 of 1 built, 47 of 62 downloaded from cache (2 downloading)
80.40 s
Downloading cached boost from https://cache.nix-ci.com
80.40 s
Downloaded cached aws-c-mqtt (557 KiB) in 91ms
80.40 s
Progress: 0 of 1 built, 48 of 62 downloaded from cache (2 downloading)
80.44 s
Downloaded cached aws-c-s3 (384 KiB) in 47ms
80.44 s
Progress: 0 of 1 built, 49 of 62 downloaded from cache (1 downloading)
80.44 s
Downloading cached aws-crt-cpp from https://cache.nix-ci.com
80.53 s
Downloaded cached boost (14.5 MiB) in 134ms
80.53 s
Progress: 0 of 1 built, 50 of 62 downloaded from cache (1 downloading)
80.53 s
Downloading cached nix-util from https://cache.nix-ci.com
80.53 s
Downloaded cached aws-crt-cpp (979 KiB) in 89ms
80.53 s
Progress: 0 of 1 built, 51 of 62 downloaded from cache (1 downloading)
80.59 s
Downloaded cached nix-util (2.4 MiB) in 56ms
80.59 s
Progress: 0 of 1 built, 52 of 62 downloaded from cache
80.59 s
Downloading cached nix-nswrapper from https://cache.nix-ci.com
80.59 s
Downloading cached nix-store from https://cache.nix-ci.com
80.63 s
Downloaded cached nix-nswrapper (131 KiB) in 42ms
80.63 s
Progress: 0 of 1 built, 53 of 62 downloaded from cache (1 downloading)
80.67 s
Downloaded cached nix-store (5.8 MiB) in 81ms
80.67 s
Progress: 0 of 1 built, 54 of 62 downloaded from cache
80.67 s
Downloading cached nix-fetchers from https://cache.nix-ci.com
80.67 s
Downloading cached nix-main from https://cache.nix-ci.com
80.72 s
Downloaded cached nix-fetchers (1.5 MiB) in 49ms
80.72 s
Progress: 0 of 1 built, 55 of 62 downloaded from cache (1 downloading)
80.72 s
Downloading cached nix-expr from https://cache.nix-ci.com
80.72 s
Downloaded cached nix-main (393 KiB) in 50ms
80.72 s
Progress: 0 of 1 built, 56 of 62 downloaded from cache (1 downloading)
80.78 s
Downloaded cached nix-expr (3.3 MiB) in 63ms
80.78 s
Progress: 0 of 1 built, 57 of 62 downloaded from cache
80.78 s
Downloading cached nix-flake from https://cache.nix-ci.com
80.83 s
Downloaded cached nix-flake (956 KiB) in 51ms
80.83 s
Progress: 0 of 1 built, 58 of 62 downloaded from cache
80.83 s
Downloading cached nix-cmd from https://cache.nix-ci.com
80.89 s
Downloaded cached nix-cmd (1 MiB) in 51ms
80.89 s
Progress: 0 of 1 built, 59 of 62 downloaded from cache
80.89 s
Downloading cached nix from https://cache.nix-ci.com
81.01 s
Downloaded cached nix (3.9 MiB) in 125ms
81.01 s
Progress: 0 of 1 built, 60 of 62 downloaded from cache
81.01 s
Downloading cached nix from https://cache.nix-ci.com
81.05 s
Downloaded cached nix (8848 B) in 39ms
81.05 s
Progress: 0 of 1 built, 61 of 62 downloaded from cache
81.05 s
Downloading cached nix-ci-check-gammaloop-doctest from https://cache.nix-ci.com
81.09 s
Downloaded cached nix-ci-check-gammaloop-doctest (1112 B) in 39ms
81.09 s
Progress: 0 of 1 built, 62 of 62 downloaded from cache
81.24 s
evaluating derivation 'gdo you want to allow configuration setting 'extra-substituters' to be set to 'https://cache.nix-ci.com ' (y/N)? do you want to permanently mark this value as untrusted (y/N)? warning: ignoring untrusted flake configuration setting 'extra-substituters'.
81.24 s
Pass '--accept-flake-config' to trust it
81.24 s
do you want to allow configuration setting 'extra-trusted-public-keys' to be set to 'nix-ci:g3xV5BDTLtIBZr/A00IU1x0EtKKlb7YLgBN2SgYgM6A= ' (y/N)? do you want to permanently mark this value as untrusted (y/N)? warning: ignoring untrusted flake configuration setting 'extra-trusted-public-keys'.
81.24 s
Pass '--accept-flake-config' to trust it
107.10 s
copying '/nix/store/639g
evaluating derivation 'g
copying '/nix/store/639g
evaluating derivation 'g
copying '/nix/store/639g
evaluating derivation 'g
copying '/nix/store/639g
evaluating derivation 'g
copying '/nix/store/639g
evaluating derivation 'g
copying '/nix/store/639g
evaluating derivation 'g
copying '/nix/store/639g
evaluating derivation 'g
copying '/nix/store/639g
evaluating derivation 'g
copying '/nix/store/639g
evaluating derivation 'g
copying '/nix/store/639g
evaluating derivation 'g
copying '/nix/store/639g
evaluating derivation 'g
copying '/nix/store/639g
evaluating derivation 'g
copying '/nix/store/639g
evaluating derivation 'g
copying '/nix/store/639g
evaluating derivation 'g
copying '/nix/store/639g
evaluating derivation 'g
copying '/nix/store/639g
evaluating derivation 'g
copying '/nix/store/639g
evaluating derivation 'g
copying '/nix/store/639g
evaluating derivation 'g
copying '/nix/store/639g
evaluating derivation 'g
copying '/nix/store/639g
evaluating derivation 'g
copying '/nix/store/639g
evaluating derivation 'g
copying '/nix/store/639g
evaluating derivation 'g
copying '/nix/store/639g
evaluating derivation 'g
copying '/nix/store/639g
evaluating derivation 'g
copying '/nix/store/639g
evaluating derivation 'g
copying '/nix/store/639g
evaluating derivation 'g
copying '/nix/store/639g
evaluating derivation 'g
copying '/nix/store/639g
evaluating derivation 'g
copying '/nix/store/639g
evaluating derivation 'g
copying '/nix/store/639g
evaluating derivation 'g
copying '/nix/store/639g
evaluating derivation 'g
copying '/nix/store/639g
evaluating derivation 'g
copying '/nix/store/639g
evaluating derivation 'g
copying '/nix/store/639g
evaluating derivation 'g
copying '/nix/store/639g
evaluating derivation 'g
copying '/nix/store/639g
evaluating derivation 'g
copying '/nix/store/639g
evaluating derivation 'g
copying '/nix/store/639g
evaluating derivation 'g
copying '/nix/store/639g
evaluating derivation 'g
copying '/nix/store/639g
evaluating derivation 'g
copying '/nix/store/639g
evaluating derivation 'g
copying '/nix/store/639g
evaluating derivation 'g
copying '/nix/store/639g
evaluating derivation 'g
copying '/nix/store/639g
evaluating derivation 'g
copying '/nix/store/639g
evaluating derivation 'g
copying '/nix/store/639g
evaluating derivation 'g
copying '/nix/store/639g
evaluating derivation 'g
copying '/nix/store/639g
evaluating derivation 'g
copying '/nix/store/639g
evaluating derivation 'g
copying '/nix/store/639g
evaluating derivation 'g
copying '/nix/store/639g
evaluating derivation 'g
copying '/nix/store/639g
evaluating derivation 'g
copying '/nix/store/639g
evaluating derivation 'g
copying '/nix/store/639g
evaluating derivation 'g
copying '/nix/store/639g
evaluating derivation 'g
copying '/nix/store/639g
evaluating derivation 'g
copying '/nix/store/639g
evaluating derivation 'g
copying '/nix/store/639g
evaluating derivation 'g
copying '/nix/store/639g
evaluating derivation 'g
copying '/nix/store/639g
evaluating derivation 'g
copying '/nix/store/639g
evaluating derivation 'g
copying '/nix/store/639g
evaluating derivation 'g
copying '/nix/store/639g
evaluating derivation 'g
copying '/nix/store/639g
evaluating derivation 'g
copying '/nix/store/639g
evaluating derivation 'g
copying '/nix/store/639g
evaluating derivation 'g
copying '/nix/store/639g
evaluating derivation 'g
copying '/nix/store/639g
evaluating derivation 'g
copying '/nix/store/639g
evaluating derivation 'g
copying '/nix/store/639g
evaluating derivation 'g
copying '/nix/store/639g
evaluating derivation 'g
copying '/nix/store/639g
evaluating derivation 'g
copying '/nix/store/639g
evaluating derivation 'g
copying '/nix/store/639g
evaluating derivation 'g
copying '/nix/store/639g
evaluating derivation 'g
copying '/nix/store/639g
evaluating derivation 'g
copying '/nix/store/639g
evaluating derivation 'g
copying '/nix/store/639g
evaluating derivation 'g
copying '/nix/store/639g
evaluating derivation 'g
copying '/nix/store/639g
evaluating derivation 'g
copying '/nix/store/639g
evaluating derivation 'g
copying '/nix/store/639g
evaluating derivation 'g
copying '/nix/store/639g
evaluating derivation 'g
copying '/nix/store/639g
evaluating derivation 'g
copying '/nix/store/639g
evaluating derivation 'g
copying '/nix/store/639g
evaluating derivation 'g
copying '/nix/store/639g
evaluating derivation 'g
copying '/nix/store/639g
evaluating derivation 'g
copying '/nix/store/639g
evaluating derivation 'g
copying '/nix/store/639g
evaluating derivation 'g
copying '/nix/store/639g
evaluating derivation 'g
copying '/nix/store/639g
evaluating derivation 'g
copying '/nix/store/639g
evaluating derivation 'g
copying '/nix/store/639g
evaluating derivation 'g
copying '/nix/store/639g
evaluating derivation 'g
copying '/nix/store/639g
evaluating derivation 'g
copying '/nix/store/639g
evaluating derivation 'g
copying '/nix/store/639g
evaluating derivation 'g
copying '/nix/store/639g
evaluating derivation 'g
copying '/nix/store/639g
evaluating derivation 'g
copying '/nix/store/639g
evaluating derivation 'g
copying '/nix/store/639g
evaluating derivation 'g
copying '/nix/store/639g
evaluating derivation 'g
copying '/nix/store/639g
evaluating derivation 'g
copying '/nix/store/639g
evaluating derivation 'g
copying '/nix/store/639g
evaluating derivation 'g
copying '/nix/store/639g
evaluating derivation 'g
copying '/nix/store/639g
evaluating derivation 'g
copying '/nix/store/639g
evaluating derivation 'g
copying '/nix/store/639g
evaluating derivation 'g
copying '/nix/store/639g
evaluating derivation 'g
copying '/nix/store/639g
evaluating derivation 'g
copying '/nix/store/639g
evaluating derivation 'g
copying '/nix/store/639g
querying gammaloop-works
[1.1 KiB DL]
[0 /9 built, 4 /0 /5 copied
[0 /8 built, 3 /1 /5 copied
135.76 s
[0 /7 built, 2 /2 /5 copied
154.00 s
[0 /3 built, 1 /4 /5 copied
159.27 s
[0 /1 built, 5 copied (2.
[1 /0 /1 built, 5 copied (gammaloop-workspace-doctest> Running phase: unpackPhase
159.28 s
gammaloop-workspace-doctest> unpacking source archive /nix/store/5cf29grr2jrj54dgkkr1mjdqm2qk94vd-source
159.54 s
gammaloop-workspace-doctest> source root is source
159.58 s
gammaloop-workspace-doctest> Running phase: patchPhase
159.59 s
gammaloop-workspace-doctest> Executing configureCargoCommonVars
159.59 s
gammaloop-workspace-doctest> decompressing cargo artifacts from /nix/store/bfj52hfq3nywm60hjzkcfqalxd3z141s-gammaloop-workspace-doctest-inputs/target.tar.zst to target
169.76 s
gammaloop-workspace-doctest> Running phase: updateAutotoolsGnuConfigScriptsPhase
169.84 s
gammaloop-workspace-doctest> Running phase: configurePhase
169.84 s
gammaloop-workspace-doctest> will append /build/source/.cargo-home/config.toml with contents of /nix/store/w72xdqk1lvxyqjazv52iqg1ir83d7798-vendor-cargo-deps/config.toml
169.85 s
gammaloop-workspace-doctest> default configurePhase, nothing to do
169.85 s
gammaloop-workspace-doctest> Running phase: buildPhase
169.85 s
gammaloop-workspace-doctest> +++ command cargo --version
169.86 s
gammaloop-workspace-doctest> cargo 1.98.1 (797e8a9bc 2026-08-05)
169.95 s
gammaloop-workspace-doctest> +++ command cargo test --profile ci-optim --doc --locked --workspace --features feynkit-graph/svg,feynkit-py/python_stubgen,gammaloop-api/cli,gammaloop-api/python_stubgen,gammaloop-api/ufo_support,gammaloop-integration-tests/python-api-tests,gammaloop-tracing-filter/clap,gammaloop-tracing-filter/python,gammaloop-tracing-filter/symbolica,gammalooprs/python_stubgen,idenso/bincode,idenso/native,idenso/reference-cases,linnest/svg,linnet-py/python_stubgen,linnet/bincode,linnet/drawing,linnet/nodestore-vec,linnet/rkyv,linnet/serde,linnet/symbolica,pyo3-stub-gen/infer_signature,pyo3-stub-gen/numpy,pyo3/anyhow,pyo3/auto-initialize,pyo3/eyre,pyo3/multiple-pymethods,spenso-hep-lib/native,spenso/native,spenso/native-code-generation,spenso/portable-payload,spenso/python,spenso/python_stubgen,spenso/shadowing,spynso3/python_stubgen,symbolica-utils/native,symbolica/tracing_max_level_info,three-dimensional-reps/display,three-dimensional-reps/eval,three-dimensional-reps/json_schema,vakint/python_stubgen,vakint/symbolica_community_module --exclude alphal00p-docs-python-exporter
170.56 s
gammaloop-workspace-doctest> Compiling gammaloop-workspace-hack v0.1.0 (/build/source/crates/gammaloop-workspace-hack)
170.56 s
gammaloop-workspace-doctest> Compiling clarabel v0.11.1 (/build/source/vendor/clarabel)
170.56 s
gammaloop-workspace-doctest> Compiling symbolica-utils v0.1.0 (/build/source/crates/symbolica-utils)
170.57 s
gammaloop-workspace-doctest> Compiling spenso-macros v0.3.2 (/build/source/crates/spenso-macros)
170.58 s
gammaloop-workspace-doctest> Compiling kurvst v0.1.0 (/build/source/crates/kurvst)
170.59 s
gammaloop-workspace-doctest> Compiling symbolica-data v0.1.0 (/build/source/crates/symbolica-data)
170.60 s
gammaloop-workspace-doctest> Compiling alphal00p-docs-macros v0.1.0 (/build/source/crates/alphal00p-docs-macros)
170.61 s
gammaloop-workspace-doctest> Compiling alphal00p-docs-schema v0.1.0 (/build/source/crates/alphal00p-docs-schema)
170.61 s
gammaloop-workspace-doctest> Compiling gammaloop-integration-tests v0.1.0 (/build/source/tests)
170.61 s
gammaloop-workspace-doctest> Compiling clinnet v0.1.8 (/build/source/crates/clinnet)
170.77 s
gammaloop-workspace-doctest> warning : unused import: `super::super::traits::*`
170.77 s
gammaloop-workspace-doctest> --> vendor/clarabel/src/solver/core/solver.rs:470:9
170.77 s
gammaloop-workspace-doctest> |
170.77 s
gammaloop-workspace-doctest> 470 | use super::super::traits::*;
170.77 s
gammaloop-workspace-doctest> | ^^^^^^^^^^^^^^^^^^^^^^^
170.77 s
gammaloop-workspace-doctest> |
170.77 s
gammaloop-workspace-doctest> = note : `#[warn(unused_imports)]` (part of `#[warn(unused)]`) on by default
170.77 s
gammaloop-workspace-doctest>
171.71 s
gammaloop-workspace-doctest> Compiling typst-renderer v0.1.0 (/build/source/crates/typst-renderer)
171.75 s
gammaloop-workspace-doctest> Compiling spynso3 v0.1.2 (/build/source/crates/spynso3)
172.19 s
gammaloop-workspace-doctest> Compiling alphal00p-docs-catalogs v0.1.0 (/build/source/crates/alphal00p-docs-catalogs)
172.38 s
gammaloop-workspace-doctest> warning : hiding a lifetime that's elided elsewhere is confusing
172.38 s
gammaloop-workspace-doctest> --> vendor/clarabel/src/solver/core/kktsolvers/direct/quasidef/datamaps.rs:26:39
172.38 s
gammaloop-workspace-doctest> |
172.38 s
gammaloop-workspace-doctest> 26 | pub(crate) fn to_sparse_expansion(&self) -> Option<SparseExpansionCone<T>> {
172.38 s
gammaloop-workspace-doctest> | ^^^^^ ^^^^^^^^^^^^^^^^^^^^^^ the same lifetime is hidden here
172.38 s
gammaloop-workspace-doctest> | |
172.38 s
gammaloop-workspace-doctest> | the lifetime is elided here
172.38 s
gammaloop-workspace-doctest> |
172.38 s
gammaloop-workspace-doctest> = help : the same lifetime is referred to in inconsistent ways, making the signature confusing
172.38 s
gammaloop-workspace-doctest> = note : `#[warn(mismatched_lifetime_syntaxes)]` on by default
172.38 s
gammaloop-workspace-doctest> help : use `'_` for type paths
172.38 s
gammaloop-workspace-doctest> |
172.38 s
gammaloop-workspace-doctest> 26 | pub(crate) fn to_sparse_expansion(&self) -> Option<SparseExpansionCone<'_, T>> {
172.38 s
gammaloop-workspace-doctest> | +++
172.38 s
gammaloop-workspace-doctest>
173.20 s
gammaloop-workspace-doctest> warning : `clarabel` (lib) generated 2 warnings (run `cargo fix --lib -p clarabel` to apply 2 suggestions)
173.20 s
gammaloop-workspace-doctest> Compiling linnet v0.17.0 (/build/source/crates/linnet)
173.21 s
gammaloop-workspace-doctest> Compiling momtrop v0.3.1 (https://github.com/alphal00p/momtrop?rev=2c80fae4dfb0f136ee07f750efd225d84feff072#2c80fae4)
176.39 s
gammaloop-workspace-doctest> Compiling alphal00p-docs-examples v0.1.0 (/build/source/crates/alphal00p-docs-examples)
180.21 s
gammaloop-workspace-doctest> Compiling spenso v0.6.0 (/build/source/crates/spenso)
180.21 s
gammaloop-workspace-doctest> Compiling feynkit-model v0.1.0 (/build/source/crates/feynkit-model)
180.21 s
gammaloop-workspace-doctest> Compiling three-dimensional-reps v0.1.0 (/build/source/crates/three-dimensional-reps)
184.99 s
gammaloop-workspace-doctest> Compiling linnest v0.1.0 (/build/source/crates/linnest)
185.15 s
gammaloop-workspace-doctest> Compiling feynkit-ufo v0.1.0 (/build/source/crates/feynkit-ufo)
198.97 s
gammaloop-workspace-doctest> Compiling idenso v0.3.0 (/build/source/crates/idenso)
198.97 s
gammaloop-workspace-doctest> Compiling feynkit-kinematics v0.1.0 (/build/source/crates/feynkit-kinematics)
198.97 s
gammaloop-workspace-doctest> Compiling gammaloop-tracing-filter v0.1.0 (/build/source/crates/gammaloop-tracing-filter)
219.96 s
gammaloop-workspace-doctest> Compiling spenso-hep-lib v0.1.7 (/build/source/crates/spenso-hep-lib)
223.13 s
gammaloop-workspace-doctest> Compiling feynkit-graph v0.1.0 (/build/source/crates/feynkit-graph)
223.13 s
gammaloop-workspace-doctest> Compiling linnet-render-py v0.1.0 (/build/source/crates/linnet-render-py)
223.13 s
gammaloop-workspace-doctest> Compiling alphal00p-docs-builder v0.1.0 (/build/source/crates/alphal00p-docs-builder)
237.36 s
gammaloop-workspace-doctest> Compiling feynkit-tensor v0.1.0 (/build/source/crates/feynkit-tensor)
237.36 s
gammaloop-workspace-doctest> Compiling feynkit-amplitude v0.1.0 (/build/source/crates/feynkit-amplitude)
237.36 s
gammaloop-workspace-doctest> Compiling feynkit-cff v0.1.0 (/build/source/crates/feynkit-cff)
237.37 s
gammaloop-workspace-doctest> Compiling linnet-py v0.1.0 (/build/source/crates/linnet-py)
238.16 s
gammaloop-workspace-doctest> Compiling feynkit-generator v0.1.0 (/build/source/crates/feynkit-generator)
240.69 s
gammaloop-workspace-doctest> Compiling vakint v0.1.2 (/build/source/crates/vakint)
244.80 s
gammaloop-workspace-doctest> Compiling feynkit v0.1.0 (/build/source/crates/feynkit)
247.81 s
gammaloop-workspace-doctest> Compiling feynkit-py v0.1.0 (/build/source/crates/feynkit-py)
253.00 s
gammaloop-workspace-doctest> Compiling gammalooprs v0.3.4 (/build/source/crates/gammalooprs)
559.10 s
gammaloop-workspace-doctest> Compiling gammaloop-api v0.1.0 (/build/source/crates/gammaloop-api)
668.97 s
gammaloop-workspace-doctest> Finished `ci-optim` profile [optimized] target(s) in 8m 19s
669.15 s
gammaloop-workspace-doctest> warning : the following packages contain code that will be rejected by a future version of Rust: proc-macro-error2 v2.0.1
669.15 s
gammaloop-workspace-doctest> note : to see what the problems were, use the option `--future-incompat-report`, or run `cargo report future-incompatibilities --id 1`
669.19 s
gammaloop-workspace-doctest> Doc-tests alphal00p_docs_builder
669.40 s
gammaloop-workspace-doctest>
669.40 s
gammaloop-workspace-doctest> running 0 tests
669.40 s
gammaloop-workspace-doctest>
669.40 s
gammaloop-workspace-doctest> test result: ok. 0 passed; 0 failed; 0 ignored; 0 measured; 0 filtered out; finished in 0.00s
669.40 s
gammaloop-workspace-doctest>
669.41 s
gammaloop-workspace-doctest> Doc-tests alphal00p_docs_catalogs
671.23 s
gammaloop-workspace-doctest>
671.23 s
gammaloop-workspace-doctest> running 0 tests
671.23 s
gammaloop-workspace-doctest>
671.23 s
gammaloop-workspace-doctest> test result: ok. 0 passed; 0 failed; 0 ignored; 0 measured; 0 filtered out; finished in 0.00s
671.23 s
gammaloop-workspace-doctest>
671.23 s
gammaloop-workspace-doctest> Doc-tests alphal00p_docs_examples
671.25 s
gammaloop-workspace-doctest>
671.25 s
gammaloop-workspace-doctest> running 0 tests
671.25 s
gammaloop-workspace-doctest>
671.25 s
gammaloop-workspace-doctest> test result: ok. 0 passed; 0 failed; 0 ignored; 0 measured; 0 filtered out; finished in 0.00s
671.25 s
gammaloop-workspace-doctest>
671.25 s
gammaloop-workspace-doctest> Doc-tests alphal00p_docs
671.33 s
gammaloop-workspace-doctest>
671.33 s
gammaloop-workspace-doctest> running 0 tests
671.33 s
gammaloop-workspace-doctest>
671.33 s
gammaloop-workspace-doctest> test result: ok. 0 passed; 0 failed; 0 ignored; 0 measured; 0 filtered out; finished in 0.00s
671.33 s
gammaloop-workspace-doctest>
671.34 s
gammaloop-workspace-doctest> Doc-tests alphal00p_docs_schema
671.45 s
gammaloop-workspace-doctest>
671.45 s
gammaloop-workspace-doctest> running 0 tests
671.45 s
gammaloop-workspace-doctest>
671.45 s
gammaloop-workspace-doctest> test result: ok. 0 passed; 0 failed; 0 ignored; 0 measured; 0 filtered out; finished in 0.00s
671.45 s
gammaloop-workspace-doctest>
671.46 s
gammaloop-workspace-doctest> Doc-tests clinnet
671.54 s
gammaloop-workspace-doctest>
671.54 s
gammaloop-workspace-doctest> running 0 tests
671.54 s
gammaloop-workspace-doctest>
671.54 s
gammaloop-workspace-doctest> test result: ok. 0 passed; 0 failed; 0 ignored; 0 measured; 0 filtered out; finished in 0.00s
671.54 s
gammaloop-workspace-doctest>
671.54 s
gammaloop-workspace-doctest> Doc-tests feynkit
671.58 s
gammaloop-workspace-doctest>
671.58 s
gammaloop-workspace-doctest> running 0 tests
671.58 s
gammaloop-workspace-doctest>
671.58 s
gammaloop-workspace-doctest> test result: ok. 0 passed; 0 failed; 0 ignored; 0 measured; 0 filtered out; finished in 0.00s
671.58 s
gammaloop-workspace-doctest>
671.58 s
gammaloop-workspace-doctest> Doc-tests feynkit_amplitude
671.66 s
gammaloop-workspace-doctest>
671.66 s
gammaloop-workspace-doctest> running 0 tests
671.66 s
gammaloop-workspace-doctest>
671.66 s
gammaloop-workspace-doctest> test result: ok. 0 passed; 0 failed; 0 ignored; 0 measured; 0 filtered out; finished in 0.00s
671.66 s
gammaloop-workspace-doctest>
671.66 s
gammaloop-workspace-doctest> Doc-tests feynkit_cff
675.09 s
gammaloop-workspace-doctest>
675.09 s
gammaloop-workspace-doctest> running 1 test
675.09 s
gammaloop-workspace-doctest> test crates/feynkit-cff/src/lib.rs - (line 10) ... ok
675.09 s
gammaloop-workspace-doctest>
675.09 s
gammaloop-workspace-doctest> test result: ok. 1 passed; 0 failed; 0 ignored; 0 measured; 0 filtered out; finished in 0.00s
675.09 s
gammaloop-workspace-doctest>
675.10 s
gammaloop-workspace-doctest> all doctests ran in 3.28s; merged doctests compilation took 3.26s
675.11 s
gammaloop-workspace-doctest> Doc-tests feynkit_generator
675.34 s
gammaloop-workspace-doctest>
675.34 s
gammaloop-workspace-doctest> running 0 tests
675.34 s
gammaloop-workspace-doctest>
675.34 s
gammaloop-workspace-doctest> test result: ok. 0 passed; 0 failed; 0 ignored; 0 measured; 0 filtered out; finished in 0.00s
675.34 s
gammaloop-workspace-doctest>
675.35 s
gammaloop-workspace-doctest> Doc-tests feynkit_graph
675.61 s
gammaloop-workspace-doctest>
675.61 s
gammaloop-workspace-doctest> running 0 tests
675.61 s
gammaloop-workspace-doctest>
675.61 s
gammaloop-workspace-doctest> test result: ok. 0 passed; 0 failed; 0 ignored; 0 measured; 0 filtered out; finished in 0.00s
675.61 s
gammaloop-workspace-doctest>
675.62 s
gammaloop-workspace-doctest> Doc-tests feynkit_kinematics
675.85 s
gammaloop-workspace-doctest>
675.85 s
gammaloop-workspace-doctest> running 0 tests
675.85 s
gammaloop-workspace-doctest>
675.85 s
gammaloop-workspace-doctest> test result: ok. 0 passed; 0 failed; 0 ignored; 0 measured; 0 filtered out; finished in 0.00s
675.85 s
gammaloop-workspace-doctest>
675.86 s
gammaloop-workspace-doctest> Doc-tests feynkit_model
676.00 s
gammaloop-workspace-doctest>
676.00 s
gammaloop-workspace-doctest> running 0 tests
676.00 s
gammaloop-workspace-doctest>
676.00 s
gammaloop-workspace-doctest> test result: ok. 0 passed; 0 failed; 0 ignored; 0 measured; 0 filtered out; finished in 0.00s
676.00 s
gammaloop-workspace-doctest>
676.01 s
gammaloop-workspace-doctest> Doc-tests feynkit_py
677.26 s
gammaloop-workspace-doctest>
677.26 s
gammaloop-workspace-doctest> running 0 tests
677.26 s
gammaloop-workspace-doctest>
677.26 s
gammaloop-workspace-doctest> test result: ok. 0 passed; 0 failed; 0 ignored; 0 measured; 0 filtered out; finished in 0.00s
677.26 s
gammaloop-workspace-doctest>
677.26 s
gammaloop-workspace-doctest> Doc-tests feynkit_tensor
680.80 s
gammaloop-workspace-doctest>
680.80 s
gammaloop-workspace-doctest> running 17 tests
680.81 s
gammaloop-workspace-doctest> test crates/feynkit-tensor/src/reduction.rs - reduction::TensorReducer (line 303) - compile ... ok
680.81 s
gammaloop-workspace-doctest> test crates/feynkit-tensor/src/reduction.rs - reduction::TensorReducer::reduce (line 475) - compile ... ok
680.81 s
gammaloop-workspace-doctest> test crates/feynkit-tensor/src/reduction.rs - reduction::ContractionOrbit (line 79) - compile ... ok
680.81 s
gammaloop-workspace-doctest> test crates/feynkit-tensor/src/weingarten.rs - weingarten::OrthogonalWeingarten::for_rank (line 275) - compile ... ok
680.81 s
gammaloop-workspace-doctest> test crates/feynkit-tensor/src/weingarten.rs - weingarten::OrthogonalWeingarten::new (line 231) - compile ... ok
680.81 s
gammaloop-workspace-doctest> test crates/feynkit-tensor/src/reduction.rs - reduction::TensorReductionTerm (line 160) - compile ... ok
680.82 s
gammaloop-workspace-doctest> test crates/feynkit-tensor/src/weingarten.rs - weingarten::OrthogonalWeingarten (line 199) - compile ... ok
680.82 s
gammaloop-workspace-doctest> test crates/feynkit-tensor/src/reduction.rs - reduction::TensorReduction (line 220) - compile ... ok
680.82 s
gammaloop-workspace-doctest> test crates/feynkit-tensor/src/reduction.rs - reduction::TensorReduction::expression (line 267) - compile ... ok
680.82 s
gammaloop-workspace-doctest> test crates/feynkit-tensor/src/weingarten.rs - weingarten::OrthogonalWeingarten::coefficient (line 309) - compile ... ok
680.83 s
gammaloop-workspace-doctest> test crates/feynkit-tensor/src/weingarten.rs - weingarten::OrthogonalWeingarten::isotropic_pairing_coefficient (line 345) ... ok
680.83 s
gammaloop-workspace-doctest> test crates/feynkit-tensor/src/weingarten.rs - weingarten::CosetType::new (line 55) ... ok
680.83 s
gammaloop-workspace-doctest> test crates/feynkit-tensor/src/reduction.rs - reduction::FeynmanDiagramTensorExt (line 1094) - compile ... ok
680.83 s
gammaloop-workspace-doctest> test crates/feynkit-tensor/src/weingarten.rs - weingarten::CosetType::class_size (line 152) ... ok
680.83 s
gammaloop-workspace-doctest> test crates/feynkit-tensor/src/weingarten.rs - weingarten::WeingartenError (line 409) ... ok
680.83 s
gammaloop-workspace-doctest> test crates/feynkit-tensor/src/weingarten.rs - weingarten::CosetType::between_matchings (line 92) ... ok
680.83 s
gammaloop-workspace-doctest> test crates/feynkit-tensor/src/weingarten.rs - weingarten::CosetType (line 34) ... ok
680.83 s
gammaloop-workspace-doctest>
680.83 s
gammaloop-workspace-doctest> test result: ok. 17 passed; 0 failed; 0 ignored; 0 measured; 0 filtered out; finished in 0.03s
680.83 s
gammaloop-workspace-doctest>
680.85 s
gammaloop-workspace-doctest> all doctests ran in 3.50s; merged doctests compilation took 3.46s
680.85 s
gammaloop-workspace-doctest> Doc-tests feynkit_ufo
680.89 s
gammaloop-workspace-doctest>
680.89 s
gammaloop-workspace-doctest> running 0 tests
680.89 s
gammaloop-workspace-doctest>
680.89 s
gammaloop-workspace-doctest> test result: ok. 0 passed; 0 failed; 0 ignored; 0 measured; 0 filtered out; finished in 0.00s
680.89 s
gammaloop-workspace-doctest>
680.90 s
gammaloop-workspace-doctest> Doc-tests gammaloop_api
682.28 s
gammaloop-workspace-doctest>
682.28 s
gammaloop-workspace-doctest> running 2 tests
682.37 s
gammaloop-workspace-doctest> test crates/gammaloop-api/src/lib.rs - (line 18) - compile ... ok
690.54 s
gammaloop-workspace-doctest> test crates/gammaloop-api/src/commands/evaluate_samples.rs - commands::evaluate_samples::EvaluateSamples (line 51) ... ok
690.54 s
gammaloop-workspace-doctest>
690.54 s
gammaloop-workspace-doctest> test result: ok. 2 passed; 0 failed; 0 ignored; 0 measured; 0 filtered out; finished in 8.26s
690.54 s
gammaloop-workspace-doctest>
690.54 s
gammaloop-workspace-doctest> Doc-tests gammaloop_integration_tests
690.61 s
gammaloop-workspace-doctest>
690.61 s
gammaloop-workspace-doctest> running 0 tests
690.61 s
gammaloop-workspace-doctest>
690.61 s
gammaloop-workspace-doctest> test result: ok. 0 passed; 0 failed; 0 ignored; 0 measured; 0 filtered out; finished in 0.00s
690.61 s
gammaloop-workspace-doctest>
690.61 s
gammaloop-workspace-doctest> Doc-tests gammaloop_tracing_filter
690.68 s
gammaloop-workspace-doctest>
690.68 s
gammaloop-workspace-doctest> running 0 tests
690.68 s
gammaloop-workspace-doctest>
690.68 s
gammaloop-workspace-doctest> test result: ok. 0 passed; 0 failed; 0 ignored; 0 measured; 0 filtered out; finished in 0.00s
690.68 s
gammaloop-workspace-doctest>
690.69 s
gammaloop-workspace-doctest> Doc-tests gammaloop_tracing_filter_macros
691.09 s
gammaloop-workspace-doctest>
691.09 s
gammaloop-workspace-doctest> running 2 tests
691.09 s
gammaloop-workspace-doctest> test crates/gammaloop-tracing-filter-macros/src/lib.rs - debug_instrument (line 14) ... ignored
691.09 s
gammaloop-workspace-doctest> test crates/gammaloop-tracing-filter-macros/src/lib.rs - debug_instrument (line 8) ... ignored
691.09 s
gammaloop-workspace-doctest>
691.09 s
gammaloop-workspace-doctest> test result: ok. 0 passed; 0 failed; 2 ignored; 0 measured; 0 filtered out; finished in 0.00s
691.09 s
gammaloop-workspace-doctest>
691.10 s
gammaloop-workspace-doctest> all doctests ran in 0.39s; merged doctests compilation took 0.38s
691.10 s
gammaloop-workspace-doctest> Doc-tests gammaloop_workspace_hack
691.13 s
gammaloop-workspace-doctest>
691.13 s
gammaloop-workspace-doctest> running 0 tests
691.13 s
gammaloop-workspace-doctest>
691.13 s
gammaloop-workspace-doctest> test result: ok. 0 passed; 0 failed; 0 ignored; 0 measured; 0 filtered out; finished in 0.00s
691.13 s
gammaloop-workspace-doctest>
691.13 s
gammaloop-workspace-doctest> Doc-tests gammalooprs
698.66 s
gammaloop-workspace-doctest>
698.66 s
gammaloop-workspace-doctest> running 2 tests
698.66 s
gammaloop-workspace-doctest> test crates/gammalooprs/src/integrands/process/mod.rs - integrands::process::ProcessIntegrandImpl::signal_external_momenta_changed (line 3391) ... ignored
698.67 s
gammaloop-workspace-doctest> test crates/gammalooprs/src/utils/linnet_ext.rs - utils::linnet_ext::Permutation::from_mappings (line 27) ... ok
698.67 s
gammaloop-workspace-doctest>
698.67 s
gammaloop-workspace-doctest> test result: ok. 1 passed; 0 failed; 1 ignored; 0 measured; 0 filtered out; finished in 0.01s
698.67 s
gammaloop-workspace-doctest>
698.69 s
gammaloop-workspace-doctest> all doctests ran in 2.45s; merged doctests compilation took 2.42s
698.69 s
gammaloop-workspace-doctest> Doc-tests idenso
699.65 s
gammaloop-workspace-doctest>
699.65 s
gammaloop-workspace-doctest> running 5 tests
699.65 s
gammaloop-workspace-doctest> test crates/idenso/src/color/macros.rs - color::macros::color_f (line 109) ... ignored
699.65 s
gammaloop-workspace-doctest> test crates/idenso/src/color/macros.rs - color::macros::color_t (line 18) ... ignored
699.65 s
gammaloop-workspace-doctest> test crates/idenso/src/dirac/macros.rs - dirac::macros::gamma (line 28) ... ignored
699.65 s
gammaloop-workspace-doctest> test crates/idenso/src/dirac/macros.rs - dirac::macros::gamma0 (line 259) ... ignored
699.65 s
gammaloop-workspace-doctest> test crates/idenso/src/dirac/macros.rs - dirac::macros::u (line 155) ... ignored
699.65 s
gammaloop-workspace-doctest>
699.65 s
gammaloop-workspace-doctest> test result: ok. 0 passed; 0 failed; 5 ignored; 0 measured; 0 filtered out; finished in 0.00s
699.65 s
gammaloop-workspace-doctest>
699.65 s
gammaloop-workspace-doctest> all doctests ran in 0.39s; merged doctests compilation took 0.38s
699.66 s
gammaloop-workspace-doctest> Doc-tests kurvst
699.78 s
gammaloop-workspace-doctest>
699.78 s
gammaloop-workspace-doctest> running 0 tests
699.78 s
gammaloop-workspace-doctest>
699.78 s
gammaloop-workspace-doctest> test result: ok. 0 passed; 0 failed; 0 ignored; 0 measured; 0 filtered out; finished in 0.00s
699.78 s
gammaloop-workspace-doctest>
699.78 s
gammaloop-workspace-doctest> Doc-tests linnest
700.39 s
gammaloop-workspace-doctest>
700.39 s
gammaloop-workspace-doctest> running 0 tests
700.39 s
gammaloop-workspace-doctest>
700.39 s
gammaloop-workspace-doctest> test result: ok. 0 passed; 0 failed; 0 ignored; 0 measured; 0 filtered out; finished in 0.00s
700.39 s
gammaloop-workspace-doctest>
700.39 s
gammaloop-workspace-doctest> Doc-tests linnet
701.08 s
gammaloop-workspace-doctest>
701.08 s
gammaloop-workspace-doctest> running 46 tests
701.08 s
gammaloop-workspace-doctest> test crates/linnet/src/half_edge/algorithms/transitive_ops.rs - half_edge::algorithms::transitive_ops::HedgeGraph<E,V,H,N>::transitive_closure (line 164) ... ignored
701.08 s
gammaloop-workspace-doctest> test crates/linnet/src/half_edge/algorithms/transitive_ops.rs - half_edge::algorithms::transitive_ops::HedgeGraph<E,V,H,N>::transitive_reduction (line 300) ... ignored
701.08 s
gammaloop-workspace-doctest> test crates/linnet/src/half_edge/builder.rs - half_edge::builder::HedgeGraphBuilder (line 110) ... ignored
706.32 s
gammaloop-workspace-doctest> test crates/linnet/src/half_edge/algorithms/trace_unfold.rs - half_edge::algorithms::trace_unfold::TraceKey<O,D>::empty (line 1071) ... ok
706.58 s
gammaloop-workspace-doctest> test crates/linnet/src/half_edge/algorithms/trace_unfold.rs - half_edge::algorithms::trace_unfold::TraceKey (line 1029) ... ok
706.66 s
gammaloop-workspace-doctest> test crates/linnet/src/half_edge/algorithms/trace_unfold.rs - half_edge::algorithms::trace_unfold::TraceKey<O,D>::view (line 1110) ... ok
706.69 s
gammaloop-workspace-doctest> test crates/linnet/src/half_edge/algorithms/trace_unfold.rs - half_edge::algorithms::trace_unfold::TraceKey<O,D>::write_foata_like (line 1356) ... ok
706.70 s
gammaloop-workspace-doctest> test crates/linnet/src/half_edge/algorithms/trace_unfold.rs - half_edge::algorithms::trace_unfold::TraceKey<O,D>::iter_levels_top_down (line 1164) ... ok
706.94 s
gammaloop-workspace-doctest> test crates/linnet/src/half_edge/algorithms/trace_unfold.rs - half_edge::algorithms::trace_unfold::TraceKeyView (line 872) ... ok
707.12 s
gammaloop-workspace-doctest> test crates/linnet/src/parser/mod.rs - parser (line 17) ... ok
707.13 s
gammaloop-workspace-doctest> test crates/linnet/src/permutation.rs - permutation::Permutation (line 61) ... ok
707.15 s
gammaloop-workspace-doctest> test crates/linnet/src/half_edge/algorithms/trace_unfold.rs - half_edge::algorithms::trace_unfold::TraceKey<O,D>::push (line 1253) ... ok
707.17 s
gammaloop-workspace-doctest> test crates/linnet/src/half_edge/algorithms/trace_unfold.rs - half_edge::algorithms::trace_unfold::TraceKey<O,D>::from_levels (line 1089) ... ok
707.19 s
gammaloop-workspace-doctest> test crates/linnet/src/half_edge/algorithms/trace_unfold.rs - half_edge::algorithms::trace_unfold::TraceKey<O,D>::iter_leaf_ops (line 1222) ... ok
707.20 s
gammaloop-workspace-doctest> test crates/linnet/src/half_edge/algorithms/trace_unfold.rs - half_edge::algorithms::trace_unfold::TraceKey<O,D>::is_empty (line 1136) ... ok
707.47 s
gammaloop-workspace-doctest> test crates/linnet/src/half_edge/algorithms/trace_unfold.rs - half_edge::algorithms::trace_unfold::TraceKey<O,D>::iter_levels_bottom_up (line 1194) ... ok
707.47 s
gammaloop-workspace-doctest> test crates/linnet/src/half_edge/algorithms/trace_unfold.rs - half_edge::algorithms::trace_unfold::TraceUnfold (line 127) ... ok
707.54 s
gammaloop-workspace-doctest> test crates/linnet/src/half_edge/algorithms/trace_unfold.rs - half_edge::algorithms::trace_unfold::TraceKeyView<'a,O,D>::to_owned (line 979) ... ok
708.07 s
gammaloop-workspace-doctest> test crates/linnet/src/half_edge/algorithms/trace_unfold.rs - half_edge::algorithms::trace_unfold::TraceUnfold::realizations_for_op (line 213) ... ok
712.13 s
gammaloop-workspace-doctest> test crates/linnet/src/permutation.rs - permutation::Permutation::apply_slice_inv (line 469) ... ok
712.32 s
gammaloop-workspace-doctest> test crates/linnet/src/permutation.rs - permutation::Permutation::from_disjoint_cycles (line 978) ... ok
712.60 s
gammaloop-workspace-doctest> test crates/linnet/src/permutation.rs - permutation::Permutation::from_map (line 113) ... ok
712.83 s
gammaloop-workspace-doctest> test crates/linnet/src/permutation.rs - permutation::Permutation::id (line 96) ... ok
712.92 s
gammaloop-workspace-doctest> test crates/linnet/src/permutation.rs - permutation::Permutation::apply_slice (line 451) ... ok
712.98 s
gammaloop-workspace-doctest> test crates/linnet/src/permutation.rs - permutation::Permutation::from_prefix_sources (line 266) ... ok
713.26 s
gammaloop-workspace-doctest> test crates/linnet/src/permutation.rs - permutation::Permutation::apply_slice_in_place_inv (line 510) ... ok
713.30 s
gammaloop-workspace-doctest> test crates/linnet/src/permutation.rs - permutation::Permutation::iter_slice (line 543) ... ok
713.30 s
gammaloop-workspace-doctest> test crates/linnet/src/permutation.rs - permutation::Permutation::from_cycles (line 1069) ... ok
713.51 s
gammaloop-workspace-doctest> test crates/linnet/src/permutation.rs - permutation::Permutation::find_cycles (line 680) ... ok
713.79 s
gammaloop-workspace-doctest> test crates/linnet/src/permutation.rs - permutation::Permutation::iter_slice_inv (line 562) ... ok
714.05 s
gammaloop-workspace-doctest> test crates/linnet/src/permutation.rs - permutation::Permutation::inverse (line 434) ... ok
714.36 s
gammaloop-workspace-doctest> test crates/linnet/src/permutation.rs - permutation::Permutation::inv (line 416) ... ok
714.96 s
gammaloop-workspace-doctest> test crates/linnet/src/permutation.rs - permutation::Permutation::apply_slice_in_place (line 488) ... ok
715.00 s
gammaloop-workspace-doctest> test crates/linnet/src/permutation.rs - permutation::Permutation::cycle_to_transpositions (line 713) ... ok
716.62 s
gammaloop-workspace-doctest> test crates/linnet/src/permutation.rs - permutation::Permutation::is_identity (line 851) ... ok
716.96 s
gammaloop-workspace-doctest> test crates/linnet/src/permutation.rs - permutation::Permutation::iter_slice_mut (line 588) ... ok
717.16 s
gammaloop-workspace-doctest> test crates/linnet/src/permutation.rs - permutation::Permutation::iter_slice_inv_mut (line 615) ... ok
717.28 s
gammaloop-workspace-doctest> test crates/linnet/src/permutation.rs - permutation::Permutation::map (line 402) ... ok
717.45 s
gammaloop-workspace-doctest> test crates/linnet/src/permutation.rs - permutation::Permutation::pow (line 896) ... ok
717.52 s
gammaloop-workspace-doctest> test crates/linnet/src/permutation.rs - permutation::Permutation::myrvold_ruskey_rank1 (line 760) ... ok
717.59 s
gammaloop-workspace-doctest> test crates/linnet/src/permutation.rs - permutation::Permutation::myrvold_ruskey_rank2 (line 805) ... ok
717.83 s
gammaloop-workspace-doctest> test crates/linnet/src/permutation.rs - permutation::Permutation::transpositions (line 733) ... ok
717.85 s
gammaloop-workspace-doctest> test crates/linnet/src/permutation.rs - permutation::Permutation::myrvold_ruskey_unrank1 (line 782) ... ok
717.98 s
gammaloop-workspace-doctest> test crates/linnet/src/permutation.rs - permutation::Permutation::myrvold_ruskey_unrank2 (line 828) ... ok
718.06 s
gammaloop-workspace-doctest> test crates/linnet/src/permutation.rs - permutation::Permutation::sign (line 869) ... ok
718.08 s
gammaloop-workspace-doctest> test crates/linnet/src/permutation.rs - permutation::Permutation::sort (line 640) ... ok
718.08 s
gammaloop-workspace-doctest>
718.08 s
gammaloop-workspace-doctest> test result: ok. 43 passed; 0 failed; 3 ignored; 0 measured; 0 filtered out; finished in 17.00s
718.08 s
gammaloop-workspace-doctest>
718.08 s
gammaloop-workspace-doctest> Doc-tests linnet_py
718.57 s
gammaloop-workspace-doctest>
718.57 s
gammaloop-workspace-doctest> running 0 tests
718.57 s
gammaloop-workspace-doctest>
718.57 s
gammaloop-workspace-doctest> test result: ok. 0 passed; 0 failed; 0 ignored; 0 measured; 0 filtered out; finished in 0.00s
718.57 s
gammaloop-workspace-doctest>
718.57 s
gammaloop-workspace-doctest> Doc-tests linnet_render_py
719.08 s
gammaloop-workspace-doctest>
719.08 s
gammaloop-workspace-doctest> running 0 tests
719.08 s
gammaloop-workspace-doctest>
719.08 s
gammaloop-workspace-doctest> test result: ok. 0 passed; 0 failed; 0 ignored; 0 measured; 0 filtered out; finished in 0.00s
719.08 s
gammaloop-workspace-doctest>
719.08 s
gammaloop-workspace-doctest> Doc-tests spenso
724.66 s
gammaloop-workspace-doctest>
724.66 s
gammaloop-workspace-doctest> running 9 tests
724.66 s
gammaloop-workspace-doctest> test crates/spenso/src/shadowing/macros.rs - shadowing::macros::antisym (line 341) ... ignored
724.66 s
gammaloop-workspace-doctest> test crates/spenso/src/shadowing/macros.rs - shadowing::macros::chain (line 391) ... ignored
724.66 s
gammaloop-workspace-doctest> test crates/spenso/src/shadowing/macros.rs - shadowing::macros::cyclic (line 365) ... ignored
724.66 s
gammaloop-workspace-doctest> test crates/spenso/src/shadowing/macros.rs - shadowing::macros::slot (line 24) ... ignored
724.66 s
gammaloop-workspace-doctest> test crates/spenso/src/shadowing/macros.rs - shadowing::macros::sym (line 317) ... ignored
724.66 s
gammaloop-workspace-doctest> test crates/spenso/src/shadowing/macros.rs - shadowing::macros::tensor (line 110) ... ignored
724.66 s
gammaloop-workspace-doctest> test crates/spenso/src/shadowing/macros.rs - shadowing::macros::trace (line 448) ... ignored
724.66 s
gammaloop-workspace-doctest> test crates/spenso/src/shadowing/macros.rs - shadowing::macros::trace_sym (line 500) ... ignored
724.66 s
gammaloop-workspace-doctest> test crates/spenso/src/network/mod.rs - network::Network (line 1715) ... ok
724.66 s
gammaloop-workspace-doctest>
724.66 s
gammaloop-workspace-doctest> test result: ok. 1 passed; 0 failed; 8 ignored; 0 measured; 0 filtered out; finished in 0.00s
724.66 s
gammaloop-workspace-doctest>
724.68 s
gammaloop-workspace-doctest> all doctests ran in 4.78s; merged doctests compilation took 4.76s
724.68 s
gammaloop-workspace-doctest> Doc-tests spenso_hep_lib
724.72 s
gammaloop-workspace-doctest>
724.72 s
gammaloop-workspace-doctest> running 0 tests
724.72 s
gammaloop-workspace-doctest>
724.72 s
gammaloop-workspace-doctest> test result: ok. 0 passed; 0 failed; 0 ignored; 0 measured; 0 filtered out; finished in 0.00s
724.72 s
gammaloop-workspace-doctest>
724.72 s
gammaloop-workspace-doctest> Doc-tests spenso_macros
724.77 s
gammaloop-workspace-doctest>
724.77 s
gammaloop-workspace-doctest> running 0 tests
724.77 s
gammaloop-workspace-doctest>
724.77 s
gammaloop-workspace-doctest> test result: ok. 0 passed; 0 failed; 0 ignored; 0 measured; 0 filtered out; finished in 0.00s
724.77 s
gammaloop-workspace-doctest>
724.77 s
gammaloop-workspace-doctest> Doc-tests spynso3
725.63 s
gammaloop-workspace-doctest>
725.63 s
gammaloop-workspace-doctest> running 1 test
725.64 s
gammaloop-workspace-doctest> test crates/spynso3/src/expression.rs - expression::TensorExpression::simplify_algebra (line 2336) ... FAILED
725.64 s
gammaloop-workspace-doctest>
725.64 s
gammaloop-workspace-doctest> failures:
725.64 s
gammaloop-workspace-doctest>
725.64 s
gammaloop-workspace-doctest> ---- crates/spynso3/src/expression.rs - expression::TensorExpression::simplify_algebra (line 2336) stdout ----
725.64 s
gammaloop-workspace-doctest> error: expected item, found `-`
725.64 s
gammaloop-workspace-doctest> --> crates/spynso3/src/expression.rs:2337:1
725.64 s
gammaloop-workspace-doctest> |
725.64 s
gammaloop-workspace-doctest> 2337 | - "fully": contract compatible metrics/identities and vectors, collect
725.64 s
gammaloop-workspace-doctest> | ^ expected item
725.64 s
gammaloop-workspace-doctest> |
725.64 s
gammaloop-workspace-doctest> = note: for a full list of items that can appear in modules, see <https://doc.rust-lang.org/reference/items.html>
725.64 s
gammaloop-workspace-doctest>
725.64 s
gammaloop-workspace-doctest> error: aborting due to 1 previous error
725.64 s
gammaloop-workspace-doctest>
725.64 s
gammaloop-workspace-doctest> Couldn't compile the test.
725.64 s
gammaloop-workspace-doctest>
725.64 s
gammaloop-workspace-doctest> failures:
725.64 s
gammaloop-workspace-doctest> crates/spynso3/src/expression.rs - expression::TensorExpression::simplify_algebra (line 2336)
725.64 s
gammaloop-workspace-doctest>
725.64 s
gammaloop-workspace-doctest> test result: FAILED. 0 passed; 1 failed; 0 ignored; 0 measured; 0 filtered out; finished in 0.01s
725.64 s
gammaloop-workspace-doctest>
725.64 s
gammaloop-workspace-doctest> error : doctest failed, to rerun pass `-p spynso3 --doc`
728.78 s
error: Cannot build '/nix/store/6klybbspcwdrsi00vn5bipxdrnnls219-gammaloop-workspace-doctest-0.1.0.drv '.
728.78 s
Reason: builder failed with exit code 101 .
728.78 s
Output paths:
728.78 s
/nix/store/6064c5jqj6rp725hp7fg9lvbhfpxl5cz-gammaloop-workspace-doctest-0.1.0
728.78 s
Last 381 log lines:
728.78 s
> Running phase: unpackPhase
728.78 s
> unpacking source archive /nix/store/5cf29grr2jrj54dgkkr1mjdqm2qk94vd-source
728.78 s
> source root is source
728.78 s
> Running phase: patchPhase
728.78 s
> Executing configureCargoCommonVars
728.78 s
> decompressing cargo artifacts from /nix/store/bfj52hfq3nywm60hjzkcfqalxd3z141s-gammaloop-workspace-doctest-inputs/target.tar.zst to target
728.78 s
> Running phase: updateAutotoolsGnuConfigScriptsPhase
728.78 s
> Running phase: configurePhase
728.78 s
> will append /build/source/.cargo-home/config.toml with contents of /nix/store/w72xdqk1lvxyqjazv52iqg1ir83d7798-vendor-cargo-deps/config.toml
728.78 s
> default configurePhase, nothing to do
728.78 s
> Running phase: buildPhase
728.78 s
> +++ command cargo --version
728.78 s
> cargo 1.98.1 (797e8a9bc 2026-08-05)
728.78 s
> +++ command cargo test --profile ci-optim --doc --locked --workspace --features feynkit-graph/svg,feynkit-py/python_stubgen,gammaloop-api/cli,gammaloop-api/python_stubgen,gammaloop-api/ufo_support,gammaloop-integration-tests/python-api-tests,gammaloop-tracing-filter/clap,gammaloop-tracing-filter/python,gammaloop-tracing-filter/symbolica,gammalooprs/python_stubgen,idenso/bincode,idenso/native,idenso/reference-cases,linnest/svg,linnet-py/python_stubgen,linnet/bincode,linnet/drawing,linnet/nodestore-vec,linnet/rkyv,linnet/serde,linnet/symbolica,pyo3-stub-gen/infer_signature,pyo3-stub-gen/numpy,pyo3/anyhow,pyo3/auto-initialize,pyo3/eyre,pyo3/multiple-pymethods,spenso-hep-lib/native,spenso/native,spenso/native-code-generation,spenso/portable-payload,spenso/python,spenso/python_stubgen,spenso/shadowing,spynso3/python_stubgen,symbolica-utils/native,symbolica/tracing_max_level_info,three-dimensional-reps/display,three-dimensional-reps/eval,three-dimensional-reps/json_schema,vakint/python_stubgen,vakint/symbolica_community_module --exclude alphal00p-docs-python-exporter
728.78 s
> Compiling gammaloop-workspace-hack v0.1.0 (/build/source/crates/gammaloop-workspace-hack)
728.78 s
> Compiling clarabel v0.11.1 (/build/source/vendor/clarabel)
728.78 s
> Compiling symbolica-utils v0.1.0 (/build/source/crates/symbolica-utils)
728.78 s
> Compiling spenso-macros v0.3.2 (/build/source/crates/spenso-macros)
728.78 s
> Compiling kurvst v0.1.0 (/build/source/crates/kurvst)
728.78 s
> Compiling symbolica-data v0.1.0 (/build/source/crates/symbolica-data)
728.78 s
> Compiling alphal00p-docs-macros v0.1.0 (/build/source/crates/alphal00p-docs-macros)
728.78 s
> Compiling alphal00p-docs-schema v0.1.0 (/build/source/crates/alphal00p-docs-schema)
728.78 s
> Compiling gammaloop-integration-tests v0.1.0 (/build/source/tests)
728.78 s
> Compiling clinnet v0.1.8 (/build/source/crates/clinnet)
728.78 s
> warning : unused import: `super::super::traits::*`
728.78 s
> --> vendor/clarabel/src/solver/core/solver.rs:470:9
728.78 s
> |
728.78 s
> 470 | use super::super::traits::*;
728.78 s
> | ^^^^^^^^^^^^^^^^^^^^^^^
728.78 s
> |
728.78 s
> = note : `#[warn(unused_imports)]` (part of `#[warn(unused)]`) on by default
728.78 s
>
728.78 s
> Compiling typst-renderer v0.1.0 (/build/source/crates/typst-renderer)
728.78 s
> Compiling spynso3 v0.1.2 (/build/source/crates/spynso3)
728.78 s
> Compiling alphal00p-docs-catalogs v0.1.0 (/build/source/crates/alphal00p-docs-catalogs)
728.78 s
> warning : hiding a lifetime that's elided elsewhere is confusing
728.78 s
> --> vendor/clarabel/src/solver/core/kktsolvers/direct/quasidef/datamaps.rs:26:39
728.78 s
> |
728.78 s
> 26 | pub(crate) fn to_sparse_expansion(&self) -> Option<SparseExpansionCone<T>> {
728.78 s
> | ^^^^^ ^^^^^^^^^^^^^^^^^^^^^^ the same lifetime is hidden here
728.78 s
> | |
728.78 s
> | the lifetime is elided here
728.78 s
> |
728.78 s
> = help : the same lifetime is referred to in inconsistent ways, making the signature confusing
728.78 s
> = note : `#[warn(mismatched_lifetime_syntaxes)]` on by default
728.78 s
> help : use `'_` for type paths
728.78 s
> |
728.78 s
> 26 | pub(crate) fn to_sparse_expansion(&self) -> Option<SparseExpansionCone<'_, T>> {
728.78 s
> | +++
728.78 s
>
728.78 s
> warning : `clarabel` (lib) generated 2 warnings (run `cargo fix --lib -p clarabel` to apply 2 suggestions)
728.78 s
> Compiling linnet v0.17.0 (/build/source/crates/linnet)
728.78 s
> Compiling momtrop v0.3.1 (https://github.com/alphal00p/momtrop?rev=2c80fae4dfb0f136ee07f750efd225d84feff072#2c80fae4)
728.78 s
> Compiling alphal00p-docs-examples v0.1.0 (/build/source/crates/alphal00p-docs-examples)
728.78 s
> Compiling spenso v0.6.0 (/build/source/crates/spenso)
728.78 s
> Compiling feynkit-model v0.1.0 (/build/source/crates/feynkit-model)
728.78 s
> Compiling three-dimensional-reps v0.1.0 (/build/source/crates/three-dimensional-reps)
728.78 s
> Compiling linnest v0.1.0 (/build/source/crates/linnest)
728.78 s
> Compiling feynkit-ufo v0.1.0 (/build/source/crates/feynkit-ufo)
728.78 s
> Compiling idenso v0.3.0 (/build/source/crates/idenso)
728.78 s
> Compiling feynkit-kinematics v0.1.0 (/build/source/crates/feynkit-kinematics)
728.78 s
> Compiling gammaloop-tracing-filter v0.1.0 (/build/source/crates/gammaloop-tracing-filter)
728.78 s
> Compiling spenso-hep-lib v0.1.7 (/build/source/crates/spenso-hep-lib)
728.78 s
> Compiling feynkit-graph v0.1.0 (/build/source/crates/feynkit-graph)
728.78 s
> Compiling linnet-render-py v0.1.0 (/build/source/crates/linnet-render-py)
728.78 s
> Compiling alphal00p-docs-builder v0.1.0 (/build/source/crates/alphal00p-docs-builder)
728.78 s
> Compiling feynkit-tensor v0.1.0 (/build/source/crates/feynkit-tensor)
728.78 s
> Compiling feynkit-amplitude v0.1.0 (/build/source/crates/feynkit-amplitude)
728.78 s
> Compiling feynkit-cff v0.1.0 (/build/source/crates/feynkit-cff)
728.78 s
> Compiling linnet-py v0.1.0 (/build/source/crates/linnet-py)
728.78 s
> Compiling feynkit-generator v0.1.0 (/build/source/crates/feynkit-generator)
728.78 s
> Compiling vakint v0.1.2 (/build/source/crates/vakint)
728.78 s
> Compiling feynkit v0.1.0 (/build/source/crates/feynkit)
728.78 s
> Compiling feynkit-py v0.1.0 (/build/source/crates/feynkit-py)
728.78 s
> Compiling gammalooprs v0.3.4 (/build/source/crates/gammalooprs)
728.78 s
> Compiling gammaloop-api v0.1.0 (/build/source/crates/gammaloop-api)
728.78 s
> Finished `ci-optim` profile [optimized] target(s) in 8m 19s
728.78 s
> warning : the following packages contain code that will be rejected by a future version of Rust: proc-macro-error2 v2.0.1
728.78 s
> note : to see what the problems were, use the option `--future-incompat-report`, or run `cargo report future-incompatibilities --id 1`
728.78 s
> Doc-tests alphal00p_docs_builder
728.78 s
>
728.78 s
> running 0 tests
728.78 s
>
728.78 s
> test result: ok. 0 passed; 0 failed; 0 ignored; 0 measured; 0 filtered out; finished in 0.00s
728.78 s
>
728.78 s
> Doc-tests alphal00p_docs_catalogs
728.78 s
>
728.78 s
> running 0 tests
728.78 s
>
728.78 s
> test result: ok. 0 passed; 0 failed; 0 ignored; 0 measured; 0 filtered out; finished in 0.00s
728.78 s
>
728.78 s
> Doc-tests alphal00p_docs_examples
728.78 s
>
728.78 s
> running 0 tests
728.78 s
>
728.78 s
> test result: ok. 0 passed; 0 failed; 0 ignored; 0 measured; 0 filtered out; finished in 0.00s
728.78 s
>
728.78 s
> Doc-tests alphal00p_docs
728.78 s
>
728.78 s
> running 0 tests
728.78 s
>
728.78 s
> test result: ok. 0 passed; 0 failed; 0 ignored; 0 measured; 0 filtered out; finished in 0.00s
728.78 s
>
728.78 s
> Doc-tests alphal00p_docs_schema
728.78 s
>
728.78 s
> running 0 tests
728.78 s
>
728.78 s
> test result: ok. 0 passed; 0 failed; 0 ignored; 0 measured; 0 filtered out; finished in 0.00s
728.78 s
>
728.78 s
> Doc-tests clinnet
728.78 s
>
728.78 s
> running 0 tests
728.78 s
>
728.78 s
> test result: ok. 0 passed; 0 failed; 0 ignored; 0 measured; 0 filtered out; finished in 0.00s
728.78 s
>
728.78 s
> Doc-tests feynkit
728.78 s
>
728.78 s
> running 0 tests
728.78 s
>
728.78 s
> test result: ok. 0 passed; 0 failed; 0 ignored; 0 measured; 0 filtered out; finished in 0.00s
728.78 s
>
728.78 s
> Doc-tests feynkit_amplitude
728.78 s
>
728.78 s
> running 0 tests
728.78 s
>
728.78 s
> test result: ok. 0 passed; 0 failed; 0 ignored; 0 measured; 0 filtered out; finished in 0.00s
728.78 s
>
728.78 s
> Doc-tests feynkit_cff
728.78 s
>
728.78 s
> running 1 test
728.78 s
> test crates/feynkit-cff/src/lib.rs - (line 10) ... ok
728.78 s
>
728.78 s
> test result: ok. 1 passed; 0 failed; 0 ignored; 0 measured; 0 filtered out; finished in 0.00s
728.78 s
>
728.78 s
> all doctests ran in 3.28s; merged doctests compilation took 3.26s
728.78 s
> Doc-tests feynkit_generator
728.78 s
>
728.78 s
> running 0 tests
728.78 s
>
728.78 s
> test result: ok. 0 passed; 0 failed; 0 ignored; 0 measured; 0 filtered out; finished in 0.00s
728.78 s
>
728.78 s
> Doc-tests feynkit_graph
728.78 s
>
728.78 s
> running 0 tests
728.78 s
>
728.78 s
> test result: ok. 0 passed; 0 failed; 0 ignored; 0 measured; 0 filtered out; finished in 0.00s
728.78 s
>
728.78 s
> Doc-tests feynkit_kinematics
728.78 s
>
728.78 s
> running 0 tests
728.78 s
>
728.78 s
> test result: ok. 0 passed; 0 failed; 0 ignored; 0 measured; 0 filtered out; finished in 0.00s
728.78 s
>
728.78 s
> Doc-tests feynkit_model
728.78 s
>
728.78 s
> running 0 tests
728.78 s
>
728.78 s
> test result: ok. 0 passed; 0 failed; 0 ignored; 0 measured; 0 filtered out; finished in 0.00s
728.78 s
>
728.78 s
> Doc-tests feynkit_py
728.78 s
>
728.78 s
> running 0 tests
728.78 s
>
728.78 s
> test result: ok. 0 passed; 0 failed; 0 ignored; 0 measured; 0 filtered out; finished in 0.00s
728.78 s
>
728.78 s
> Doc-tests feynkit_tensor
728.78 s
>
728.78 s
> running 17 tests
728.78 s
> test crates/feynkit-tensor/src/reduction.rs - reduction::TensorReducer (line 303) - compile ... ok
728.78 s
> test crates/feynkit-tensor/src/reduction.rs - reduction::TensorReducer::reduce (line 475) - compile ... ok
728.78 s
> test crates/feynkit-tensor/src/reduction.rs - reduction::ContractionOrbit (line 79) - compile ... ok
728.78 s
> test crates/feynkit-tensor/src/weingarten.rs - weingarten::OrthogonalWeingarten::for_rank (line 275) - compile ... ok
728.78 s
> test crates/feynkit-tensor/src/weingarten.rs - weingarten::OrthogonalWeingarten::new (line 231) - compile ... ok
728.78 s
> test crates/feynkit-tensor/src/reduction.rs - reduction::TensorReductionTerm (line 160) - compile ... ok
728.78 s
> test crates/feynkit-tensor/src/weingarten.rs - weingarten::OrthogonalWeingarten (line 199) - compile ... ok
728.78 s
> test crates/feynkit-tensor/src/reduction.rs - reduction::TensorReduction (line 220) - compile ... ok
728.78 s
> test crates/feynkit-tensor/src/reduction.rs - reduction::TensorReduction::expression (line 267) - compile ... ok
728.78 s
> test crates/feynkit-tensor/src/weingarten.rs - weingarten::OrthogonalWeingarten::coefficient (line 309) - compile ... ok
728.78 s
> test crates/feynkit-tensor/src/weingarten.rs - weingarten::OrthogonalWeingarten::isotropic_pairing_coefficient (line 345) ... ok
728.78 s
> test crates/feynkit-tensor/src/weingarten.rs - weingarten::CosetType::new (line 55) ... ok
728.78 s
> test crates/feynkit-tensor/src/reduction.rs - reduction::FeynmanDiagramTensorExt (line 1094) - compile ... ok
728.78 s
> test crates/feynkit-tensor/src/weingarten.rs - weingarten::CosetType::class_size (line 152) ... ok
728.78 s
> test crates/feynkit-tensor/src/weingarten.rs - weingarten::WeingartenError (line 409) ... ok
728.78 s
> test crates/feynkit-tensor/src/weingarten.rs - weingarten::CosetType::between_matchings (line 92) ... ok
728.78 s
> test crates/feynkit-tensor/src/weingarten.rs - weingarten::CosetType (line 34) ... ok
728.78 s
>
728.78 s
> test result: ok. 17 passed; 0 failed; 0 ignored; 0 measured; 0 filtered out; finished in 0.03s
728.78 s
>
728.78 s
> all doctests ran in 3.50s; merged doctests compilation took 3.46s
728.78 s
> Doc-tests feynkit_ufo
728.78 s
>
728.78 s
> running 0 tests
728.78 s
>
728.78 s
> test result: ok. 0 passed; 0 failed; 0 ignored; 0 measured; 0 filtered out; finished in 0.00s
728.78 s
>
728.78 s
> Doc-tests gammaloop_api
728.78 s
>
728.78 s
> running 2 tests
728.78 s
> test crates/gammaloop-api/src/lib.rs - (line 18) - compile ... ok
728.78 s
> test crates/gammaloop-api/src/commands/evaluate_samples.rs - commands::evaluate_samples::EvaluateSamples (line 51) ... ok
728.78 s
>
728.78 s
> test result: ok. 2 passed; 0 failed; 0 ignored; 0 measured; 0 filtered out; finished in 8.26s
728.78 s
>
728.78 s
> Doc-tests gammaloop_integration_tests
728.78 s
>
728.78 s
> running 0 tests
728.78 s
>
728.78 s
> test result: ok. 0 passed; 0 failed; 0 ignored; 0 measured; 0 filtered out; finished in 0.00s
728.78 s
>
728.78 s
> Doc-tests gammaloop_tracing_filter
728.78 s
>
728.78 s
> running 0 tests
728.78 s
>
728.78 s
> test result: ok. 0 passed; 0 failed; 0 ignored; 0 measured; 0 filtered out; finished in 0.00s
728.78 s
>
728.78 s
> Doc-tests gammaloop_tracing_filter_macros
728.78 s
>
728.78 s
> running 2 tests
728.78 s
> test crates/gammaloop-tracing-filter-macros/src/lib.rs - debug_instrument (line 14) ... ignored
728.78 s
> test crates/gammaloop-tracing-filter-macros/src/lib.rs - debug_instrument (line 8) ... ignored
728.78 s
>
728.78 s
> test result: ok. 0 passed; 0 failed; 2 ignored; 0 measured; 0 filtered out; finished in 0.00s
728.78 s
>
728.78 s
> all doctests ran in 0.39s; merged doctests compilation took 0.38s
728.78 s
> Doc-tests gammaloop_workspace_hack
728.78 s
>
728.78 s
> running 0 tests
728.78 s
>
728.78 s
> test result: ok. 0 passed; 0 failed; 0 ignored; 0 measured; 0 filtered out; finished in 0.00s
728.78 s
>
728.78 s
> Doc-tests gammalooprs
728.78 s
>
728.78 s
> running 2 tests
728.78 s
> test crates/gammalooprs/src/integrands/process/mod.rs - integrands::process::ProcessIntegrandImpl::signal_external_momenta_changed (line 3391) ... ignored
728.78 s
> test crates/gammalooprs/src/utils/linnet_ext.rs - utils::linnet_ext::Permutation::from_mappings (line 27) ... ok
728.78 s
>
728.78 s
> test result: ok. 1 passed; 0 failed; 1 ignored; 0 measured; 0 filtered out; finished in 0.01s
728.78 s
>
728.78 s
> all doctests ran in 2.45s; merged doctests compilation took 2.42s
728.78 s
> Doc-tests idenso
728.78 s
>
728.78 s
> running 5 tests
728.78 s
> test crates/idenso/src/color/macros.rs - color::macros::color_f (line 109) ... ignored
728.78 s
> test crates/idenso/src/color/macros.rs - color::macros::color_t (line 18) ... ignored
728.78 s
> test crates/idenso/src/dirac/macros.rs - dirac::macros::gamma (line 28) ... ignored
728.78 s
> test crates/idenso/src/dirac/macros.rs - dirac::macros::gamma0 (line 259) ... ignored
728.78 s
> test crates/idenso/src/dirac/macros.rs - dirac::macros::u (line 155) ... ignored
728.78 s
>
728.78 s
> test result: ok. 0 passed; 0 failed; 5 ignored; 0 measured; 0 filtered out; finished in 0.00s
728.78 s
>
728.78 s
> all doctests ran in 0.39s; merged doctests compilation took 0.38s
728.78 s
> Doc-tests kurvst
728.78 s
>
728.78 s
> running 0 tests
728.78 s
>
728.78 s
> test result: ok. 0 passed; 0 failed; 0 ignored; 0 measured; 0 filtered out; finished in 0.00s
728.78 s
>
728.78 s
> Doc-tests linnest
728.78 s
>
728.78 s
> running 0 tests
728.78 s
>
728.78 s
> test result: ok. 0 passed; 0 failed; 0 ignored; 0 measured; 0 filtered out; finished in 0.00s
728.78 s
>
728.78 s
> Doc-tests linnet
728.78 s
>
728.78 s
> running 46 tests
728.78 s
> test crates/linnet/src/half_edge/algorithms/transitive_ops.rs - half_edge::algorithms::transitive_ops::HedgeGraph<E,V,H,N>::transitive_closure (line 164) ... ignored
728.78 s
> test crates/linnet/src/half_edge/algorithms/transitive_ops.rs - half_edge::algorithms::transitive_ops::HedgeGraph<E,V,H,N>::transitive_reduction (line 300) ... ignored
728.78 s
> test crates/linnet/src/half_edge/builder.rs - half_edge::builder::HedgeGraphBuilder (line 110) ... ignored
728.78 s
> test crates/linnet/src/half_edge/algorithms/trace_unfold.rs - half_edge::algorithms::trace_unfold::TraceKey<O,D>::empty (line 1071) ... ok
728.78 s
> test crates/linnet/src/half_edge/algorithms/trace_unfold.rs - half_edge::algorithms::trace_unfold::TraceKey (line 1029) ... ok
728.78 s
> test crates/linnet/src/half_edge/algorithms/trace_unfold.rs - half_edge::algorithms::trace_unfold::TraceKey<O,D>::view (line 1110) ... ok
728.78 s
> test crates/linnet/src/half_edge/algorithms/trace_unfold.rs - half_edge::algorithms::trace_unfold::TraceKey<O,D>::write_foata_like (line 1356) ... ok
728.78 s
> test crates/linnet/src/half_edge/algorithms/trace_unfold.rs - half_edge::algorithms::trace_unfold::TraceKey<O,D>::iter_levels_top_down (line 1164) ... ok
728.78 s
> test crates/linnet/src/half_edge/algorithms/trace_unfold.rs - half_edge::algorithms::trace_unfold::TraceKeyView (line 872) ... ok
728.78 s
> test crates/linnet/src/parser/mod.rs - parser (line 17) ... ok
728.78 s
> test crates/linnet/src/permutation.rs - permutation::Permutation (line 61) ... ok
728.78 s
> test crates/linnet/src/half_edge/algorithms/trace_unfold.rs - half_edge::algorithms::trace_unfold::TraceKey<O,D>::push (line 1253) ... ok
728.78 s
> test crates/linnet/src/half_edge/algorithms/trace_unfold.rs - half_edge::algorithms::trace_unfold::TraceKey<O,D>::from_levels (line 1089) ... ok
728.78 s
> test crates/linnet/src/half_edge/algorithms/trace_unfold.rs - half_edge::algorithms::trace_unfold::TraceKey<O,D>::iter_leaf_ops (line 1222) ... ok
728.78 s
> test crates/linnet/src/half_edge/algorithms/trace_unfold.rs - half_edge::algorithms::trace_unfold::TraceKey<O,D>::is_empty (line 1136) ... ok
728.78 s
> test crates/linnet/src/half_edge/algorithms/trace_unfold.rs - half_edge::algorithms::trace_unfold::TraceKey<O,D>::iter_levels_bottom_up (line 1194) ... ok
728.78 s
> test crates/linnet/src/half_edge/algorithms/trace_unfold.rs - half_edge::algorithms::trace_unfold::TraceUnfold (line 127) ... ok
728.78 s
> test crates/linnet/src/half_edge/algorithms/trace_unfold.rs - half_edge::algorithms::trace_unfold::TraceKeyView<'a,O,D>::to_owned (line 979) ... ok
728.78 s
> test crates/linnet/src/half_edge/algorithms/trace_unfold.rs - half_edge::algorithms::trace_unfold::TraceUnfold::realizations_for_op (line 213) ... ok
728.78 s
> test crates/linnet/src/permutation.rs - permutation::Permutation::apply_slice_inv (line 469) ... ok
728.78 s
> test crates/linnet/src/permutation.rs - permutation::Permutation::from_disjoint_cycles (line 978) ... ok
728.78 s
> test crates/linnet/src/permutation.rs - permutation::Permutation::from_map (line 113) ... ok
728.78 s
> test crates/linnet/src/permutation.rs - permutation::Permutation::id (line 96) ... ok
728.78 s
> test crates/linnet/src/permutation.rs - permutation::Permutation::apply_slice (line 451) ... ok
728.78 s
> test crates/linnet/src/permutation.rs - permutation::Permutation::from_prefix_sources (line 266) ... ok
728.78 s
> test crates/linnet/src/permutation.rs - permutation::Permutation::apply_slice_in_place_inv (line 510) ... ok
728.78 s
> test crates/linnet/src/permutation.rs - permutation::Permutation::iter_slice (line 543) ... ok
728.78 s
> test crates/linnet/src/permutation.rs - permutation::Permutation::from_cycles (line 1069) ... ok
728.78 s
> test crates/linnet/src/permutation.rs - permutation::Permutation::find_cycles (line 680) ... ok
728.78 s
> test crates/linnet/src/permutation.rs - permutation::Permutation::iter_slice_inv (line 562) ... ok
728.78 s
> test crates/linnet/src/permutation.rs - permutation::Permutation::inverse (line 434) ... ok
728.78 s
> test crates/linnet/src/permutation.rs - permutation::Permutation::inv (line 416) ... ok
728.78 s
> test crates/linnet/src/permutation.rs - permutation::Permutation::apply_slice_in_place (line 488) ... ok
728.78 s
> test crates/linnet/src/permutation.rs - permutation::Permutation::cycle_to_transpositions (line 713) ... ok
728.78 s
> test crates/linnet/src/permutation.rs - permutation::Permutation::is_identity (line 851) ... ok
728.78 s
> test crates/linnet/src/permutation.rs - permutation::Permutation::iter_slice_mut (line 588) ... ok
728.78 s
> test crates/linnet/src/permutation.rs - permutation::Permutation::iter_slice_inv_mut (line 615) ... ok
728.78 s
> test crates/linnet/src/permutation.rs - permutation::Permutation::map (line 402) ... ok
728.78 s
> test crates/linnet/src/permutation.rs - permutation::Permutation::pow (line 896) ... ok
728.78 s
> test crates/linnet/src/permutation.rs - permutation::Permutation::myrvold_ruskey_rank1 (line 760) ... ok
728.78 s
> test crates/linnet/src/permutation.rs - permutation::Permutation::myrvold_ruskey_rank2 (line 805) ... ok
728.78 s
> test crates/linnet/src/permutation.rs - permutation::Permutation::transpositions (line 733) ... ok
728.78 s
> test crates/linnet/src/permutation.rs - permutation::Permutation::myrvold_ruskey_unrank1 (line 782) ... ok
728.78 s
> test crates/linnet/src/permutation.rs - permutation::Permutation::myrvold_ruskey_unrank2 (line 828) ... ok
728.78 s
> test crates/linnet/src/permutation.rs - permutation::Permutation::sign (line 869) ... ok
728.78 s
> test crates/linnet/src/permutation.rs - permutation::Permutation::sort (line 640) ... ok
728.78 s
>
728.78 s
> test result: ok. 43 passed; 0 failed; 3 ignored; 0 measured; 0 filtered out; finished in 17.00s
728.78 s
>
728.78 s
> Doc-tests linnet_py
728.78 s
>
728.78 s
> running 0 tests
728.78 s
>
728.78 s
> test result: ok. 0 passed; 0 failed; 0 ignored; 0 measured; 0 filtered out; finished in 0.00s
728.78 s
>
728.78 s
> Doc-tests linnet_render_py
728.78 s
>
728.78 s
> running 0 tests
728.78 s
>
728.78 s
> test result: ok. 0 passed; 0 failed; 0 ignored; 0 measured; 0 filtered out; finished in 0.00s
728.78 s
>
728.78 s
> Doc-tests spenso
728.78 s
>
728.78 s
> running 9 tests
728.78 s
> test crates/spenso/src/shadowing/macros.rs - shadowing::macros::antisym (line 341) ... ignored
728.78 s
> test crates/spenso/src/shadowing/macros.rs - shadowing::macros::chain (line 391) ... ignored
728.78 s
> test crates/spenso/src/shadowing/macros.rs - shadowing::macros::cyclic (line 365) ... ignored
728.78 s
> test crates/spenso/src/shadowing/macros.rs - shadowing::macros::slot (line 24) ... ignored
728.78 s
> test crates/spenso/src/shadowing/macros.rs - shadowing::macros::sym (line 317) ... ignored
728.78 s
> test crates/spenso/src/shadowing/macros.rs - shadowing::macros::tensor (line 110) ... ignored
728.78 s
> test crates/spenso/src/shadowing/macros.rs - shadowing::macros::trace (line 448) ... ignored
728.78 s
> test crates/spenso/src/shadowing/macros.rs - shadowing::macros::trace_sym (line 500) ... ignored
728.78 s
> test crates/spenso/src/network/mod.rs - network::Network (line 1715) ... ok
728.78 s
>
728.78 s
> test result: ok. 1 passed; 0 failed; 8 ignored; 0 measured; 0 filtered out; finished in 0.00s
728.78 s
>
728.78 s
> all doctests ran in 4.78s; merged doctests compilation took 4.76s
728.78 s
> Doc-tests spenso_hep_lib
728.78 s
>
728.78 s
> running 0 tests
728.78 s
>
728.78 s
> test result: ok. 0 passed; 0 failed; 0 ignored; 0 measured; 0 filtered out; finished in 0.00s
728.78 s
>
728.78 s
> Doc-tests spenso_macros
728.78 s
>
728.78 s
> running 0 tests
728.78 s
>
728.78 s
> test result: ok. 0 passed; 0 failed; 0 ignored; 0 measured; 0 filtered out; finished in 0.00s
728.78 s
>
728.78 s
> Doc-tests spynso3
728.78 s
>
728.78 s
> running 1 test
728.78 s
> test crates/spynso3/src/expression.rs - expression::TensorExpression::simplify_algebra (line 2336) ... FAILED
728.78 s
>
728.78 s
> failures:
728.78 s
>
728.78 s
> ---- crates/spynso3/src/expression.rs - expression::TensorExpression::simplify_algebra (line 2336) stdout ----
728.78 s
> error: expected item, found `-`
728.78 s
> --> crates/spynso3/src/expression.rs:2337:1
728.78 s
> |
728.78 s
> 2337 | - "fully": contract compatible metrics/identities and vectors, collect
728.78 s
> | ^ expected item
728.78 s
> |
728.78 s
> = note: for a full list of items that can appear in modules, see <https://doc.rust-lang.org/reference/items.html>
728.78 s
>
728.78 s
> error: aborting due to 1 previous error
728.78 s
>
728.78 s
> Couldn't compile the test.
728.78 s
>
728.78 s
> failures:
728.78 s
> crates/spynso3/src/expression.rs - expression::TensorExpression::simplify_algebra (line 2336)
728.78 s
>
728.78 s
> test result: FAILED. 0 passed; 1 failed; 0 ignored; 0 measured; 0 filtered out; finished in 0.01s
728.78 s
>
728.78 s
> error : doctest failed, to rerun pass `-p spynso3 --doc`
728.78 s
For full logs, run:
728.78 s
nix log /nix/store/6klybbspcwdrsi00vn5bipxdrnnls219-gammaloop-workspace-doctest-0.1.0.drv
729.03 s
[0 built (1 failed ), 5 cRun failed.