0.00 s
$ /nix/store/9ypz3flqsrl5xl495mm8h645gadjsxi1-coreutils-9.11/bin/timeout --kill-after=15s 7200s /nix/store/23zk8sgzamrbmj1fday15szf7f2279s8-nix-2.34.7/bin/nix --extra-experimental-features nix-command --extra-experimental-features flakes flake clone git+https://github.com/alphal00p/gammaloop --dest /tmp/nix-ci-worker/stable-pwd/repo/
0.07 s
Cloning into '/tmp/nix-ci-worker/stable-pwd/repo'...
1.43 s
remote: Enumerating objects: 78074, done.
1.54 s
remote: Counting objects: 0% (1/13896)
remote: Counting objects: 1% (139/13896)
remote: Counting objects: 2% (278/13896)
remote: Counting objects: 3% (417/13896)
remote: Counting objects: 4% (556/13896)
remote: Counting objects: 5% (695/13896)
remote: Counting objects: 6% (834/13896)
remote: Counting objects: 7% (973/13896)
remote: Counting objects: 8% (1112/13896)
remote: Counting objects: 9% (1251/13896)
remote: Counting objects: 10% (1390/13896)
remote: Counting objects: 11% (1529/13896)
remote: Counting objects: 12% (1668/13896)
remote: Counting objects: 13% (1807/13896)
remote: Counting objects: 14% (1946/13896)
remote: Counting objects: 15% (2085/13896)
remote: Counting objects: 16% (2224/13896)
remote: Counting objects: 17% (2363/13896)
remote: Counting objects: 18% (2502/13896)
remote: Counting objects: 19% (2641/13896)
remote: Counting objects: 20% (2780/13896)
remote: Counting objects: 21% (2919/13896)
remote: Counting objects: 22% (3058/13896)
remote: Counting objects: 23% (3197/13896)
remote: Counting objects: 24% (3336/13896)
remote: Counting objects: 25% (3474/13896)
remote: Counting objects: 26% (3613/13896)
remote: Counting objects: 27% (3752/13896)
remote: Counting objects: 28% (3891/13896)
remote: Counting objects: 29% (4030/13896)
remote: Counting objects: 30% (4169/13896)
remote: Counting objects: 31% (4308/13896)
remote: Counting objects: 32% (4447/13896)
remote: Counting objects: 33% (4586/13896)
remote: Counting objects: 34% (4725/13896)
remote: Counting objects: 35% (4864/13896)
remote: Counting objects: 36% (5003/13896)
remote: Counting objects: 37% (5142/13896)
remote: Counting objects: 38% (5281/13896)
remote: Counting objects: 39% (5420/13896)
remote: Counting objects: 40% (5559/13896)
remote: Counting objects: 41% (5698/13896)
remote: Counting objects: 42% (5837/13896)
remote: Counting objects: 43% (5976/13896)
remote: Counting objects: 44% (6115/13896)
remote: Counting objects: 45% (6254/13896)
remote: Counting objects: 46% (6393/13896)
remote: Counting objects: 47% (6532/13896)
remote: Counting objects: 48% (6671/13896)
remote: Counting objects: 49% (6810/13896)
remote: Counting objects: 50% (6948/13896)
remote: Counting objects: 51% (7087/13896)
remote: Counting objects: 52% (7226/13896)
remote: Counting objects: 53% (7365/13896)
remote: Counting objects: 54% (7504/13896)
remote: Counting objects: 55% (7643/13896)
remote: Counting objects: 56% (7782/13896)
remote: Counting objects: 57% (7921/13896)
remote: Counting objects: 58% (8060/13896)
remote: Counting objects: 59% (8199/13896)
remote: Counting objects: 60% (8338/13896)
remote: Counting objects: 61% (8477/13896)
remote: Counting objects: 62% (8616/13896)
remote: Counting objects: 63% (8755/13896)
remote: Counting objects: 64% (8894/13896)
remote: Counting objects: 65% (9033/13896)
remote: Counting objects: 66% (9172/13896)
remote: Counting objects: 67% (9311/13896)
remote: Counting objects: 68% (9450/13896)
remote: Counting objects: 69% (9589/13896)
remote: Counting objects: 70% (9728/13896)
remote: Counting objects: 71% (9867/13896)
remote: Counting objects: 72% (10006/13896)
remote: Counting objects: 73% (10145/13896)
remote: Counting objects: 74% (10284/13896)
remote: Counting objects: 75% (10422/13896)
remote: Counting objects: 76% (10561/13896)
remote: Counting objects: 77% (10700/13896)
remote: Counting objects: 78% (10839/13896)
remote: Counting objects: 79% (10978/13896)
remote: Counting objects: 80% (11117/13896)
remote: Counting objects: 81% (11256/13896)
remote: Counting objects: 82% (11395/13896)
remote: Counting objects: 83% (11534/13896)
remote: Counting objects: 84% (11673/13896)
remote: Counting objects: 85% (11812/13896)
remote: Counting objects: 86% (11951/13896)
remote: Counting objects: 87% (12090/13896)
remote: Counting objects: 88% (12229/13896)
remote: Counting objects: 89% (12368/13896)
remote: Counting objects: 90% (12507/13896)
remote: Counting objects: 91% (12646/13896)
remote: Counting objects: 92% (12785/13896)
remote: Counting objects: 93% (12924/13896)
remote: Counting objects: 94% (13063/13896)
remote: Counting objects: 95% (13202/13896)
remote: Counting objects: 96% (13341/13896)
remote: Counting objects: 97% (13480/13896)
remote: Counting objects: 98% (13619/13896)
remote: Counting objects: 99% (13758/13896)
remote: Counting objects: 100% (13896/13896)
remote: Counting objects: 100% (13896/13896), done.
4.44 s
remote: Compressing objects: 0% (1/3083)
remote: Compressing objects: 1% (31/3083)
remote: Compressing objects: 2% (62/3083)
remote: Compressing objects: 3% (93/3083)
remote: Compressing objects: 4% (124/3083)
remote: Compressing objects: 5% (155/3083)
remote: Compressing objects: 6% (185/3083)
remote: Compressing objects: 7% (216/3083)
remote: Compressing objects: 8% (247/3083)
remote: Compressing objects: 9% (278/3083)
remote: Compressing objects: 10% (309/3083)
remote: Compressing objects: 11% (340/3083)
remote: Compressing objects: 12% (370/3083)
remote: Compressing objects: 13% (401/3083)
remote: Compressing objects: 14% (432/3083)
remote: Compressing objects: 15% (463/3083)
remote: Compressing objects: 16% (494/3083)
remote: Compressing objects: 17% (525/3083)
remote: Compressing objects: 18% (555/3083)
remote: Compressing objects: 19% (586/3083)
remote: Compressing objects: 20% (617/3083)
remote: Compressing objects: 21% (648/3083)
remote: Compressing objects: 22% (679/3083)
remote: Compressing objects: 23% (710/3083)
remote: Compressing objects: 24% (740/3083)
remote: Compressing objects: 24% (769/3083)
remote: Compressing objects: 25% (771/3083)
remote: Compressing objects: 26% (802/3083)
remote: Compressing objects: 27% (833/3083)
remote: Compressing objects: 28% (864/3083)
remote: Compressing objects: 28% (867/3083)
remote: Compressing objects: 29% (895/3083)
remote: Compressing objects: 30% (925/3083)
remote: Compressing objects: 31% (956/3083)
remote: Compressing objects: 32% (987/3083)
remote: Compressing objects: 33% (1018/3083)
remote: Compressing objects: 34% (1049/3083)
remote: Compressing objects: 35% (1080/3083)
remote: Compressing objects: 36% (1110/3083)
remote: Compressing objects: 37% (1141/3083)
remote: Compressing objects: 38% (1172/3083)
remote: Compressing objects: 39% (1203/3083)
remote: Compressing objects: 40% (1234/3083)
remote: Compressing objects: 41% (1265/3083)
remote: Compressing objects: 42% (1295/3083)
remote: Compressing objects: 43% (1326/3083)
remote: Compressing objects: 44% (1357/3083)
remote: Compressing objects: 45% (1388/3083)
remote: Compressing objects: 46% (1419/3083)
remote: Compressing objects: 47% (1450/3083)
remote: Compressing objects: 48% (1480/3083)
remote: Compressing objects: 49% (1511/3083)
remote: Compressing objects: 50% (1542/3083)
remote: Compressing objects: 51% (1573/3083)
remote: Compressing objects: 52% (1604/3083)
remote: Compressing objects: 53% (1634/3083)
remote: Compressing objects: 54% (1665/3083)
remote: Compressing objects: 55% (1696/3083)
remote: Compressing objects: 56% (1727/3083)
remote: Compressing objects: 57% (1758/3083)
remote: Compressing objects: 58% (1789/3083)
remote: Compressing objects: 59% (1819/3083)
remote: Compressing objects: 60% (1850/3083)
remote: Compressing objects: 61% (1881/3083)
remote: Compressing objects: 62% (1912/3083)
remote: Compressing objects: 63% (1943/3083)
remote: Compressing objects: 64% (1974/3083)
remote: Compressing objects: 65% (2004/3083)
remote: Compressing objects: 66% (2035/3083)
remote: Compressing objects: 67% (2066/3083)
remote: Compressing objects: 68% (2097/3083)
remote: Compressing objects: 69% (2128/3083)
remote: Compressing objects: 70% (2159/3083)
remote: Compressing objects: 71% (2189/3083)
remote: Compressing objects: 72% (2220/3083)
remote: Compressing objects: 73% (2251/3083)
remote: Compressing objects: 74% (2282/3083)
remote: Compressing objects: 75% (2313/3083)
remote: Compressing objects: 76% (2344/3083)
remote: Compressing objects: 77% (2374/3083)
remote: Compressing objects: 78% (2405/3083)
remote: Compressing objects: 79% (2436/3083)
remote: Compressing objects: 80% (2467/3083)
remote: Compressing objects: 81% (2498/3083)
remote: Compressing objects: 82% (2529/3083)
remote: Compressing objects: 83% (2559/3083)
remote: Compressing objects: 84% (2590/3083)
remote: Compressing objects: 85% (2621/3083)
remote: Compressing objects: 86% (2652/3083)
remote: Compressing objects: 87% (2683/3083)
remote: Compressing objects: 88% (2714/3083)
remote: Compressing objects: 89% (2744/3083)
remote: Compressing objects: 90% (2775/3083)
remote: Compressing objects: 91% (2806/3083)
remote: Compressing objects: 92% (2837/3083)
remote: Compressing objects: 93% (2868/3083)
remote: Compressing objects: 94% (2899/3083)
remote: Compressing objects: 95% (2929/3083)
remote: Compressing objects: 96% (2960/3083)
remote: Compressing objects: 97% (2991/3083)
remote: Compressing objects: 98% (3022/3083)
remote: Compressing objects: 98% (3042/3083)
remote: Compressing objects: 99% (3053/3083)
remote: Compressing objects: 100% (3083/3083)
remote: Compressing objects: 100% (3083/3083), done.
8.06 s
Receiving objects: 0% (1/78074)
Receiving objects: 1% (781/78074)
Receiving objects: 2% (1562/78074)
Receiving objects: 3% (2343/78074)
Receiving objects: 4% (3123/78074)
Receiving objects: 5% (3904/78074)
Receiving objects: 6% (4685/78074)
Receiving objects: 7% (5466/78074)
Receiving objects: 8% (6246/78074)
Receiving objects: 9% (7027/78074)
Receiving objects: 10% (7808/78074), 16.59 MiB | 33.16 MiB/s
Receiving objects: 11% (8589/78074), 16.59 MiB | 33.16 MiB/s
Receiving objects: 12% (9369/78074), 16.59 MiB | 33.16 MiB/s
Receiving objects: 13% (10150/78074), 16.59 MiB | 33.16 MiB/s
Receiving objects: 14% (10931/78074), 16.59 MiB | 33.16 MiB/s
Receiving objects: 15% (11712/78074), 16.59 MiB | 33.16 MiB/s
Receiving objects: 16% (12492/78074), 16.59 MiB | 33.16 MiB/s
Receiving objects: 17% (13273/78074), 16.59 MiB | 33.16 MiB/s
Receiving objects: 18% (14054/78074), 16.59 MiB | 33.16 MiB/s
Receiving objects: 19% (14835/78074), 16.59 MiB | 33.16 MiB/s
Receiving objects: 20% (15615/78074), 16.59 MiB | 33.16 MiB/s
Receiving objects: 21% (16396/78074), 16.59 MiB | 33.16 MiB/s
Receiving objects: 22% (17177/78074), 16.59 MiB | 33.16 MiB/s
Receiving objects: 23% (17958/78074), 16.59 MiB | 33.16 MiB/s
Receiving objects: 24% (18738/78074), 16.59 MiB | 33.16 MiB/s
Receiving objects: 25% (19519/78074), 16.59 MiB | 33.16 MiB/s
Receiving objects: 26% (20300/78074), 16.59 MiB | 33.16 MiB/s
Receiving objects: 27% (21080/78074), 16.59 MiB | 33.16 MiB/s
Receiving objects: 28% (21861/78074), 16.59 MiB | 33.16 MiB/s
Receiving objects: 29% (22642/78074), 16.59 MiB | 33.16 MiB/s
Receiving objects: 30% (23423/78074), 16.59 MiB | 33.16 MiB/s
Receiving objects: 31% (24203/78074), 16.59 MiB | 33.16 MiB/s
Receiving objects: 32% (24984/78074), 16.59 MiB | 33.16 MiB/s
Receiving objects: 33% (25765/78074), 16.59 MiB | 33.16 MiB/s
Receiving objects: 34% (26546/78074), 16.59 MiB | 33.16 MiB/s
Receiving objects: 35% (27326/78074), 16.59 MiB | 33.16 MiB/s
Receiving objects: 36% (28107/78074), 16.59 MiB | 33.16 MiB/s
Receiving objects: 37% (28888/78074), 16.59 MiB | 33.16 MiB/s
Receiving objects: 38% (29669/78074), 16.59 MiB | 33.16 MiB/s
Receiving objects: 39% (30449/78074), 16.59 MiB | 33.16 MiB/s
Receiving objects: 40% (31230/78074), 16.59 MiB | 33.16 MiB/s
Receiving objects: 41% (32011/78074), 16.59 MiB | 33.16 MiB/s
Receiving objects: 42% (32792/78074), 16.59 MiB | 33.16 MiB/s
Receiving objects: 43% (33572/78074), 16.59 MiB | 33.16 MiB/s
Receiving objects: 43% (33769/78074), 31.75 MiB | 31.56 MiB/s
Receiving objects: 44% (34353/78074), 31.75 MiB | 31.56 MiB/s
Receiving objects: 45% (35134/78074), 31.75 MiB | 31.56 MiB/s
Receiving objects: 46% (35915/78074), 31.75 MiB | 31.56 MiB/s
Receiving objects: 47% (36695/78074), 31.75 MiB | 31.56 MiB/s
Receiving objects: 48% (37476/78074), 31.75 MiB | 31.56 MiB/s
Receiving objects: 49% (38257/78074), 31.75 MiB | 31.56 MiB/s
Receiving objects: 50% (39037/78074), 31.75 MiB | 31.56 MiB/s
Receiving objects: 51% (39818/78074), 31.75 MiB | 31.56 MiB/s
Receiving objects: 52% (40599/78074), 31.75 MiB | 31.56 MiB/s
Receiving objects: 53% (41380/78074), 31.75 MiB | 31.56 MiB/s
Receiving objects: 54% (42160/78074), 31.75 MiB | 31.56 MiB/s
Receiving objects: 55% (42941/78074), 50.61 MiB | 32.27 MiB/s
Receiving objects: 56% (43722/78074), 50.61 MiB | 32.27 MiB/s
Receiving objects: 57% (44503/78074), 50.61 MiB | 32.27 MiB/s
Receiving objects: 58% (45283/78074), 50.61 MiB | 32.27 MiB/s
Receiving objects: 59% (46064/78074), 50.61 MiB | 32.27 MiB/s
Receiving objects: 60% (46845/78074), 50.61 MiB | 32.27 MiB/s
Receiving objects: 61% (47626/78074), 50.61 MiB | 32.27 MiB/s
Receiving objects: 62% (48406/78074), 50.61 MiB | 32.27 MiB/s
Receiving objects: 62% (48917/78074), 50.61 MiB | 32.27 MiB/s
Receiving objects: 63% (49187/78074), 50.61 MiB | 32.27 MiB/s
Receiving objects: 64% (49968/78074), 50.61 MiB | 32.27 MiB/s
Receiving objects: 65% (50749/78074), 69.73 MiB | 32.72 MiB/s
Receiving objects: 66% (51529/78074), 69.73 MiB | 32.72 MiB/s
Receiving objects: 67% (52310/78074), 69.73 MiB | 32.72 MiB/s
Receiving objects: 68% (53091/78074), 69.73 MiB | 32.72 MiB/s
Receiving objects: 69% (53872/78074), 69.73 MiB | 32.72 MiB/s
Receiving objects: 70% (54652/78074), 69.73 MiB | 32.72 MiB/s
Receiving objects: 71% (55433/78074), 69.73 MiB | 32.72 MiB/s
Receiving objects: 72% (56214/78074), 69.73 MiB | 32.72 MiB/s
Receiving objects: 73% (56995/78074), 69.73 MiB | 32.72 MiB/s
Receiving objects: 74% (57775/78074), 69.73 MiB | 32.72 MiB/s
Receiving objects: 75% (58556/78074), 69.73 MiB | 32.72 MiB/s
Receiving objects: 76% (59337/78074), 69.73 MiB | 32.72 MiB/s
Receiving objects: 77% (60117/78074), 69.73 MiB | 32.72 MiB/s
Receiving objects: 78% (60898/78074), 88.68 MiB | 33.71 MiB/s
Receiving objects: 79% (61679/78074), 88.68 MiB | 33.71 MiB/s
Receiving objects: 80% (62460/78074), 88.68 MiB | 33.71 MiB/s
Receiving objects: 81% (63240/78074), 88.68 MiB | 33.71 MiB/s
Receiving objects: 81% (63424/78074), 88.68 MiB | 33.71 MiB/s
Receiving objects: 82% (64021/78074), 104.29 MiB | 33.17 MiB/s
Receiving objects: 83% (64802/78074), 104.29 MiB | 33.17 MiB/s
Receiving objects: 84% (65583/78074), 104.29 MiB | 33.17 MiB/s
Receiving objects: 85% (66363/78074), 104.29 MiB | 33.17 MiB/s
Receiving objects: 86% (67144/78074), 104.29 MiB | 33.17 MiB/s
Receiving objects: 87% (67925/78074), 104.29 MiB | 33.17 MiB/s
Receiving objects: 88% (68706/78074), 104.29 MiB | 33.17 MiB/s
Receiving objects: 89% (69486/78074), 104.29 MiB | 33.17 MiB/s
Receiving objects: 90% (70267/78074), 104.29 MiB | 33.17 MiB/s
Receiving objects: 91% (71048/78074), 104.29 MiB | 33.17 MiB/s
Receiving objects: 92% (71829/78074), 104.29 MiB | 33.17 MiB/s
Receiving objects: 93% (72609/78074), 104.29 MiB | 33.17 MiB/s
Receiving objects: 94% (73390/78074), 104.29 MiB | 33.17 MiB/s
Receiving objects: 95% (74171/78074), 104.29 MiB | 33.17 MiB/s
Receiving objects: 96% (74952/78074), 104.29 MiB | 33.17 MiB/s
Receiving objects: 97% (75732/78074), 104.29 MiB | 33.17 MiB/s
Receiving objects: 98% (76513/78074), 104.29 MiB | 33.17 MiB/s
Receiving objects: 99% (77294/78074), 104.29 MiB | 33.17 MiB/s
remote: Total 78074 (delta 9798), reused 11670 (delta 8716), pack-reused 64178 (from 2)
8.06 s
Receiving objects: 100% (78074/78074), 104.29 MiB | 33.17 MiB/s
Receiving objects: 100% (78074/78074), 120.78 MiB | 33.42 MiB/s, done.
8.84 s
Resolving deltas: 0% (0/53117)
Resolving deltas: 1% (532/53117)
Resolving deltas: 2% (1063/53117)
Resolving deltas: 3% (1596/53117)
Resolving deltas: 4% (2125/53117)
Resolving deltas: 5% (2656/53117)
Resolving deltas: 6% (3188/53117)
Resolving deltas: 7% (3719/53117)
Resolving deltas: 8% (4250/53117)
Resolving deltas: 9% (4782/53117)
Resolving deltas: 10% (5312/53117)
Resolving deltas: 11% (5843/53117)
Resolving deltas: 12% (6375/53117)
Resolving deltas: 13% (6906/53117)
Resolving deltas: 14% (7437/53117)
Resolving deltas: 15% (7968/53117)
Resolving deltas: 16% (8500/53117)
Resolving deltas: 17% (9030/53117)
Resolving deltas: 18% (9562/53117)
Resolving deltas: 19% (10093/53117)
Resolving deltas: 20% (10625/53117)
Resolving deltas: 21% (11155/53117)
Resolving deltas: 22% (11686/53117)
Resolving deltas: 23% (12217/53117)
Resolving deltas: 24% (12749/53117)
Resolving deltas: 25% (13281/53117)
Resolving deltas: 26% (13811/53117)
Resolving deltas: 27% (14343/53117)
Resolving deltas: 28% (14874/53117)
Resolving deltas: 29% (15404/53117)
Resolving deltas: 30% (15936/53117)
Resolving deltas: 31% (16467/53117)
Resolving deltas: 32% (16998/53117)
Resolving deltas: 33% (17529/53117)
Resolving deltas: 34% (18060/53117)
Resolving deltas: 35% (18591/53117)
Resolving deltas: 36% (19124/53117)
Resolving deltas: 37% (19654/53117)
Resolving deltas: 38% (20185/53117)
Resolving deltas: 39% (20716/53117)
Resolving deltas: 40% (21247/53117)
Resolving deltas: 41% (21780/53117)
Resolving deltas: 42% (22310/53117)
Resolving deltas: 43% (22843/53117)
Resolving deltas: 44% (23372/53117)
Resolving deltas: 45% (23903/53117)
Resolving deltas: 46% (24434/53117)
Resolving deltas: 47% (24965/53117)
Resolving deltas: 48% (25499/53117)
Resolving deltas: 49% (26028/53117)
Resolving deltas: 50% (26559/53117)
Resolving deltas: 51% (27091/53117)
Resolving deltas: 52% (27621/53117)
Resolving deltas: 53% (28153/53117)
Resolving deltas: 54% (28684/53117)
Resolving deltas: 55% (29216/53117)
Resolving deltas: 56% (29746/53117)
Resolving deltas: 57% (30277/53117)
Resolving deltas: 58% (30808/53117)
Resolving deltas: 59% (31340/53117)
Resolving deltas: 60% (31871/53117)
Resolving deltas: 61% (32402/53117)
Resolving deltas: 62% (32933/53117)
Resolving deltas: 63% (33464/53117)
Resolving deltas: 64% (33996/53117)
Resolving deltas: 65% (34527/53117)
Resolving deltas: 66% (35060/53117)
Resolving deltas: 67% (35590/53117)
Resolving deltas: 68% (36120/53117)
Resolving deltas: 69% (36651/53117)
Resolving deltas: 70% (37182/53117)
Resolving deltas: 71% (37714/53117)
Resolving deltas: 72% (38245/53117)
Resolving deltas: 73% (38776/53117)
Resolving deltas: 74% (39307/53117)
Resolving deltas: 75% (39838/53117)
Resolving deltas: 76% (40370/53117)
Resolving deltas: 77% (40901/53117)
Resolving deltas: 78% (41432/53117)
Resolving deltas: 79% (41963/53117)
Resolving deltas: 80% (42497/53117)
Resolving deltas: 81% (43025/53117)
Resolving deltas: 82% (43556/53117)
Resolving deltas: 83% (44088/53117)
Resolving deltas: 84% (44619/53117)
Resolving deltas: 85% (45150/53117)
Resolving deltas: 86% (45681/53117)
Resolving deltas: 87% (46212/53117)
Resolving deltas: 88% (46743/53117)
Resolving deltas: 89% (47275/53117)
Resolving deltas: 90% (47806/53117)
Resolving deltas: 91% (48340/53117)
Resolving deltas: 92% (48868/53117)
Resolving deltas: 93% (49399/53117)
Resolving deltas: 94% (49930/53117)
Resolving deltas: 95% (50462/53117)
Resolving deltas: 96% (50994/53117)
Resolving deltas: 97% (51525/53117)
Resolving deltas: 98% (52055/53117)
Resolving deltas: 99% (52586/53117)
Resolving deltas: 100% (53117/53117)
Resolving deltas: 100% (53117/53117), done.
9.18 s
Fetching commit ed57fed921fd95d2832e02eb6340b77e3db01418 for codex/aa-aa-identical-program-d3 ...
9.18 s
$ /nix/store/bcnisk3ydfgv26v2gw3zlky24g00yww2-git-2.54.0/bin/git fetch origin ed57fed921fd95d2832e02eb6340b77e3db01418
9.57 s
From https://github.com/alphal00p/gammaloop
9.57 s
* branch ed57fed921fd95d2832e02eb6340b77e3db01418 -> FETCH_HEAD
9.58 s
$ /nix/store/9ypz3flqsrl5xl495mm8h645gadjsxi1-coreutils-9.11/bin/timeout --kill-after=15s 7200s /nix/store/bcnisk3ydfgv26v2gw3zlky24g00yww2-git-2.54.0/bin/git -c advice.detachedHead=false checkout ed57fed921fd95d2832e02eb6340b77e3db01418
9.76 s
HEAD is now at ed57fed92 capture identical Linux evaluator programs
9.77 s
$ /nix/store/9ypz3flqsrl5xl495mm8h645gadjsxi1-coreutils-9.11/bin/timeout --kill-after=15s 7200s /nix/store/23zk8sgzamrbmj1fday15szf7f2279s8-nix-2.34.7/bin/nix --extra-experimental-features nix-command --extra-experimental-features flakes --log-format internal-json run .#packages.x86_64-linux.nix-ci-check-gammaloop-nextest-integration --print-build-logs
13.18 s
13.36 s
Downloading cached gammaloop-nextest-binaries-integration-gammaloop-integration-tests from https://cache.nix-ci.com
15.55 s
Downloaded cached gammaloop-nextest-binaries-integration-gammaloop-integration-tests (415.8 MiB) in 2.1s
15.55 s
Progress: 0 of 3 built, 1 of 1 downloaded from cache
15.58 s
Building /nix/store/abz03pnp06gbfgmdg9fza9wdqc4y834f-gammaloop-nextest-binaries-integration.drv
15.63 s
[gammaloop-nextest-binaries-integration:post-build] Uploading to the NixCI cache: /nix/store/rlr0jhb3d7f04qvv8hzzz6kgvyhn2zbk-gammaloop-nextest-binaries-integration
15.67 s
[gammaloop-nextest-binaries-integration:post-build] warning: 'warn-short-path-literals' is deprecated, use 'lint-short-path-literals = ignore' instead
15.67 s
[gammaloop-nextest-binaries-integration:post-build] copying 1 paths...
15.67 s
[gammaloop-nextest-binaries-integration:post-build] copying path '/nix/store/rlr0jhb3d7f04qvv8hzzz6kgvyhn2zbk-gammaloop-nextest-binaries-integration' to 'https://cache.nix-ci.com'...
15.73 s
[gammaloop-nextest-binaries-integration:post-build] warning: 'warn-short-path-literals' is deprecated, use 'lint-short-path-literals = ignore' instead
15.85 s
[gammaloop-nextest-binaries-integration:post-build] copying 0 paths...
15.87 s
Uploaded gammaloop-nextest-binaries-integration in 249ms
15.87 s
Progress: 1 of 3 built, 1 of 1 downloaded from cache
15.87 s
Built gammaloop-nextest-binaries-integration in 290ms
15.94 s
Building /nix/store/7fhr3n4hr8mxxgmycwf6wbkxb33kwnq3-nix-ci-check-gammaloop-nextest-integration.drv
16.00 s
[nix-ci-check-gammaloop-nextest-integration:post-build] Uploading to the NixCI cache: /nix/store/rwvrdk84q33hhw4sg27cqrf12n9h06nc-nix-ci-check-gammaloop-nextest-integration
16.04 s
[nix-ci-check-gammaloop-nextest-integration:post-build] warning: 'warn-short-path-literals' is deprecated, use 'lint-short-path-literals = ignore' instead
16.05 s
[nix-ci-check-gammaloop-nextest-integration:post-build] copying 1 paths...
16.05 s
[nix-ci-check-gammaloop-nextest-integration:post-build] copying path '/nix/store/rwvrdk84q33hhw4sg27cqrf12n9h06nc-nix-ci-check-gammaloop-nextest-integration' to 'https://cache.nix-ci.com'...
16.11 s
[nix-ci-check-gammaloop-nextest-integration:post-build] warning: 'warn-short-path-literals' is deprecated, use 'lint-short-path-literals = ignore' instead
16.28 s
[nix-ci-check-gammaloop-nextest-integration:post-build] copying 0 paths...
16.30 s
Uploaded nix-ci-check-gammaloop-nextest-integration in 306ms
16.30 s
Progress: 2 of 3 built, 1 of 1 downloaded from cache
16.30 s
Built nix-ci-check-gammaloop-nextest-integration in 358ms
16.30 s
Progress: 3 of 3 built, 1 of 1 downloaded from cache
20.71 s
evaluating derivation 'g
copying '/nix/store/msjs
evaluating derivation 'g
copying '/nix/store/msjs
evaluating derivation 'g
copying '/nix/store/msjs
evaluating derivation 'g
copying '/nix/store/msjs
evaluating derivation 'g
querying gammaloop-nexte
[0 /1 built, 0.0 KiB DL]
[1 /0 /1 built, 0.0 KiB DLgammaloop-nextest-integration> Extracting 13 binaries, 1 build script output directory, and 3 linked paths to /build/nextest-archive-Oo48Rf
22.78 s
gammaloop-nextest-integration> Extracted 30 files to /build/nextest-archive-Oo48Rf in 2.08s
22.80 s
gammaloop-nextest-integration> ------------
22.80 s
gammaloop-nextest-integration> Nextest run ID 0d0c8672-4518-4ec7-94f1-f2c6fef7350e with nextest profile: ci_gammaloop
22.80 s
gammaloop-nextest-integration> Starting 152 tests across 13 binaries (208 tests skipped , including 207 tests via profile.ci_gammaloop.default-filter )
338.45 s
gammaloop-nextest-integration> FAIL [ 66.679s] ( 54/152) gammaloop-integration-tests::test_runs aa_aa::important :: aa_aa_local_inspect_backend_consistency
338.45 s
gammaloop-nextest-integration> stdout ---
338.45 s
gammaloop-nextest-integration>
338.45 s
gammaloop-nextest-integration> running 1 test
338.45 s
gammaloop-nextest-integration> test aa_aa::important::aa_aa_local_inspect_backend_consistency has been running for over 60 seconds
338.45 s
gammaloop-nextest-integration> test aa_aa::important::aa_aa_local_inspect_backend_consistency ... FAILED
338.45 s
gammaloop-nextest-integration>
338.45 s
gammaloop-nextest-integration> failures:
338.45 s
gammaloop-nextest-integration>
338.45 s
gammaloop-nextest-integration> failures:
338.45 s
gammaloop-nextest-integration> aa_aa::important::aa_aa_local_inspect_backend_consistency
338.45 s
gammaloop-nextest-integration>
338.45 s
gammaloop-nextest-integration> test result: FAILED. 0 passed; 1 failed; 0 ignored; 0 measured; 258 filtered out; finished in 66.52s
338.45 s
gammaloop-nextest-integration>
338.45 s
gammaloop-nextest-integration> stderr ---
338.45 s
gammaloop-nextest-integration> [2026-09-06 07:46:23.373] @gammaloop_api::se... INFO : Running command import model sm-default.json
338.45 s
gammaloop-nextest-integration> [2026-09-06 07:46:23.373] @import::model INFO : Loading built-in JSON model sm-default
338.45 s
gammaloop-nextest-integration> [2026-09-06 07:46:23.391] @gammalooprs::model INFO : The following 11 external parameters were forced to zero by the restriction card:
338.45 s
gammaloop-nextest-integration> lamWS, AWS, rhoWS, etaWS, ymc, yme, ymm, MC, Me, MM, WTau
338.45 s
gammaloop-nextest-integration> [2026-09-06 07:46:23.391] @gammalooprs::model INFO : The following 34 vertex rules were removed by the restriction card:
338.45 s
gammaloop-nextest-integration> V_82 -> (c~, d, G+) | V_83 -> (t~, d, G+) | V_84 -> (c~, s, G+) | V_85 -> (t~, s, G+) | V_86 -> (u~, b, G+) | V_87 -> (c~, b, G+) | V_90 -> (c~, d, W+) | V_91 -> (t~, d, W+) | V_92 -> (u~, s, W+) | V_94 -> (t~, s, W+) | V_95 -> (u~, b, W+) | V_96 -> (c~, b, W+) | V_101 -> (e+, e-, G0) | V_102 -> (mu+, mu-, G0) | V_104 -> (e+, e-, H) | V_105 -> (mu+, mu-, H) | V_110 -> (ve~, e-, G+) | V_111 -> (vm~, mu-, G+) | V_116 -> (b~, u, G-) | V_117 -> (d~, c, G-) | V_118 -> (s~, c, G-) | V_119 -> (b~, c, G-) | V_120 -> (d~, t, G-) | V_121 -> (s~, t, G-) | V_124 -> (s~, u, W-) | V_125 -> (b~, u, W-) | V_126 -> (d~, c, W-) | V_128 -> (b~, c, W-) | V_129 -> (d~, t, W-) | V_130 -> (s~, t, W-) | V_138 -> (c~, c, G0) | V_140 -> (c~, c, H) | V_145 -> (e+, ve, G-) | V_146 -> (mu+, vm, G-)
338.45 s
gammaloop-nextest-integration> [2026-09-06 07:46:23.391] @gammalooprs::model INFO : The following 36 couplings were removed by the restriction card:
338.45 s
gammaloop-nextest-integration> GC_13, GC_14, GC_16, GC_17, GC_18, GC_19, GC_20, GC_22, GC_23, GC_24, GC_25, GC_26, GC_28, GC_29, GC_42, GC_43, GC_44, GC_46, GC_47, GC_48, GC_84, GC_85, GC_86, GC_87, GC_88, GC_89, GC_90, GC_91, GC_92, GC_93, GC_101, GC_102, GC_103, GC_105, GC_106, GC_107
338.45 s
gammaloop-nextest-integration> [2026-09-06 07:46:23.392] @gammaloop_api::se... INFO : Running command run set_model_parameters
338.45 s
gammaloop-nextest-integration> [2026-09-06 07:46:23.392] @gammaloop_api::se... INFO : Starting command block set_model_parameters
338.45 s
gammaloop-nextest-integration> [2026-09-06 07:46:23.392] @gammaloop_api::se... INFO : Running command set model MT=173.0
338.45 s
gammaloop-nextest-integration> [2026-09-06 07:46:23.395] @gammaloop_api::se... INFO : Running command set model WT=0.0
338.45 s
gammaloop-nextest-integration> [2026-09-06 07:46:23.398] @gammaloop_api::se... INFO : Running command set model ymt=173.0
338.45 s
gammaloop-nextest-integration> [2026-09-06 07:46:23.402] @gammaloop_api::se... INFO : Running command set model aS=0.118
338.45 s
gammaloop-nextest-integration> [2026-09-06 07:46:23.405] @gammaloop_api::se... INFO : Running command set model aEWM1=137.036
338.45 s
gammaloop-nextest-integration> [2026-09-06 07:46:23.408] @gammaloop_api::se... INFO : Running command set model Gf=1.166390e-05
338.45 s
gammaloop-nextest-integration> [2026-09-06 07:46:23.411] @gammaloop_api::se... INFO : Running command set model MZ=91.188
338.45 s
gammaloop-nextest-integration> [2026-09-06 07:46:23.415] @gammaloop_api::se... INFO : Running command set global string '
338.45 s
gammaloop-nextest-integration> [global.generation.compile]
338.45 s
gammaloop-nextest-integration> compilation_mode = "symjit"
338.45 s
gammaloop-nextest-integration> optimization_level = "O0"
338.45 s
gammaloop-nextest-integration> fast_math = false
338.45 s
gammaloop-nextest-integration> [...]
338.45 s
gammaloop-nextest-integration> [2026-09-06 07:46:23.416] @gammaloop_api::se... INFO : Running command import graphs ./examples/cli/aa_aa/1L/aa_aa_1L.dot -p aa_aa_all_helicities -i 1L_ppmm -o
338.45 s
gammaloop-nextest-integration> [2026-09-06 07:46:23.416] @commands::import INFO : Loading graphs from '/build/source/examples/cli/aa_aa/1L/aa_aa_1L.dot'
338.45 s
gammaloop-nextest-integration> [2026-09-06 07:46:23.423] @gammaloop_api::se... INFO : Running command generate existing -p aa_aa_all_helicities
338.45 s
gammaloop-nextest-integration> [2026-09-06 07:46:48.360] @commands::generate INFO :
338.45 s
gammaloop-nextest-integration> Integrand generation summary
338.45 s
gammaloop-nextest-integration> peak RAM 1012.75 MiB | cores 1
338.45 s
gammaloop-nextest-integration> ╭───────────┬───────┬─────────┬──────────────┬─────────────┬────────────────┬───────────────╮
338.45 s
gammaloop-nextest-integration> │ integrand │ graph │ # evals │ expr build │ spenso │ symbolica eval │ compile │
338.45 s
gammaloop-nextest-integration> ├───────────┼───────┼─────────┼──────────────┼─────────────┼────────────────┼───────────────┤
338.45 s
gammaloop-nextest-integration> │ 1L_ppmm │ GL0 │ 13 │ 498ms (5.9% ) │ 1.62s (19% ) │ 5.50s (65% ) │ 842ms (10.0% ) │
338.45 s
gammaloop-nextest-integration> │ 1L_ppmm │ GL2 │ 13 │ 477ms (5.7% ) │ 1.47s (18% ) │ 5.62s (67% ) │ 803ms (9.6% ) │
338.45 s
gammaloop-nextest-integration> │ 1L_ppmm │ GL4 │ 11 │ 463ms (5.8% ) │ 1.37s (17% ) │ 5.43s (68% ) │ 756ms (9.4% ) │
338.45 s
gammaloop-nextest-integration> ├───────────┼───────┼─────────┼──────────────┼─────────────┼────────────────┼───────────────┤
338.45 s
gammaloop-nextest-integration> │ Total │ │ 37 │ 1.44s (5.8% ) │ 4.46s (18% ) │ 16.55s (67% ) │ 2.40s (9.7% ) │
338.45 s
gammaloop-nextest-integration> ╰───────────┴───────┴─────────┴──────────────┴─────────────┴────────────────┴───────────────╯
338.45 s
gammaloop-nextest-integration> [2026-09-06 07:46:48.993] @gammaloop_api::se... INFO : Running command import model sm-default.json
338.45 s
gammaloop-nextest-integration> [2026-09-06 07:46:48.993] @import::model INFO : Loading built-in JSON model sm-default
338.45 s
gammaloop-nextest-integration> [2026-09-06 07:46:49.010] @gammalooprs::model INFO : The following 11 external parameters were forced to zero by the restriction card:
338.45 s
gammaloop-nextest-integration> lamWS, AWS, rhoWS, etaWS, ymc, yme, ymm, MC, Me, MM, WTau
338.45 s
gammaloop-nextest-integration> [2026-09-06 07:46:49.010] @gammalooprs::model INFO : The following 34 vertex rules were removed by the restriction card:
338.45 s
gammaloop-nextest-integration> V_82 -> (c~, d, G+) | V_83 -> (t~, d, G+) | V_84 -> (c~, s, G+) | V_85 -> (t~, s, G+) | V_86 -> (u~, b, G+) | V_87 -> (c~, b, G+) | V_90 -> (c~, d, W+) | V_91 -> (t~, d, W+) | V_92 -> (u~, s, W+) | V_94 -> (t~, s, W+) | V_95 -> (u~, b, W+) | V_96 -> (c~, b, W+) | V_101 -> (e+, e-, G0) | V_102 -> (mu+, mu-, G0) | V_104 -> (e+, e-, H) | V_105 -> (mu+, mu-, H) | V_110 -> (ve~, e-, G+) | V_111 -> (vm~, mu-, G+) | V_116 -> (b~, u, G-) | V_117 -> (d~, c, G-) | V_118 -> (s~, c, G-) | V_119 -> (b~, c, G-) | V_120 -> (d~, t, G-) | V_121 -> (s~, t, G-) | V_124 -> (s~, u, W-) | V_125 -> (b~, u, W-) | V_126 -> (d~, c, W-) | V_128 -> (b~, c, W-) | V_129 -> (d~, t, W-) | V_130 -> (s~, t, W-) | V_138 -> (c~, c, G0) | V_140 -> (c~, c, H) | V_145 -> (e+, ve, G-) | V_146 -> (mu+, vm, G-)
338.45 s
gammaloop-nextest-integration> [2026-09-06 07:46:49.010] @gammalooprs::model INFO : The following 36 couplings were removed by the restriction card:
338.45 s
gammaloop-nextest-integration> GC_13, GC_14, GC_16, GC_17, GC_18, GC_19, GC_20, GC_22, GC_23, GC_24, GC_25, GC_26, GC_28, GC_29, GC_42, GC_43, GC_44, GC_46, GC_47, GC_48, GC_84, GC_85, GC_86, GC_87, GC_88, GC_89, GC_90, GC_91, GC_92, GC_93, GC_101, GC_102, GC_103, GC_105, GC_106, GC_107
338.45 s
gammaloop-nextest-integration> [2026-09-06 07:46:49.011] @gammaloop_api::se... INFO : Running command run set_model_parameters
338.45 s
gammaloop-nextest-integration> [2026-09-06 07:46:49.011] @gammaloop_api::se... INFO : Starting command block set_model_parameters
338.45 s
gammaloop-nextest-integration> [2026-09-06 07:46:49.011] @gammaloop_api::se... INFO : Running command set model MT=173.0
338.45 s
gammaloop-nextest-integration> [2026-09-06 07:46:49.014] @gammaloop_api::se... INFO : Running command set model WT=0.0
338.45 s
gammaloop-nextest-integration> [2026-09-06 07:46:49.017] @gammaloop_api::se... INFO : Running command set model ymt=173.0
338.45 s
gammaloop-nextest-integration> [2026-09-06 07:46:49.020] @gammaloop_api::se... INFO : Running command set model aS=0.118
338.45 s
gammaloop-nextest-integration> [2026-09-06 07:46:49.024] @gammaloop_api::se... INFO : Running command set model aEWM1=137.036
338.45 s
gammaloop-nextest-integration> [2026-09-06 07:46:49.027] @gammaloop_api::se... INFO : Running command set model Gf=1.166390e-05
338.45 s
gammaloop-nextest-integration> [2026-09-06 07:46:49.030] @gammaloop_api::se... INFO : Running command set model MZ=91.188
338.45 s
gammaloop-nextest-integration> [2026-09-06 07:46:49.033] @gammaloop_api::se... INFO : Running command set global string '
338.45 s
gammaloop-nextest-integration> [global.generation.compile]
338.45 s
gammaloop-nextest-integration> compilation_mode = "assembly"
338.45 s
gammaloop-nextest-integration> optimization_level = "O0"
338.45 s
gammaloop-nextest-integration> fast_math = false
338.45 s
gammaloop-nextest-integration> [...]
338.45 s
gammaloop-nextest-integration> [2026-09-06 07:46:49.034] @gammaloop_api::se... INFO : Running command import graphs ./examples/cli/aa_aa/1L/aa_aa_1L.dot -p aa_aa_all_helicities_assembly -i 1L_ppmm -o
338.45 s
gammaloop-nextest-integration> [2026-09-06 07:46:49.034] @commands::import INFO : Loading graphs from '/build/source/examples/cli/aa_aa/1L/aa_aa_1L.dot'
338.45 s
gammaloop-nextest-integration> [2026-09-06 07:46:49.041] @gammaloop_api::se... INFO : Running command generate existing -p aa_aa_all_helicities_assembly
338.45 s
gammaloop-nextest-integration> [2026-09-06 07:47:11.191] @processes::amplitude INFO : Compiling amplitude 1L_ppmm
338.45 s
gammaloop-nextest-integration> [2026-09-06 07:47:28.850] @commands::generate INFO : Removed 34 generated C++ source file(s). Use '--keep-sources ' to keep them.
338.45 s
gammaloop-nextest-integration> [2026-09-06 07:47:28.850] @commands::generate INFO :
338.45 s
gammaloop-nextest-integration> Integrand generation summary
338.45 s
gammaloop-nextest-integration> peak RAM 2.32 GiB | cores 1
338.45 s
gammaloop-nextest-integration> ╭───────────┬───────┬─────────┬──────────────┬─────────────┬────────────────┬──────────────╮
338.45 s
gammaloop-nextest-integration> │ integrand │ graph │ # evals │ expr build │ spenso │ symbolica eval │ compile │
338.45 s
gammaloop-nextest-integration> ├───────────┼───────┼─────────┼──────────────┼─────────────┼────────────────┼──────────────┤
338.45 s
gammaloop-nextest-integration> │ 1L_ppmm │ GL0 │ 13 │ 480ms (3.6% ) │ 1.34s (10% ) │ 5.55s (42% ) │ 5.99s (45% ) │
338.45 s
gammaloop-nextest-integration> │ 1L_ppmm │ GL2 │ 13 │ 475ms (3.5% ) │ 1.50s (11% ) │ 5.42s (40% ) │ 6.29s (46% ) │
338.45 s
gammaloop-nextest-integration> │ 1L_ppmm │ GL4 │ 11 │ 462ms (3.6% ) │ 1.41s (11% ) │ 5.47s (43% ) │ 5.37s (42% ) │
338.45 s
gammaloop-nextest-integration> ├───────────┼───────┼─────────┼──────────────┼─────────────┼────────────────┼──────────────┤
338.45 s
gammaloop-nextest-integration> │ Total │ │ 37 │ 1.42s (3.6% ) │ 4.25s (11% ) │ 16.44s (41% ) │ 17.65s (44% ) │
338.45 s
gammaloop-nextest-integration> ╰───────────┴───────┴─────────┴──────────────┴─────────────┴────────────────┴──────────────╯
338.45 s
gammaloop-nextest-integration> [2026-09-06 07:47:29.455] @gammaloop_api::se... INFO : Running command set process -p aa_aa_all_helicities -i 1L_ppmm string '
338.45 s
gammaloop-nextest-integration> [stability]
338.45 s
gammaloop-nextest-integration> check_on_norm = true
338.45 s
gammaloop-nextest-integration> escalate_if_exact_zero = false
338.45 s
gammaloop-nextest-integration> loop_momenta_norm_escalation_factor = -1.0
338.45 s
gammaloop-nextest-integration> [...]
338.45 s
gammaloop-nextest-integration> [2026-09-06 07:47:29.456] @gammaloop_api::se... INFO : Running command set process -p aa_aa_all_helicities_assembly -i 1L_ppmm string '
338.45 s
gammaloop-nextest-integration> [stability]
338.45 s
gammaloop-nextest-integration> check_on_norm = true
338.45 s
gammaloop-nextest-integration> escalate_if_exact_zero = false
338.45 s
gammaloop-nextest-integration> loop_momenta_norm_escalation_factor = -1.0
338.45 s
gammaloop-nextest-integration> [...]
338.45 s
gammaloop-nextest-integration> [2026-09-06 07:47:29.457] @gammaloop_api::se... INFO : Running command set process -p aa_aa_all_helicities -i 1L_mpmm string '
338.45 s
gammaloop-nextest-integration> [stability]
338.45 s
gammaloop-nextest-integration> check_on_norm = true
338.45 s
gammaloop-nextest-integration> escalate_if_exact_zero = false
338.45 s
gammaloop-nextest-integration> loop_momenta_norm_escalation_factor = -1.0
338.45 s
gammaloop-nextest-integration> [...]
338.45 s
gammaloop-nextest-integration> [2026-09-06 07:47:29.458] @gammaloop_api::se... INFO : Running command set process -p aa_aa_all_helicities_assembly -i 1L_mpmm string '
338.45 s
gammaloop-nextest-integration> [stability]
338.45 s
gammaloop-nextest-integration> check_on_norm = true
338.45 s
gammaloop-nextest-integration> escalate_if_exact_zero = false
338.45 s
gammaloop-nextest-integration> loop_momenta_norm_escalation_factor = -1.0
338.45 s
gammaloop-nextest-integration> [...]
338.45 s
gammaloop-nextest-integration> [2026-09-06 07:47:29.458] @gammaloop_api::se... INFO : Running command set process -p aa_aa_all_helicities -i 1L_mmmm string '
338.45 s
gammaloop-nextest-integration> [stability]
338.45 s
gammaloop-nextest-integration> check_on_norm = true
338.45 s
gammaloop-nextest-integration> escalate_if_exact_zero = false
338.45 s
gammaloop-nextest-integration> loop_momenta_norm_escalation_factor = -1.0
338.45 s
gammaloop-nextest-integration> [...]
338.45 s
gammaloop-nextest-integration> [2026-09-06 07:47:29.459] @gammaloop_api::se... INFO : Running command set process -p aa_aa_all_helicities_assembly -i 1L_mmmm string '
338.45 s
gammaloop-nextest-integration> [stability]
338.45 s
gammaloop-nextest-integration> check_on_norm = true
338.45 s
gammaloop-nextest-integration> escalate_if_exact_zero = false
338.45 s
gammaloop-nextest-integration> loop_momenta_norm_escalation_factor = -1.0
338.45 s
gammaloop-nextest-integration> [...]
338.45 s
gammaloop-nextest-integration> [2026-09-06 07:47:29.460] @gammaloop_api::se... INFO : Running command set process -p aa_aa_all_helicities -i 1L_pmmp string '
338.45 s
gammaloop-nextest-integration> [stability]
338.45 s
gammaloop-nextest-integration> check_on_norm = true
338.45 s
gammaloop-nextest-integration> escalate_if_exact_zero = false
338.45 s
gammaloop-nextest-integration> loop_momenta_norm_escalation_factor = -1.0
338.45 s
gammaloop-nextest-integration> [...]
338.45 s
gammaloop-nextest-integration> [2026-09-06 07:47:29.460] @gammaloop_api::se... INFO : Running command set process -p aa_aa_all_helicities_assembly -i 1L_pmmp string '
338.45 s
gammaloop-nextest-integration> [stability]
338.45 s
gammaloop-nextest-integration> check_on_norm = true
338.45 s
gammaloop-nextest-integration> escalate_if_exact_zero = false
338.45 s
gammaloop-nextest-integration> loop_momenta_norm_escalation_factor = -1.0
338.45 s
gammaloop-nextest-integration> [...]
338.45 s
gammaloop-nextest-integration> [2026-09-06 07:47:29.461] @gammaloop_api::se... INFO : Running command set process -p aa_aa_all_helicities -i 1L_pmpm string '
338.45 s
gammaloop-nextest-integration> [stability]
338.45 s
gammaloop-nextest-integration> check_on_norm = true
338.45 s
gammaloop-nextest-integration> escalate_if_exact_zero = false
338.45 s
gammaloop-nextest-integration> loop_momenta_norm_escalation_factor = -1.0
338.45 s
gammaloop-nextest-integration> [...]
338.45 s
gammaloop-nextest-integration> [2026-09-06 07:47:29.461] @gammaloop_api::se... INFO : Running command set process -p aa_aa_all_helicities_assembly -i 1L_pmpm string '
338.45 s
gammaloop-nextest-integration> [stability]
338.45 s
gammaloop-nextest-integration> check_on_norm = true
338.45 s
gammaloop-nextest-integration> escalate_if_exact_zero = false
338.45 s
gammaloop-nextest-integration> loop_momenta_norm_escalation_factor = -1.0
338.45 s
gammaloop-nextest-integration> [...]
338.45 s
gammaloop-nextest-integration> [2026-09-06 07:47:29.466] @process::amplitude INFO : Input is below threshold: 0 existing threshold E-surfaces across 0/1 graph groups
338.45 s
gammaloop-nextest-integration> [2026-09-06 07:47:29.466] @process::amplitude INFO : overlap structure of group 0: [0: []]
338.45 s
gammaloop-nextest-integration> [2026-09-06 07:47:29.466] @integrands::process [{#im_is_nan, #re_is_nan}] WARNING : final process evaluation is nonfinite
338.45 s
gammaloop-nextest-integration> [2026-09-06 07:47:29.466] @commands::inspect INFO :
338.45 s
gammaloop-nextest-integration> Input point in momentum space:
338.45 s
gammaloop-nextest-integration>
338.45 s
gammaloop-nextest-integration> ( 0.1100000000000000, -0.0700000000000000, 0.1900000000000000 )
338.45 s
gammaloop-nextest-integration>
338.45 s
gammaloop-nextest-integration> The evaluation of integrand '1L_ppmm' is:
338.45 s
gammaloop-nextest-integration>
338.45 s
gammaloop-nextest-integration> ( +0.0000000000000000e0, +0.0000000000000000e0 i)
338.45 s
gammaloop-nextest-integration>
338.45 s
gammaloop-nextest-integration> [2026-09-06 07:47:29.470] @process::amplitude INFO : Input is below threshold: 0 existing threshold E-surfaces across 0/1 graph groups
338.45 s
gammaloop-nextest-integration> [2026-09-06 07:47:29.470] @process::amplitude INFO : overlap structure of group 0: [0: []]
338.45 s
gammaloop-nextest-integration> [2026-09-06 07:47:29.470] @commands::inspect INFO :
338.45 s
gammaloop-nextest-integration> Input point in momentum space:
338.45 s
gammaloop-nextest-integration>
338.45 s
gammaloop-nextest-integration> ( 0.1100000000000000, -0.0700000000000000, 0.1900000000000000 )
338.45 s
gammaloop-nextest-integration>
338.45 s
gammaloop-nextest-integration> The evaluation of integrand '1L_ppmm' is:
338.45 s
gammaloop-nextest-integration>
338.45 s
gammaloop-nextest-integration> ( -1.7132462539328486e-28, -8.7105072229446864e-10 i)
338.45 s
gammaloop-nextest-integration>
338.45 s
gammaloop-nextest-integration> The application panicked (crashed).
338.45 s
gammaloop-nextest-integration> Message: kinematics=a, integrand=1L_ppmm, graph_id=0: assembly vs symjit inspect: actual=(-0.00000000000000000000000000017132462539328486+-0.0000000008710507222944686i), expected=(0+0i), tolerance=0.0000000001
338.45 s
gammaloop-nextest-integration> Location: tests/tests/test_runs/utils.rs :466
338.45 s
gammaloop-nextest-integration>
338.45 s
gammaloop-nextest-integration> ━━━━━━━━━━━━━━━━━━━━━━━━━━━━━━━━━━ BACKTRACE ━━━━━━━━━━━━━━━━━━━━━━━━━━━━━━━━━━━
338.45 s
gammaloop-nextest-integration> 1: <color_eyre[51793ea62743adbd]::config::PanicHook>::panic_report <unknown>
338.45 s
gammaloop-nextest-integration> at <unknown source file> :<unknown line>
338.45 s
gammaloop-nextest-integration> 2: <color_eyre[51793ea62743adbd]::config::PanicHook>::into_panic_hook::{closure#0} <unknown>
338.45 s
gammaloop-nextest-integration> at <unknown source file> :<unknown line>
338.45 s
gammaloop-nextest-integration> 3: std[bcb96dfbba0ab899]::panicking::panic_with_hook <unknown>
338.45 s
gammaloop-nextest-integration> at <unknown source file> :<unknown line>
338.45 s
gammaloop-nextest-integration> 4: std[bcb96dfbba0ab899]::panicking::panic_handler::{closure#0} <unknown>
338.45 s
gammaloop-nextest-integration> at <unknown source file> :<unknown line>
338.45 s
gammaloop-nextest-integration> 5: std[bcb96dfbba0ab899]::sys::backtrace::__rust_end_short_backtrace::<std[bcb96dfbba0ab899]::panicking::panic_handler::{closure#0}, !> <unknown>
338.45 s
gammaloop-nextest-integration> at <unknown source file> :<unknown line>
338.45 s
gammaloop-nextest-integration> 6: __rustc[6c289b9f9c454d21]::rust_begin_unwind <unknown>
338.45 s
gammaloop-nextest-integration> at <unknown source file> :<unknown line>
338.45 s
gammaloop-nextest-integration> 7: core[940e698046960fd5]::panicking::panic_fmt <unknown>
338.45 s
gammaloop-nextest-integration> at <unknown source file> :<unknown line>
338.45 s
gammaloop-nextest-integration> 8: <test_runs[66584badfeb6c7be]::aa_aa::important::aa_aa_local_inspect_backend_consistency::{closure#0} as core[940e698046960fd5]::ops::function::FnOnce<()>>::call_once <unknown>
338.45 s
gammaloop-nextest-integration> at <unknown source file> :<unknown line>
338.45 s
gammaloop-nextest-integration> 9: serial_test[cd99724524a2f1c0]::serial_code_lock::local_serial_core_with_return::<(), eyre[cb2fd339c0c40fca]::Report> <unknown>
338.45 s
gammaloop-nextest-integration> at <unknown source file> :<unknown line>
338.45 s
gammaloop-nextest-integration> 10: <test_runs[66584badfeb6c7be]::aa_aa::important::aa_aa_local_inspect_backend_consistency::{closure#0} as core[940e698046960fd5]::ops::function::FnOnce<()>>::call_once <unknown>
338.45 s
gammaloop-nextest-integration> at <unknown source file> :<unknown line>
338.45 s
gammaloop-nextest-integration> 11: test[75d6903177b1d7e9]::__rust_begin_short_backtrace::<core[940e698046960fd5]::result::Result<(), alloc[2ea6bcb46fca0c42]::string::String>, fn() -> core[940e698046960fd5]::result::Result<(), alloc[2ea6bcb46fca0c42]::string::String>> <unknown>
338.45 s
gammaloop-nextest-integration> at <unknown source file> :<unknown line>
338.45 s
gammaloop-nextest-integration> 12: test[75d6903177b1d7e9]::run_test::{closure#0} <unknown>
338.45 s
gammaloop-nextest-integration> at <unknown source file> :<unknown line>
338.45 s
gammaloop-nextest-integration> 13: std[bcb96dfbba0ab899]::sys::backtrace::__rust_begin_short_backtrace::<test[75d6903177b1d7e9]::run_test::{closure#1}, ()> <unknown>
338.45 s
gammaloop-nextest-integration> at <unknown source file> :<unknown line>
338.45 s
gammaloop-nextest-integration> 14: <std[bcb96dfbba0ab899]::thread::lifecycle::spawn_unchecked<test[75d6903177b1d7e9]::run_test::{closure#1}, ()>::{closure#1} as core[940e698046960fd5]::ops::function::FnOnce<()>>::call_once::{shim:vtable#0} <unknown>
338.45 s
gammaloop-nextest-integration> at <unknown source file> :<unknown line>
338.45 s
gammaloop-nextest-integration> 15: <std[bcb96dfbba0ab899]::sys::thread::unix::Thread>::new::thread_start <unknown>
338.45 s
gammaloop-nextest-integration> at <unknown source file> :<unknown line>
338.45 s
gammaloop-nextest-integration> 16: start_thread <unknown>
338.45 s
gammaloop-nextest-integration> at <unknown source file> :<unknown line>
338.45 s
gammaloop-nextest-integration> 17: __clone3 <unknown>
338.45 s
gammaloop-nextest-integration> at <unknown source file> :<unknown line>
338.45 s
gammaloop-nextest-integration>
338.45 s
gammaloop-nextest-integration> Run with COLORBT_SHOW_HIDDEN=1 environment variable to disable frame filtering.
338.45 s
gammaloop-nextest-integration> Run with RUST_BACKTRACE=full to include source snippets.
338.45 s
gammaloop-nextest-integration>
766.75 s
gammaloop-nextest-integration> ------------
766.75 s
gammaloop-nextest-integration> Summary [ 743.943s] 152 tests run: 151 passed , 1 failed , 208 skipped
766.75 s
gammaloop-nextest-integration> FAIL [ 66.679s] ( 54/152) gammaloop-integration-tests::test_runs aa_aa::important :: aa_aa_local_inspect_backend_consistency
766.75 s
gammaloop-nextest-integration> stdout ---
766.75 s
gammaloop-nextest-integration>
766.75 s
gammaloop-nextest-integration> running 1 test
766.75 s
gammaloop-nextest-integration> test aa_aa::important::aa_aa_local_inspect_backend_consistency has been running for over 60 seconds
766.75 s
gammaloop-nextest-integration> test aa_aa::important::aa_aa_local_inspect_backend_consistency ... FAILED
766.75 s
gammaloop-nextest-integration>
766.75 s
gammaloop-nextest-integration> failures:
766.75 s
gammaloop-nextest-integration>
766.75 s
gammaloop-nextest-integration> failures:
766.75 s
gammaloop-nextest-integration> aa_aa::important::aa_aa_local_inspect_backend_consistency
766.75 s
gammaloop-nextest-integration>
766.75 s
gammaloop-nextest-integration> test result: FAILED. 0 passed; 1 failed; 0 ignored; 0 measured; 258 filtered out; finished in 66.52s
766.75 s
gammaloop-nextest-integration>
766.75 s
gammaloop-nextest-integration> stderr ---
766.75 s
gammaloop-nextest-integration> [2026-09-06 07:46:23.373] @gammaloop_api::se... INFO : Running command import model sm-default.json
766.75 s
gammaloop-nextest-integration> [2026-09-06 07:46:23.373] @import::model INFO : Loading built-in JSON model sm-default
766.75 s
gammaloop-nextest-integration> [2026-09-06 07:46:23.391] @gammalooprs::model INFO : The following 11 external parameters were forced to zero by the restriction card:
766.75 s
gammaloop-nextest-integration> lamWS, AWS, rhoWS, etaWS, ymc, yme, ymm, MC, Me, MM, WTau
766.75 s
gammaloop-nextest-integration> [2026-09-06 07:46:23.391] @gammalooprs::model INFO : The following 34 vertex rules were removed by the restriction card:
766.75 s
gammaloop-nextest-integration> V_82 -> (c~, d, G+) | V_83 -> (t~, d, G+) | V_84 -> (c~, s, G+) | V_85 -> (t~, s, G+) | V_86 -> (u~, b, G+) | V_87 -> (c~, b, G+) | V_90 -> (c~, d, W+) | V_91 -> (t~, d, W+) | V_92 -> (u~, s, W+) | V_94 -> (t~, s, W+) | V_95 -> (u~, b, W+) | V_96 -> (c~, b, W+) | V_101 -> (e+, e-, G0) | V_102 -> (mu+, mu-, G0) | V_104 -> (e+, e-, H) | V_105 -> (mu+, mu-, H) | V_110 -> (ve~, e-, G+) | V_111 -> (vm~, mu-, G+) | V_116 -> (b~, u, G-) | V_117 -> (d~, c, G-) | V_118 -> (s~, c, G-) | V_119 -> (b~, c, G-) | V_120 -> (d~, t, G-) | V_121 -> (s~, t, G-) | V_124 -> (s~, u, W-) | V_125 -> (b~, u, W-) | V_126 -> (d~, c, W-) | V_128 -> (b~, c, W-) | V_129 -> (d~, t, W-) | V_130 -> (s~, t, W-) | V_138 -> (c~, c, G0) | V_140 -> (c~, c, H) | V_145 -> (e+, ve, G-) | V_146 -> (mu+, vm, G-)
766.75 s
gammaloop-nextest-integration> [2026-09-06 07:46:23.391] @gammalooprs::model INFO : The following 36 couplings were removed by the restriction card:
766.75 s
gammaloop-nextest-integration> GC_13, GC_14, GC_16, GC_17, GC_18, GC_19, GC_20, GC_22, GC_23, GC_24, GC_25, GC_26, GC_28, GC_29, GC_42, GC_43, GC_44, GC_46, GC_47, GC_48, GC_84, GC_85, GC_86, GC_87, GC_88, GC_89, GC_90, GC_91, GC_92, GC_93, GC_101, GC_102, GC_103, GC_105, GC_106, GC_107
766.75 s
gammaloop-nextest-integration> [2026-09-06 07:46:23.392] @gammaloop_api::se... INFO : Running command run set_model_parameters
766.75 s
gammaloop-nextest-integration> [2026-09-06 07:46:23.392] @gammaloop_api::se... INFO : Starting command block set_model_parameters
766.75 s
gammaloop-nextest-integration> [2026-09-06 07:46:23.392] @gammaloop_api::se... INFO : Running command set model MT=173.0
766.75 s
gammaloop-nextest-integration> [2026-09-06 07:46:23.395] @gammaloop_api::se... INFO : Running command set model WT=0.0
766.75 s
gammaloop-nextest-integration> [2026-09-06 07:46:23.398] @gammaloop_api::se... INFO : Running command set model ymt=173.0
766.75 s
gammaloop-nextest-integration> [2026-09-06 07:46:23.402] @gammaloop_api::se... INFO : Running command set model aS=0.118
766.75 s
gammaloop-nextest-integration> [2026-09-06 07:46:23.405] @gammaloop_api::se... INFO : Running command set model aEWM1=137.036
766.75 s
gammaloop-nextest-integration> [2026-09-06 07:46:23.408] @gammaloop_api::se... INFO : Running command set model Gf=1.166390e-05
766.75 s
gammaloop-nextest-integration> [2026-09-06 07:46:23.411] @gammaloop_api::se... INFO : Running command set model MZ=91.188
766.75 s
gammaloop-nextest-integration> [2026-09-06 07:46:23.415] @gammaloop_api::se... INFO : Running command set global string '
766.75 s
gammaloop-nextest-integration> [global.generation.compile]
766.75 s
gammaloop-nextest-integration> compilation_mode = "symjit"
766.75 s
gammaloop-nextest-integration> optimization_level = "O0"
766.75 s
gammaloop-nextest-integration> fast_math = false
766.75 s
gammaloop-nextest-integration> [...]
766.75 s
gammaloop-nextest-integration> [2026-09-06 07:46:23.416] @gammaloop_api::se... INFO : Running command import graphs ./examples/cli/aa_aa/1L/aa_aa_1L.dot -p aa_aa_all_helicities -i 1L_ppmm -o
766.75 s
gammaloop-nextest-integration> [2026-09-06 07:46:23.416] @commands::import INFO : Loading graphs from '/build/source/examples/cli/aa_aa/1L/aa_aa_1L.dot'
766.75 s
gammaloop-nextest-integration> [2026-09-06 07:46:23.423] @gammaloop_api::se... INFO : Running command generate existing -p aa_aa_all_helicities
766.75 s
gammaloop-nextest-integration> [2026-09-06 07:46:48.360] @commands::generate INFO :
766.75 s
gammaloop-nextest-integration> Integrand generation summary
766.75 s
gammaloop-nextest-integration> peak RAM 1012.75 MiB | cores 1
766.75 s
gammaloop-nextest-integration> ╭───────────┬───────┬─────────┬──────────────┬─────────────┬────────────────┬───────────────╮
766.75 s
gammaloop-nextest-integration> │ integrand │ graph │ # evals │ expr build │ spenso │ symbolica eval │ compile │
766.75 s
gammaloop-nextest-integration> ├───────────┼───────┼─────────┼──────────────┼─────────────┼────────────────┼───────────────┤
766.75 s
gammaloop-nextest-integration> │ 1L_ppmm │ GL0 │ 13 │ 498ms (5.9% ) │ 1.62s (19% ) │ 5.50s (65% ) │ 842ms (10.0% ) │
766.75 s
gammaloop-nextest-integration> │ 1L_ppmm │ GL2 │ 13 │ 477ms (5.7% ) │ 1.47s (18% ) │ 5.62s (67% ) │ 803ms (9.6% ) │
766.75 s
gammaloop-nextest-integration> │ 1L_ppmm │ GL4 │ 11 │ 463ms (5.8% ) │ 1.37s (17% ) │ 5.43s (68% ) │ 756ms (9.4% ) │
766.75 s
gammaloop-nextest-integration> ├───────────┼───────┼─────────┼──────────────┼─────────────┼────────────────┼───────────────┤
766.75 s
gammaloop-nextest-integration> │ Total │ │ 37 │ 1.44s (5.8% ) │ 4.46s (18% ) │ 16.55s (67% ) │ 2.40s (9.7% ) │
766.75 s
gammaloop-nextest-integration> ╰───────────┴───────┴─────────┴──────────────┴─────────────┴────────────────┴───────────────╯
766.75 s
gammaloop-nextest-integration> [2026-09-06 07:46:48.993] @gammaloop_api::se... INFO : Running command import model sm-default.json
766.75 s
gammaloop-nextest-integration> [2026-09-06 07:46:48.993] @import::model INFO : Loading built-in JSON model sm-default
766.75 s
gammaloop-nextest-integration> [2026-09-06 07:46:49.010] @gammalooprs::model INFO : The following 11 external parameters were forced to zero by the restriction card:
766.75 s
gammaloop-nextest-integration> lamWS, AWS, rhoWS, etaWS, ymc, yme, ymm, MC, Me, MM, WTau
766.75 s
gammaloop-nextest-integration> [2026-09-06 07:46:49.010] @gammalooprs::model INFO : The following 34 vertex rules were removed by the restriction card:
766.75 s
gammaloop-nextest-integration> V_82 -> (c~, d, G+) | V_83 -> (t~, d, G+) | V_84 -> (c~, s, G+) | V_85 -> (t~, s, G+) | V_86 -> (u~, b, G+) | V_87 -> (c~, b, G+) | V_90 -> (c~, d, W+) | V_91 -> (t~, d, W+) | V_92 -> (u~, s, W+) | V_94 -> (t~, s, W+) | V_95 -> (u~, b, W+) | V_96 -> (c~, b, W+) | V_101 -> (e+, e-, G0) | V_102 -> (mu+, mu-, G0) | V_104 -> (e+, e-, H) | V_105 -> (mu+, mu-, H) | V_110 -> (ve~, e-, G+) | V_111 -> (vm~, mu-, G+) | V_116 -> (b~, u, G-) | V_117 -> (d~, c, G-) | V_118 -> (s~, c, G-) | V_119 -> (b~, c, G-) | V_120 -> (d~, t, G-) | V_121 -> (s~, t, G-) | V_124 -> (s~, u, W-) | V_125 -> (b~, u, W-) | V_126 -> (d~, c, W-) | V_128 -> (b~, c, W-) | V_129 -> (d~, t, W-) | V_130 -> (s~, t, W-) | V_138 -> (c~, c, G0) | V_140 -> (c~, c, H) | V_145 -> (e+, ve, G-) | V_146 -> (mu+, vm, G-)
766.75 s
gammaloop-nextest-integration> [2026-09-06 07:46:49.010] @gammalooprs::model INFO : The following 36 couplings were removed by the restriction card:
766.75 s
gammaloop-nextest-integration> GC_13, GC_14, GC_16, GC_17, GC_18, GC_19, GC_20, GC_22, GC_23, GC_24, GC_25, GC_26, GC_28, GC_29, GC_42, GC_43, GC_44, GC_46, GC_47, GC_48, GC_84, GC_85, GC_86, GC_87, GC_88, GC_89, GC_90, GC_91, GC_92, GC_93, GC_101, GC_102, GC_103, GC_105, GC_106, GC_107
766.75 s
gammaloop-nextest-integration> [2026-09-06 07:46:49.011] @gammaloop_api::se... INFO : Running command run set_model_parameters
766.75 s
gammaloop-nextest-integration> [2026-09-06 07:46:49.011] @gammaloop_api::se... INFO : Starting command block set_model_parameters
766.75 s
gammaloop-nextest-integration> [2026-09-06 07:46:49.011] @gammaloop_api::se... INFO : Running command set model MT=173.0
766.75 s
gammaloop-nextest-integration> [2026-09-06 07:46:49.014] @gammaloop_api::se... INFO : Running command set model WT=0.0
766.75 s
gammaloop-nextest-integration> [2026-09-06 07:46:49.017] @gammaloop_api::se... INFO : Running command set model ymt=173.0
766.75 s
gammaloop-nextest-integration> [2026-09-06 07:46:49.020] @gammaloop_api::se... INFO : Running command set model aS=0.118
766.75 s
gammaloop-nextest-integration> [2026-09-06 07:46:49.024] @gammaloop_api::se... INFO : Running command set model aEWM1=137.036
766.75 s
gammaloop-nextest-integration> [2026-09-06 07:46:49.027] @gammaloop_api::se... INFO : Running command set model Gf=1.166390e-05
766.75 s
gammaloop-nextest-integration> [2026-09-06 07:46:49.030] @gammaloop_api::se... INFO : Running command set model MZ=91.188
766.75 s
gammaloop-nextest-integration> [2026-09-06 07:46:49.033] @gammaloop_api::se... INFO : Running command set global string '
766.75 s
gammaloop-nextest-integration> [global.generation.compile]
766.75 s
gammaloop-nextest-integration> compilation_mode = "assembly"
766.75 s
gammaloop-nextest-integration> optimization_level = "O0"
766.75 s
gammaloop-nextest-integration> fast_math = false
766.75 s
gammaloop-nextest-integration> [...]
766.75 s
gammaloop-nextest-integration> [2026-09-06 07:46:49.034] @gammaloop_api::se... INFO : Running command import graphs ./examples/cli/aa_aa/1L/aa_aa_1L.dot -p aa_aa_all_helicities_assembly -i 1L_ppmm -o
766.75 s
gammaloop-nextest-integration> [2026-09-06 07:46:49.034] @commands::import INFO : Loading graphs from '/build/source/examples/cli/aa_aa/1L/aa_aa_1L.dot'
766.75 s
gammaloop-nextest-integration> [2026-09-06 07:46:49.041] @gammaloop_api::se... INFO : Running command generate existing -p aa_aa_all_helicities_assembly
766.75 s
gammaloop-nextest-integration> [2026-09-06 07:47:11.191] @processes::amplitude INFO : Compiling amplitude 1L_ppmm
766.75 s
gammaloop-nextest-integration> [2026-09-06 07:47:28.850] @commands::generate INFO : Removed 34 generated C++ source file(s). Use '--keep-sources ' to keep them.
766.75 s
gammaloop-nextest-integration> [2026-09-06 07:47:28.850] @commands::generate INFO :
766.75 s
gammaloop-nextest-integration> Integrand generation summary
766.75 s
gammaloop-nextest-integration> peak RAM 2.32 GiB | cores 1
766.75 s
gammaloop-nextest-integration> ╭───────────┬───────┬─────────┬──────────────┬─────────────┬────────────────┬──────────────╮
766.75 s
gammaloop-nextest-integration> │ integrand │ graph │ # evals │ expr build │ spenso │ symbolica eval │ compile │
766.75 s
gammaloop-nextest-integration> ├───────────┼───────┼─────────┼──────────────┼─────────────┼────────────────┼──────────────┤
766.75 s
gammaloop-nextest-integration> │ 1L_ppmm │ GL0 │ 13 │ 480ms (3.6% ) │ 1.34s (10% ) │ 5.55s (42% ) │ 5.99s (45% ) │
766.75 s
gammaloop-nextest-integration> │ 1L_ppmm │ GL2 │ 13 │ 475ms (3.5% ) │ 1.50s (11% ) │ 5.42s (40% ) │ 6.29s (46% ) │
766.75 s
gammaloop-nextest-integration> │ 1L_ppmm │ GL4 │ 11 │ 462ms (3.6% ) │ 1.41s (11% ) │ 5.47s (43% ) │ 5.37s (42% ) │
766.75 s
gammaloop-nextest-integration> ├───────────┼───────┼─────────┼──────────────┼─────────────┼────────────────┼──────────────┤
766.75 s
gammaloop-nextest-integration> │ Total │ │ 37 │ 1.42s (3.6% ) │ 4.25s (11% ) │ 16.44s (41% ) │ 17.65s (44% ) │
766.75 s
gammaloop-nextest-integration> ╰───────────┴───────┴─────────┴──────────────┴─────────────┴────────────────┴──────────────╯
766.75 s
gammaloop-nextest-integration> [2026-09-06 07:47:29.455] @gammaloop_api::se... INFO : Running command set process -p aa_aa_all_helicities -i 1L_ppmm string '
766.75 s
gammaloop-nextest-integration> [stability]
766.75 s
gammaloop-nextest-integration> check_on_norm = true
766.75 s
gammaloop-nextest-integration> escalate_if_exact_zero = false
766.75 s
gammaloop-nextest-integration> loop_momenta_norm_escalation_factor = -1.0
766.75 s
gammaloop-nextest-integration> [...]
766.75 s
gammaloop-nextest-integration> [2026-09-06 07:47:29.456] @gammaloop_api::se... INFO : Running command set process -p aa_aa_all_helicities_assembly -i 1L_ppmm string '
766.75 s
gammaloop-nextest-integration> [stability]
766.75 s
gammaloop-nextest-integration> check_on_norm = true
766.75 s
gammaloop-nextest-integration> escalate_if_exact_zero = false
766.75 s
gammaloop-nextest-integration> loop_momenta_norm_escalation_factor = -1.0
766.75 s
gammaloop-nextest-integration> [...]
766.75 s
gammaloop-nextest-integration> [2026-09-06 07:47:29.457] @gammaloop_api::se... INFO : Running command set process -p aa_aa_all_helicities -i 1L_mpmm string '
766.75 s
gammaloop-nextest-integration> [stability]
766.75 s
gammaloop-nextest-integration> check_on_norm = true
766.75 s
gammaloop-nextest-integration> escalate_if_exact_zero = false
766.75 s
gammaloop-nextest-integration> loop_momenta_norm_escalation_factor = -1.0
766.75 s
gammaloop-nextest-integration> [...]
766.75 s
gammaloop-nextest-integration> [2026-09-06 07:47:29.458] @gammaloop_api::se... INFO : Running command set process -p aa_aa_all_helicities_assembly -i 1L_mpmm string '
766.75 s
gammaloop-nextest-integration> [stability]
766.75 s
gammaloop-nextest-integration> check_on_norm = true
766.75 s
gammaloop-nextest-integration> escalate_if_exact_zero = false
766.75 s
gammaloop-nextest-integration> loop_momenta_norm_escalation_factor = -1.0
766.75 s
gammaloop-nextest-integration> [...]
766.75 s
gammaloop-nextest-integration> [2026-09-06 07:47:29.458] @gammaloop_api::se... INFO : Running command set process -p aa_aa_all_helicities -i 1L_mmmm string '
766.75 s
gammaloop-nextest-integration> [stability]
766.75 s
gammaloop-nextest-integration> check_on_norm = true
766.75 s
gammaloop-nextest-integration> escalate_if_exact_zero = false
766.75 s
gammaloop-nextest-integration> loop_momenta_norm_escalation_factor = -1.0
766.75 s
gammaloop-nextest-integration> [...]
766.75 s
gammaloop-nextest-integration> [2026-09-06 07:47:29.459] @gammaloop_api::se... INFO : Running command set process -p aa_aa_all_helicities_assembly -i 1L_mmmm string '
766.75 s
gammaloop-nextest-integration> [stability]
766.75 s
gammaloop-nextest-integration> check_on_norm = true
766.75 s
gammaloop-nextest-integration> escalate_if_exact_zero = false
766.75 s
gammaloop-nextest-integration> loop_momenta_norm_escalation_factor = -1.0
766.75 s
gammaloop-nextest-integration> [...]
766.75 s
gammaloop-nextest-integration> [2026-09-06 07:47:29.460] @gammaloop_api::se... INFO : Running command set process -p aa_aa_all_helicities -i 1L_pmmp string '
766.75 s
gammaloop-nextest-integration> [stability]
766.75 s
gammaloop-nextest-integration> check_on_norm = true
766.75 s
gammaloop-nextest-integration> escalate_if_exact_zero = false
766.75 s
gammaloop-nextest-integration> loop_momenta_norm_escalation_factor = -1.0
766.75 s
gammaloop-nextest-integration> [...]
766.75 s
gammaloop-nextest-integration> [2026-09-06 07:47:29.460] @gammaloop_api::se... INFO : Running command set process -p aa_aa_all_helicities_assembly -i 1L_pmmp string '
766.75 s
gammaloop-nextest-integration> [stability]
766.75 s
gammaloop-nextest-integration> check_on_norm = true
766.75 s
gammaloop-nextest-integration> escalate_if_exact_zero = false
766.75 s
gammaloop-nextest-integration> loop_momenta_norm_escalation_factor = -1.0
766.75 s
gammaloop-nextest-integration> [...]
766.75 s
gammaloop-nextest-integration> [2026-09-06 07:47:29.461] @gammaloop_api::se... INFO : Running command set process -p aa_aa_all_helicities -i 1L_pmpm string '
766.75 s
gammaloop-nextest-integration> [stability]
766.75 s
gammaloop-nextest-integration> check_on_norm = true
766.75 s
gammaloop-nextest-integration> escalate_if_exact_zero = false
766.75 s
gammaloop-nextest-integration> loop_momenta_norm_escalation_factor = -1.0
766.75 s
gammaloop-nextest-integration> [...]
766.75 s
gammaloop-nextest-integration> [2026-09-06 07:47:29.461] @gammaloop_api::se... INFO : Running command set process -p aa_aa_all_helicities_assembly -i 1L_pmpm string '
766.75 s
gammaloop-nextest-integration> [stability]
766.75 s
gammaloop-nextest-integration> check_on_norm = true
766.75 s
gammaloop-nextest-integration> escalate_if_exact_zero = false
766.75 s
gammaloop-nextest-integration> loop_momenta_norm_escalation_factor = -1.0
766.75 s
gammaloop-nextest-integration> [...]
766.75 s
gammaloop-nextest-integration> [2026-09-06 07:47:29.466] @process::amplitude INFO : Input is below threshold: 0 existing threshold E-surfaces across 0/1 graph groups
766.75 s
gammaloop-nextest-integration> [2026-09-06 07:47:29.466] @process::amplitude INFO : overlap structure of group 0: [0: []]
766.75 s
gammaloop-nextest-integration> [2026-09-06 07:47:29.466] @integrands::process [{#im_is_nan, #re_is_nan}] WARNING : final process evaluation is nonfinite
766.75 s
gammaloop-nextest-integration> [2026-09-06 07:47:29.466] @commands::inspect INFO :
766.75 s
gammaloop-nextest-integration> Input point in momentum space:
766.75 s
gammaloop-nextest-integration>
766.75 s
gammaloop-nextest-integration> ( 0.1100000000000000, -0.0700000000000000, 0.1900000000000000 )
766.75 s
gammaloop-nextest-integration>
766.75 s
gammaloop-nextest-integration> The evaluation of integrand '1L_ppmm' is:
766.75 s
gammaloop-nextest-integration>
766.75 s
gammaloop-nextest-integration> ( +0.0000000000000000e0, +0.0000000000000000e0 i)
766.75 s
gammaloop-nextest-integration>
766.75 s
gammaloop-nextest-integration> [2026-09-06 07:47:29.470] @process::amplitude INFO : Input is below threshold: 0 existing threshold E-surfaces across 0/1 graph groups
766.75 s
gammaloop-nextest-integration> [2026-09-06 07:47:29.470] @process::amplitude INFO : overlap structure of group 0: [0: []]
766.75 s
gammaloop-nextest-integration> [2026-09-06 07:47:29.470] @commands::inspect INFO :
766.75 s
gammaloop-nextest-integration> Input point in momentum space:
766.75 s
gammaloop-nextest-integration>
766.75 s
gammaloop-nextest-integration> ( 0.1100000000000000, -0.0700000000000000, 0.1900000000000000 )
766.75 s
gammaloop-nextest-integration>
766.75 s
gammaloop-nextest-integration> The evaluation of integrand '1L_ppmm' is:
766.75 s
gammaloop-nextest-integration>
766.75 s
gammaloop-nextest-integration> ( -1.7132462539328486e-28, -8.7105072229446864e-10 i)
766.75 s
gammaloop-nextest-integration>
766.75 s
gammaloop-nextest-integration> The application panicked (crashed).
766.75 s
gammaloop-nextest-integration> Message: kinematics=a, integrand=1L_ppmm, graph_id=0: assembly vs symjit inspect: actual=(-0.00000000000000000000000000017132462539328486+-0.0000000008710507222944686i), expected=(0+0i), tolerance=0.0000000001
766.75 s
gammaloop-nextest-integration> Location: tests/tests/test_runs/utils.rs :466
766.75 s
gammaloop-nextest-integration>
766.75 s
gammaloop-nextest-integration> ━━━━━━━━━━━━━━━━━━━━━━━━━━━━━━━━━━ BACKTRACE ━━━━━━━━━━━━━━━━━━━━━━━━━━━━━━━━━━━
766.75 s
gammaloop-nextest-integration> 1: <color_eyre[51793ea62743adbd]::config::PanicHook>::panic_report <unknown>
766.75 s
gammaloop-nextest-integration> at <unknown source file> :<unknown line>
766.75 s
gammaloop-nextest-integration> 2: <color_eyre[51793ea62743adbd]::config::PanicHook>::into_panic_hook::{closure#0} <unknown>
766.75 s
gammaloop-nextest-integration> at <unknown source file> :<unknown line>
766.75 s
gammaloop-nextest-integration> 3: std[bcb96dfbba0ab899]::panicking::panic_with_hook <unknown>
766.75 s
gammaloop-nextest-integration> at <unknown source file> :<unknown line>
766.75 s
gammaloop-nextest-integration> 4: std[bcb96dfbba0ab899]::panicking::panic_handler::{closure#0} <unknown>
766.75 s
gammaloop-nextest-integration> at <unknown source file> :<unknown line>
766.75 s
gammaloop-nextest-integration> 5: std[bcb96dfbba0ab899]::sys::backtrace::__rust_end_short_backtrace::<std[bcb96dfbba0ab899]::panicking::panic_handler::{closure#0}, !> <unknown>
766.75 s
gammaloop-nextest-integration> at <unknown source file> :<unknown line>
766.75 s
gammaloop-nextest-integration> 6: __rustc[6c289b9f9c454d21]::rust_begin_unwind <unknown>
766.75 s
gammaloop-nextest-integration> at <unknown source file> :<unknown line>
766.75 s
gammaloop-nextest-integration> 7: core[940e698046960fd5]::panicking::panic_fmt <unknown>
766.75 s
gammaloop-nextest-integration> at <unknown source file> :<unknown line>
766.75 s
gammaloop-nextest-integration> 8: <test_runs[66584badfeb6c7be]::aa_aa::important::aa_aa_local_inspect_backend_consistency::{closure#0} as core[940e698046960fd5]::ops::function::FnOnce<()>>::call_once <unknown>
766.75 s
gammaloop-nextest-integration> at <unknown source file> :<unknown line>
766.75 s
gammaloop-nextest-integration> 9: serial_test[cd99724524a2f1c0]::serial_code_lock::local_serial_core_with_return::<(), eyre[cb2fd339c0c40fca]::Report> <unknown>
766.75 s
gammaloop-nextest-integration> at <unknown source file> :<unknown line>
766.75 s
gammaloop-nextest-integration> 10: <test_runs[66584badfeb6c7be]::aa_aa::important::aa_aa_local_inspect_backend_consistency::{closure#0} as core[940e698046960fd5]::ops::function::FnOnce<()>>::call_once <unknown>
766.75 s
gammaloop-nextest-integration> at <unknown source file> :<unknown line>
766.75 s
gammaloop-nextest-integration> 11: test[75d6903177b1d7e9]::__rust_begin_short_backtrace::<core[940e698046960fd5]::result::Result<(), alloc[2ea6bcb46fca0c42]::string::String>, fn() -> core[940e698046960fd5]::result::Result<(), alloc[2ea6bcb46fca0c42]::string::String>> <unknown>
766.75 s
gammaloop-nextest-integration> at <unknown source file> :<unknown line>
766.75 s
gammaloop-nextest-integration> 12: test[75d6903177b1d7e9]::run_test::{closure#0} <unknown>
766.75 s
gammaloop-nextest-integration> at <unknown source file> :<unknown line>
766.75 s
gammaloop-nextest-integration> 13: std[bcb96dfbba0ab899]::sys::backtrace::__rust_begin_short_backtrace::<test[75d6903177b1d7e9]::run_test::{closure#1}, ()> <unknown>
766.75 s
gammaloop-nextest-integration> at <unknown source file> :<unknown line>
766.75 s
gammaloop-nextest-integration> 14: <std[bcb96dfbba0ab899]::thread::lifecycle::spawn_unchecked<test[75d6903177b1d7e9]::run_test::{closure#1}, ()>::{closure#1} as core[940e698046960fd5]::ops::function::FnOnce<()>>::call_once::{shim:vtable#0} <unknown>
766.75 s
gammaloop-nextest-integration> at <unknown source file> :<unknown line>
766.75 s
gammaloop-nextest-integration> 15: <std[bcb96dfbba0ab899]::sys::thread::unix::Thread>::new::thread_start <unknown>
766.75 s
gammaloop-nextest-integration> at <unknown source file> :<unknown line>
766.75 s
gammaloop-nextest-integration> 16: start_thread <unknown>
766.75 s
gammaloop-nextest-integration> at <unknown source file> :<unknown line>
766.75 s
gammaloop-nextest-integration> 17: __clone3 <unknown>
766.75 s
gammaloop-nextest-integration> at <unknown source file> :<unknown line>
766.75 s
gammaloop-nextest-integration>
766.75 s
gammaloop-nextest-integration> Run with COLORBT_SHOW_HIDDEN=1 environment variable to disable frame filtering.
766.75 s
gammaloop-nextest-integration> Run with RUST_BACKTRACE=full to include source snippets.
766.75 s
gammaloop-nextest-integration>
767.01 s
gammaloop-nextest-integration> error : test run failed
767.04 s
gammaloop-nextest-integration>
767.04 s
gammaloop-nextest-integration> ========== nextest test summary ==========
767.04 s
gammaloop-nextest-integration> report: target/nextest/ci_gammaloop/junit.xml
767.04 s
gammaloop-nextest-integration> tests: 152, failures: 1, errors: 0
767.04 s
gammaloop-nextest-integration>
767.04 s
gammaloop-nextest-integration> 1. gammaloop-integration-tests::test_runs::aa_aa::important::aa_aa_local_inspect_backend_consistency
767.04 s
gammaloop-nextest-integration> failure: test failure with exit code 101
767.04 s
gammaloop-nextest-integration> system-out
767.04 s
gammaloop-nextest-integration> running 1 test
767.04 s
gammaloop-nextest-integration> test aa_aa::important::aa_aa_local_inspect_backend_consistency has been running for over 60 seconds
767.04 s
gammaloop-nextest-integration> test aa_aa::important::aa_aa_local_inspect_backend_consistency ... FAILED
767.04 s
gammaloop-nextest-integration>
767.04 s
gammaloop-nextest-integration> failures:
767.04 s
gammaloop-nextest-integration>
767.04 s
gammaloop-nextest-integration> failures:
767.04 s
gammaloop-nextest-integration> aa_aa::important::aa_aa_local_inspect_backend_consistency
767.04 s
gammaloop-nextest-integration>
767.04 s
gammaloop-nextest-integration> test result: FAILED. 0 passed; 1 failed; 0 ignored; 0 measured; 258 filtered out; finished in 66.52s
767.04 s
gammaloop-nextest-integration> system-err
767.04 s
gammaloop-nextest-integration> [2026-09-06 07:46:23.373] @gammaloop_api::se... INFO : Running command import model sm-default.json
767.04 s
gammaloop-nextest-integration> [2026-09-06 07:46:23.373] @import::model INFO : Loading built-in JSON model sm-default
767.04 s
gammaloop-nextest-integration> [2026-09-06 07:46:23.391] @gammalooprs::model INFO : The following 11 external parameters were forced to zero by the restriction card:
767.04 s
gammaloop-nextest-integration> lamWS, AWS, rhoWS, etaWS, ymc, yme, ymm, MC, Me, MM, WTau
767.04 s
gammaloop-nextest-integration> [2026-09-06 07:46:23.391] @gammalooprs::model INFO : The following 34 vertex rules were removed by the restriction card:
767.04 s
gammaloop-nextest-integration> V_82 -> (c~, d, G+) | V_83 -> (t~, d, G+) | V_84 -> (c~, s, G+) | V_85 -> (t~, s, G+) | V_86 -> (u~, b, G+) | V_87 -> (c~, b, G+) | V_90 -> (c~, d, W+) | V_91 -> (t~, d, W+) | V_92 -> (u~, s, W+) | V_94 -> (t~, s, W+) | V_95 -> (u~, b, W+) | V_96 -> (c~, b, W+) | V_101 -> (e+, e-, G0) | V_102 -> (mu+, mu-, G0) | V_104 -> (e+, e-, H) | V_105 -> (mu+, mu-, H) | V_110 -> (ve~, e-, G+) | V_111 -> (vm~, mu-, G+) | V_116 -> (b~, u, G-) | V_117 -> (d~, c, G-) | V_118 -> (s~, c, G-) | V_119 -> (b~, c, G-) | V_120 -> (d~, t, G-) | V_121 -> (s~, t, G-) | V_124 -> (s~, u, W-) | V_125 -> (b~, u, W-) | V_126 -> (d~, c, W-) | V_128 -> (b~, c, W-) | V_129 -> (d~, t, W-) | V_130 -> (s~, t, W-) | V_138 -> (c~, c, G0) | V_140 -> (c~, c, H) | V_145 -> (e+, ve, G-) | V_146 -> (mu+, vm, G-)
767.04 s
gammaloop-nextest-integration> [2026-09-06 07:46:23.391] @gammalooprs::model INFO : The following 36 couplings were removed by the restriction card:
767.04 s
gammaloop-nextest-integration> GC_13, GC_14, GC_16, GC_17, GC_18, GC_19, GC_20, GC_22, GC_23, GC_24, GC_25, GC_26, GC_28, GC_29, GC_42, GC_43, GC_44, GC_46, GC_47, GC_48, GC_84, GC_85, GC_86, GC_87, GC_88, GC_89, GC_90, GC_91, GC_92, GC_93, GC_101, GC_102, GC_103, GC_105, GC_106, GC_107
767.04 s
gammaloop-nextest-integration> [2026-09-06 07:46:23.392] @gammaloop_api::se... INFO : Running command run set_model_parameters
767.04 s
gammaloop-nextest-integration> [2026-09-06 07:46:23.392] @gammaloop_api::se... INFO : Starting command block set_model_parameters
767.04 s
gammaloop-nextest-integration> [2026-09-06 07:46:23.392] @gammaloop_api::se... INFO : Running command set model MT=173.0
767.04 s
gammaloop-nextest-integration> [2026-09-06 07:46:23.395] @gammaloop_api::se... INFO : Running command set model WT=0.0
767.04 s
gammaloop-nextest-integration> [2026-09-06 07:46:23.398] @gammaloop_api::se... INFO : Running command set model ymt=173.0
767.04 s
gammaloop-nextest-integration> [2026-09-06 07:46:23.402] @gammaloop_api::se... INFO : Running command set model aS=0.118
767.04 s
gammaloop-nextest-integration> [2026-09-06 07:46:23.405] @gammaloop_api::se... INFO : Running command set model aEWM1=137.036
767.04 s
gammaloop-nextest-integration> [2026-09-06 07:46:23.408] @gammaloop_api::se... INFO : Running command set model Gf=1.166390e-05
767.04 s
gammaloop-nextest-integration> [2026-09-06 07:46:23.411] @gammaloop_api::se... INFO : Running command set model MZ=91.188
767.04 s
gammaloop-nextest-integration> [2026-09-06 07:46:23.415] @gammaloop_api::se... INFO : Running command set global string '
767.04 s
gammaloop-nextest-integration> [global.generation.compile]
767.04 s
gammaloop-nextest-integration> compilation_mode = "symjit"
767.04 s
gammaloop-nextest-integration> optimization_level = "O0"
767.04 s
gammaloop-nextest-integration> fast_math = false
767.04 s
gammaloop-nextest-integration> [...]
767.04 s
gammaloop-nextest-integration> [2026-09-06 07:46:23.416] @gammaloop_api::se... INFO : Running command import graphs ./examples/cli/aa_aa/1L/aa_aa_1L.dot -p aa_aa_all_helicities -i 1L_ppmm -o
767.04 s
gammaloop-nextest-integration> [2026-09-06 07:46:23.416] @commands::import INFO : Loading graphs from '/build/source/examples/cli/aa_aa/1L/aa_aa_1L.dot'
767.04 s
gammaloop-nextest-integration> [2026-09-06 07:46:23.423] @gammaloop_api::se... INFO : Running command generate existing -p aa_aa_all_helicities
767.04 s
gammaloop-nextest-integration> [2026-09-06 07:46:48.360] @commands::generate INFO :
767.04 s
gammaloop-nextest-integration> Integrand generation summary
767.04 s
gammaloop-nextest-integration> peak RAM 1012.75 MiB | cores 1
767.04 s
gammaloop-nextest-integration> ╭───────────┬───────┬─────────┬──────────────┬─────────────┬────────────────┬───────────────╮
767.04 s
gammaloop-nextest-integration> │ integrand │ graph │ # evals │ expr build │ spenso │ symbolica eval │ compile │
767.04 s
gammaloop-nextest-integration> ├───────────┼───────┼─────────┼──────────────┼─────────────┼────────────────┼───────────────┤
767.04 s
gammaloop-nextest-integration> │ 1L_ppmm │ GL0 │ 13 │ 498ms (5.9%) │ 1.62s (19%) │ 5.50s (65%) │ 842ms (10.0%) │
767.04 s
gammaloop-nextest-integration> │ 1L_ppmm │ GL2 │ 13 │ 477ms (5.7%) │ 1.47s (18%) │ 5.62s (67%) │ 803ms (9.6%) │
767.04 s
gammaloop-nextest-integration> │ 1L_ppmm │ GL4 │ 11 │ 463ms (5.8%) │ 1.37s (17%) │ 5.43s (68%) │ 756ms (9.4%) │
767.04 s
gammaloop-nextest-integration> ├───────────┼───────┼─────────┼──────────────┼─────────────┼────────────────┼───────────────┤
767.04 s
gammaloop-nextest-integration> │ Total │ │ 37 │ 1.44s (5.8%) │ 4.46s (18%) │ 16.55s (67%) │ 2.40s (9.7%) │
767.04 s
gammaloop-nextest-integration> ╰───────────┴───────┴─────────┴──────────────┴─────────────┴────────────────┴───────────────╯
767.04 s
gammaloop-nextest-integration> [2026-09-06 07:46:48.993] @gammaloop_api::se... INFO : Running command import model sm-default.json
767.04 s
gammaloop-nextest-integration> [2026-09-06 07:46:48.993] @import::model INFO : Loading built-in JSON model sm-default
767.04 s
gammaloop-nextest-integration> [2026-09-06 07:46:49.010] @gammalooprs::model INFO : The following 11 external parameters were forced to zero by the restriction card:
767.04 s
gammaloop-nextest-integration> lamWS, AWS, rhoWS, etaWS, ymc, yme, ymm, MC, Me, MM, WTau
767.04 s
gammaloop-nextest-integration> [2026-09-06 07:46:49.010] @gammalooprs::model INFO : The following 34 vertex rules were removed by the restriction card:
767.04 s
gammaloop-nextest-integration> V_82 -> (c~, d, G+) | V_83 -> (t~, d, G+) | V_84 -> (c~, s, G+) | V_85 -> (t~, s, G+) | V_86 -> (u~, b, G+) | V_87 -> (c~, b, G+) | V_90 -> (c~, d, W+) | V_91 -> (t~, d, W+) | V_92 -> (u~, s, W+) | V_94 -> (t~, s, W+) | V_95 -> (u~, b, W+) | V_96 -> (c~, b, W+) | V_101 -> (e+, e-, G0) | V_102 -> (mu+, mu-, G0) | V_104 -> (e+, e-, H) | V_105 -> (mu+, mu-, H) | V_110 -> (ve~, e-, G+) | V_111 -> (vm~, mu-, G+) | V_116 -> (b~, u, G-) | V_117 -> (d~, c, G-) | V_118 -> (s~, c, G-) | V_119 -> (b~, c, G-) | V_120 -> (d~, t, G-) | V_121 -> (s~, t, G-) | V_124 -> (s~, u, W-) | V_125 -> (b~, u, W-) | V_126 -> (d~, c, W-) | V_128 -> (b~, c, W-) | V_129 -> (d~, t, W-) | V_130 -> (s~, t, W-) | V_138 -> (c~, c, G0) | V_140 -> (c~, c, H) | V_145 -> (e+, ve, G-) | V_146 -> (mu+, vm, G-)
767.04 s
gammaloop-nextest-integration> [2026-09-06 07:46:49.010] @gammalooprs::model INFO : The following 36 couplings were removed by the restriction card:
767.04 s
gammaloop-nextest-integration> GC_13, GC_14, GC_16, GC_17, GC_18, GC_19, GC_20, GC_22, GC_23, GC_24, GC_25, GC_26, GC_28, GC_29, GC_42, GC_43, GC_44, GC_46, GC_47, GC_48, GC_84, GC_85, GC_86, GC_87, GC_88, GC_89, GC_90, GC_91, GC_92, GC_93, GC_101, GC_102, GC_103, GC_105, GC_106, GC_107
767.04 s
gammaloop-nextest-integration> [2026-09-06 07:46:49.011] @gammaloop_api::se... INFO : Running command run set_model_parameters
767.04 s
gammaloop-nextest-integration> [2026-09-06 07:46:49.011] @gammaloop_api::se... INFO : Starting command block set_model_parameters
767.04 s
gammaloop-nextest-integration> [2026-09-06 07:46:49.011] @gammaloop_api::se... INFO : Running command set model MT=173.0
767.04 s
gammaloop-nextest-integration> [2026-09-06 07:46:49.014] @gammaloop_api::se... INFO : Running command set model WT=0.0
767.04 s
gammaloop-nextest-integration> [2026-09-06 07:46:49.017] @gammaloop_api::se... INFO : Running command set model ymt=173.0
767.04 s
gammaloop-nextest-integration> [2026-09-06 07:46:49.020] @gammaloop_api::se... INFO : Running command set model aS=0.118
767.04 s
gammaloop-nextest-integration> [2026-09-06 07:46:49.024] @gammaloop_api::se... INFO : Running command set model aEWM1=137.036
767.04 s
gammaloop-nextest-integration> [2026-09-06 07:46:49.027] @gammaloop_api::se... INFO : Running command set model Gf=1.166390e-05
767.04 s
gammaloop-nextest-integration> [2026-09-06 07:46:49.030] @gammaloop_api::se... INFO : Running command set model MZ=91.188
767.04 s
gammaloop-nextest-integration> [2026-09-06 07:46:49.033] @gammaloop_api::se... INFO : Running command set global string '
767.04 s
gammaloop-nextest-integration> [global.generation.compile]
767.04 s
gammaloop-nextest-integration> compilation_mode = "assembly"
767.04 s
gammaloop-nextest-integration> optimization_level = "O0"
767.04 s
gammaloop-nextest-integration> fast_math = false
767.04 s
gammaloop-nextest-integration> [...]
767.04 s
gammaloop-nextest-integration> [2026-09-06 07:46:49.034] @gammaloop_api::se... INFO : Running command import graphs ./examples/cli/aa_aa/1L/aa_aa_1L.dot -p aa_aa_all_helicities_assembly -i 1L_ppmm -o
767.04 s
gammaloop-nextest-integration> [2026-09-06 07:46:49.034] @commands::import INFO : Loading graphs from '/build/source/examples/cli/aa_aa/1L/aa_aa_1L.dot'
767.04 s
gammaloop-nextest-integration> [2026-09-06 07:46:49.041] @gammaloop_api::se... INFO : Running command generate existing -p aa_aa_all_helicities_assembly
767.04 s
gammaloop-nextest-integration> [2026-09-06 07:47:11.191] @processes::amplitude INFO : Compiling amplitude 1L_ppmm
767.04 s
gammaloop-nextest-integration> [2026-09-06 07:47:28.850] @commands::generate INFO : Removed 34 generated C++ source file(s). Use '--keep-sources' to keep them.
767.04 s
gammaloop-nextest-integration> [2026-09-06 07:47:28.850] @commands::generate INFO :
767.04 s
gammaloop-nextest-integration> Integrand generation summary
767.04 s
gammaloop-nextest-integration> peak RAM 2.32 GiB | cores 1
767.04 s
gammaloop-nextest-integration> ╭───────────┬───────┬─────────┬──────────────┬─────────────┬────────────────┬──────────────╮
767.04 s
gammaloop-nextest-integration> │ integrand │ graph │ # evals │ expr build │ spenso │ symbolica eval │ compile │
767.04 s
gammaloop-nextest-integration> ├───────────┼───────┼─────────┼──────────────┼─────────────┼────────────────┼──────────────┤
767.04 s
gammaloop-nextest-integration> │ 1L_ppmm │ GL0 │ 13 │ 480ms (3.6%) │ 1.34s (10%) │ 5.55s (42%) │ 5.99s (45%) │
767.04 s
gammaloop-nextest-integration> │ 1L_ppmm │ GL2 │ 13 │ 475ms (3.5%) │ 1.50s (11%) │ 5.42s (40%) │ 6.29s (46%) │
767.04 s
gammaloop-nextest-integration> │ 1L_ppmm │ GL4 │ 11 │ 462ms (3.6%) │ 1.41s (11%) │ 5.47s (43%) │ 5.37s (42%) │
767.04 s
gammaloop-nextest-integration> ├───────────┼───────┼─────────┼──────────────┼─────────────┼────────────────┼──────────────┤
767.04 s
gammaloop-nextest-integration> │ Total │ │ 37 │ 1.42s (3.6%) │ 4.25s (11%) │ 16.44s (41%) │ 17.65s (44%) │
767.04 s
gammaloop-nextest-integration> ╰───────────┴───────┴─────────┴──────────────┴─────────────┴────────────────┴──────────────╯
767.04 s
gammaloop-nextest-integration> [2026-09-06 07:47:29.455] @gammaloop_api::se... INFO : Running command set process -p aa_aa_all_helicities -i 1L_ppmm string '
767.04 s
gammaloop-nextest-integration> [stability]
767.04 s
gammaloop-nextest-integration> check_on_norm = true
767.04 s
gammaloop-nextest-integration> escalate_if_exact_zero = false
767.04 s
gammaloop-nextest-integration> loop_momenta_norm_escalation_factor = -1.0
767.04 s
gammaloop-nextest-integration> [...]
767.04 s
gammaloop-nextest-integration> [2026-09-06 07:47:29.456] @gammaloop_api::se... INFO : Running command set process -p aa_aa_all_helicities_assembly -i 1L_ppmm string '
767.04 s
gammaloop-nextest-integration> [stability]
767.04 s
gammaloop-nextest-integration> check_on_norm = true
767.04 s
gammaloop-nextest-integration> escalate_if_exact_zero = false
767.04 s
gammaloop-nextest-integration> loop_momenta_norm_escalation_factor = -1.0
767.04 s
gammaloop-nextest-integration> [...]
767.04 s
gammaloop-nextest-integration> [2026-09-06 07:47:29.457] @gammaloop_api::se... INFO : Running command set process -p aa_aa_all_helicities -i 1L_mpmm string '
767.04 s
gammaloop-nextest-integration> [stability]
767.04 s
gammaloop-nextest-integration> check_on_norm = true
767.04 s
gammaloop-nextest-integration> escalate_if_exact_zero = false
767.04 s
gammaloop-nextest-integration> loop_momenta_norm_escalation_factor = -1.0
767.04 s
gammaloop-nextest-integration> [...]
767.04 s
gammaloop-nextest-integration> [2026-09-06 07:47:29.458] @gammaloop_api::se... INFO : Running command set process -p aa_aa_all_helicities_assembly -i 1L_mpmm string '
767.04 s
gammaloop-nextest-integration> [stability]
767.04 s
gammaloop-nextest-integration> check_on_norm = true
767.04 s
gammaloop-nextest-integration> escalate_if_exact_zero = false
767.04 s
gammaloop-nextest-integration> loop_momenta_norm_escalation_factor = -1.0
767.04 s
gammaloop-nextest-integration> [...]
767.04 s
gammaloop-nextest-integration> [2026-09-06 07:47:29.458] @gammaloop_api::se... INFO : Running command set process -p aa_aa_all_helicities -i 1L_mmmm string '
767.04 s
gammaloop-nextest-integration> [stability]
767.04 s
gammaloop-nextest-integration> check_on_norm = true
767.04 s
gammaloop-nextest-integration> escalate_if_exact_zero = false
767.04 s
gammaloop-nextest-integration> loop_momenta_norm_escalation_factor = -1.0
767.04 s
gammaloop-nextest-integration> [...]
767.04 s
gammaloop-nextest-integration> [2026-09-06 07:47:29.459] @gammaloop_api::se... INFO : Running command set process -p aa_aa_all_helicities_assembly -i 1L_mmmm string '
767.04 s
gammaloop-nextest-integration> [stability]
767.04 s
gammaloop-nextest-integration> check_on_norm = true
767.04 s
gammaloop-nextest-integration> escalate_if_exact_zero = false
767.04 s
gammaloop-nextest-integration> loop_momenta_norm_escalation_factor = -1.0
767.04 s
gammaloop-nextest-integration> [...]
767.04 s
gammaloop-nextest-integration> [2026-09-06 07:47:29.460] @gammaloop_api::se... INFO : Running command set process -p aa_aa_all_helicities -i 1L_pmmp string '
767.04 s
gammaloop-nextest-integration> [stability]
767.04 s
gammaloop-nextest-integration> check_on_norm = true
767.04 s
gammaloop-nextest-integration> escalate_if_exact_zero = false
767.04 s
gammaloop-nextest-integration> loop_momenta_norm_escalation_factor = -1.0
767.04 s
gammaloop-nextest-integration> ... omitted 84 more lines; see full nextest output above
767.04 s
gammaloop-nextest-integration> =========================================
767.13 s
error: Cannot build '/nix/store/xaf9bwgnrhpb0jrkx6mcwl1pfl8pk1ly-gammaloop-nextest-integration.drv '.
767.13 s
Reason: builder failed with exit code 100 .
767.13 s
Output paths:
767.13 s
/nix/store/nwjsprs0wh86kdyq96q44q9sagn61pgk-gammaloop-nextest-integration
767.13 s
Last 586 log lines:
767.13 s
> Extracting 13 binaries, 1 build script output directory, and 3 linked paths to /build/nextest-archive-Oo48Rf
767.13 s
> Extracted 30 files to /build/nextest-archive-Oo48Rf in 2.08s
767.13 s
> ------------
767.13 s
> Nextest run ID 0d0c8672-4518-4ec7-94f1-f2c6fef7350e with nextest profile: ci_gammaloop
767.13 s
> Starting 152 tests across 13 binaries (208 tests skipped , including 207 tests via profile.ci_gammaloop.default-filter )
767.13 s
> FAIL [ 66.679s] ( 54/152) gammaloop-integration-tests::test_runs aa_aa::important :: aa_aa_local_inspect_backend_consistency
767.13 s
> stdout ---
767.13 s
>
767.13 s
> running 1 test
767.13 s
> test aa_aa::important::aa_aa_local_inspect_backend_consistency has been running for over 60 seconds
767.13 s
> test aa_aa::important::aa_aa_local_inspect_backend_consistency ... FAILED
767.13 s
>
767.13 s
> failures:
767.13 s
>
767.13 s
> failures:
767.13 s
> aa_aa::important::aa_aa_local_inspect_backend_consistency
767.13 s
>
767.13 s
> test result: FAILED. 0 passed; 1 failed; 0 ignored; 0 measured; 258 filtered out; finished in 66.52s
767.13 s
>
767.13 s
> stderr ---
767.13 s
> [2026-09-06 07:46:23.373] @gammaloop_api::se... INFO : Running command import model sm-default.json
767.13 s
> [2026-09-06 07:46:23.373] @import::model INFO : Loading built-in JSON model sm-default
767.13 s
> [2026-09-06 07:46:23.391] @gammalooprs::model INFO : The following 11 external parameters were forced to zero by the restriction card:
767.13 s
> lamWS, AWS, rhoWS, etaWS, ymc, yme, ymm, MC, Me, MM, WTau
767.13 s
> [2026-09-06 07:46:23.391] @gammalooprs::model INFO : The following 34 vertex rules were removed by the restriction card:
767.13 s
> V_82 -> (c~, d, G+) | V_83 -> (t~, d, G+) | V_84 -> (c~, s, G+) | V_85 -> (t~, s, G+) | V_86 -> (u~, b, G+) | V_87 -> (c~, b, G+) | V_90 -> (c~, d, W+) | V_91 -> (t~, d, W+) | V_92 -> (u~, s, W+) | V_94 -> (t~, s, W+) | V_95 -> (u~, b, W+) | V_96 -> (c~, b, W+) | V_101 -> (e+, e-, G0) | V_102 -> (mu+, mu-, G0) | V_104 -> (e+, e-, H) | V_105 -> (mu+, mu-, H) | V_110 -> (ve~, e-, G+) | V_111 -> (vm~, mu-, G+) | V_116 -> (b~, u, G-) | V_117 -> (d~, c, G-) | V_118 -> (s~, c, G-) | V_119 -> (b~, c, G-) | V_120 -> (d~, t, G-) | V_121 -> (s~, t, G-) | V_124 -> (s~, u, W-) | V_125 -> (b~, u, W-) | V_126 -> (d~, c, W-) | V_128 -> (b~, c, W-) | V_129 -> (d~, t, W-) | V_130 -> (s~, t, W-) | V_138 -> (c~, c, G0) | V_140 -> (c~, c, H) | V_145 -> (e+, ve, G-) | V_146 -> (mu+, vm, G-)
767.13 s
> [2026-09-06 07:46:23.391] @gammalooprs::model INFO : The following 36 couplings were removed by the restriction card:
767.13 s
> GC_13, GC_14, GC_16, GC_17, GC_18, GC_19, GC_20, GC_22, GC_23, GC_24, GC_25, GC_26, GC_28, GC_29, GC_42, GC_43, GC_44, GC_46, GC_47, GC_48, GC_84, GC_85, GC_86, GC_87, GC_88, GC_89, GC_90, GC_91, GC_92, GC_93, GC_101, GC_102, GC_103, GC_105, GC_106, GC_107
767.13 s
> [2026-09-06 07:46:23.392] @gammaloop_api::se... INFO : Running command run set_model_parameters
767.13 s
> [2026-09-06 07:46:23.392] @gammaloop_api::se... INFO : Starting command block set_model_parameters
767.13 s
> [2026-09-06 07:46:23.392] @gammaloop_api::se... INFO : Running command set model MT=173.0
767.13 s
> [2026-09-06 07:46:23.395] @gammaloop_api::se... INFO : Running command set model WT=0.0
767.13 s
> [2026-09-06 07:46:23.398] @gammaloop_api::se... INFO : Running command set model ymt=173.0
767.13 s
> [2026-09-06 07:46:23.402] @gammaloop_api::se... INFO : Running command set model aS=0.118
767.13 s
> [2026-09-06 07:46:23.405] @gammaloop_api::se... INFO : Running command set model aEWM1=137.036
767.13 s
> [2026-09-06 07:46:23.408] @gammaloop_api::se... INFO : Running command set model Gf=1.166390e-05
767.13 s
> [2026-09-06 07:46:23.411] @gammaloop_api::se... INFO : Running command set model MZ=91.188
767.13 s
> [2026-09-06 07:46:23.415] @gammaloop_api::se... INFO : Running command set global string '
767.13 s
> [global.generation.compile]
767.13 s
> compilation_mode = "symjit"
767.13 s
> optimization_level = "O0"
767.13 s
> fast_math = false
767.13 s
> [...]
767.13 s
> [2026-09-06 07:46:23.416] @gammaloop_api::se... INFO : Running command import graphs ./examples/cli/aa_aa/1L/aa_aa_1L.dot -p aa_aa_all_helicities -i 1L_ppmm -o
767.13 s
> [2026-09-06 07:46:23.416] @commands::import INFO : Loading graphs from '/build/source/examples/cli/aa_aa/1L/aa_aa_1L.dot'
767.13 s
> [2026-09-06 07:46:23.423] @gammaloop_api::se... INFO : Running command generate existing -p aa_aa_all_helicities
767.13 s
> [2026-09-06 07:46:48.360] @commands::generate INFO :
767.13 s
> Integrand generation summary
767.13 s
> peak RAM 1012.75 MiB | cores 1
767.13 s
> ╭───────────┬───────┬─────────┬──────────────┬─────────────┬────────────────┬───────────────╮
767.13 s
> │ integrand │ graph │ # evals │ expr build │ spenso │ symbolica eval │ compile │
767.13 s
> ├───────────┼───────┼─────────┼──────────────┼─────────────┼────────────────┼───────────────┤
767.13 s
> │ 1L_ppmm │ GL0 │ 13 │ 498ms (5.9% ) │ 1.62s (19% ) │ 5.50s (65% ) │ 842ms (10.0% ) │
767.13 s
> │ 1L_ppmm │ GL2 │ 13 │ 477ms (5.7% ) │ 1.47s (18% ) │ 5.62s (67% ) │ 803ms (9.6% ) │
767.13 s
> │ 1L_ppmm │ GL4 │ 11 │ 463ms (5.8% ) │ 1.37s (17% ) │ 5.43s (68% ) │ 756ms (9.4% ) │
767.13 s
> ├───────────┼───────┼─────────┼──────────────┼─────────────┼────────────────┼───────────────┤
767.13 s
> │ Total │ │ 37 │ 1.44s (5.8% ) │ 4.46s (18% ) │ 16.55s (67% ) │ 2.40s (9.7% ) │
767.13 s
> ╰───────────┴───────┴─────────┴──────────────┴─────────────┴────────────────┴───────────────╯
767.13 s
> [2026-09-06 07:46:48.993] @gammaloop_api::se... INFO : Running command import model sm-default.json
767.13 s
> [2026-09-06 07:46:48.993] @import::model INFO : Loading built-in JSON model sm-default
767.13 s
> [2026-09-06 07:46:49.010] @gammalooprs::model INFO : The following 11 external parameters were forced to zero by the restriction card:
767.13 s
> lamWS, AWS, rhoWS, etaWS, ymc, yme, ymm, MC, Me, MM, WTau
767.13 s
> [2026-09-06 07:46:49.010] @gammalooprs::model INFO : The following 34 vertex rules were removed by the restriction card:
767.13 s
> V_82 -> (c~, d, G+) | V_83 -> (t~, d, G+) | V_84 -> (c~, s, G+) | V_85 -> (t~, s, G+) | V_86 -> (u~, b, G+) | V_87 -> (c~, b, G+) | V_90 -> (c~, d, W+) | V_91 -> (t~, d, W+) | V_92 -> (u~, s, W+) | V_94 -> (t~, s, W+) | V_95 -> (u~, b, W+) | V_96 -> (c~, b, W+) | V_101 -> (e+, e-, G0) | V_102 -> (mu+, mu-, G0) | V_104 -> (e+, e-, H) | V_105 -> (mu+, mu-, H) | V_110 -> (ve~, e-, G+) | V_111 -> (vm~, mu-, G+) | V_116 -> (b~, u, G-) | V_117 -> (d~, c, G-) | V_118 -> (s~, c, G-) | V_119 -> (b~, c, G-) | V_120 -> (d~, t, G-) | V_121 -> (s~, t, G-) | V_124 -> (s~, u, W-) | V_125 -> (b~, u, W-) | V_126 -> (d~, c, W-) | V_128 -> (b~, c, W-) | V_129 -> (d~, t, W-) | V_130 -> (s~, t, W-) | V_138 -> (c~, c, G0) | V_140 -> (c~, c, H) | V_145 -> (e+, ve, G-) | V_146 -> (mu+, vm, G-)
767.13 s
> [2026-09-06 07:46:49.010] @gammalooprs::model INFO : The following 36 couplings were removed by the restriction card:
767.13 s
> GC_13, GC_14, GC_16, GC_17, GC_18, GC_19, GC_20, GC_22, GC_23, GC_24, GC_25, GC_26, GC_28, GC_29, GC_42, GC_43, GC_44, GC_46, GC_47, GC_48, GC_84, GC_85, GC_86, GC_87, GC_88, GC_89, GC_90, GC_91, GC_92, GC_93, GC_101, GC_102, GC_103, GC_105, GC_106, GC_107
767.13 s
> [2026-09-06 07:46:49.011] @gammaloop_api::se... INFO : Running command run set_model_parameters
767.13 s
> [2026-09-06 07:46:49.011] @gammaloop_api::se... INFO : Starting command block set_model_parameters
767.13 s
> [2026-09-06 07:46:49.011] @gammaloop_api::se... INFO : Running command set model MT=173.0
767.13 s
> [2026-09-06 07:46:49.014] @gammaloop_api::se... INFO : Running command set model WT=0.0
767.13 s
> [2026-09-06 07:46:49.017] @gammaloop_api::se... INFO : Running command set model ymt=173.0
767.13 s
> [2026-09-06 07:46:49.020] @gammaloop_api::se... INFO : Running command set model aS=0.118
767.13 s
> [2026-09-06 07:46:49.024] @gammaloop_api::se... INFO : Running command set model aEWM1=137.036
767.13 s
> [2026-09-06 07:46:49.027] @gammaloop_api::se... INFO : Running command set model Gf=1.166390e-05
767.13 s
> [2026-09-06 07:46:49.030] @gammaloop_api::se... INFO : Running command set model MZ=91.188
767.13 s
> [2026-09-06 07:46:49.033] @gammaloop_api::se... INFO : Running command set global string '
767.13 s
> [global.generation.compile]
767.13 s
> compilation_mode = "assembly"
767.13 s
> optimization_level = "O0"
767.13 s
> fast_math = false
767.13 s
> [...]
767.13 s
> [2026-09-06 07:46:49.034] @gammaloop_api::se... INFO : Running command import graphs ./examples/cli/aa_aa/1L/aa_aa_1L.dot -p aa_aa_all_helicities_assembly -i 1L_ppmm -o
767.13 s
> [2026-09-06 07:46:49.034] @commands::import INFO : Loading graphs from '/build/source/examples/cli/aa_aa/1L/aa_aa_1L.dot'
767.13 s
> [2026-09-06 07:46:49.041] @gammaloop_api::se... INFO : Running command generate existing -p aa_aa_all_helicities_assembly
767.13 s
> [2026-09-06 07:47:11.191] @processes::amplitude INFO : Compiling amplitude 1L_ppmm
767.13 s
> [2026-09-06 07:47:28.850] @commands::generate INFO : Removed 34 generated C++ source file(s). Use '--keep-sources ' to keep them.
767.13 s
> [2026-09-06 07:47:28.850] @commands::generate INFO :
767.13 s
> Integrand generation summary
767.13 s
> peak RAM 2.32 GiB | cores 1
767.13 s
> ╭───────────┬───────┬─────────┬──────────────┬─────────────┬────────────────┬──────────────╮
767.13 s
> │ integrand │ graph │ # evals │ expr build │ spenso │ symbolica eval │ compile │
767.13 s
> ├───────────┼───────┼─────────┼──────────────┼─────────────┼────────────────┼──────────────┤
767.13 s
> │ 1L_ppmm │ GL0 │ 13 │ 480ms (3.6% ) │ 1.34s (10% ) │ 5.55s (42% ) │ 5.99s (45% ) │
767.13 s
> │ 1L_ppmm │ GL2 │ 13 │ 475ms (3.5% ) │ 1.50s (11% ) │ 5.42s (40% ) │ 6.29s (46% ) │
767.13 s
> │ 1L_ppmm │ GL4 │ 11 │ 462ms (3.6% ) │ 1.41s (11% ) │ 5.47s (43% ) │ 5.37s (42% ) │
767.13 s
> ├───────────┼───────┼─────────┼──────────────┼─────────────┼────────────────┼──────────────┤
767.13 s
> │ Total │ │ 37 │ 1.42s (3.6% ) │ 4.25s (11% ) │ 16.44s (41% ) │ 17.65s (44% ) │
767.13 s
> ╰───────────┴───────┴─────────┴──────────────┴─────────────┴────────────────┴──────────────╯
767.13 s
> [2026-09-06 07:47:29.455] @gammaloop_api::se... INFO : Running command set process -p aa_aa_all_helicities -i 1L_ppmm string '
767.13 s
> [stability]
767.13 s
> check_on_norm = true
767.13 s
> escalate_if_exact_zero = false
767.13 s
> loop_momenta_norm_escalation_factor = -1.0
767.13 s
> [...]
767.13 s
> [2026-09-06 07:47:29.456] @gammaloop_api::se... INFO : Running command set process -p aa_aa_all_helicities_assembly -i 1L_ppmm string '
767.13 s
> [stability]
767.13 s
> check_on_norm = true
767.13 s
> escalate_if_exact_zero = false
767.13 s
> loop_momenta_norm_escalation_factor = -1.0
767.13 s
> [...]
767.13 s
> [2026-09-06 07:47:29.457] @gammaloop_api::se... INFO : Running command set process -p aa_aa_all_helicities -i 1L_mpmm string '
767.13 s
> [stability]
767.13 s
> check_on_norm = true
767.13 s
> escalate_if_exact_zero = false
767.13 s
> loop_momenta_norm_escalation_factor = -1.0
767.13 s
> [...]
767.13 s
> [2026-09-06 07:47:29.458] @gammaloop_api::se... INFO : Running command set process -p aa_aa_all_helicities_assembly -i 1L_mpmm string '
767.13 s
> [stability]
767.13 s
> check_on_norm = true
767.13 s
> escalate_if_exact_zero = false
767.13 s
> loop_momenta_norm_escalation_factor = -1.0
767.13 s
> [...]
767.13 s
> [2026-09-06 07:47:29.458] @gammaloop_api::se... INFO : Running command set process -p aa_aa_all_helicities -i 1L_mmmm string '
767.13 s
> [stability]
767.13 s
> check_on_norm = true
767.13 s
> escalate_if_exact_zero = false
767.13 s
> loop_momenta_norm_escalation_factor = -1.0
767.13 s
> [...]
767.13 s
> [2026-09-06 07:47:29.459] @gammaloop_api::se... INFO : Running command set process -p aa_aa_all_helicities_assembly -i 1L_mmmm string '
767.13 s
> [stability]
767.13 s
> check_on_norm = true
767.13 s
> escalate_if_exact_zero = false
767.13 s
> loop_momenta_norm_escalation_factor = -1.0
767.13 s
> [...]
767.13 s
> [2026-09-06 07:47:29.460] @gammaloop_api::se... INFO : Running command set process -p aa_aa_all_helicities -i 1L_pmmp string '
767.13 s
> [stability]
767.13 s
> check_on_norm = true
767.13 s
> escalate_if_exact_zero = false
767.13 s
> loop_momenta_norm_escalation_factor = -1.0
767.13 s
> [...]
767.13 s
> [2026-09-06 07:47:29.460] @gammaloop_api::se... INFO : Running command set process -p aa_aa_all_helicities_assembly -i 1L_pmmp string '
767.13 s
> [stability]
767.13 s
> check_on_norm = true
767.13 s
> escalate_if_exact_zero = false
767.13 s
> loop_momenta_norm_escalation_factor = -1.0
767.13 s
> [...]
767.13 s
> [2026-09-06 07:47:29.461] @gammaloop_api::se... INFO : Running command set process -p aa_aa_all_helicities -i 1L_pmpm string '
767.13 s
> [stability]
767.13 s
> check_on_norm = true
767.13 s
> escalate_if_exact_zero = false
767.13 s
> loop_momenta_norm_escalation_factor = -1.0
767.13 s
> [...]
767.13 s
> [2026-09-06 07:47:29.461] @gammaloop_api::se... INFO : Running command set process -p aa_aa_all_helicities_assembly -i 1L_pmpm string '
767.13 s
> [stability]
767.13 s
> check_on_norm = true
767.13 s
> escalate_if_exact_zero = false
767.13 s
> loop_momenta_norm_escalation_factor = -1.0
767.13 s
> [...]
767.13 s
> [2026-09-06 07:47:29.466] @process::amplitude INFO : Input is below threshold: 0 existing threshold E-surfaces across 0/1 graph groups
767.13 s
> [2026-09-06 07:47:29.466] @process::amplitude INFO : overlap structure of group 0: [0: []]
767.13 s
> [2026-09-06 07:47:29.466] @integrands::process [{#im_is_nan, #re_is_nan}] WARNING : final process evaluation is nonfinite
767.13 s
> [2026-09-06 07:47:29.466] @commands::inspect INFO :
767.13 s
> Input point in momentum space:
767.13 s
>
767.13 s
> ( 0.1100000000000000, -0.0700000000000000, 0.1900000000000000 )
767.13 s
>
767.13 s
> The evaluation of integrand '1L_ppmm' is:
767.13 s
>
767.13 s
> ( +0.0000000000000000e0, +0.0000000000000000e0 i)
767.13 s
>
767.13 s
> [2026-09-06 07:47:29.470] @process::amplitude INFO : Input is below threshold: 0 existing threshold E-surfaces across 0/1 graph groups
767.13 s
> [2026-09-06 07:47:29.470] @process::amplitude INFO : overlap structure of group 0: [0: []]
767.13 s
> [2026-09-06 07:47:29.470] @commands::inspect INFO :
767.13 s
> Input point in momentum space:
767.13 s
>
767.13 s
> ( 0.1100000000000000, -0.0700000000000000, 0.1900000000000000 )
767.13 s
>
767.13 s
> The evaluation of integrand '1L_ppmm' is:
767.13 s
>
767.13 s
> ( -1.7132462539328486e-28, -8.7105072229446864e-10 i)
767.13 s
>
767.13 s
> The application panicked (crashed).
767.13 s
> Message: kinematics=a, integrand=1L_ppmm, graph_id=0: assembly vs symjit inspect: actual=(-0.00000000000000000000000000017132462539328486+-0.0000000008710507222944686i), expected=(0+0i), tolerance=0.0000000001
767.13 s
> Location: tests/tests/test_runs/utils.rs :466
767.13 s
>
767.13 s
> ━━━━━━━━━━━━━━━━━━━━━━━━━━━━━━━━━━ BACKTRACE ━━━━━━━━━━━━━━━━━━━━━━━━━━━━━━━━━━━
767.13 s
> 1: <color_eyre[51793ea62743adbd]::config::PanicHook>::panic_report <unknown>
767.13 s
> at <unknown source file> :<unknown line>
767.13 s
> 2: <color_eyre[51793ea62743adbd]::config::PanicHook>::into_panic_hook::{closure#0} <unknown>
767.13 s
> at <unknown source file> :<unknown line>
767.13 s
> 3: std[bcb96dfbba0ab899]::panicking::panic_with_hook <unknown>
767.13 s
> at <unknown source file> :<unknown line>
767.13 s
> 4: std[bcb96dfbba0ab899]::panicking::panic_handler::{closure#0} <unknown>
767.13 s
> at <unknown source file> :<unknown line>
767.13 s
> 5: std[bcb96dfbba0ab899]::sys::backtrace::__rust_end_short_backtrace::<std[bcb96dfbba0ab899]::panicking::panic_handler::{closure#0}, !> <unknown>
767.13 s
> at <unknown source file> :<unknown line>
767.13 s
> 6: __rustc[6c289b9f9c454d21]::rust_begin_unwind <unknown>
767.13 s
> at <unknown source file> :<unknown line>
767.13 s
> 7: core[940e698046960fd5]::panicking::panic_fmt <unknown>
767.13 s
> at <unknown source file> :<unknown line>
767.13 s
> 8: <test_runs[66584badfeb6c7be]::aa_aa::important::aa_aa_local_inspect_backend_consistency::{closure#0} as core[940e698046960fd5]::ops::function::FnOnce<()>>::call_once <unknown>
767.13 s
> at <unknown source file> :<unknown line>
767.13 s
> 9: serial_test[cd99724524a2f1c0]::serial_code_lock::local_serial_core_with_return::<(), eyre[cb2fd339c0c40fca]::Report> <unknown>
767.13 s
> at <unknown source file> :<unknown line>
767.13 s
> 10: <test_runs[66584badfeb6c7be]::aa_aa::important::aa_aa_local_inspect_backend_consistency::{closure#0} as core[940e698046960fd5]::ops::function::FnOnce<()>>::call_once <unknown>
767.13 s
> at <unknown source file> :<unknown line>
767.13 s
> 11: test[75d6903177b1d7e9]::__rust_begin_short_backtrace::<core[940e698046960fd5]::result::Result<(), alloc[2ea6bcb46fca0c42]::string::String>, fn() -> core[940e698046960fd5]::result::Result<(), alloc[2ea6bcb46fca0c42]::string::String>> <unknown>
767.13 s
> at <unknown source file> :<unknown line>
767.13 s
> 12: test[75d6903177b1d7e9]::run_test::{closure#0} <unknown>
767.13 s
> at <unknown source file> :<unknown line>
767.13 s
> 13: std[bcb96dfbba0ab899]::sys::backtrace::__rust_begin_short_backtrace::<test[75d6903177b1d7e9]::run_test::{closure#1}, ()> <unknown>
767.13 s
> at <unknown source file> :<unknown line>
767.13 s
> 14: <std[bcb96dfbba0ab899]::thread::lifecycle::spawn_unchecked<test[75d6903177b1d7e9]::run_test::{closure#1}, ()>::{closure#1} as core[940e698046960fd5]::ops::function::FnOnce<()>>::call_once::{shim:vtable#0} <unknown>
767.13 s
> at <unknown source file> :<unknown line>
767.13 s
> 15: <std[bcb96dfbba0ab899]::sys::thread::unix::Thread>::new::thread_start <unknown>
767.13 s
> at <unknown source file> :<unknown line>
767.13 s
> 16: start_thread <unknown>
767.13 s
> at <unknown source file> :<unknown line>
767.13 s
> 17: __clone3 <unknown>
767.13 s
> at <unknown source file> :<unknown line>
767.13 s
>
767.13 s
> Run with COLORBT_SHOW_HIDDEN=1 environment variable to disable frame filtering.
767.13 s
> Run with RUST_BACKTRACE=full to include source snippets.
767.13 s
>
767.13 s
> ------------
767.13 s
> Summary [ 743.943s] 152 tests run: 151 passed , 1 failed , 208 skipped
767.13 s
> FAIL [ 66.679s] ( 54/152) gammaloop-integration-tests::test_runs aa_aa::important :: aa_aa_local_inspect_backend_consistency
767.13 s
> stdout ---
767.13 s
>
767.13 s
> running 1 test
767.13 s
> test aa_aa::important::aa_aa_local_inspect_backend_consistency has been running for over 60 seconds
767.13 s
> test aa_aa::important::aa_aa_local_inspect_backend_consistency ... FAILED
767.13 s
>
767.13 s
> failures:
767.13 s
>
767.13 s
> failures:
767.13 s
> aa_aa::important::aa_aa_local_inspect_backend_consistency
767.13 s
>
767.13 s
> test result: FAILED. 0 passed; 1 failed; 0 ignored; 0 measured; 258 filtered out; finished in 66.52s
767.13 s
>
767.13 s
> stderr ---
767.13 s
> [2026-09-06 07:46:23.373] @gammaloop_api::se... INFO : Running command import model sm-default.json
767.13 s
> [2026-09-06 07:46:23.373] @import::model INFO : Loading built-in JSON model sm-default
767.13 s
> [2026-09-06 07:46:23.391] @gammalooprs::model INFO : The following 11 external parameters were forced to zero by the restriction card:
767.13 s
> lamWS, AWS, rhoWS, etaWS, ymc, yme, ymm, MC, Me, MM, WTau
767.13 s
> [2026-09-06 07:46:23.391] @gammalooprs::model INFO : The following 34 vertex rules were removed by the restriction card:
767.13 s
> V_82 -> (c~, d, G+) | V_83 -> (t~, d, G+) | V_84 -> (c~, s, G+) | V_85 -> (t~, s, G+) | V_86 -> (u~, b, G+) | V_87 -> (c~, b, G+) | V_90 -> (c~, d, W+) | V_91 -> (t~, d, W+) | V_92 -> (u~, s, W+) | V_94 -> (t~, s, W+) | V_95 -> (u~, b, W+) | V_96 -> (c~, b, W+) | V_101 -> (e+, e-, G0) | V_102 -> (mu+, mu-, G0) | V_104 -> (e+, e-, H) | V_105 -> (mu+, mu-, H) | V_110 -> (ve~, e-, G+) | V_111 -> (vm~, mu-, G+) | V_116 -> (b~, u, G-) | V_117 -> (d~, c, G-) | V_118 -> (s~, c, G-) | V_119 -> (b~, c, G-) | V_120 -> (d~, t, G-) | V_121 -> (s~, t, G-) | V_124 -> (s~, u, W-) | V_125 -> (b~, u, W-) | V_126 -> (d~, c, W-) | V_128 -> (b~, c, W-) | V_129 -> (d~, t, W-) | V_130 -> (s~, t, W-) | V_138 -> (c~, c, G0) | V_140 -> (c~, c, H) | V_145 -> (e+, ve, G-) | V_146 -> (mu+, vm, G-)
767.13 s
> [2026-09-06 07:46:23.391] @gammalooprs::model INFO : The following 36 couplings were removed by the restriction card:
767.13 s
> GC_13, GC_14, GC_16, GC_17, GC_18, GC_19, GC_20, GC_22, GC_23, GC_24, GC_25, GC_26, GC_28, GC_29, GC_42, GC_43, GC_44, GC_46, GC_47, GC_48, GC_84, GC_85, GC_86, GC_87, GC_88, GC_89, GC_90, GC_91, GC_92, GC_93, GC_101, GC_102, GC_103, GC_105, GC_106, GC_107
767.13 s
> [2026-09-06 07:46:23.392] @gammaloop_api::se... INFO : Running command run set_model_parameters
767.13 s
> [2026-09-06 07:46:23.392] @gammaloop_api::se... INFO : Starting command block set_model_parameters
767.13 s
> [2026-09-06 07:46:23.392] @gammaloop_api::se... INFO : Running command set model MT=173.0
767.13 s
> [2026-09-06 07:46:23.395] @gammaloop_api::se... INFO : Running command set model WT=0.0
767.13 s
> [2026-09-06 07:46:23.398] @gammaloop_api::se... INFO : Running command set model ymt=173.0
767.13 s
> [2026-09-06 07:46:23.402] @gammaloop_api::se... INFO : Running command set model aS=0.118
767.13 s
> [2026-09-06 07:46:23.405] @gammaloop_api::se... INFO : Running command set model aEWM1=137.036
767.13 s
> [2026-09-06 07:46:23.408] @gammaloop_api::se... INFO : Running command set model Gf=1.166390e-05
767.13 s
> [2026-09-06 07:46:23.411] @gammaloop_api::se... INFO : Running command set model MZ=91.188
767.13 s
> [2026-09-06 07:46:23.415] @gammaloop_api::se... INFO : Running command set global string '
767.13 s
> [global.generation.compile]
767.13 s
> compilation_mode = "symjit"
767.13 s
> optimization_level = "O0"
767.13 s
> fast_math = false
767.13 s
> [...]
767.13 s
> [2026-09-06 07:46:23.416] @gammaloop_api::se... INFO : Running command import graphs ./examples/cli/aa_aa/1L/aa_aa_1L.dot -p aa_aa_all_helicities -i 1L_ppmm -o
767.13 s
> [2026-09-06 07:46:23.416] @commands::import INFO : Loading graphs from '/build/source/examples/cli/aa_aa/1L/aa_aa_1L.dot'
767.13 s
> [2026-09-06 07:46:23.423] @gammaloop_api::se... INFO : Running command generate existing -p aa_aa_all_helicities
767.13 s
> [2026-09-06 07:46:48.360] @commands::generate INFO :
767.13 s
> Integrand generation summary
767.13 s
> peak RAM 1012.75 MiB | cores 1
767.13 s
> ╭───────────┬───────┬─────────┬──────────────┬─────────────┬────────────────┬───────────────╮
767.13 s
> │ integrand │ graph │ # evals │ expr build │ spenso │ symbolica eval │ compile │
767.13 s
> ├───────────┼───────┼─────────┼──────────────┼─────────────┼────────────────┼───────────────┤
767.13 s
> │ 1L_ppmm │ GL0 │ 13 │ 498ms (5.9% ) │ 1.62s (19% ) │ 5.50s (65% ) │ 842ms (10.0% ) │
767.13 s
> │ 1L_ppmm │ GL2 │ 13 │ 477ms (5.7% ) │ 1.47s (18% ) │ 5.62s (67% ) │ 803ms (9.6% ) │
767.13 s
> │ 1L_ppmm │ GL4 │ 11 │ 463ms (5.8% ) │ 1.37s (17% ) │ 5.43s (68% ) │ 756ms (9.4% ) │
767.13 s
> ├───────────┼───────┼─────────┼──────────────┼─────────────┼────────────────┼───────────────┤
767.13 s
> │ Total │ │ 37 │ 1.44s (5.8% ) │ 4.46s (18% ) │ 16.55s (67% ) │ 2.40s (9.7% ) │
767.13 s
> ╰───────────┴───────┴─────────┴──────────────┴─────────────┴────────────────┴───────────────╯
767.13 s
> [2026-09-06 07:46:48.993] @gammaloop_api::se... INFO : Running command import model sm-default.json
767.13 s
> [2026-09-06 07:46:48.993] @import::model INFO : Loading built-in JSON model sm-default
767.13 s
> [2026-09-06 07:46:49.010] @gammalooprs::model INFO : The following 11 external parameters were forced to zero by the restriction card:
767.13 s
> lamWS, AWS, rhoWS, etaWS, ymc, yme, ymm, MC, Me, MM, WTau
767.13 s
> [2026-09-06 07:46:49.010] @gammalooprs::model INFO : The following 34 vertex rules were removed by the restriction card:
767.13 s
> V_82 -> (c~, d, G+) | V_83 -> (t~, d, G+) | V_84 -> (c~, s, G+) | V_85 -> (t~, s, G+) | V_86 -> (u~, b, G+) | V_87 -> (c~, b, G+) | V_90 -> (c~, d, W+) | V_91 -> (t~, d, W+) | V_92 -> (u~, s, W+) | V_94 -> (t~, s, W+) | V_95 -> (u~, b, W+) | V_96 -> (c~, b, W+) | V_101 -> (e+, e-, G0) | V_102 -> (mu+, mu-, G0) | V_104 -> (e+, e-, H) | V_105 -> (mu+, mu-, H) | V_110 -> (ve~, e-, G+) | V_111 -> (vm~, mu-, G+) | V_116 -> (b~, u, G-) | V_117 -> (d~, c, G-) | V_118 -> (s~, c, G-) | V_119 -> (b~, c, G-) | V_120 -> (d~, t, G-) | V_121 -> (s~, t, G-) | V_124 -> (s~, u, W-) | V_125 -> (b~, u, W-) | V_126 -> (d~, c, W-) | V_128 -> (b~, c, W-) | V_129 -> (d~, t, W-) | V_130 -> (s~, t, W-) | V_138 -> (c~, c, G0) | V_140 -> (c~, c, H) | V_145 -> (e+, ve, G-) | V_146 -> (mu+, vm, G-)
767.13 s
> [2026-09-06 07:46:49.010] @gammalooprs::model INFO : The following 36 couplings were removed by the restriction card:
767.13 s
> GC_13, GC_14, GC_16, GC_17, GC_18, GC_19, GC_20, GC_22, GC_23, GC_24, GC_25, GC_26, GC_28, GC_29, GC_42, GC_43, GC_44, GC_46, GC_47, GC_48, GC_84, GC_85, GC_86, GC_87, GC_88, GC_89, GC_90, GC_91, GC_92, GC_93, GC_101, GC_102, GC_103, GC_105, GC_106, GC_107
767.13 s
> [2026-09-06 07:46:49.011] @gammaloop_api::se... INFO : Running command run set_model_parameters
767.13 s
> [2026-09-06 07:46:49.011] @gammaloop_api::se... INFO : Starting command block set_model_parameters
767.13 s
> [2026-09-06 07:46:49.011] @gammaloop_api::se... INFO : Running command set model MT=173.0
767.13 s
> [2026-09-06 07:46:49.014] @gammaloop_api::se... INFO : Running command set model WT=0.0
767.13 s
> [2026-09-06 07:46:49.017] @gammaloop_api::se... INFO : Running command set model ymt=173.0
767.13 s
> [2026-09-06 07:46:49.020] @gammaloop_api::se... INFO : Running command set model aS=0.118
767.13 s
> [2026-09-06 07:46:49.024] @gammaloop_api::se... INFO : Running command set model aEWM1=137.036
767.13 s
> [2026-09-06 07:46:49.027] @gammaloop_api::se... INFO : Running command set model Gf=1.166390e-05
767.13 s
> [2026-09-06 07:46:49.030] @gammaloop_api::se... INFO : Running command set model MZ=91.188
767.13 s
> [2026-09-06 07:46:49.033] @gammaloop_api::se... INFO : Running command set global string '
767.13 s
> [global.generation.compile]
767.13 s
> compilation_mode = "assembly"
767.13 s
> optimization_level = "O0"
767.13 s
> fast_math = false
767.13 s
> [...]
767.13 s
> [2026-09-06 07:46:49.034] @gammaloop_api::se... INFO : Running command import graphs ./examples/cli/aa_aa/1L/aa_aa_1L.dot -p aa_aa_all_helicities_assembly -i 1L_ppmm -o
767.13 s
> [2026-09-06 07:46:49.034] @commands::import INFO : Loading graphs from '/build/source/examples/cli/aa_aa/1L/aa_aa_1L.dot'
767.13 s
> [2026-09-06 07:46:49.041] @gammaloop_api::se... INFO : Running command generate existing -p aa_aa_all_helicities_assembly
767.13 s
> [2026-09-06 07:47:11.191] @processes::amplitude INFO : Compiling amplitude 1L_ppmm
767.13 s
> [2026-09-06 07:47:28.850] @commands::generate INFO : Removed 34 generated C++ source file(s). Use '--keep-sources ' to keep them.
767.13 s
> [2026-09-06 07:47:28.850] @commands::generate INFO :
767.13 s
> Integrand generation summary
767.13 s
> peak RAM 2.32 GiB | cores 1
767.13 s
> ╭───────────┬───────┬─────────┬──────────────┬─────────────┬────────────────┬──────────────╮
767.13 s
> │ integrand │ graph │ # evals │ expr build │ spenso │ symbolica eval │ compile │
767.13 s
> ├───────────┼───────┼─────────┼──────────────┼─────────────┼────────────────┼──────────────┤
767.13 s
> │ 1L_ppmm │ GL0 │ 13 │ 480ms (3.6% ) │ 1.34s (10% ) │ 5.55s (42% ) │ 5.99s (45% ) │
767.13 s
> │ 1L_ppmm │ GL2 │ 13 │ 475ms (3.5% ) │ 1.50s (11% ) │ 5.42s (40% ) │ 6.29s (46% ) │
767.13 s
> │ 1L_ppmm │ GL4 │ 11 │ 462ms (3.6% ) │ 1.41s (11% ) │ 5.47s (43% ) │ 5.37s (42% ) │
767.13 s
> ├───────────┼───────┼─────────┼──────────────┼─────────────┼────────────────┼──────────────┤
767.13 s
> │ Total │ │ 37 │ 1.42s (3.6% ) │ 4.25s (11% ) │ 16.44s (41% ) │ 17.65s (44% ) │
767.13 s
> ╰───────────┴───────┴─────────┴──────────────┴─────────────┴────────────────┴──────────────╯
767.13 s
> [2026-09-06 07:47:29.455] @gammaloop_api::se... INFO : Running command set process -p aa_aa_all_helicities -i 1L_ppmm string '
767.13 s
> [stability]
767.13 s
> check_on_norm = true
767.13 s
> escalate_if_exact_zero = false
767.13 s
> loop_momenta_norm_escalation_factor = -1.0
767.13 s
> [...]
767.13 s
> [2026-09-06 07:47:29.456] @gammaloop_api::se... INFO : Running command set process -p aa_aa_all_helicities_assembly -i 1L_ppmm string '
767.13 s
> [stability]
767.13 s
> check_on_norm = true
767.13 s
> escalate_if_exact_zero = false
767.13 s
> loop_momenta_norm_escalation_factor = -1.0
767.13 s
> [...]
767.13 s
> [2026-09-06 07:47:29.457] @gammaloop_api::se... INFO : Running command set process -p aa_aa_all_helicities -i 1L_mpmm string '
767.13 s
> [stability]
767.13 s
> check_on_norm = true
767.13 s
> escalate_if_exact_zero = false
767.13 s
> loop_momenta_norm_escalation_factor = -1.0
767.13 s
> [...]
767.13 s
> [2026-09-06 07:47:29.458] @gammaloop_api::se... INFO : Running command set process -p aa_aa_all_helicities_assembly -i 1L_mpmm string '
767.13 s
> [stability]
767.13 s
> check_on_norm = true
767.13 s
> escalate_if_exact_zero = false
767.13 s
> loop_momenta_norm_escalation_factor = -1.0
767.13 s
> [...]
767.13 s
> [2026-09-06 07:47:29.458] @gammaloop_api::se... INFO : Running command set process -p aa_aa_all_helicities -i 1L_mmmm string '
767.13 s
> [stability]
767.13 s
> check_on_norm = true
767.13 s
> escalate_if_exact_zero = false
767.13 s
> loop_momenta_norm_escalation_factor = -1.0
767.13 s
> [...]
767.13 s
> [2026-09-06 07:47:29.459] @gammaloop_api::se... INFO : Running command set process -p aa_aa_all_helicities_assembly -i 1L_mmmm string '
767.13 s
> [stability]
767.13 s
> check_on_norm = true
767.13 s
> escalate_if_exact_zero = false
767.13 s
> loop_momenta_norm_escalation_factor = -1.0
767.13 s
> [...]
767.13 s
> [2026-09-06 07:47:29.460] @gammaloop_api::se... INFO : Running command set process -p aa_aa_all_helicities -i 1L_pmmp string '
767.13 s
> [stability]
767.13 s
> check_on_norm = true
767.13 s
> escalate_if_exact_zero = false
767.13 s
> loop_momenta_norm_escalation_factor = -1.0
767.13 s
> [...]
767.13 s
> [2026-09-06 07:47:29.460] @gammaloop_api::se... INFO : Running command set process -p aa_aa_all_helicities_assembly -i 1L_pmmp string '
767.13 s
> [stability]
767.13 s
> check_on_norm = true
767.13 s
> escalate_if_exact_zero = false
767.13 s
> loop_momenta_norm_escalation_factor = -1.0
767.13 s
> [...]
767.13 s
> [2026-09-06 07:47:29.461] @gammaloop_api::se... INFO : Running command set process -p aa_aa_all_helicities -i 1L_pmpm string '
767.13 s
> [stability]
767.13 s
> check_on_norm = true
767.13 s
> escalate_if_exact_zero = false
767.13 s
> loop_momenta_norm_escalation_factor = -1.0
767.13 s
> [...]
767.13 s
> [2026-09-06 07:47:29.461] @gammaloop_api::se... INFO : Running command set process -p aa_aa_all_helicities_assembly -i 1L_pmpm string '
767.13 s
> [stability]
767.13 s
> check_on_norm = true
767.13 s
> escalate_if_exact_zero = false
767.14 s
> loop_momenta_norm_escalation_factor = -1.0
767.14 s
> [...]
767.14 s
> [2026-09-06 07:47:29.466] @process::amplitude INFO : Input is below threshold: 0 existing threshold E-surfaces across 0/1 graph groups
767.14 s
> [2026-09-06 07:47:29.466] @process::amplitude INFO : overlap structure of group 0: [0: []]
767.14 s
> [2026-09-06 07:47:29.466] @integrands::process [{#im_is_nan, #re_is_nan}] WARNING : final process evaluation is nonfinite
767.14 s
> [2026-09-06 07:47:29.466] @commands::inspect INFO :
767.14 s
> Input point in momentum space:
767.14 s
>
767.14 s
> ( 0.1100000000000000, -0.0700000000000000, 0.1900000000000000 )
767.14 s
>
767.14 s
> The evaluation of integrand '1L_ppmm' is:
767.14 s
>
767.14 s
> ( +0.0000000000000000e0, +0.0000000000000000e0 i)
767.14 s
>
767.14 s
> [2026-09-06 07:47:29.470] @process::amplitude INFO : Input is below threshold: 0 existing threshold E-surfaces across 0/1 graph groups
767.14 s
> [2026-09-06 07:47:29.470] @process::amplitude INFO : overlap structure of group 0: [0: []]
767.14 s
> [2026-09-06 07:47:29.470] @commands::inspect INFO :
767.14 s
> Input point in momentum space:
767.14 s
>
767.14 s
> ( 0.1100000000000000, -0.0700000000000000, 0.1900000000000000 )
767.14 s
>
767.14 s
> The evaluation of integrand '1L_ppmm' is:
767.14 s
>
767.14 s
> ( -1.7132462539328486e-28, -8.7105072229446864e-10 i)
767.14 s
>
767.14 s
> The application panicked (crashed).
767.14 s
> Message: kinematics=a, integrand=1L_ppmm, graph_id=0: assembly vs symjit inspect: actual=(-0.00000000000000000000000000017132462539328486+-0.0000000008710507222944686i), expected=(0+0i), tolerance=0.0000000001
767.14 s
> Location: tests/tests/test_runs/utils.rs :466
767.14 s
>
767.14 s
> ━━━━━━━━━━━━━━━━━━━━━━━━━━━━━━━━━━ BACKTRACE ━━━━━━━━━━━━━━━━━━━━━━━━━━━━━━━━━━━
767.14 s
> 1: <color_eyre[51793ea62743adbd]::config::PanicHook>::panic_report <unknown>
767.14 s
> at <unknown source file> :<unknown line>
767.14 s
> 2: <color_eyre[51793ea62743adbd]::config::PanicHook>::into_panic_hook::{closure#0} <unknown>
767.14 s
> at <unknown source file> :<unknown line>
767.14 s
> 3: std[bcb96dfbba0ab899]::panicking::panic_with_hook <unknown>
767.14 s
> at <unknown source file> :<unknown line>
767.14 s
> 4: std[bcb96dfbba0ab899]::panicking::panic_handler::{closure#0} <unknown>
767.14 s
> at <unknown source file> :<unknown line>
767.14 s
> 5: std[bcb96dfbba0ab899]::sys::backtrace::__rust_end_short_backtrace::<std[bcb96dfbba0ab899]::panicking::panic_handler::{closure#0}, !> <unknown>
767.14 s
> at <unknown source file> :<unknown line>
767.14 s
> 6: __rustc[6c289b9f9c454d21]::rust_begin_unwind <unknown>
767.14 s
> at <unknown source file> :<unknown line>
767.14 s
> 7: core[940e698046960fd5]::panicking::panic_fmt <unknown>
767.14 s
> at <unknown source file> :<unknown line>
767.14 s
> 8: <test_runs[66584badfeb6c7be]::aa_aa::important::aa_aa_local_inspect_backend_consistency::{closure#0} as core[940e698046960fd5]::ops::function::FnOnce<()>>::call_once <unknown>
767.14 s
> at <unknown source file> :<unknown line>
767.14 s
> 9: serial_test[cd99724524a2f1c0]::serial_code_lock::local_serial_core_with_return::<(), eyre[cb2fd339c0c40fca]::Report> <unknown>
767.14 s
> at <unknown source file> :<unknown line>
767.14 s
> 10: <test_runs[66584badfeb6c7be]::aa_aa::important::aa_aa_local_inspect_backend_consistency::{closure#0} as core[940e698046960fd5]::ops::function::FnOnce<()>>::call_once <unknown>
767.14 s
> at <unknown source file> :<unknown line>
767.14 s
> 11: test[75d6903177b1d7e9]::__rust_begin_short_backtrace::<core[940e698046960fd5]::result::Result<(), alloc[2ea6bcb46fca0c42]::string::String>, fn() -> core[940e698046960fd5]::result::Result<(), alloc[2ea6bcb46fca0c42]::string::String>> <unknown>
767.14 s
> at <unknown source file> :<unknown line>
767.14 s
> 12: test[75d6903177b1d7e9]::run_test::{closure#0} <unknown>
767.14 s
> at <unknown source file> :<unknown line>
767.14 s
> 13: std[bcb96dfbba0ab899]::sys::backtrace::__rust_begin_short_backtrace::<test[75d6903177b1d7e9]::run_test::{closure#1}, ()> <unknown>
767.14 s
> at <unknown source file> :<unknown line>
767.14 s
> 14: <std[bcb96dfbba0ab899]::thread::lifecycle::spawn_unchecked<test[75d6903177b1d7e9]::run_test::{closure#1}, ()>::{closure#1} as core[940e698046960fd5]::ops::function::FnOnce<()>>::call_once::{shim:vtable#0} <unknown>
767.14 s
> at <unknown source file> :<unknown line>
767.14 s
> 15: <std[bcb96dfbba0ab899]::sys::thread::unix::Thread>::new::thread_start <unknown>
767.14 s
> at <unknown source file> :<unknown line>
767.14 s
> 16: start_thread <unknown>
767.14 s
> at <unknown source file> :<unknown line>
767.14 s
> 17: __clone3 <unknown>
767.14 s
> at <unknown source file> :<unknown line>
767.14 s
>
767.14 s
> Run with COLORBT_SHOW_HIDDEN=1 environment variable to disable frame filtering.
767.14 s
> Run with RUST_BACKTRACE=full to include source snippets.
767.14 s
>
767.14 s
> error : test run failed
767.14 s
>
767.14 s
> ========== nextest test summary ==========
767.14 s
> report: target/nextest/ci_gammaloop/junit.xml
767.14 s
> tests: 152, failures: 1, errors: 0
767.14 s
>
767.14 s
> 1. gammaloop-integration-tests::test_runs::aa_aa::important::aa_aa_local_inspect_backend_consistency
767.14 s
> failure: test failure with exit code 101
767.14 s
> system-out
767.14 s
> running 1 test
767.14 s
> test aa_aa::important::aa_aa_local_inspect_backend_consistency has been running for over 60 seconds
767.14 s
> test aa_aa::important::aa_aa_local_inspect_backend_consistency ... FAILED
767.14 s
>
767.14 s
> failures:
767.14 s
>
767.14 s
> failures:
767.14 s
> aa_aa::important::aa_aa_local_inspect_backend_consistency
767.14 s
>
767.14 s
> test result: FAILED. 0 passed; 1 failed; 0 ignored; 0 measured; 258 filtered out; finished in 66.52s
767.14 s
> system-err
767.14 s
> [2026-09-06 07:46:23.373] @gammaloop_api::se... INFO : Running command import model sm-default.json
767.14 s
> [2026-09-06 07:46:23.373] @import::model INFO : Loading built-in JSON model sm-default
767.14 s
> [2026-09-06 07:46:23.391] @gammalooprs::model INFO : The following 11 external parameters were forced to zero by the restriction card:
767.14 s
> lamWS, AWS, rhoWS, etaWS, ymc, yme, ymm, MC, Me, MM, WTau
767.14 s
> [2026-09-06 07:46:23.391] @gammalooprs::model INFO : The following 34 vertex rules were removed by the restriction card:
767.14 s
> V_82 -> (c~, d, G+) | V_83 -> (t~, d, G+) | V_84 -> (c~, s, G+) | V_85 -> (t~, s, G+) | V_86 -> (u~, b, G+) | V_87 -> (c~, b, G+) | V_90 -> (c~, d, W+) | V_91 -> (t~, d, W+) | V_92 -> (u~, s, W+) | V_94 -> (t~, s, W+) | V_95 -> (u~, b, W+) | V_96 -> (c~, b, W+) | V_101 -> (e+, e-, G0) | V_102 -> (mu+, mu-, G0) | V_104 -> (e+, e-, H) | V_105 -> (mu+, mu-, H) | V_110 -> (ve~, e-, G+) | V_111 -> (vm~, mu-, G+) | V_116 -> (b~, u, G-) | V_117 -> (d~, c, G-) | V_118 -> (s~, c, G-) | V_119 -> (b~, c, G-) | V_120 -> (d~, t, G-) | V_121 -> (s~, t, G-) | V_124 -> (s~, u, W-) | V_125 -> (b~, u, W-) | V_126 -> (d~, c, W-) | V_128 -> (b~, c, W-) | V_129 -> (d~, t, W-) | V_130 -> (s~, t, W-) | V_138 -> (c~, c, G0) | V_140 -> (c~, c, H) | V_145 -> (e+, ve, G-) | V_146 -> (mu+, vm, G-)
767.14 s
> [2026-09-06 07:46:23.391] @gammalooprs::model INFO : The following 36 couplings were removed by the restriction card:
767.14 s
> GC_13, GC_14, GC_16, GC_17, GC_18, GC_19, GC_20, GC_22, GC_23, GC_24, GC_25, GC_26, GC_28, GC_29, GC_42, GC_43, GC_44, GC_46, GC_47, GC_48, GC_84, GC_85, GC_86, GC_87, GC_88, GC_89, GC_90, GC_91, GC_92, GC_93, GC_101, GC_102, GC_103, GC_105, GC_106, GC_107
767.14 s
> [2026-09-06 07:46:23.392] @gammaloop_api::se... INFO : Running command run set_model_parameters
767.14 s
> [2026-09-06 07:46:23.392] @gammaloop_api::se... INFO : Starting command block set_model_parameters
767.14 s
> [2026-09-06 07:46:23.392] @gammaloop_api::se... INFO : Running command set model MT=173.0
767.14 s
> [2026-09-06 07:46:23.395] @gammaloop_api::se... INFO : Running command set model WT=0.0
767.14 s
> [2026-09-06 07:46:23.398] @gammaloop_api::se... INFO : Running command set model ymt=173.0
767.14 s
> [2026-09-06 07:46:23.402] @gammaloop_api::se... INFO : Running command set model aS=0.118
767.14 s
> [2026-09-06 07:46:23.405] @gammaloop_api::se... INFO : Running command set model aEWM1=137.036
767.14 s
> [2026-09-06 07:46:23.408] @gammaloop_api::se... INFO : Running command set model Gf=1.166390e-05
767.14 s
> [2026-09-06 07:46:23.411] @gammaloop_api::se... INFO : Running command set model MZ=91.188
767.14 s
> [2026-09-06 07:46:23.415] @gammaloop_api::se... INFO : Running command set global string '
767.14 s
> [global.generation.compile]
767.14 s
> compilation_mode = "symjit"
767.14 s
> optimization_level = "O0"
767.14 s
> fast_math = false
767.14 s
> [...]
767.14 s
> [2026-09-06 07:46:23.416] @gammaloop_api::se... INFO : Running command import graphs ./examples/cli/aa_aa/1L/aa_aa_1L.dot -p aa_aa_all_helicities -i 1L_ppmm -o
767.14 s
> [2026-09-06 07:46:23.416] @commands::import INFO : Loading graphs from '/build/source/examples/cli/aa_aa/1L/aa_aa_1L.dot'
767.14 s
> [2026-09-06 07:46:23.423] @gammaloop_api::se... INFO : Running command generate existing -p aa_aa_all_helicities
767.14 s
> [2026-09-06 07:46:48.360] @commands::generate INFO :
767.14 s
> Integrand generation summary
767.14 s
> peak RAM 1012.75 MiB | cores 1
767.14 s
> ╭───────────┬───────┬─────────┬──────────────┬─────────────┬────────────────┬───────────────╮
767.14 s
> │ integrand │ graph │ # evals │ expr build │ spenso │ symbolica eval │ compile │
767.14 s
> ├───────────┼───────┼─────────┼──────────────┼─────────────┼────────────────┼───────────────┤
767.14 s
> │ 1L_ppmm │ GL0 │ 13 │ 498ms (5.9%) │ 1.62s (19%) │ 5.50s (65%) │ 842ms (10.0%) │
767.14 s
> │ 1L_ppmm │ GL2 │ 13 │ 477ms (5.7%) │ 1.47s (18%) │ 5.62s (67%) │ 803ms (9.6%) │
767.14 s
> │ 1L_ppmm │ GL4 │ 11 │ 463ms (5.8%) │ 1.37s (17%) │ 5.43s (68%) │ 756ms (9.4%) │
767.14 s
> ├───────────┼───────┼─────────┼──────────────┼─────────────┼────────────────┼───────────────┤
767.14 s
> │ Total │ │ 37 │ 1.44s (5.8%) │ 4.46s (18%) │ 16.55s (67%) │ 2.40s (9.7%) │
767.14 s
> ╰───────────┴───────┴─────────┴──────────────┴─────────────┴────────────────┴───────────────╯
767.14 s
> [2026-09-06 07:46:48.993] @gammaloop_api::se... INFO : Running command import model sm-default.json
767.14 s
> [2026-09-06 07:46:48.993] @import::model INFO : Loading built-in JSON model sm-default
767.14 s
> [2026-09-06 07:46:49.010] @gammalooprs::model INFO : The following 11 external parameters were forced to zero by the restriction card:
767.14 s
> lamWS, AWS, rhoWS, etaWS, ymc, yme, ymm, MC, Me, MM, WTau
767.14 s
> [2026-09-06 07:46:49.010] @gammalooprs::model INFO : The following 34 vertex rules were removed by the restriction card:
767.14 s
> V_82 -> (c~, d, G+) | V_83 -> (t~, d, G+) | V_84 -> (c~, s, G+) | V_85 -> (t~, s, G+) | V_86 -> (u~, b, G+) | V_87 -> (c~, b, G+) | V_90 -> (c~, d, W+) | V_91 -> (t~, d, W+) | V_92 -> (u~, s, W+) | V_94 -> (t~, s, W+) | V_95 -> (u~, b, W+) | V_96 -> (c~, b, W+) | V_101 -> (e+, e-, G0) | V_102 -> (mu+, mu-, G0) | V_104 -> (e+, e-, H) | V_105 -> (mu+, mu-, H) | V_110 -> (ve~, e-, G+) | V_111 -> (vm~, mu-, G+) | V_116 -> (b~, u, G-) | V_117 -> (d~, c, G-) | V_118 -> (s~, c, G-) | V_119 -> (b~, c, G-) | V_120 -> (d~, t, G-) | V_121 -> (s~, t, G-) | V_124 -> (s~, u, W-) | V_125 -> (b~, u, W-) | V_126 -> (d~, c, W-) | V_128 -> (b~, c, W-) | V_129 -> (d~, t, W-) | V_130 -> (s~, t, W-) | V_138 -> (c~, c, G0) | V_140 -> (c~, c, H) | V_145 -> (e+, ve, G-) | V_146 -> (mu+, vm, G-)
767.14 s
> [2026-09-06 07:46:49.010] @gammalooprs::model INFO : The following 36 couplings were removed by the restriction card:
767.14 s
> GC_13, GC_14, GC_16, GC_17, GC_18, GC_19, GC_20, GC_22, GC_23, GC_24, GC_25, GC_26, GC_28, GC_29, GC_42, GC_43, GC_44, GC_46, GC_47, GC_48, GC_84, GC_85, GC_86, GC_87, GC_88, GC_89, GC_90, GC_91, GC_92, GC_93, GC_101, GC_102, GC_103, GC_105, GC_106, GC_107
767.14 s
> [2026-09-06 07:46:49.011] @gammaloop_api::se... INFO : Running command run set_model_parameters
767.14 s
> [2026-09-06 07:46:49.011] @gammaloop_api::se... INFO : Starting command block set_model_parameters
767.14 s
> [2026-09-06 07:46:49.011] @gammaloop_api::se... INFO : Running command set model MT=173.0
767.14 s
> [2026-09-06 07:46:49.014] @gammaloop_api::se... INFO : Running command set model WT=0.0
767.14 s
> [2026-09-06 07:46:49.017] @gammaloop_api::se... INFO : Running command set model ymt=173.0
767.14 s
> [2026-09-06 07:46:49.020] @gammaloop_api::se... INFO : Running command set model aS=0.118
767.14 s
> [2026-09-06 07:46:49.024] @gammaloop_api::se... INFO : Running command set model aEWM1=137.036
767.14 s
> [2026-09-06 07:46:49.027] @gammaloop_api::se... INFO : Running command set model Gf=1.166390e-05
767.14 s
> [2026-09-06 07:46:49.030] @gammaloop_api::se... INFO : Running command set model MZ=91.188
767.14 s
> [2026-09-06 07:46:49.033] @gammaloop_api::se... INFO : Running command set global string '
767.14 s
> [global.generation.compile]
767.14 s
> compilation_mode = "assembly"
767.14 s
> optimization_level = "O0"
767.14 s
> fast_math = false
767.14 s
> [...]
767.14 s
> [2026-09-06 07:46:49.034] @gammaloop_api::se... INFO : Running command import graphs ./examples/cli/aa_aa/1L/aa_aa_1L.dot -p aa_aa_all_helicities_assembly -i 1L_ppmm -o
767.14 s
> [2026-09-06 07:46:49.034] @commands::import INFO : Loading graphs from '/build/source/examples/cli/aa_aa/1L/aa_aa_1L.dot'
767.14 s
> [2026-09-06 07:46:49.041] @gammaloop_api::se... INFO : Running command generate existing -p aa_aa_all_helicities_assembly
767.14 s
> [2026-09-06 07:47:11.191] @processes::amplitude INFO : Compiling amplitude 1L_ppmm
767.14 s
> [2026-09-06 07:47:28.850] @commands::generate INFO : Removed 34 generated C++ source file(s). Use '--keep-sources' to keep them.
767.14 s
> [2026-09-06 07:47:28.850] @commands::generate INFO :
767.14 s
> Integrand generation summary
767.14 s
> peak RAM 2.32 GiB | cores 1
767.14 s
> ╭───────────┬───────┬─────────┬──────────────┬─────────────┬────────────────┬──────────────╮
767.14 s
> │ integrand │ graph │ # evals │ expr build │ spenso │ symbolica eval │ compile │
767.14 s
> ├───────────┼───────┼─────────┼──────────────┼─────────────┼────────────────┼──────────────┤
767.14 s
> │ 1L_ppmm │ GL0 │ 13 │ 480ms (3.6%) │ 1.34s (10%) │ 5.55s (42%) │ 5.99s (45%) │
767.14 s
> │ 1L_ppmm │ GL2 │ 13 │ 475ms (3.5%) │ 1.50s (11%) │ 5.42s (40%) │ 6.29s (46%) │
767.14 s
> │ 1L_ppmm │ GL4 │ 11 │ 462ms (3.6%) │ 1.41s (11%) │ 5.47s (43%) │ 5.37s (42%) │
767.14 s
> ├───────────┼───────┼─────────┼──────────────┼─────────────┼────────────────┼──────────────┤
767.14 s
> │ Total │ │ 37 │ 1.42s (3.6%) │ 4.25s (11%) │ 16.44s (41%) │ 17.65s (44%) │
767.14 s
> ╰───────────┴───────┴─────────┴──────────────┴─────────────┴────────────────┴──────────────╯
767.14 s
> [2026-09-06 07:47:29.455] @gammaloop_api::se... INFO : Running command set process -p aa_aa_all_helicities -i 1L_ppmm string '
767.14 s
> [stability]
767.14 s
> check_on_norm = true
767.14 s
> escalate_if_exact_zero = false
767.14 s
> loop_momenta_norm_escalation_factor = -1.0
767.14 s
> [...]
767.14 s
> [2026-09-06 07:47:29.456] @gammaloop_api::se... INFO : Running command set process -p aa_aa_all_helicities_assembly -i 1L_ppmm string '
767.14 s
> [stability]
767.14 s
> check_on_norm = true
767.14 s
> escalate_if_exact_zero = false
767.14 s
> loop_momenta_norm_escalation_factor = -1.0
767.14 s
> [...]
767.14 s
> [2026-09-06 07:47:29.457] @gammaloop_api::se... INFO : Running command set process -p aa_aa_all_helicities -i 1L_mpmm string '
767.14 s
> [stability]
767.14 s
> check_on_norm = true
767.14 s
> escalate_if_exact_zero = false
767.14 s
> loop_momenta_norm_escalation_factor = -1.0
767.14 s
> [...]
767.14 s
> [2026-09-06 07:47:29.458] @gammaloop_api::se... INFO : Running command set process -p aa_aa_all_helicities_assembly -i 1L_mpmm string '
767.14 s
> [stability]
767.14 s
> check_on_norm = true
767.14 s
> escalate_if_exact_zero = false
767.14 s
> loop_momenta_norm_escalation_factor = -1.0
767.14 s
> [...]
767.14 s
> [2026-09-06 07:47:29.458] @gammaloop_api::se... INFO : Running command set process -p aa_aa_all_helicities -i 1L_mmmm string '
767.14 s
> [stability]
767.14 s
> check_on_norm = true
767.14 s
> escalate_if_exact_zero = false
767.14 s
> loop_momenta_norm_escalation_factor = -1.0
767.14 s
> [...]
767.14 s
> [2026-09-06 07:47:29.459] @gammaloop_api::se... INFO : Running command set process -p aa_aa_all_helicities_assembly -i 1L_mmmm string '
767.14 s
> [stability]
767.14 s
> check_on_norm = true
767.14 s
> escalate_if_exact_zero = false
767.14 s
> loop_momenta_norm_escalation_factor = -1.0
767.14 s
> [...]
767.14 s
> [2026-09-06 07:47:29.460] @gammaloop_api::se... INFO : Running command set process -p aa_aa_all_helicities -i 1L_pmmp string '
767.14 s
> [stability]
767.14 s
> check_on_norm = true
767.14 s
> escalate_if_exact_zero = false
767.14 s
> loop_momenta_norm_escalation_factor = -1.0
767.14 s
> ... omitted 84 more lines; see full nextest output above
767.14 s
> =========================================
767.14 s
For full logs, run:
767.14 s
nix log /nix/store/xaf9bwgnrhpb0jrkx6mcwl1pfl8pk1ly-gammaloop-nextest-integration.drv
767.25 s
[0 built (1 failed ), 0.0 Run failed.