test packages.x86_64-linux.nix-ci-check-gammaloop-nextest-integration

Reproduce this run
Retry Run
  1. 0.00 s $ /nix/store/9ypz3flqsrl5xl495mm8h645gadjsxi1-coreutils-9.11/bin/timeout --kill-after=15s 7200s /nix/store/23zk8sgzamrbmj1fday15szf7f2279s8-nix-2.34.7/bin/nix --extra-experimental-features nix-command --extra-experimental-features flakes flake clone git+https://github.com/alphal00p/gammaloop --dest /tmp/nix-ci-worker/stable-pwd/repo/
  2. 0.07 s Cloning into '/tmp/nix-ci-worker/stable-pwd/repo'...
  3. 1.43 s remote: Enumerating objects: 78074, done.
  4. 1.54 s remote: Counting objects: 0% (1/13896) remote: Counting objects: 1% (139/13896) remote: Counting objects: 2% (278/13896) remote: Counting objects: 3% (417/13896) remote: Counting objects: 4% (556/13896) remote: Counting objects: 5% (695/13896) remote: Counting objects: 6% (834/13896) remote: Counting objects: 7% (973/13896) remote: Counting objects: 8% (1112/13896) remote: Counting objects: 9% (1251/13896) remote: Counting objects: 10% (1390/13896) remote: Counting objects: 11% (1529/13896) remote: Counting objects: 12% (1668/13896) remote: Counting objects: 13% (1807/13896) remote: Counting objects: 14% (1946/13896) remote: Counting objects: 15% (2085/13896) remote: Counting objects: 16% (2224/13896) remote: Counting objects: 17% (2363/13896) remote: Counting objects: 18% (2502/13896) remote: Counting objects: 19% (2641/13896) remote: Counting objects: 20% (2780/13896) remote: Counting objects: 21% (2919/13896) remote: Counting objects: 22% (3058/13896) remote: Counting objects: 23% (3197/13896) remote: Counting objects: 24% (3336/13896) remote: Counting objects: 25% (3474/13896) remote: Counting objects: 26% (3613/13896) remote: Counting objects: 27% (3752/13896) remote: Counting objects: 28% (3891/13896) remote: Counting objects: 29% (4030/13896) remote: Counting objects: 30% (4169/13896) remote: Counting objects: 31% (4308/13896) remote: Counting objects: 32% (4447/13896) remote: Counting objects: 33% (4586/13896) remote: Counting objects: 34% (4725/13896) remote: Counting objects: 35% (4864/13896) remote: Counting objects: 36% (5003/13896) remote: Counting objects: 37% (5142/13896) remote: Counting objects: 38% (5281/13896) remote: Counting objects: 39% (5420/13896) remote: Counting objects: 40% (5559/13896) remote: Counting objects: 41% (5698/13896) remote: Counting objects: 42% (5837/13896) remote: Counting objects: 43% (5976/13896) remote: Counting objects: 44% (6115/13896) remote: Counting objects: 45% (6254/13896) remote: Counting objects: 46% (6393/13896) remote: Counting objects: 47% (6532/13896) remote: Counting objects: 48% (6671/13896) remote: Counting objects: 49% (6810/13896) remote: Counting objects: 50% (6948/13896) remote: Counting objects: 51% (7087/13896) remote: Counting objects: 52% (7226/13896) remote: Counting objects: 53% (7365/13896) remote: Counting objects: 54% (7504/13896) remote: Counting objects: 55% (7643/13896) remote: Counting objects: 56% (7782/13896) remote: Counting objects: 57% (7921/13896) remote: Counting objects: 58% (8060/13896) remote: Counting objects: 59% (8199/13896) remote: Counting objects: 60% (8338/13896) remote: Counting objects: 61% (8477/13896) remote: Counting objects: 62% (8616/13896) remote: Counting objects: 63% (8755/13896) remote: Counting objects: 64% (8894/13896) remote: Counting objects: 65% (9033/13896) remote: Counting objects: 66% (9172/13896) remote: Counting objects: 67% (9311/13896) remote: Counting objects: 68% (9450/13896) remote: Counting objects: 69% (9589/13896) remote: Counting objects: 70% (9728/13896) remote: Counting objects: 71% (9867/13896) remote: Counting objects: 72% (10006/13896) remote: Counting objects: 73% (10145/13896) remote: Counting objects: 74% (10284/13896) remote: Counting objects: 75% (10422/13896) remote: Counting objects: 76% (10561/13896) remote: Counting objects: 77% (10700/13896) remote: Counting objects: 78% (10839/13896) remote: Counting objects: 79% (10978/13896) remote: Counting objects: 80% (11117/13896) remote: Counting objects: 81% (11256/13896) remote: Counting objects: 82% (11395/13896) remote: Counting objects: 83% (11534/13896) remote: Counting objects: 84% (11673/13896) remote: Counting objects: 85% (11812/13896) remote: Counting objects: 86% (11951/13896) remote: Counting objects: 87% (12090/13896) remote: Counting objects: 88% (12229/13896) remote: Counting objects: 89% (12368/13896) remote: Counting objects: 90% (12507/13896) remote: Counting objects: 91% (12646/13896) remote: Counting objects: 92% (12785/13896) remote: Counting objects: 93% (12924/13896) remote: Counting objects: 94% (13063/13896) remote: Counting objects: 95% (13202/13896) remote: Counting objects: 96% (13341/13896) remote: Counting objects: 97% (13480/13896) remote: Counting objects: 98% (13619/13896) remote: Counting objects: 99% (13758/13896) remote: Counting objects: 100% (13896/13896) remote: Counting objects: 100% (13896/13896), done.
  5. 4.44 s remote: Compressing objects: 0% (1/3083) remote: Compressing objects: 1% (31/3083) remote: Compressing objects: 2% (62/3083) remote: Compressing objects: 3% (93/3083) remote: Compressing objects: 4% (124/3083) remote: Compressing objects: 5% (155/3083) remote: Compressing objects: 6% (185/3083) remote: Compressing objects: 7% (216/3083) remote: Compressing objects: 8% (247/3083) remote: Compressing objects: 9% (278/3083) remote: Compressing objects: 10% (309/3083) remote: Compressing objects: 11% (340/3083) remote: Compressing objects: 12% (370/3083) remote: Compressing objects: 13% (401/3083) remote: Compressing objects: 14% (432/3083) remote: Compressing objects: 15% (463/3083) remote: Compressing objects: 16% (494/3083) remote: Compressing objects: 17% (525/3083) remote: Compressing objects: 18% (555/3083) remote: Compressing objects: 19% (586/3083) remote: Compressing objects: 20% (617/3083) remote: Compressing objects: 21% (648/3083) remote: Compressing objects: 22% (679/3083) remote: Compressing objects: 23% (710/3083) remote: Compressing objects: 24% (740/3083) remote: Compressing objects: 24% (769/3083) remote: Compressing objects: 25% (771/3083) remote: Compressing objects: 26% (802/3083) remote: Compressing objects: 27% (833/3083) remote: Compressing objects: 28% (864/3083) remote: Compressing objects: 28% (867/3083) remote: Compressing objects: 29% (895/3083) remote: Compressing objects: 30% (925/3083) remote: Compressing objects: 31% (956/3083) remote: Compressing objects: 32% (987/3083) remote: Compressing objects: 33% (1018/3083) remote: Compressing objects: 34% (1049/3083) remote: Compressing objects: 35% (1080/3083) remote: Compressing objects: 36% (1110/3083) remote: Compressing objects: 37% (1141/3083) remote: Compressing objects: 38% (1172/3083) remote: Compressing objects: 39% (1203/3083) remote: Compressing objects: 40% (1234/3083) remote: Compressing objects: 41% (1265/3083) remote: Compressing objects: 42% (1295/3083) remote: Compressing objects: 43% (1326/3083) remote: Compressing objects: 44% (1357/3083) remote: Compressing objects: 45% (1388/3083) remote: Compressing objects: 46% (1419/3083) remote: Compressing objects: 47% (1450/3083) remote: Compressing objects: 48% (1480/3083) remote: Compressing objects: 49% (1511/3083) remote: Compressing objects: 50% (1542/3083) remote: Compressing objects: 51% (1573/3083) remote: Compressing objects: 52% (1604/3083) remote: Compressing objects: 53% (1634/3083) remote: Compressing objects: 54% (1665/3083) remote: Compressing objects: 55% (1696/3083) remote: Compressing objects: 56% (1727/3083) remote: Compressing objects: 57% (1758/3083) remote: Compressing objects: 58% (1789/3083) remote: Compressing objects: 59% (1819/3083) remote: Compressing objects: 60% (1850/3083) remote: Compressing objects: 61% (1881/3083) remote: Compressing objects: 62% (1912/3083) remote: Compressing objects: 63% (1943/3083) remote: Compressing objects: 64% (1974/3083) remote: Compressing objects: 65% (2004/3083) remote: Compressing objects: 66% (2035/3083) remote: Compressing objects: 67% (2066/3083) remote: Compressing objects: 68% (2097/3083) remote: Compressing objects: 69% (2128/3083) remote: Compressing objects: 70% (2159/3083) remote: Compressing objects: 71% (2189/3083) remote: Compressing objects: 72% (2220/3083) remote: Compressing objects: 73% (2251/3083) remote: Compressing objects: 74% (2282/3083) remote: Compressing objects: 75% (2313/3083) remote: Compressing objects: 76% (2344/3083) remote: Compressing objects: 77% (2374/3083) remote: Compressing objects: 78% (2405/3083) remote: Compressing objects: 79% (2436/3083) remote: Compressing objects: 80% (2467/3083) remote: Compressing objects: 81% (2498/3083) remote: Compressing objects: 82% (2529/3083) remote: Compressing objects: 83% (2559/3083) remote: Compressing objects: 84% (2590/3083) remote: Compressing objects: 85% (2621/3083) remote: Compressing objects: 86% (2652/3083) remote: Compressing objects: 87% (2683/3083) remote: Compressing objects: 88% (2714/3083) remote: Compressing objects: 89% (2744/3083) remote: Compressing objects: 90% (2775/3083) remote: Compressing objects: 91% (2806/3083) remote: Compressing objects: 92% (2837/3083) remote: Compressing objects: 93% (2868/3083) remote: Compressing objects: 94% (2899/3083) remote: Compressing objects: 95% (2929/3083) remote: Compressing objects: 96% (2960/3083) remote: Compressing objects: 97% (2991/3083) remote: Compressing objects: 98% (3022/3083) remote: Compressing objects: 98% (3042/3083) remote: Compressing objects: 99% (3053/3083) remote: Compressing objects: 100% (3083/3083) remote: Compressing objects: 100% (3083/3083), done.
  6. 8.06 s Receiving objects: 0% (1/78074) Receiving objects: 1% (781/78074) Receiving objects: 2% (1562/78074) Receiving objects: 3% (2343/78074) Receiving objects: 4% (3123/78074) Receiving objects: 5% (3904/78074) Receiving objects: 6% (4685/78074) Receiving objects: 7% (5466/78074) Receiving objects: 8% (6246/78074) Receiving objects: 9% (7027/78074) Receiving objects: 10% (7808/78074), 16.59 MiB | 33.16 MiB/s Receiving objects: 11% (8589/78074), 16.59 MiB | 33.16 MiB/s Receiving objects: 12% (9369/78074), 16.59 MiB | 33.16 MiB/s Receiving objects: 13% (10150/78074), 16.59 MiB | 33.16 MiB/s Receiving objects: 14% (10931/78074), 16.59 MiB | 33.16 MiB/s Receiving objects: 15% (11712/78074), 16.59 MiB | 33.16 MiB/s Receiving objects: 16% (12492/78074), 16.59 MiB | 33.16 MiB/s Receiving objects: 17% (13273/78074), 16.59 MiB | 33.16 MiB/s Receiving objects: 18% (14054/78074), 16.59 MiB | 33.16 MiB/s Receiving objects: 19% (14835/78074), 16.59 MiB | 33.16 MiB/s Receiving objects: 20% (15615/78074), 16.59 MiB | 33.16 MiB/s Receiving objects: 21% (16396/78074), 16.59 MiB | 33.16 MiB/s Receiving objects: 22% (17177/78074), 16.59 MiB | 33.16 MiB/s Receiving objects: 23% (17958/78074), 16.59 MiB | 33.16 MiB/s Receiving objects: 24% (18738/78074), 16.59 MiB | 33.16 MiB/s Receiving objects: 25% (19519/78074), 16.59 MiB | 33.16 MiB/s Receiving objects: 26% (20300/78074), 16.59 MiB | 33.16 MiB/s Receiving objects: 27% (21080/78074), 16.59 MiB | 33.16 MiB/s Receiving objects: 28% (21861/78074), 16.59 MiB | 33.16 MiB/s Receiving objects: 29% (22642/78074), 16.59 MiB | 33.16 MiB/s Receiving objects: 30% (23423/78074), 16.59 MiB | 33.16 MiB/s Receiving objects: 31% (24203/78074), 16.59 MiB | 33.16 MiB/s Receiving objects: 32% (24984/78074), 16.59 MiB | 33.16 MiB/s Receiving objects: 33% (25765/78074), 16.59 MiB | 33.16 MiB/s Receiving objects: 34% (26546/78074), 16.59 MiB | 33.16 MiB/s Receiving objects: 35% (27326/78074), 16.59 MiB | 33.16 MiB/s Receiving objects: 36% (28107/78074), 16.59 MiB | 33.16 MiB/s Receiving objects: 37% (28888/78074), 16.59 MiB | 33.16 MiB/s Receiving objects: 38% (29669/78074), 16.59 MiB | 33.16 MiB/s Receiving objects: 39% (30449/78074), 16.59 MiB | 33.16 MiB/s Receiving objects: 40% (31230/78074), 16.59 MiB | 33.16 MiB/s Receiving objects: 41% (32011/78074), 16.59 MiB | 33.16 MiB/s Receiving objects: 42% (32792/78074), 16.59 MiB | 33.16 MiB/s Receiving objects: 43% (33572/78074), 16.59 MiB | 33.16 MiB/s Receiving objects: 43% (33769/78074), 31.75 MiB | 31.56 MiB/s Receiving objects: 44% (34353/78074), 31.75 MiB | 31.56 MiB/s Receiving objects: 45% (35134/78074), 31.75 MiB | 31.56 MiB/s Receiving objects: 46% (35915/78074), 31.75 MiB | 31.56 MiB/s Receiving objects: 47% (36695/78074), 31.75 MiB | 31.56 MiB/s Receiving objects: 48% (37476/78074), 31.75 MiB | 31.56 MiB/s Receiving objects: 49% (38257/78074), 31.75 MiB | 31.56 MiB/s Receiving objects: 50% (39037/78074), 31.75 MiB | 31.56 MiB/s Receiving objects: 51% (39818/78074), 31.75 MiB | 31.56 MiB/s Receiving objects: 52% (40599/78074), 31.75 MiB | 31.56 MiB/s Receiving objects: 53% (41380/78074), 31.75 MiB | 31.56 MiB/s Receiving objects: 54% (42160/78074), 31.75 MiB | 31.56 MiB/s Receiving objects: 55% (42941/78074), 50.61 MiB | 32.27 MiB/s Receiving objects: 56% (43722/78074), 50.61 MiB | 32.27 MiB/s Receiving objects: 57% (44503/78074), 50.61 MiB | 32.27 MiB/s Receiving objects: 58% (45283/78074), 50.61 MiB | 32.27 MiB/s Receiving objects: 59% (46064/78074), 50.61 MiB | 32.27 MiB/s Receiving objects: 60% (46845/78074), 50.61 MiB | 32.27 MiB/s Receiving objects: 61% (47626/78074), 50.61 MiB | 32.27 MiB/s Receiving objects: 62% (48406/78074), 50.61 MiB | 32.27 MiB/s Receiving objects: 62% (48917/78074), 50.61 MiB | 32.27 MiB/s Receiving objects: 63% (49187/78074), 50.61 MiB | 32.27 MiB/s Receiving objects: 64% (49968/78074), 50.61 MiB | 32.27 MiB/s Receiving objects: 65% (50749/78074), 69.73 MiB | 32.72 MiB/s Receiving objects: 66% (51529/78074), 69.73 MiB | 32.72 MiB/s Receiving objects: 67% (52310/78074), 69.73 MiB | 32.72 MiB/s Receiving objects: 68% (53091/78074), 69.73 MiB | 32.72 MiB/s Receiving objects: 69% (53872/78074), 69.73 MiB | 32.72 MiB/s Receiving objects: 70% (54652/78074), 69.73 MiB | 32.72 MiB/s Receiving objects: 71% (55433/78074), 69.73 MiB | 32.72 MiB/s Receiving objects: 72% (56214/78074), 69.73 MiB | 32.72 MiB/s Receiving objects: 73% (56995/78074), 69.73 MiB | 32.72 MiB/s Receiving objects: 74% (57775/78074), 69.73 MiB | 32.72 MiB/s Receiving objects: 75% (58556/78074), 69.73 MiB | 32.72 MiB/s Receiving objects: 76% (59337/78074), 69.73 MiB | 32.72 MiB/s Receiving objects: 77% (60117/78074), 69.73 MiB | 32.72 MiB/s Receiving objects: 78% (60898/78074), 88.68 MiB | 33.71 MiB/s Receiving objects: 79% (61679/78074), 88.68 MiB | 33.71 MiB/s Receiving objects: 80% (62460/78074), 88.68 MiB | 33.71 MiB/s Receiving objects: 81% (63240/78074), 88.68 MiB | 33.71 MiB/s Receiving objects: 81% (63424/78074), 88.68 MiB | 33.71 MiB/s Receiving objects: 82% (64021/78074), 104.29 MiB | 33.17 MiB/s Receiving objects: 83% (64802/78074), 104.29 MiB | 33.17 MiB/s Receiving objects: 84% (65583/78074), 104.29 MiB | 33.17 MiB/s Receiving objects: 85% (66363/78074), 104.29 MiB | 33.17 MiB/s Receiving objects: 86% (67144/78074), 104.29 MiB | 33.17 MiB/s Receiving objects: 87% (67925/78074), 104.29 MiB | 33.17 MiB/s Receiving objects: 88% (68706/78074), 104.29 MiB | 33.17 MiB/s Receiving objects: 89% (69486/78074), 104.29 MiB | 33.17 MiB/s Receiving objects: 90% (70267/78074), 104.29 MiB | 33.17 MiB/s Receiving objects: 91% (71048/78074), 104.29 MiB | 33.17 MiB/s Receiving objects: 92% (71829/78074), 104.29 MiB | 33.17 MiB/s Receiving objects: 93% (72609/78074), 104.29 MiB | 33.17 MiB/s Receiving objects: 94% (73390/78074), 104.29 MiB | 33.17 MiB/s Receiving objects: 95% (74171/78074), 104.29 MiB | 33.17 MiB/s Receiving objects: 96% (74952/78074), 104.29 MiB | 33.17 MiB/s Receiving objects: 97% (75732/78074), 104.29 MiB | 33.17 MiB/s Receiving objects: 98% (76513/78074), 104.29 MiB | 33.17 MiB/s Receiving objects: 99% (77294/78074), 104.29 MiB | 33.17 MiB/s remote: Total 78074 (delta 9798), reused 11670 (delta 8716), pack-reused 64178 (from 2)
  7. 8.06 s Receiving objects: 100% (78074/78074), 104.29 MiB | 33.17 MiB/s Receiving objects: 100% (78074/78074), 120.78 MiB | 33.42 MiB/s, done.
  8. 8.84 s Resolving deltas: 0% (0/53117) Resolving deltas: 1% (532/53117) Resolving deltas: 2% (1063/53117) Resolving deltas: 3% (1596/53117) Resolving deltas: 4% (2125/53117) Resolving deltas: 5% (2656/53117) Resolving deltas: 6% (3188/53117) Resolving deltas: 7% (3719/53117) Resolving deltas: 8% (4250/53117) Resolving deltas: 9% (4782/53117) Resolving deltas: 10% (5312/53117) Resolving deltas: 11% (5843/53117) Resolving deltas: 12% (6375/53117) Resolving deltas: 13% (6906/53117) Resolving deltas: 14% (7437/53117) Resolving deltas: 15% (7968/53117) Resolving deltas: 16% (8500/53117) Resolving deltas: 17% (9030/53117) Resolving deltas: 18% (9562/53117) Resolving deltas: 19% (10093/53117) Resolving deltas: 20% (10625/53117) Resolving deltas: 21% (11155/53117) Resolving deltas: 22% (11686/53117) Resolving deltas: 23% (12217/53117) Resolving deltas: 24% (12749/53117) Resolving deltas: 25% (13281/53117) Resolving deltas: 26% (13811/53117) Resolving deltas: 27% (14343/53117) Resolving deltas: 28% (14874/53117) Resolving deltas: 29% (15404/53117) Resolving deltas: 30% (15936/53117) Resolving deltas: 31% (16467/53117) Resolving deltas: 32% (16998/53117) Resolving deltas: 33% (17529/53117) Resolving deltas: 34% (18060/53117) Resolving deltas: 35% (18591/53117) Resolving deltas: 36% (19124/53117) Resolving deltas: 37% (19654/53117) Resolving deltas: 38% (20185/53117) Resolving deltas: 39% (20716/53117) Resolving deltas: 40% (21247/53117) Resolving deltas: 41% (21780/53117) Resolving deltas: 42% (22310/53117) Resolving deltas: 43% (22843/53117) Resolving deltas: 44% (23372/53117) Resolving deltas: 45% (23903/53117) Resolving deltas: 46% (24434/53117) Resolving deltas: 47% (24965/53117) Resolving deltas: 48% (25499/53117) Resolving deltas: 49% (26028/53117) Resolving deltas: 50% (26559/53117) Resolving deltas: 51% (27091/53117) Resolving deltas: 52% (27621/53117) Resolving deltas: 53% (28153/53117) Resolving deltas: 54% (28684/53117) Resolving deltas: 55% (29216/53117) Resolving deltas: 56% (29746/53117) Resolving deltas: 57% (30277/53117) Resolving deltas: 58% (30808/53117) Resolving deltas: 59% (31340/53117) Resolving deltas: 60% (31871/53117) Resolving deltas: 61% (32402/53117) Resolving deltas: 62% (32933/53117) Resolving deltas: 63% (33464/53117) Resolving deltas: 64% (33996/53117) Resolving deltas: 65% (34527/53117) Resolving deltas: 66% (35060/53117) Resolving deltas: 67% (35590/53117) Resolving deltas: 68% (36120/53117) Resolving deltas: 69% (36651/53117) Resolving deltas: 70% (37182/53117) Resolving deltas: 71% (37714/53117) Resolving deltas: 72% (38245/53117) Resolving deltas: 73% (38776/53117) Resolving deltas: 74% (39307/53117) Resolving deltas: 75% (39838/53117) Resolving deltas: 76% (40370/53117) Resolving deltas: 77% (40901/53117) Resolving deltas: 78% (41432/53117) Resolving deltas: 79% (41963/53117) Resolving deltas: 80% (42497/53117) Resolving deltas: 81% (43025/53117) Resolving deltas: 82% (43556/53117) Resolving deltas: 83% (44088/53117) Resolving deltas: 84% (44619/53117) Resolving deltas: 85% (45150/53117) Resolving deltas: 86% (45681/53117) Resolving deltas: 87% (46212/53117) Resolving deltas: 88% (46743/53117) Resolving deltas: 89% (47275/53117) Resolving deltas: 90% (47806/53117) Resolving deltas: 91% (48340/53117) Resolving deltas: 92% (48868/53117) Resolving deltas: 93% (49399/53117) Resolving deltas: 94% (49930/53117) Resolving deltas: 95% (50462/53117) Resolving deltas: 96% (50994/53117) Resolving deltas: 97% (51525/53117) Resolving deltas: 98% (52055/53117) Resolving deltas: 99% (52586/53117) Resolving deltas: 100% (53117/53117) Resolving deltas: 100% (53117/53117), done.
  9. 9.18 s Fetching commit ed57fed921fd95d2832e02eb6340b77e3db01418 for codex/aa-aa-identical-program-d3 ...
  10. 9.18 s $ /nix/store/bcnisk3ydfgv26v2gw3zlky24g00yww2-git-2.54.0/bin/git fetch origin ed57fed921fd95d2832e02eb6340b77e3db01418
  11. 9.57 s From https://github.com/alphal00p/gammaloop
  12. 9.57 s * branch ed57fed921fd95d2832e02eb6340b77e3db01418 -> FETCH_HEAD
  13. 9.58 s $ /nix/store/9ypz3flqsrl5xl495mm8h645gadjsxi1-coreutils-9.11/bin/timeout --kill-after=15s 7200s /nix/store/bcnisk3ydfgv26v2gw3zlky24g00yww2-git-2.54.0/bin/git -c advice.detachedHead=false checkout ed57fed921fd95d2832e02eb6340b77e3db01418
  14. 9.76 s HEAD is now at ed57fed92 capture identical Linux evaluator programs
  15. 9.77 s $ /nix/store/9ypz3flqsrl5xl495mm8h645gadjsxi1-coreutils-9.11/bin/timeout --kill-after=15s 7200s /nix/store/23zk8sgzamrbmj1fday15szf7f2279s8-nix-2.34.7/bin/nix --extra-experimental-features nix-command --extra-experimental-features flakes --log-format internal-json run .#packages.x86_64-linux.nix-ci-check-gammaloop-nextest-integration --print-build-logs
  16. 13.18 s
  17. 13.36 s Downloading cached gammaloop-nextest-binaries-integration-gammaloop-integration-tests from https://cache.nix-ci.com
  18. 15.55 s Downloaded cached gammaloop-nextest-binaries-integration-gammaloop-integration-tests (415.8 MiB) in 2.1s
  19. 15.55 s Progress: 0 of 3 built, 1 of 1 downloaded from cache
  20. 15.58 s Building /nix/store/abz03pnp06gbfgmdg9fza9wdqc4y834f-gammaloop-nextest-binaries-integration.drv
  21. 15.63 s [gammaloop-nextest-binaries-integration:post-build] Uploading to the NixCI cache: /nix/store/rlr0jhb3d7f04qvv8hzzz6kgvyhn2zbk-gammaloop-nextest-binaries-integration
  22. 15.67 s [gammaloop-nextest-binaries-integration:post-build] warning: 'warn-short-path-literals' is deprecated, use 'lint-short-path-literals = ignore' instead
  23. 15.67 s [gammaloop-nextest-binaries-integration:post-build] copying 1 paths...
  24. 15.67 s [gammaloop-nextest-binaries-integration:post-build] copying path '/nix/store/rlr0jhb3d7f04qvv8hzzz6kgvyhn2zbk-gammaloop-nextest-binaries-integration' to 'https://cache.nix-ci.com'...
  25. 15.73 s [gammaloop-nextest-binaries-integration:post-build] warning: 'warn-short-path-literals' is deprecated, use 'lint-short-path-literals = ignore' instead
  26. 15.85 s [gammaloop-nextest-binaries-integration:post-build] copying 0 paths...
  27. 15.87 s Uploaded gammaloop-nextest-binaries-integration in 249ms
  28. 15.87 s Progress: 1 of 3 built, 1 of 1 downloaded from cache
  29. 15.87 s Built gammaloop-nextest-binaries-integration in 290ms
  30. 15.94 s Building /nix/store/7fhr3n4hr8mxxgmycwf6wbkxb33kwnq3-nix-ci-check-gammaloop-nextest-integration.drv
  31. 16.00 s [nix-ci-check-gammaloop-nextest-integration:post-build] Uploading to the NixCI cache: /nix/store/rwvrdk84q33hhw4sg27cqrf12n9h06nc-nix-ci-check-gammaloop-nextest-integration
  32. 16.04 s [nix-ci-check-gammaloop-nextest-integration:post-build] warning: 'warn-short-path-literals' is deprecated, use 'lint-short-path-literals = ignore' instead
  33. 16.05 s [nix-ci-check-gammaloop-nextest-integration:post-build] copying 1 paths...
  34. 16.05 s [nix-ci-check-gammaloop-nextest-integration:post-build] copying path '/nix/store/rwvrdk84q33hhw4sg27cqrf12n9h06nc-nix-ci-check-gammaloop-nextest-integration' to 'https://cache.nix-ci.com'...
  35. 16.11 s [nix-ci-check-gammaloop-nextest-integration:post-build] warning: 'warn-short-path-literals' is deprecated, use 'lint-short-path-literals = ignore' instead
  36. 16.28 s [nix-ci-check-gammaloop-nextest-integration:post-build] copying 0 paths...
  37. 16.30 s Uploaded nix-ci-check-gammaloop-nextest-integration in 306ms
  38. 16.30 s Progress: 2 of 3 built, 1 of 1 downloaded from cache
  39. 16.30 s Built nix-ci-check-gammaloop-nextest-integration in 358ms
  40. 16.30 s Progress: 3 of 3 built, 1 of 1 downloaded from cache
  41. 20.71 s evaluating derivation 'g copying '/nix/store/msjs evaluating derivation 'g copying '/nix/store/msjs evaluating derivation 'g copying '/nix/store/msjs evaluating derivation 'g copying '/nix/store/msjs evaluating derivation 'g querying gammaloop-nexte [0/1 built, 0.0 KiB DL] [1/0/1 built, 0.0 KiB DLgammaloop-nextest-integration> Extracting 13 binaries, 1 build script output directory, and 3 linked paths to /build/nextest-archive-Oo48Rf
  42. 22.78 s gammaloop-nextest-integration> Extracted 30 files to /build/nextest-archive-Oo48Rf in 2.08s
  43. 22.80 s gammaloop-nextest-integration> ------------
  44. 22.80 s gammaloop-nextest-integration> Nextest run ID 0d0c8672-4518-4ec7-94f1-f2c6fef7350e with nextest profile: ci_gammaloop
  45. 22.80 s gammaloop-nextest-integration> Starting 152 tests across 13 binaries (208 tests skipped, including 207 tests via profile.ci_gammaloop.default-filter)
  46. 338.45 s gammaloop-nextest-integration> FAIL [ 66.679s] ( 54/152) gammaloop-integration-tests::test_runs aa_aa::important::aa_aa_local_inspect_backend_consistency
  47. 338.45 s gammaloop-nextest-integration> stdout ---
  48. 338.45 s gammaloop-nextest-integration>
  49. 338.45 s gammaloop-nextest-integration> running 1 test
  50. 338.45 s gammaloop-nextest-integration> test aa_aa::important::aa_aa_local_inspect_backend_consistency has been running for over 60 seconds
  51. 338.45 s gammaloop-nextest-integration> test aa_aa::important::aa_aa_local_inspect_backend_consistency ... FAILED
  52. 338.45 s gammaloop-nextest-integration>
  53. 338.45 s gammaloop-nextest-integration> failures:
  54. 338.45 s gammaloop-nextest-integration>
  55. 338.45 s gammaloop-nextest-integration> failures:
  56. 338.45 s gammaloop-nextest-integration> aa_aa::important::aa_aa_local_inspect_backend_consistency
  57. 338.45 s gammaloop-nextest-integration>
  58. 338.45 s gammaloop-nextest-integration> test result: FAILED. 0 passed; 1 failed; 0 ignored; 0 measured; 258 filtered out; finished in 66.52s
  59. 338.45 s gammaloop-nextest-integration>
  60. 338.45 s gammaloop-nextest-integration> stderr ---
  61. 338.45 s gammaloop-nextest-integration> [2026-09-06 07:46:23.373] @gammaloop_api::se... INFO : Running command import model sm-default.json
  62. 338.45 s gammaloop-nextest-integration> [2026-09-06 07:46:23.373] @import::model INFO : Loading built-in JSON model sm-default
  63. 338.45 s gammaloop-nextest-integration> [2026-09-06 07:46:23.391] @gammalooprs::model INFO : The following 11 external parameters were forced to zero by the restriction card:
  64. 338.45 s gammaloop-nextest-integration> lamWS, AWS, rhoWS, etaWS, ymc, yme, ymm, MC, Me, MM, WTau
  65. 338.45 s gammaloop-nextest-integration> [2026-09-06 07:46:23.391] @gammalooprs::model INFO : The following 34 vertex rules were removed by the restriction card:
  66. 338.45 s gammaloop-nextest-integration> V_82 -> (c~, d, G+) | V_83 -> (t~, d, G+) | V_84 -> (c~, s, G+) | V_85 -> (t~, s, G+) | V_86 -> (u~, b, G+) | V_87 -> (c~, b, G+) | V_90 -> (c~, d, W+) | V_91 -> (t~, d, W+) | V_92 -> (u~, s, W+) | V_94 -> (t~, s, W+) | V_95 -> (u~, b, W+) | V_96 -> (c~, b, W+) | V_101 -> (e+, e-, G0) | V_102 -> (mu+, mu-, G0) | V_104 -> (e+, e-, H) | V_105 -> (mu+, mu-, H) | V_110 -> (ve~, e-, G+) | V_111 -> (vm~, mu-, G+) | V_116 -> (b~, u, G-) | V_117 -> (d~, c, G-) | V_118 -> (s~, c, G-) | V_119 -> (b~, c, G-) | V_120 -> (d~, t, G-) | V_121 -> (s~, t, G-) | V_124 -> (s~, u, W-) | V_125 -> (b~, u, W-) | V_126 -> (d~, c, W-) | V_128 -> (b~, c, W-) | V_129 -> (d~, t, W-) | V_130 -> (s~, t, W-) | V_138 -> (c~, c, G0) | V_140 -> (c~, c, H) | V_145 -> (e+, ve, G-) | V_146 -> (mu+, vm, G-)
  67. 338.45 s gammaloop-nextest-integration> [2026-09-06 07:46:23.391] @gammalooprs::model INFO : The following 36 couplings were removed by the restriction card:
  68. 338.45 s gammaloop-nextest-integration> GC_13, GC_14, GC_16, GC_17, GC_18, GC_19, GC_20, GC_22, GC_23, GC_24, GC_25, GC_26, GC_28, GC_29, GC_42, GC_43, GC_44, GC_46, GC_47, GC_48, GC_84, GC_85, GC_86, GC_87, GC_88, GC_89, GC_90, GC_91, GC_92, GC_93, GC_101, GC_102, GC_103, GC_105, GC_106, GC_107
  69. 338.45 s gammaloop-nextest-integration> [2026-09-06 07:46:23.392] @gammaloop_api::se... INFO : Running command run set_model_parameters
  70. 338.45 s gammaloop-nextest-integration> [2026-09-06 07:46:23.392] @gammaloop_api::se... INFO : Starting command block set_model_parameters
  71. 338.45 s gammaloop-nextest-integration> [2026-09-06 07:46:23.392] @gammaloop_api::se... INFO : Running command set model MT=173.0
  72. 338.45 s gammaloop-nextest-integration> [2026-09-06 07:46:23.395] @gammaloop_api::se... INFO : Running command set model WT=0.0
  73. 338.45 s gammaloop-nextest-integration> [2026-09-06 07:46:23.398] @gammaloop_api::se... INFO : Running command set model ymt=173.0
  74. 338.45 s gammaloop-nextest-integration> [2026-09-06 07:46:23.402] @gammaloop_api::se... INFO : Running command set model aS=0.118
  75. 338.45 s gammaloop-nextest-integration> [2026-09-06 07:46:23.405] @gammaloop_api::se... INFO : Running command set model aEWM1=137.036
  76. 338.45 s gammaloop-nextest-integration> [2026-09-06 07:46:23.408] @gammaloop_api::se... INFO : Running command set model Gf=1.166390e-05
  77. 338.45 s gammaloop-nextest-integration> [2026-09-06 07:46:23.411] @gammaloop_api::se... INFO : Running command set model MZ=91.188
  78. 338.45 s gammaloop-nextest-integration> [2026-09-06 07:46:23.415] @gammaloop_api::se... INFO : Running command set global string '
  79. 338.45 s gammaloop-nextest-integration> [global.generation.compile]
  80. 338.45 s gammaloop-nextest-integration> compilation_mode = "symjit"
  81. 338.45 s gammaloop-nextest-integration> optimization_level = "O0"
  82. 338.45 s gammaloop-nextest-integration> fast_math = false
  83. 338.45 s gammaloop-nextest-integration> [...]
  84. 338.45 s gammaloop-nextest-integration> [2026-09-06 07:46:23.416] @gammaloop_api::se... INFO : Running command import graphs ./examples/cli/aa_aa/1L/aa_aa_1L.dot -p aa_aa_all_helicities -i 1L_ppmm -o
  85. 338.45 s gammaloop-nextest-integration> [2026-09-06 07:46:23.416] @commands::import INFO : Loading graphs from '/build/source/examples/cli/aa_aa/1L/aa_aa_1L.dot'
  86. 338.45 s gammaloop-nextest-integration> [2026-09-06 07:46:23.423] @gammaloop_api::se... INFO : Running command generate existing -p aa_aa_all_helicities
  87. 338.45 s gammaloop-nextest-integration> [2026-09-06 07:46:48.360] @commands::generate INFO :
  88. 338.45 s gammaloop-nextest-integration> Integrand generation summary
  89. 338.45 s gammaloop-nextest-integration> peak RAM 1012.75 MiB | cores 1
  90. 338.45 s gammaloop-nextest-integration> ╭───────────┬───────┬─────────┬──────────────┬─────────────┬────────────────┬───────────────╮
  91. 338.45 s gammaloop-nextest-integration> │ integrand │ graph │ # evals │ expr build │ spenso │ symbolica eval │ compile │
  92. 338.45 s gammaloop-nextest-integration> ├───────────┼───────┼─────────┼──────────────┼─────────────┼────────────────┼───────────────┤
  93. 338.45 s gammaloop-nextest-integration> │ 1L_ppmm │ GL0 │ 13 │ 498ms (5.9%) │ 1.62s (19%) │ 5.50s (65%) │ 842ms (10.0%) │
  94. 338.45 s gammaloop-nextest-integration> │ 1L_ppmm │ GL2 │ 13 │ 477ms (5.7%) │ 1.47s (18%) │ 5.62s (67%) │ 803ms (9.6%) │
  95. 338.45 s gammaloop-nextest-integration> │ 1L_ppmm │ GL4 │ 11 │ 463ms (5.8%) │ 1.37s (17%) │ 5.43s (68%) │ 756ms (9.4%) │
  96. 338.45 s gammaloop-nextest-integration> ├───────────┼───────┼─────────┼──────────────┼─────────────┼────────────────┼───────────────┤
  97. 338.45 s gammaloop-nextest-integration> │ Total │ │ 37 │ 1.44s (5.8%) │ 4.46s (18%) │ 16.55s (67%) │ 2.40s (9.7%) │
  98. 338.45 s gammaloop-nextest-integration> ╰───────────┴───────┴─────────┴──────────────┴─────────────┴────────────────┴───────────────╯
  99. 338.45 s gammaloop-nextest-integration> [2026-09-06 07:46:48.993] @gammaloop_api::se... INFO : Running command import model sm-default.json
  100. 338.45 s gammaloop-nextest-integration> [2026-09-06 07:46:48.993] @import::model INFO : Loading built-in JSON model sm-default
  101. 338.45 s gammaloop-nextest-integration> [2026-09-06 07:46:49.010] @gammalooprs::model INFO : The following 11 external parameters were forced to zero by the restriction card:
  102. 338.45 s gammaloop-nextest-integration> lamWS, AWS, rhoWS, etaWS, ymc, yme, ymm, MC, Me, MM, WTau
  103. 338.45 s gammaloop-nextest-integration> [2026-09-06 07:46:49.010] @gammalooprs::model INFO : The following 34 vertex rules were removed by the restriction card:
  104. 338.45 s gammaloop-nextest-integration> V_82 -> (c~, d, G+) | V_83 -> (t~, d, G+) | V_84 -> (c~, s, G+) | V_85 -> (t~, s, G+) | V_86 -> (u~, b, G+) | V_87 -> (c~, b, G+) | V_90 -> (c~, d, W+) | V_91 -> (t~, d, W+) | V_92 -> (u~, s, W+) | V_94 -> (t~, s, W+) | V_95 -> (u~, b, W+) | V_96 -> (c~, b, W+) | V_101 -> (e+, e-, G0) | V_102 -> (mu+, mu-, G0) | V_104 -> (e+, e-, H) | V_105 -> (mu+, mu-, H) | V_110 -> (ve~, e-, G+) | V_111 -> (vm~, mu-, G+) | V_116 -> (b~, u, G-) | V_117 -> (d~, c, G-) | V_118 -> (s~, c, G-) | V_119 -> (b~, c, G-) | V_120 -> (d~, t, G-) | V_121 -> (s~, t, G-) | V_124 -> (s~, u, W-) | V_125 -> (b~, u, W-) | V_126 -> (d~, c, W-) | V_128 -> (b~, c, W-) | V_129 -> (d~, t, W-) | V_130 -> (s~, t, W-) | V_138 -> (c~, c, G0) | V_140 -> (c~, c, H) | V_145 -> (e+, ve, G-) | V_146 -> (mu+, vm, G-)
  105. 338.45 s gammaloop-nextest-integration> [2026-09-06 07:46:49.010] @gammalooprs::model INFO : The following 36 couplings were removed by the restriction card:
  106. 338.45 s gammaloop-nextest-integration> GC_13, GC_14, GC_16, GC_17, GC_18, GC_19, GC_20, GC_22, GC_23, GC_24, GC_25, GC_26, GC_28, GC_29, GC_42, GC_43, GC_44, GC_46, GC_47, GC_48, GC_84, GC_85, GC_86, GC_87, GC_88, GC_89, GC_90, GC_91, GC_92, GC_93, GC_101, GC_102, GC_103, GC_105, GC_106, GC_107
  107. 338.45 s gammaloop-nextest-integration> [2026-09-06 07:46:49.011] @gammaloop_api::se... INFO : Running command run set_model_parameters
  108. 338.45 s gammaloop-nextest-integration> [2026-09-06 07:46:49.011] @gammaloop_api::se... INFO : Starting command block set_model_parameters
  109. 338.45 s gammaloop-nextest-integration> [2026-09-06 07:46:49.011] @gammaloop_api::se... INFO : Running command set model MT=173.0
  110. 338.45 s gammaloop-nextest-integration> [2026-09-06 07:46:49.014] @gammaloop_api::se... INFO : Running command set model WT=0.0
  111. 338.45 s gammaloop-nextest-integration> [2026-09-06 07:46:49.017] @gammaloop_api::se... INFO : Running command set model ymt=173.0
  112. 338.45 s gammaloop-nextest-integration> [2026-09-06 07:46:49.020] @gammaloop_api::se... INFO : Running command set model aS=0.118
  113. 338.45 s gammaloop-nextest-integration> [2026-09-06 07:46:49.024] @gammaloop_api::se... INFO : Running command set model aEWM1=137.036
  114. 338.45 s gammaloop-nextest-integration> [2026-09-06 07:46:49.027] @gammaloop_api::se... INFO : Running command set model Gf=1.166390e-05
  115. 338.45 s gammaloop-nextest-integration> [2026-09-06 07:46:49.030] @gammaloop_api::se... INFO : Running command set model MZ=91.188
  116. 338.45 s gammaloop-nextest-integration> [2026-09-06 07:46:49.033] @gammaloop_api::se... INFO : Running command set global string '
  117. 338.45 s gammaloop-nextest-integration> [global.generation.compile]
  118. 338.45 s gammaloop-nextest-integration> compilation_mode = "assembly"
  119. 338.45 s gammaloop-nextest-integration> optimization_level = "O0"
  120. 338.45 s gammaloop-nextest-integration> fast_math = false
  121. 338.45 s gammaloop-nextest-integration> [...]
  122. 338.45 s gammaloop-nextest-integration> [2026-09-06 07:46:49.034] @gammaloop_api::se... INFO : Running command import graphs ./examples/cli/aa_aa/1L/aa_aa_1L.dot -p aa_aa_all_helicities_assembly -i 1L_ppmm -o
  123. 338.45 s gammaloop-nextest-integration> [2026-09-06 07:46:49.034] @commands::import INFO : Loading graphs from '/build/source/examples/cli/aa_aa/1L/aa_aa_1L.dot'
  124. 338.45 s gammaloop-nextest-integration> [2026-09-06 07:46:49.041] @gammaloop_api::se... INFO : Running command generate existing -p aa_aa_all_helicities_assembly
  125. 338.45 s gammaloop-nextest-integration> [2026-09-06 07:47:11.191] @processes::amplitude INFO : Compiling amplitude 1L_ppmm
  126. 338.45 s gammaloop-nextest-integration> [2026-09-06 07:47:28.850] @commands::generate INFO : Removed 34 generated C++ source file(s). Use '--keep-sources' to keep them.
  127. 338.45 s gammaloop-nextest-integration> [2026-09-06 07:47:28.850] @commands::generate INFO :
  128. 338.45 s gammaloop-nextest-integration> Integrand generation summary
  129. 338.45 s gammaloop-nextest-integration> peak RAM 2.32 GiB | cores 1
  130. 338.45 s gammaloop-nextest-integration> ╭───────────┬───────┬─────────┬──────────────┬─────────────┬────────────────┬──────────────╮
  131. 338.45 s gammaloop-nextest-integration> │ integrand │ graph │ # evals │ expr build │ spenso │ symbolica eval │ compile │
  132. 338.45 s gammaloop-nextest-integration> ├───────────┼───────┼─────────┼──────────────┼─────────────┼────────────────┼──────────────┤
  133. 338.45 s gammaloop-nextest-integration> │ 1L_ppmm │ GL0 │ 13 │ 480ms (3.6%) │ 1.34s (10%) │ 5.55s (42%) │ 5.99s (45%) │
  134. 338.45 s gammaloop-nextest-integration> │ 1L_ppmm │ GL2 │ 13 │ 475ms (3.5%) │ 1.50s (11%) │ 5.42s (40%) │ 6.29s (46%) │
  135. 338.45 s gammaloop-nextest-integration> │ 1L_ppmm │ GL4 │ 11 │ 462ms (3.6%) │ 1.41s (11%) │ 5.47s (43%) │ 5.37s (42%) │
  136. 338.45 s gammaloop-nextest-integration> ├───────────┼───────┼─────────┼──────────────┼─────────────┼────────────────┼──────────────┤
  137. 338.45 s gammaloop-nextest-integration> │ Total │ │ 37 │ 1.42s (3.6%) │ 4.25s (11%) │ 16.44s (41%) │ 17.65s (44%) │
  138. 338.45 s gammaloop-nextest-integration> ╰───────────┴───────┴─────────┴──────────────┴─────────────┴────────────────┴──────────────╯
  139. 338.45 s gammaloop-nextest-integration> [2026-09-06 07:47:29.455] @gammaloop_api::se... INFO : Running command set process -p aa_aa_all_helicities -i 1L_ppmm string '
  140. 338.45 s gammaloop-nextest-integration> [stability]
  141. 338.45 s gammaloop-nextest-integration> check_on_norm = true
  142. 338.45 s gammaloop-nextest-integration> escalate_if_exact_zero = false
  143. 338.45 s gammaloop-nextest-integration> loop_momenta_norm_escalation_factor = -1.0
  144. 338.45 s gammaloop-nextest-integration> [...]
  145. 338.45 s gammaloop-nextest-integration> [2026-09-06 07:47:29.456] @gammaloop_api::se... INFO : Running command set process -p aa_aa_all_helicities_assembly -i 1L_ppmm string '
  146. 338.45 s gammaloop-nextest-integration> [stability]
  147. 338.45 s gammaloop-nextest-integration> check_on_norm = true
  148. 338.45 s gammaloop-nextest-integration> escalate_if_exact_zero = false
  149. 338.45 s gammaloop-nextest-integration> loop_momenta_norm_escalation_factor = -1.0
  150. 338.45 s gammaloop-nextest-integration> [...]
  151. 338.45 s gammaloop-nextest-integration> [2026-09-06 07:47:29.457] @gammaloop_api::se... INFO : Running command set process -p aa_aa_all_helicities -i 1L_mpmm string '
  152. 338.45 s gammaloop-nextest-integration> [stability]
  153. 338.45 s gammaloop-nextest-integration> check_on_norm = true
  154. 338.45 s gammaloop-nextest-integration> escalate_if_exact_zero = false
  155. 338.45 s gammaloop-nextest-integration> loop_momenta_norm_escalation_factor = -1.0
  156. 338.45 s gammaloop-nextest-integration> [...]
  157. 338.45 s gammaloop-nextest-integration> [2026-09-06 07:47:29.458] @gammaloop_api::se... INFO : Running command set process -p aa_aa_all_helicities_assembly -i 1L_mpmm string '
  158. 338.45 s gammaloop-nextest-integration> [stability]
  159. 338.45 s gammaloop-nextest-integration> check_on_norm = true
  160. 338.45 s gammaloop-nextest-integration> escalate_if_exact_zero = false
  161. 338.45 s gammaloop-nextest-integration> loop_momenta_norm_escalation_factor = -1.0
  162. 338.45 s gammaloop-nextest-integration> [...]
  163. 338.45 s gammaloop-nextest-integration> [2026-09-06 07:47:29.458] @gammaloop_api::se... INFO : Running command set process -p aa_aa_all_helicities -i 1L_mmmm string '
  164. 338.45 s gammaloop-nextest-integration> [stability]
  165. 338.45 s gammaloop-nextest-integration> check_on_norm = true
  166. 338.45 s gammaloop-nextest-integration> escalate_if_exact_zero = false
  167. 338.45 s gammaloop-nextest-integration> loop_momenta_norm_escalation_factor = -1.0
  168. 338.45 s gammaloop-nextest-integration> [...]
  169. 338.45 s gammaloop-nextest-integration> [2026-09-06 07:47:29.459] @gammaloop_api::se... INFO : Running command set process -p aa_aa_all_helicities_assembly -i 1L_mmmm string '
  170. 338.45 s gammaloop-nextest-integration> [stability]
  171. 338.45 s gammaloop-nextest-integration> check_on_norm = true
  172. 338.45 s gammaloop-nextest-integration> escalate_if_exact_zero = false
  173. 338.45 s gammaloop-nextest-integration> loop_momenta_norm_escalation_factor = -1.0
  174. 338.45 s gammaloop-nextest-integration> [...]
  175. 338.45 s gammaloop-nextest-integration> [2026-09-06 07:47:29.460] @gammaloop_api::se... INFO : Running command set process -p aa_aa_all_helicities -i 1L_pmmp string '
  176. 338.45 s gammaloop-nextest-integration> [stability]
  177. 338.45 s gammaloop-nextest-integration> check_on_norm = true
  178. 338.45 s gammaloop-nextest-integration> escalate_if_exact_zero = false
  179. 338.45 s gammaloop-nextest-integration> loop_momenta_norm_escalation_factor = -1.0
  180. 338.45 s gammaloop-nextest-integration> [...]
  181. 338.45 s gammaloop-nextest-integration> [2026-09-06 07:47:29.460] @gammaloop_api::se... INFO : Running command set process -p aa_aa_all_helicities_assembly -i 1L_pmmp string '
  182. 338.45 s gammaloop-nextest-integration> [stability]
  183. 338.45 s gammaloop-nextest-integration> check_on_norm = true
  184. 338.45 s gammaloop-nextest-integration> escalate_if_exact_zero = false
  185. 338.45 s gammaloop-nextest-integration> loop_momenta_norm_escalation_factor = -1.0
  186. 338.45 s gammaloop-nextest-integration> [...]
  187. 338.45 s gammaloop-nextest-integration> [2026-09-06 07:47:29.461] @gammaloop_api::se... INFO : Running command set process -p aa_aa_all_helicities -i 1L_pmpm string '
  188. 338.45 s gammaloop-nextest-integration> [stability]
  189. 338.45 s gammaloop-nextest-integration> check_on_norm = true
  190. 338.45 s gammaloop-nextest-integration> escalate_if_exact_zero = false
  191. 338.45 s gammaloop-nextest-integration> loop_momenta_norm_escalation_factor = -1.0
  192. 338.45 s gammaloop-nextest-integration> [...]
  193. 338.45 s gammaloop-nextest-integration> [2026-09-06 07:47:29.461] @gammaloop_api::se... INFO : Running command set process -p aa_aa_all_helicities_assembly -i 1L_pmpm string '
  194. 338.45 s gammaloop-nextest-integration> [stability]
  195. 338.45 s gammaloop-nextest-integration> check_on_norm = true
  196. 338.45 s gammaloop-nextest-integration> escalate_if_exact_zero = false
  197. 338.45 s gammaloop-nextest-integration> loop_momenta_norm_escalation_factor = -1.0
  198. 338.45 s gammaloop-nextest-integration> [...]
  199. 338.45 s gammaloop-nextest-integration> [2026-09-06 07:47:29.466] @process::amplitude INFO : Input is below threshold: 0 existing threshold E-surfaces across 0/1 graph groups
  200. 338.45 s gammaloop-nextest-integration> [2026-09-06 07:47:29.466] @process::amplitude INFO : overlap structure of group 0: [0: []]
  201. 338.45 s gammaloop-nextest-integration> [2026-09-06 07:47:29.466] @integrands::process [{#im_is_nan, #re_is_nan}] WARNING : final process evaluation is nonfinite
  202. 338.45 s gammaloop-nextest-integration> [2026-09-06 07:47:29.466] @commands::inspect INFO :
  203. 338.45 s gammaloop-nextest-integration> Input point in momentum space:
  204. 338.45 s gammaloop-nextest-integration>
  205. 338.45 s gammaloop-nextest-integration> ( 0.1100000000000000, -0.0700000000000000, 0.1900000000000000 )
  206. 338.45 s gammaloop-nextest-integration>
  207. 338.45 s gammaloop-nextest-integration> The evaluation of integrand '1L_ppmm' is:
  208. 338.45 s gammaloop-nextest-integration>
  209. 338.45 s gammaloop-nextest-integration> ( +0.0000000000000000e0, +0.0000000000000000e0 i)
  210. 338.45 s gammaloop-nextest-integration>
  211. 338.45 s gammaloop-nextest-integration> [2026-09-06 07:47:29.470] @process::amplitude INFO : Input is below threshold: 0 existing threshold E-surfaces across 0/1 graph groups
  212. 338.45 s gammaloop-nextest-integration> [2026-09-06 07:47:29.470] @process::amplitude INFO : overlap structure of group 0: [0: []]
  213. 338.45 s gammaloop-nextest-integration> [2026-09-06 07:47:29.470] @commands::inspect INFO :
  214. 338.45 s gammaloop-nextest-integration> Input point in momentum space:
  215. 338.45 s gammaloop-nextest-integration>
  216. 338.45 s gammaloop-nextest-integration> ( 0.1100000000000000, -0.0700000000000000, 0.1900000000000000 )
  217. 338.45 s gammaloop-nextest-integration>
  218. 338.45 s gammaloop-nextest-integration> The evaluation of integrand '1L_ppmm' is:
  219. 338.45 s gammaloop-nextest-integration>
  220. 338.45 s gammaloop-nextest-integration> ( -1.7132462539328486e-28, -8.7105072229446864e-10 i)
  221. 338.45 s gammaloop-nextest-integration>
  222. 338.45 s gammaloop-nextest-integration> The application panicked (crashed).
  223. 338.45 s gammaloop-nextest-integration> Message: kinematics=a, integrand=1L_ppmm, graph_id=0: assembly vs symjit inspect: actual=(-0.00000000000000000000000000017132462539328486+-0.0000000008710507222944686i), expected=(0+0i), tolerance=0.0000000001
  224. 338.45 s gammaloop-nextest-integration> Location: tests/tests/test_runs/utils.rs:466
  225. 338.45 s gammaloop-nextest-integration>
  226. 338.45 s gammaloop-nextest-integration> ━━━━━━━━━━━━━━━━━━━━━━━━━━━━━━━━━━ BACKTRACE ━━━━━━━━━━━━━━━━━━━━━━━━━━━━━━━━━━━
  227. 338.45 s gammaloop-nextest-integration> 1: <color_eyre[51793ea62743adbd]::config::PanicHook>::panic_report<unknown>
  228. 338.45 s gammaloop-nextest-integration> at <unknown source file>:<unknown line>
  229. 338.45 s gammaloop-nextest-integration> 2: <color_eyre[51793ea62743adbd]::config::PanicHook>::into_panic_hook::{closure#0}<unknown>
  230. 338.45 s gammaloop-nextest-integration> at <unknown source file>:<unknown line>
  231. 338.45 s gammaloop-nextest-integration> 3: std[bcb96dfbba0ab899]::panicking::panic_with_hook<unknown>
  232. 338.45 s gammaloop-nextest-integration> at <unknown source file>:<unknown line>
  233. 338.45 s gammaloop-nextest-integration> 4: std[bcb96dfbba0ab899]::panicking::panic_handler::{closure#0}<unknown>
  234. 338.45 s gammaloop-nextest-integration> at <unknown source file>:<unknown line>
  235. 338.45 s gammaloop-nextest-integration> 5: std[bcb96dfbba0ab899]::sys::backtrace::__rust_end_short_backtrace::<std[bcb96dfbba0ab899]::panicking::panic_handler::{closure#0}, !><unknown>
  236. 338.45 s gammaloop-nextest-integration> at <unknown source file>:<unknown line>
  237. 338.45 s gammaloop-nextest-integration> 6: __rustc[6c289b9f9c454d21]::rust_begin_unwind<unknown>
  238. 338.45 s gammaloop-nextest-integration> at <unknown source file>:<unknown line>
  239. 338.45 s gammaloop-nextest-integration> 7: core[940e698046960fd5]::panicking::panic_fmt<unknown>
  240. 338.45 s gammaloop-nextest-integration> at <unknown source file>:<unknown line>
  241. 338.45 s gammaloop-nextest-integration> 8: <test_runs[66584badfeb6c7be]::aa_aa::important::aa_aa_local_inspect_backend_consistency::{closure#0} as core[940e698046960fd5]::ops::function::FnOnce<()>>::call_once<unknown>
  242. 338.45 s gammaloop-nextest-integration> at <unknown source file>:<unknown line>
  243. 338.45 s gammaloop-nextest-integration> 9: serial_test[cd99724524a2f1c0]::serial_code_lock::local_serial_core_with_return::<(), eyre[cb2fd339c0c40fca]::Report><unknown>
  244. 338.45 s gammaloop-nextest-integration> at <unknown source file>:<unknown line>
  245. 338.45 s gammaloop-nextest-integration> 10: <test_runs[66584badfeb6c7be]::aa_aa::important::aa_aa_local_inspect_backend_consistency::{closure#0} as core[940e698046960fd5]::ops::function::FnOnce<()>>::call_once<unknown>
  246. 338.45 s gammaloop-nextest-integration> at <unknown source file>:<unknown line>
  247. 338.45 s gammaloop-nextest-integration> 11: test[75d6903177b1d7e9]::__rust_begin_short_backtrace::<core[940e698046960fd5]::result::Result<(), alloc[2ea6bcb46fca0c42]::string::String>, fn() -> core[940e698046960fd5]::result::Result<(), alloc[2ea6bcb46fca0c42]::string::String>><unknown>
  248. 338.45 s gammaloop-nextest-integration> at <unknown source file>:<unknown line>
  249. 338.45 s gammaloop-nextest-integration> 12: test[75d6903177b1d7e9]::run_test::{closure#0}<unknown>
  250. 338.45 s gammaloop-nextest-integration> at <unknown source file>:<unknown line>
  251. 338.45 s gammaloop-nextest-integration> 13: std[bcb96dfbba0ab899]::sys::backtrace::__rust_begin_short_backtrace::<test[75d6903177b1d7e9]::run_test::{closure#1}, ()><unknown>
  252. 338.45 s gammaloop-nextest-integration> at <unknown source file>:<unknown line>
  253. 338.45 s gammaloop-nextest-integration> 14: <std[bcb96dfbba0ab899]::thread::lifecycle::spawn_unchecked<test[75d6903177b1d7e9]::run_test::{closure#1}, ()>::{closure#1} as core[940e698046960fd5]::ops::function::FnOnce<()>>::call_once::{shim:vtable#0}<unknown>
  254. 338.45 s gammaloop-nextest-integration> at <unknown source file>:<unknown line>
  255. 338.45 s gammaloop-nextest-integration> 15: <std[bcb96dfbba0ab899]::sys::thread::unix::Thread>::new::thread_start<unknown>
  256. 338.45 s gammaloop-nextest-integration> at <unknown source file>:<unknown line>
  257. 338.45 s gammaloop-nextest-integration> 16: start_thread<unknown>
  258. 338.45 s gammaloop-nextest-integration> at <unknown source file>:<unknown line>
  259. 338.45 s gammaloop-nextest-integration> 17: __clone3<unknown>
  260. 338.45 s gammaloop-nextest-integration> at <unknown source file>:<unknown line>
  261. 338.45 s gammaloop-nextest-integration>
  262. 338.45 s gammaloop-nextest-integration> Run with COLORBT_SHOW_HIDDEN=1 environment variable to disable frame filtering.
  263. 338.45 s gammaloop-nextest-integration> Run with RUST_BACKTRACE=full to include source snippets.
  264. 338.45 s gammaloop-nextest-integration>
  265. 766.75 s gammaloop-nextest-integration> ------------
  266. 766.75 s gammaloop-nextest-integration> Summary [ 743.943s] 152 tests run: 151 passed, 1 failed, 208 skipped
  267. 766.75 s gammaloop-nextest-integration> FAIL [ 66.679s] ( 54/152) gammaloop-integration-tests::test_runs aa_aa::important::aa_aa_local_inspect_backend_consistency
  268. 766.75 s gammaloop-nextest-integration> stdout ---
  269. 766.75 s gammaloop-nextest-integration>
  270. 766.75 s gammaloop-nextest-integration> running 1 test
  271. 766.75 s gammaloop-nextest-integration> test aa_aa::important::aa_aa_local_inspect_backend_consistency has been running for over 60 seconds
  272. 766.75 s gammaloop-nextest-integration> test aa_aa::important::aa_aa_local_inspect_backend_consistency ... FAILED
  273. 766.75 s gammaloop-nextest-integration>
  274. 766.75 s gammaloop-nextest-integration> failures:
  275. 766.75 s gammaloop-nextest-integration>
  276. 766.75 s gammaloop-nextest-integration> failures:
  277. 766.75 s gammaloop-nextest-integration> aa_aa::important::aa_aa_local_inspect_backend_consistency
  278. 766.75 s gammaloop-nextest-integration>
  279. 766.75 s gammaloop-nextest-integration> test result: FAILED. 0 passed; 1 failed; 0 ignored; 0 measured; 258 filtered out; finished in 66.52s
  280. 766.75 s gammaloop-nextest-integration>
  281. 766.75 s gammaloop-nextest-integration> stderr ---
  282. 766.75 s gammaloop-nextest-integration> [2026-09-06 07:46:23.373] @gammaloop_api::se... INFO : Running command import model sm-default.json
  283. 766.75 s gammaloop-nextest-integration> [2026-09-06 07:46:23.373] @import::model INFO : Loading built-in JSON model sm-default
  284. 766.75 s gammaloop-nextest-integration> [2026-09-06 07:46:23.391] @gammalooprs::model INFO : The following 11 external parameters were forced to zero by the restriction card:
  285. 766.75 s gammaloop-nextest-integration> lamWS, AWS, rhoWS, etaWS, ymc, yme, ymm, MC, Me, MM, WTau
  286. 766.75 s gammaloop-nextest-integration> [2026-09-06 07:46:23.391] @gammalooprs::model INFO : The following 34 vertex rules were removed by the restriction card:
  287. 766.75 s gammaloop-nextest-integration> V_82 -> (c~, d, G+) | V_83 -> (t~, d, G+) | V_84 -> (c~, s, G+) | V_85 -> (t~, s, G+) | V_86 -> (u~, b, G+) | V_87 -> (c~, b, G+) | V_90 -> (c~, d, W+) | V_91 -> (t~, d, W+) | V_92 -> (u~, s, W+) | V_94 -> (t~, s, W+) | V_95 -> (u~, b, W+) | V_96 -> (c~, b, W+) | V_101 -> (e+, e-, G0) | V_102 -> (mu+, mu-, G0) | V_104 -> (e+, e-, H) | V_105 -> (mu+, mu-, H) | V_110 -> (ve~, e-, G+) | V_111 -> (vm~, mu-, G+) | V_116 -> (b~, u, G-) | V_117 -> (d~, c, G-) | V_118 -> (s~, c, G-) | V_119 -> (b~, c, G-) | V_120 -> (d~, t, G-) | V_121 -> (s~, t, G-) | V_124 -> (s~, u, W-) | V_125 -> (b~, u, W-) | V_126 -> (d~, c, W-) | V_128 -> (b~, c, W-) | V_129 -> (d~, t, W-) | V_130 -> (s~, t, W-) | V_138 -> (c~, c, G0) | V_140 -> (c~, c, H) | V_145 -> (e+, ve, G-) | V_146 -> (mu+, vm, G-)
  288. 766.75 s gammaloop-nextest-integration> [2026-09-06 07:46:23.391] @gammalooprs::model INFO : The following 36 couplings were removed by the restriction card:
  289. 766.75 s gammaloop-nextest-integration> GC_13, GC_14, GC_16, GC_17, GC_18, GC_19, GC_20, GC_22, GC_23, GC_24, GC_25, GC_26, GC_28, GC_29, GC_42, GC_43, GC_44, GC_46, GC_47, GC_48, GC_84, GC_85, GC_86, GC_87, GC_88, GC_89, GC_90, GC_91, GC_92, GC_93, GC_101, GC_102, GC_103, GC_105, GC_106, GC_107
  290. 766.75 s gammaloop-nextest-integration> [2026-09-06 07:46:23.392] @gammaloop_api::se... INFO : Running command run set_model_parameters
  291. 766.75 s gammaloop-nextest-integration> [2026-09-06 07:46:23.392] @gammaloop_api::se... INFO : Starting command block set_model_parameters
  292. 766.75 s gammaloop-nextest-integration> [2026-09-06 07:46:23.392] @gammaloop_api::se... INFO : Running command set model MT=173.0
  293. 766.75 s gammaloop-nextest-integration> [2026-09-06 07:46:23.395] @gammaloop_api::se... INFO : Running command set model WT=0.0
  294. 766.75 s gammaloop-nextest-integration> [2026-09-06 07:46:23.398] @gammaloop_api::se... INFO : Running command set model ymt=173.0
  295. 766.75 s gammaloop-nextest-integration> [2026-09-06 07:46:23.402] @gammaloop_api::se... INFO : Running command set model aS=0.118
  296. 766.75 s gammaloop-nextest-integration> [2026-09-06 07:46:23.405] @gammaloop_api::se... INFO : Running command set model aEWM1=137.036
  297. 766.75 s gammaloop-nextest-integration> [2026-09-06 07:46:23.408] @gammaloop_api::se... INFO : Running command set model Gf=1.166390e-05
  298. 766.75 s gammaloop-nextest-integration> [2026-09-06 07:46:23.411] @gammaloop_api::se... INFO : Running command set model MZ=91.188
  299. 766.75 s gammaloop-nextest-integration> [2026-09-06 07:46:23.415] @gammaloop_api::se... INFO : Running command set global string '
  300. 766.75 s gammaloop-nextest-integration> [global.generation.compile]
  301. 766.75 s gammaloop-nextest-integration> compilation_mode = "symjit"
  302. 766.75 s gammaloop-nextest-integration> optimization_level = "O0"
  303. 766.75 s gammaloop-nextest-integration> fast_math = false
  304. 766.75 s gammaloop-nextest-integration> [...]
  305. 766.75 s gammaloop-nextest-integration> [2026-09-06 07:46:23.416] @gammaloop_api::se... INFO : Running command import graphs ./examples/cli/aa_aa/1L/aa_aa_1L.dot -p aa_aa_all_helicities -i 1L_ppmm -o
  306. 766.75 s gammaloop-nextest-integration> [2026-09-06 07:46:23.416] @commands::import INFO : Loading graphs from '/build/source/examples/cli/aa_aa/1L/aa_aa_1L.dot'
  307. 766.75 s gammaloop-nextest-integration> [2026-09-06 07:46:23.423] @gammaloop_api::se... INFO : Running command generate existing -p aa_aa_all_helicities
  308. 766.75 s gammaloop-nextest-integration> [2026-09-06 07:46:48.360] @commands::generate INFO :
  309. 766.75 s gammaloop-nextest-integration> Integrand generation summary
  310. 766.75 s gammaloop-nextest-integration> peak RAM 1012.75 MiB | cores 1
  311. 766.75 s gammaloop-nextest-integration> ╭───────────┬───────┬─────────┬──────────────┬─────────────┬────────────────┬───────────────╮
  312. 766.75 s gammaloop-nextest-integration> │ integrand │ graph │ # evals │ expr build │ spenso │ symbolica eval │ compile │
  313. 766.75 s gammaloop-nextest-integration> ├───────────┼───────┼─────────┼──────────────┼─────────────┼────────────────┼───────────────┤
  314. 766.75 s gammaloop-nextest-integration> │ 1L_ppmm │ GL0 │ 13 │ 498ms (5.9%) │ 1.62s (19%) │ 5.50s (65%) │ 842ms (10.0%) │
  315. 766.75 s gammaloop-nextest-integration> │ 1L_ppmm │ GL2 │ 13 │ 477ms (5.7%) │ 1.47s (18%) │ 5.62s (67%) │ 803ms (9.6%) │
  316. 766.75 s gammaloop-nextest-integration> │ 1L_ppmm │ GL4 │ 11 │ 463ms (5.8%) │ 1.37s (17%) │ 5.43s (68%) │ 756ms (9.4%) │
  317. 766.75 s gammaloop-nextest-integration> ├───────────┼───────┼─────────┼──────────────┼─────────────┼────────────────┼───────────────┤
  318. 766.75 s gammaloop-nextest-integration> │ Total │ │ 37 │ 1.44s (5.8%) │ 4.46s (18%) │ 16.55s (67%) │ 2.40s (9.7%) │
  319. 766.75 s gammaloop-nextest-integration> ╰───────────┴───────┴─────────┴──────────────┴─────────────┴────────────────┴───────────────╯
  320. 766.75 s gammaloop-nextest-integration> [2026-09-06 07:46:48.993] @gammaloop_api::se... INFO : Running command import model sm-default.json
  321. 766.75 s gammaloop-nextest-integration> [2026-09-06 07:46:48.993] @import::model INFO : Loading built-in JSON model sm-default
  322. 766.75 s gammaloop-nextest-integration> [2026-09-06 07:46:49.010] @gammalooprs::model INFO : The following 11 external parameters were forced to zero by the restriction card:
  323. 766.75 s gammaloop-nextest-integration> lamWS, AWS, rhoWS, etaWS, ymc, yme, ymm, MC, Me, MM, WTau
  324. 766.75 s gammaloop-nextest-integration> [2026-09-06 07:46:49.010] @gammalooprs::model INFO : The following 34 vertex rules were removed by the restriction card:
  325. 766.75 s gammaloop-nextest-integration> V_82 -> (c~, d, G+) | V_83 -> (t~, d, G+) | V_84 -> (c~, s, G+) | V_85 -> (t~, s, G+) | V_86 -> (u~, b, G+) | V_87 -> (c~, b, G+) | V_90 -> (c~, d, W+) | V_91 -> (t~, d, W+) | V_92 -> (u~, s, W+) | V_94 -> (t~, s, W+) | V_95 -> (u~, b, W+) | V_96 -> (c~, b, W+) | V_101 -> (e+, e-, G0) | V_102 -> (mu+, mu-, G0) | V_104 -> (e+, e-, H) | V_105 -> (mu+, mu-, H) | V_110 -> (ve~, e-, G+) | V_111 -> (vm~, mu-, G+) | V_116 -> (b~, u, G-) | V_117 -> (d~, c, G-) | V_118 -> (s~, c, G-) | V_119 -> (b~, c, G-) | V_120 -> (d~, t, G-) | V_121 -> (s~, t, G-) | V_124 -> (s~, u, W-) | V_125 -> (b~, u, W-) | V_126 -> (d~, c, W-) | V_128 -> (b~, c, W-) | V_129 -> (d~, t, W-) | V_130 -> (s~, t, W-) | V_138 -> (c~, c, G0) | V_140 -> (c~, c, H) | V_145 -> (e+, ve, G-) | V_146 -> (mu+, vm, G-)
  326. 766.75 s gammaloop-nextest-integration> [2026-09-06 07:46:49.010] @gammalooprs::model INFO : The following 36 couplings were removed by the restriction card:
  327. 766.75 s gammaloop-nextest-integration> GC_13, GC_14, GC_16, GC_17, GC_18, GC_19, GC_20, GC_22, GC_23, GC_24, GC_25, GC_26, GC_28, GC_29, GC_42, GC_43, GC_44, GC_46, GC_47, GC_48, GC_84, GC_85, GC_86, GC_87, GC_88, GC_89, GC_90, GC_91, GC_92, GC_93, GC_101, GC_102, GC_103, GC_105, GC_106, GC_107
  328. 766.75 s gammaloop-nextest-integration> [2026-09-06 07:46:49.011] @gammaloop_api::se... INFO : Running command run set_model_parameters
  329. 766.75 s gammaloop-nextest-integration> [2026-09-06 07:46:49.011] @gammaloop_api::se... INFO : Starting command block set_model_parameters
  330. 766.75 s gammaloop-nextest-integration> [2026-09-06 07:46:49.011] @gammaloop_api::se... INFO : Running command set model MT=173.0
  331. 766.75 s gammaloop-nextest-integration> [2026-09-06 07:46:49.014] @gammaloop_api::se... INFO : Running command set model WT=0.0
  332. 766.75 s gammaloop-nextest-integration> [2026-09-06 07:46:49.017] @gammaloop_api::se... INFO : Running command set model ymt=173.0
  333. 766.75 s gammaloop-nextest-integration> [2026-09-06 07:46:49.020] @gammaloop_api::se... INFO : Running command set model aS=0.118
  334. 766.75 s gammaloop-nextest-integration> [2026-09-06 07:46:49.024] @gammaloop_api::se... INFO : Running command set model aEWM1=137.036
  335. 766.75 s gammaloop-nextest-integration> [2026-09-06 07:46:49.027] @gammaloop_api::se... INFO : Running command set model Gf=1.166390e-05
  336. 766.75 s gammaloop-nextest-integration> [2026-09-06 07:46:49.030] @gammaloop_api::se... INFO : Running command set model MZ=91.188
  337. 766.75 s gammaloop-nextest-integration> [2026-09-06 07:46:49.033] @gammaloop_api::se... INFO : Running command set global string '
  338. 766.75 s gammaloop-nextest-integration> [global.generation.compile]
  339. 766.75 s gammaloop-nextest-integration> compilation_mode = "assembly"
  340. 766.75 s gammaloop-nextest-integration> optimization_level = "O0"
  341. 766.75 s gammaloop-nextest-integration> fast_math = false
  342. 766.75 s gammaloop-nextest-integration> [...]
  343. 766.75 s gammaloop-nextest-integration> [2026-09-06 07:46:49.034] @gammaloop_api::se... INFO : Running command import graphs ./examples/cli/aa_aa/1L/aa_aa_1L.dot -p aa_aa_all_helicities_assembly -i 1L_ppmm -o
  344. 766.75 s gammaloop-nextest-integration> [2026-09-06 07:46:49.034] @commands::import INFO : Loading graphs from '/build/source/examples/cli/aa_aa/1L/aa_aa_1L.dot'
  345. 766.75 s gammaloop-nextest-integration> [2026-09-06 07:46:49.041] @gammaloop_api::se... INFO : Running command generate existing -p aa_aa_all_helicities_assembly
  346. 766.75 s gammaloop-nextest-integration> [2026-09-06 07:47:11.191] @processes::amplitude INFO : Compiling amplitude 1L_ppmm
  347. 766.75 s gammaloop-nextest-integration> [2026-09-06 07:47:28.850] @commands::generate INFO : Removed 34 generated C++ source file(s). Use '--keep-sources' to keep them.
  348. 766.75 s gammaloop-nextest-integration> [2026-09-06 07:47:28.850] @commands::generate INFO :
  349. 766.75 s gammaloop-nextest-integration> Integrand generation summary
  350. 766.75 s gammaloop-nextest-integration> peak RAM 2.32 GiB | cores 1
  351. 766.75 s gammaloop-nextest-integration> ╭───────────┬───────┬─────────┬──────────────┬─────────────┬────────────────┬──────────────╮
  352. 766.75 s gammaloop-nextest-integration> │ integrand │ graph │ # evals │ expr build │ spenso │ symbolica eval │ compile │
  353. 766.75 s gammaloop-nextest-integration> ├───────────┼───────┼─────────┼──────────────┼─────────────┼────────────────┼──────────────┤
  354. 766.75 s gammaloop-nextest-integration> │ 1L_ppmm │ GL0 │ 13 │ 480ms (3.6%) │ 1.34s (10%) │ 5.55s (42%) │ 5.99s (45%) │
  355. 766.75 s gammaloop-nextest-integration> │ 1L_ppmm │ GL2 │ 13 │ 475ms (3.5%) │ 1.50s (11%) │ 5.42s (40%) │ 6.29s (46%) │
  356. 766.75 s gammaloop-nextest-integration> │ 1L_ppmm │ GL4 │ 11 │ 462ms (3.6%) │ 1.41s (11%) │ 5.47s (43%) │ 5.37s (42%) │
  357. 766.75 s gammaloop-nextest-integration> ├───────────┼───────┼─────────┼──────────────┼─────────────┼────────────────┼──────────────┤
  358. 766.75 s gammaloop-nextest-integration> │ Total │ │ 37 │ 1.42s (3.6%) │ 4.25s (11%) │ 16.44s (41%) │ 17.65s (44%) │
  359. 766.75 s gammaloop-nextest-integration> ╰───────────┴───────┴─────────┴──────────────┴─────────────┴────────────────┴──────────────╯
  360. 766.75 s gammaloop-nextest-integration> [2026-09-06 07:47:29.455] @gammaloop_api::se... INFO : Running command set process -p aa_aa_all_helicities -i 1L_ppmm string '
  361. 766.75 s gammaloop-nextest-integration> [stability]
  362. 766.75 s gammaloop-nextest-integration> check_on_norm = true
  363. 766.75 s gammaloop-nextest-integration> escalate_if_exact_zero = false
  364. 766.75 s gammaloop-nextest-integration> loop_momenta_norm_escalation_factor = -1.0
  365. 766.75 s gammaloop-nextest-integration> [...]
  366. 766.75 s gammaloop-nextest-integration> [2026-09-06 07:47:29.456] @gammaloop_api::se... INFO : Running command set process -p aa_aa_all_helicities_assembly -i 1L_ppmm string '
  367. 766.75 s gammaloop-nextest-integration> [stability]
  368. 766.75 s gammaloop-nextest-integration> check_on_norm = true
  369. 766.75 s gammaloop-nextest-integration> escalate_if_exact_zero = false
  370. 766.75 s gammaloop-nextest-integration> loop_momenta_norm_escalation_factor = -1.0
  371. 766.75 s gammaloop-nextest-integration> [...]
  372. 766.75 s gammaloop-nextest-integration> [2026-09-06 07:47:29.457] @gammaloop_api::se... INFO : Running command set process -p aa_aa_all_helicities -i 1L_mpmm string '
  373. 766.75 s gammaloop-nextest-integration> [stability]
  374. 766.75 s gammaloop-nextest-integration> check_on_norm = true
  375. 766.75 s gammaloop-nextest-integration> escalate_if_exact_zero = false
  376. 766.75 s gammaloop-nextest-integration> loop_momenta_norm_escalation_factor = -1.0
  377. 766.75 s gammaloop-nextest-integration> [...]
  378. 766.75 s gammaloop-nextest-integration> [2026-09-06 07:47:29.458] @gammaloop_api::se... INFO : Running command set process -p aa_aa_all_helicities_assembly -i 1L_mpmm string '
  379. 766.75 s gammaloop-nextest-integration> [stability]
  380. 766.75 s gammaloop-nextest-integration> check_on_norm = true
  381. 766.75 s gammaloop-nextest-integration> escalate_if_exact_zero = false
  382. 766.75 s gammaloop-nextest-integration> loop_momenta_norm_escalation_factor = -1.0
  383. 766.75 s gammaloop-nextest-integration> [...]
  384. 766.75 s gammaloop-nextest-integration> [2026-09-06 07:47:29.458] @gammaloop_api::se... INFO : Running command set process -p aa_aa_all_helicities -i 1L_mmmm string '
  385. 766.75 s gammaloop-nextest-integration> [stability]
  386. 766.75 s gammaloop-nextest-integration> check_on_norm = true
  387. 766.75 s gammaloop-nextest-integration> escalate_if_exact_zero = false
  388. 766.75 s gammaloop-nextest-integration> loop_momenta_norm_escalation_factor = -1.0
  389. 766.75 s gammaloop-nextest-integration> [...]
  390. 766.75 s gammaloop-nextest-integration> [2026-09-06 07:47:29.459] @gammaloop_api::se... INFO : Running command set process -p aa_aa_all_helicities_assembly -i 1L_mmmm string '
  391. 766.75 s gammaloop-nextest-integration> [stability]
  392. 766.75 s gammaloop-nextest-integration> check_on_norm = true
  393. 766.75 s gammaloop-nextest-integration> escalate_if_exact_zero = false
  394. 766.75 s gammaloop-nextest-integration> loop_momenta_norm_escalation_factor = -1.0
  395. 766.75 s gammaloop-nextest-integration> [...]
  396. 766.75 s gammaloop-nextest-integration> [2026-09-06 07:47:29.460] @gammaloop_api::se... INFO : Running command set process -p aa_aa_all_helicities -i 1L_pmmp string '
  397. 766.75 s gammaloop-nextest-integration> [stability]
  398. 766.75 s gammaloop-nextest-integration> check_on_norm = true
  399. 766.75 s gammaloop-nextest-integration> escalate_if_exact_zero = false
  400. 766.75 s gammaloop-nextest-integration> loop_momenta_norm_escalation_factor = -1.0
  401. 766.75 s gammaloop-nextest-integration> [...]
  402. 766.75 s gammaloop-nextest-integration> [2026-09-06 07:47:29.460] @gammaloop_api::se... INFO : Running command set process -p aa_aa_all_helicities_assembly -i 1L_pmmp string '
  403. 766.75 s gammaloop-nextest-integration> [stability]
  404. 766.75 s gammaloop-nextest-integration> check_on_norm = true
  405. 766.75 s gammaloop-nextest-integration> escalate_if_exact_zero = false
  406. 766.75 s gammaloop-nextest-integration> loop_momenta_norm_escalation_factor = -1.0
  407. 766.75 s gammaloop-nextest-integration> [...]
  408. 766.75 s gammaloop-nextest-integration> [2026-09-06 07:47:29.461] @gammaloop_api::se... INFO : Running command set process -p aa_aa_all_helicities -i 1L_pmpm string '
  409. 766.75 s gammaloop-nextest-integration> [stability]
  410. 766.75 s gammaloop-nextest-integration> check_on_norm = true
  411. 766.75 s gammaloop-nextest-integration> escalate_if_exact_zero = false
  412. 766.75 s gammaloop-nextest-integration> loop_momenta_norm_escalation_factor = -1.0
  413. 766.75 s gammaloop-nextest-integration> [...]
  414. 766.75 s gammaloop-nextest-integration> [2026-09-06 07:47:29.461] @gammaloop_api::se... INFO : Running command set process -p aa_aa_all_helicities_assembly -i 1L_pmpm string '
  415. 766.75 s gammaloop-nextest-integration> [stability]
  416. 766.75 s gammaloop-nextest-integration> check_on_norm = true
  417. 766.75 s gammaloop-nextest-integration> escalate_if_exact_zero = false
  418. 766.75 s gammaloop-nextest-integration> loop_momenta_norm_escalation_factor = -1.0
  419. 766.75 s gammaloop-nextest-integration> [...]
  420. 766.75 s gammaloop-nextest-integration> [2026-09-06 07:47:29.466] @process::amplitude INFO : Input is below threshold: 0 existing threshold E-surfaces across 0/1 graph groups
  421. 766.75 s gammaloop-nextest-integration> [2026-09-06 07:47:29.466] @process::amplitude INFO : overlap structure of group 0: [0: []]
  422. 766.75 s gammaloop-nextest-integration> [2026-09-06 07:47:29.466] @integrands::process [{#im_is_nan, #re_is_nan}] WARNING : final process evaluation is nonfinite
  423. 766.75 s gammaloop-nextest-integration> [2026-09-06 07:47:29.466] @commands::inspect INFO :
  424. 766.75 s gammaloop-nextest-integration> Input point in momentum space:
  425. 766.75 s gammaloop-nextest-integration>
  426. 766.75 s gammaloop-nextest-integration> ( 0.1100000000000000, -0.0700000000000000, 0.1900000000000000 )
  427. 766.75 s gammaloop-nextest-integration>
  428. 766.75 s gammaloop-nextest-integration> The evaluation of integrand '1L_ppmm' is:
  429. 766.75 s gammaloop-nextest-integration>
  430. 766.75 s gammaloop-nextest-integration> ( +0.0000000000000000e0, +0.0000000000000000e0 i)
  431. 766.75 s gammaloop-nextest-integration>
  432. 766.75 s gammaloop-nextest-integration> [2026-09-06 07:47:29.470] @process::amplitude INFO : Input is below threshold: 0 existing threshold E-surfaces across 0/1 graph groups
  433. 766.75 s gammaloop-nextest-integration> [2026-09-06 07:47:29.470] @process::amplitude INFO : overlap structure of group 0: [0: []]
  434. 766.75 s gammaloop-nextest-integration> [2026-09-06 07:47:29.470] @commands::inspect INFO :
  435. 766.75 s gammaloop-nextest-integration> Input point in momentum space:
  436. 766.75 s gammaloop-nextest-integration>
  437. 766.75 s gammaloop-nextest-integration> ( 0.1100000000000000, -0.0700000000000000, 0.1900000000000000 )
  438. 766.75 s gammaloop-nextest-integration>
  439. 766.75 s gammaloop-nextest-integration> The evaluation of integrand '1L_ppmm' is:
  440. 766.75 s gammaloop-nextest-integration>
  441. 766.75 s gammaloop-nextest-integration> ( -1.7132462539328486e-28, -8.7105072229446864e-10 i)
  442. 766.75 s gammaloop-nextest-integration>
  443. 766.75 s gammaloop-nextest-integration> The application panicked (crashed).
  444. 766.75 s gammaloop-nextest-integration> Message: kinematics=a, integrand=1L_ppmm, graph_id=0: assembly vs symjit inspect: actual=(-0.00000000000000000000000000017132462539328486+-0.0000000008710507222944686i), expected=(0+0i), tolerance=0.0000000001
  445. 766.75 s gammaloop-nextest-integration> Location: tests/tests/test_runs/utils.rs:466
  446. 766.75 s gammaloop-nextest-integration>
  447. 766.75 s gammaloop-nextest-integration> ━━━━━━━━━━━━━━━━━━━━━━━━━━━━━━━━━━ BACKTRACE ━━━━━━━━━━━━━━━━━━━━━━━━━━━━━━━━━━━
  448. 766.75 s gammaloop-nextest-integration> 1: <color_eyre[51793ea62743adbd]::config::PanicHook>::panic_report<unknown>
  449. 766.75 s gammaloop-nextest-integration> at <unknown source file>:<unknown line>
  450. 766.75 s gammaloop-nextest-integration> 2: <color_eyre[51793ea62743adbd]::config::PanicHook>::into_panic_hook::{closure#0}<unknown>
  451. 766.75 s gammaloop-nextest-integration> at <unknown source file>:<unknown line>
  452. 766.75 s gammaloop-nextest-integration> 3: std[bcb96dfbba0ab899]::panicking::panic_with_hook<unknown>
  453. 766.75 s gammaloop-nextest-integration> at <unknown source file>:<unknown line>
  454. 766.75 s gammaloop-nextest-integration> 4: std[bcb96dfbba0ab899]::panicking::panic_handler::{closure#0}<unknown>
  455. 766.75 s gammaloop-nextest-integration> at <unknown source file>:<unknown line>
  456. 766.75 s gammaloop-nextest-integration> 5: std[bcb96dfbba0ab899]::sys::backtrace::__rust_end_short_backtrace::<std[bcb96dfbba0ab899]::panicking::panic_handler::{closure#0}, !><unknown>
  457. 766.75 s gammaloop-nextest-integration> at <unknown source file>:<unknown line>
  458. 766.75 s gammaloop-nextest-integration> 6: __rustc[6c289b9f9c454d21]::rust_begin_unwind<unknown>
  459. 766.75 s gammaloop-nextest-integration> at <unknown source file>:<unknown line>
  460. 766.75 s gammaloop-nextest-integration> 7: core[940e698046960fd5]::panicking::panic_fmt<unknown>
  461. 766.75 s gammaloop-nextest-integration> at <unknown source file>:<unknown line>
  462. 766.75 s gammaloop-nextest-integration> 8: <test_runs[66584badfeb6c7be]::aa_aa::important::aa_aa_local_inspect_backend_consistency::{closure#0} as core[940e698046960fd5]::ops::function::FnOnce<()>>::call_once<unknown>
  463. 766.75 s gammaloop-nextest-integration> at <unknown source file>:<unknown line>
  464. 766.75 s gammaloop-nextest-integration> 9: serial_test[cd99724524a2f1c0]::serial_code_lock::local_serial_core_with_return::<(), eyre[cb2fd339c0c40fca]::Report><unknown>
  465. 766.75 s gammaloop-nextest-integration> at <unknown source file>:<unknown line>
  466. 766.75 s gammaloop-nextest-integration> 10: <test_runs[66584badfeb6c7be]::aa_aa::important::aa_aa_local_inspect_backend_consistency::{closure#0} as core[940e698046960fd5]::ops::function::FnOnce<()>>::call_once<unknown>
  467. 766.75 s gammaloop-nextest-integration> at <unknown source file>:<unknown line>
  468. 766.75 s gammaloop-nextest-integration> 11: test[75d6903177b1d7e9]::__rust_begin_short_backtrace::<core[940e698046960fd5]::result::Result<(), alloc[2ea6bcb46fca0c42]::string::String>, fn() -> core[940e698046960fd5]::result::Result<(), alloc[2ea6bcb46fca0c42]::string::String>><unknown>
  469. 766.75 s gammaloop-nextest-integration> at <unknown source file>:<unknown line>
  470. 766.75 s gammaloop-nextest-integration> 12: test[75d6903177b1d7e9]::run_test::{closure#0}<unknown>
  471. 766.75 s gammaloop-nextest-integration> at <unknown source file>:<unknown line>
  472. 766.75 s gammaloop-nextest-integration> 13: std[bcb96dfbba0ab899]::sys::backtrace::__rust_begin_short_backtrace::<test[75d6903177b1d7e9]::run_test::{closure#1}, ()><unknown>
  473. 766.75 s gammaloop-nextest-integration> at <unknown source file>:<unknown line>
  474. 766.75 s gammaloop-nextest-integration> 14: <std[bcb96dfbba0ab899]::thread::lifecycle::spawn_unchecked<test[75d6903177b1d7e9]::run_test::{closure#1}, ()>::{closure#1} as core[940e698046960fd5]::ops::function::FnOnce<()>>::call_once::{shim:vtable#0}<unknown>
  475. 766.75 s gammaloop-nextest-integration> at <unknown source file>:<unknown line>
  476. 766.75 s gammaloop-nextest-integration> 15: <std[bcb96dfbba0ab899]::sys::thread::unix::Thread>::new::thread_start<unknown>
  477. 766.75 s gammaloop-nextest-integration> at <unknown source file>:<unknown line>
  478. 766.75 s gammaloop-nextest-integration> 16: start_thread<unknown>
  479. 766.75 s gammaloop-nextest-integration> at <unknown source file>:<unknown line>
  480. 766.75 s gammaloop-nextest-integration> 17: __clone3<unknown>
  481. 766.75 s gammaloop-nextest-integration> at <unknown source file>:<unknown line>
  482. 766.75 s gammaloop-nextest-integration>
  483. 766.75 s gammaloop-nextest-integration> Run with COLORBT_SHOW_HIDDEN=1 environment variable to disable frame filtering.
  484. 766.75 s gammaloop-nextest-integration> Run with RUST_BACKTRACE=full to include source snippets.
  485. 766.75 s gammaloop-nextest-integration>
  486. 767.01 s gammaloop-nextest-integration> error: test run failed
  487. 767.04 s gammaloop-nextest-integration>
  488. 767.04 s gammaloop-nextest-integration> ========== nextest test summary ==========
  489. 767.04 s gammaloop-nextest-integration> report: target/nextest/ci_gammaloop/junit.xml
  490. 767.04 s gammaloop-nextest-integration> tests: 152, failures: 1, errors: 0
  491. 767.04 s gammaloop-nextest-integration>
  492. 767.04 s gammaloop-nextest-integration> 1. gammaloop-integration-tests::test_runs::aa_aa::important::aa_aa_local_inspect_backend_consistency
  493. 767.04 s gammaloop-nextest-integration> failure: test failure with exit code 101
  494. 767.04 s gammaloop-nextest-integration> system-out
  495. 767.04 s gammaloop-nextest-integration> running 1 test
  496. 767.04 s gammaloop-nextest-integration> test aa_aa::important::aa_aa_local_inspect_backend_consistency has been running for over 60 seconds
  497. 767.04 s gammaloop-nextest-integration> test aa_aa::important::aa_aa_local_inspect_backend_consistency ... FAILED
  498. 767.04 s gammaloop-nextest-integration>
  499. 767.04 s gammaloop-nextest-integration> failures:
  500. 767.04 s gammaloop-nextest-integration>
  501. 767.04 s gammaloop-nextest-integration> failures:
  502. 767.04 s gammaloop-nextest-integration> aa_aa::important::aa_aa_local_inspect_backend_consistency
  503. 767.04 s gammaloop-nextest-integration>
  504. 767.04 s gammaloop-nextest-integration> test result: FAILED. 0 passed; 1 failed; 0 ignored; 0 measured; 258 filtered out; finished in 66.52s
  505. 767.04 s gammaloop-nextest-integration> system-err
  506. 767.04 s gammaloop-nextest-integration> [2026-09-06 07:46:23.373] @gammaloop_api::se... INFO : Running command import model sm-default.json
  507. 767.04 s gammaloop-nextest-integration> [2026-09-06 07:46:23.373] @import::model INFO : Loading built-in JSON model sm-default
  508. 767.04 s gammaloop-nextest-integration> [2026-09-06 07:46:23.391] @gammalooprs::model INFO : The following 11 external parameters were forced to zero by the restriction card:
  509. 767.04 s gammaloop-nextest-integration> lamWS, AWS, rhoWS, etaWS, ymc, yme, ymm, MC, Me, MM, WTau
  510. 767.04 s gammaloop-nextest-integration> [2026-09-06 07:46:23.391] @gammalooprs::model INFO : The following 34 vertex rules were removed by the restriction card:
  511. 767.04 s gammaloop-nextest-integration> V_82 -> (c~, d, G+) | V_83 -> (t~, d, G+) | V_84 -> (c~, s, G+) | V_85 -> (t~, s, G+) | V_86 -> (u~, b, G+) | V_87 -> (c~, b, G+) | V_90 -> (c~, d, W+) | V_91 -> (t~, d, W+) | V_92 -> (u~, s, W+) | V_94 -> (t~, s, W+) | V_95 -> (u~, b, W+) | V_96 -> (c~, b, W+) | V_101 -> (e+, e-, G0) | V_102 -> (mu+, mu-, G0) | V_104 -> (e+, e-, H) | V_105 -> (mu+, mu-, H) | V_110 -> (ve~, e-, G+) | V_111 -> (vm~, mu-, G+) | V_116 -> (b~, u, G-) | V_117 -> (d~, c, G-) | V_118 -> (s~, c, G-) | V_119 -> (b~, c, G-) | V_120 -> (d~, t, G-) | V_121 -> (s~, t, G-) | V_124 -> (s~, u, W-) | V_125 -> (b~, u, W-) | V_126 -> (d~, c, W-) | V_128 -> (b~, c, W-) | V_129 -> (d~, t, W-) | V_130 -> (s~, t, W-) | V_138 -> (c~, c, G0) | V_140 -> (c~, c, H) | V_145 -> (e+, ve, G-) | V_146 -> (mu+, vm, G-)
  512. 767.04 s gammaloop-nextest-integration> [2026-09-06 07:46:23.391] @gammalooprs::model INFO : The following 36 couplings were removed by the restriction card:
  513. 767.04 s gammaloop-nextest-integration> GC_13, GC_14, GC_16, GC_17, GC_18, GC_19, GC_20, GC_22, GC_23, GC_24, GC_25, GC_26, GC_28, GC_29, GC_42, GC_43, GC_44, GC_46, GC_47, GC_48, GC_84, GC_85, GC_86, GC_87, GC_88, GC_89, GC_90, GC_91, GC_92, GC_93, GC_101, GC_102, GC_103, GC_105, GC_106, GC_107
  514. 767.04 s gammaloop-nextest-integration> [2026-09-06 07:46:23.392] @gammaloop_api::se... INFO : Running command run set_model_parameters
  515. 767.04 s gammaloop-nextest-integration> [2026-09-06 07:46:23.392] @gammaloop_api::se... INFO : Starting command block set_model_parameters
  516. 767.04 s gammaloop-nextest-integration> [2026-09-06 07:46:23.392] @gammaloop_api::se... INFO : Running command set model MT=173.0
  517. 767.04 s gammaloop-nextest-integration> [2026-09-06 07:46:23.395] @gammaloop_api::se... INFO : Running command set model WT=0.0
  518. 767.04 s gammaloop-nextest-integration> [2026-09-06 07:46:23.398] @gammaloop_api::se... INFO : Running command set model ymt=173.0
  519. 767.04 s gammaloop-nextest-integration> [2026-09-06 07:46:23.402] @gammaloop_api::se... INFO : Running command set model aS=0.118
  520. 767.04 s gammaloop-nextest-integration> [2026-09-06 07:46:23.405] @gammaloop_api::se... INFO : Running command set model aEWM1=137.036
  521. 767.04 s gammaloop-nextest-integration> [2026-09-06 07:46:23.408] @gammaloop_api::se... INFO : Running command set model Gf=1.166390e-05
  522. 767.04 s gammaloop-nextest-integration> [2026-09-06 07:46:23.411] @gammaloop_api::se... INFO : Running command set model MZ=91.188
  523. 767.04 s gammaloop-nextest-integration> [2026-09-06 07:46:23.415] @gammaloop_api::se... INFO : Running command set global string '
  524. 767.04 s gammaloop-nextest-integration> [global.generation.compile]
  525. 767.04 s gammaloop-nextest-integration> compilation_mode = "symjit"
  526. 767.04 s gammaloop-nextest-integration> optimization_level = "O0"
  527. 767.04 s gammaloop-nextest-integration> fast_math = false
  528. 767.04 s gammaloop-nextest-integration> [...]
  529. 767.04 s gammaloop-nextest-integration> [2026-09-06 07:46:23.416] @gammaloop_api::se... INFO : Running command import graphs ./examples/cli/aa_aa/1L/aa_aa_1L.dot -p aa_aa_all_helicities -i 1L_ppmm -o
  530. 767.04 s gammaloop-nextest-integration> [2026-09-06 07:46:23.416] @commands::import INFO : Loading graphs from '/build/source/examples/cli/aa_aa/1L/aa_aa_1L.dot'
  531. 767.04 s gammaloop-nextest-integration> [2026-09-06 07:46:23.423] @gammaloop_api::se... INFO : Running command generate existing -p aa_aa_all_helicities
  532. 767.04 s gammaloop-nextest-integration> [2026-09-06 07:46:48.360] @commands::generate INFO :
  533. 767.04 s gammaloop-nextest-integration> Integrand generation summary
  534. 767.04 s gammaloop-nextest-integration> peak RAM 1012.75 MiB | cores 1
  535. 767.04 s gammaloop-nextest-integration> ╭───────────┬───────┬─────────┬──────────────┬─────────────┬────────────────┬───────────────╮
  536. 767.04 s gammaloop-nextest-integration> │ integrand │ graph │ # evals │ expr build │ spenso │ symbolica eval │ compile │
  537. 767.04 s gammaloop-nextest-integration> ├───────────┼───────┼─────────┼──────────────┼─────────────┼────────────────┼───────────────┤
  538. 767.04 s gammaloop-nextest-integration> │ 1L_ppmm │ GL0 │ 13 │ 498ms (5.9%) │ 1.62s (19%) │ 5.50s (65%) │ 842ms (10.0%) │
  539. 767.04 s gammaloop-nextest-integration> │ 1L_ppmm │ GL2 │ 13 │ 477ms (5.7%) │ 1.47s (18%) │ 5.62s (67%) │ 803ms (9.6%) │
  540. 767.04 s gammaloop-nextest-integration> │ 1L_ppmm │ GL4 │ 11 │ 463ms (5.8%) │ 1.37s (17%) │ 5.43s (68%) │ 756ms (9.4%) │
  541. 767.04 s gammaloop-nextest-integration> ├───────────┼───────┼─────────┼──────────────┼─────────────┼────────────────┼───────────────┤
  542. 767.04 s gammaloop-nextest-integration> │ Total │ │ 37 │ 1.44s (5.8%) │ 4.46s (18%) │ 16.55s (67%) │ 2.40s (9.7%) │
  543. 767.04 s gammaloop-nextest-integration> ╰───────────┴───────┴─────────┴──────────────┴─────────────┴────────────────┴───────────────╯
  544. 767.04 s gammaloop-nextest-integration> [2026-09-06 07:46:48.993] @gammaloop_api::se... INFO : Running command import model sm-default.json
  545. 767.04 s gammaloop-nextest-integration> [2026-09-06 07:46:48.993] @import::model INFO : Loading built-in JSON model sm-default
  546. 767.04 s gammaloop-nextest-integration> [2026-09-06 07:46:49.010] @gammalooprs::model INFO : The following 11 external parameters were forced to zero by the restriction card:
  547. 767.04 s gammaloop-nextest-integration> lamWS, AWS, rhoWS, etaWS, ymc, yme, ymm, MC, Me, MM, WTau
  548. 767.04 s gammaloop-nextest-integration> [2026-09-06 07:46:49.010] @gammalooprs::model INFO : The following 34 vertex rules were removed by the restriction card:
  549. 767.04 s gammaloop-nextest-integration> V_82 -> (c~, d, G+) | V_83 -> (t~, d, G+) | V_84 -> (c~, s, G+) | V_85 -> (t~, s, G+) | V_86 -> (u~, b, G+) | V_87 -> (c~, b, G+) | V_90 -> (c~, d, W+) | V_91 -> (t~, d, W+) | V_92 -> (u~, s, W+) | V_94 -> (t~, s, W+) | V_95 -> (u~, b, W+) | V_96 -> (c~, b, W+) | V_101 -> (e+, e-, G0) | V_102 -> (mu+, mu-, G0) | V_104 -> (e+, e-, H) | V_105 -> (mu+, mu-, H) | V_110 -> (ve~, e-, G+) | V_111 -> (vm~, mu-, G+) | V_116 -> (b~, u, G-) | V_117 -> (d~, c, G-) | V_118 -> (s~, c, G-) | V_119 -> (b~, c, G-) | V_120 -> (d~, t, G-) | V_121 -> (s~, t, G-) | V_124 -> (s~, u, W-) | V_125 -> (b~, u, W-) | V_126 -> (d~, c, W-) | V_128 -> (b~, c, W-) | V_129 -> (d~, t, W-) | V_130 -> (s~, t, W-) | V_138 -> (c~, c, G0) | V_140 -> (c~, c, H) | V_145 -> (e+, ve, G-) | V_146 -> (mu+, vm, G-)
  550. 767.04 s gammaloop-nextest-integration> [2026-09-06 07:46:49.010] @gammalooprs::model INFO : The following 36 couplings were removed by the restriction card:
  551. 767.04 s gammaloop-nextest-integration> GC_13, GC_14, GC_16, GC_17, GC_18, GC_19, GC_20, GC_22, GC_23, GC_24, GC_25, GC_26, GC_28, GC_29, GC_42, GC_43, GC_44, GC_46, GC_47, GC_48, GC_84, GC_85, GC_86, GC_87, GC_88, GC_89, GC_90, GC_91, GC_92, GC_93, GC_101, GC_102, GC_103, GC_105, GC_106, GC_107
  552. 767.04 s gammaloop-nextest-integration> [2026-09-06 07:46:49.011] @gammaloop_api::se... INFO : Running command run set_model_parameters
  553. 767.04 s gammaloop-nextest-integration> [2026-09-06 07:46:49.011] @gammaloop_api::se... INFO : Starting command block set_model_parameters
  554. 767.04 s gammaloop-nextest-integration> [2026-09-06 07:46:49.011] @gammaloop_api::se... INFO : Running command set model MT=173.0
  555. 767.04 s gammaloop-nextest-integration> [2026-09-06 07:46:49.014] @gammaloop_api::se... INFO : Running command set model WT=0.0
  556. 767.04 s gammaloop-nextest-integration> [2026-09-06 07:46:49.017] @gammaloop_api::se... INFO : Running command set model ymt=173.0
  557. 767.04 s gammaloop-nextest-integration> [2026-09-06 07:46:49.020] @gammaloop_api::se... INFO : Running command set model aS=0.118
  558. 767.04 s gammaloop-nextest-integration> [2026-09-06 07:46:49.024] @gammaloop_api::se... INFO : Running command set model aEWM1=137.036
  559. 767.04 s gammaloop-nextest-integration> [2026-09-06 07:46:49.027] @gammaloop_api::se... INFO : Running command set model Gf=1.166390e-05
  560. 767.04 s gammaloop-nextest-integration> [2026-09-06 07:46:49.030] @gammaloop_api::se... INFO : Running command set model MZ=91.188
  561. 767.04 s gammaloop-nextest-integration> [2026-09-06 07:46:49.033] @gammaloop_api::se... INFO : Running command set global string '
  562. 767.04 s gammaloop-nextest-integration> [global.generation.compile]
  563. 767.04 s gammaloop-nextest-integration> compilation_mode = "assembly"
  564. 767.04 s gammaloop-nextest-integration> optimization_level = "O0"
  565. 767.04 s gammaloop-nextest-integration> fast_math = false
  566. 767.04 s gammaloop-nextest-integration> [...]
  567. 767.04 s gammaloop-nextest-integration> [2026-09-06 07:46:49.034] @gammaloop_api::se... INFO : Running command import graphs ./examples/cli/aa_aa/1L/aa_aa_1L.dot -p aa_aa_all_helicities_assembly -i 1L_ppmm -o
  568. 767.04 s gammaloop-nextest-integration> [2026-09-06 07:46:49.034] @commands::import INFO : Loading graphs from '/build/source/examples/cli/aa_aa/1L/aa_aa_1L.dot'
  569. 767.04 s gammaloop-nextest-integration> [2026-09-06 07:46:49.041] @gammaloop_api::se... INFO : Running command generate existing -p aa_aa_all_helicities_assembly
  570. 767.04 s gammaloop-nextest-integration> [2026-09-06 07:47:11.191] @processes::amplitude INFO : Compiling amplitude 1L_ppmm
  571. 767.04 s gammaloop-nextest-integration> [2026-09-06 07:47:28.850] @commands::generate INFO : Removed 34 generated C++ source file(s). Use '--keep-sources' to keep them.
  572. 767.04 s gammaloop-nextest-integration> [2026-09-06 07:47:28.850] @commands::generate INFO :
  573. 767.04 s gammaloop-nextest-integration> Integrand generation summary
  574. 767.04 s gammaloop-nextest-integration> peak RAM 2.32 GiB | cores 1
  575. 767.04 s gammaloop-nextest-integration> ╭───────────┬───────┬─────────┬──────────────┬─────────────┬────────────────┬──────────────╮
  576. 767.04 s gammaloop-nextest-integration> │ integrand │ graph │ # evals │ expr build │ spenso │ symbolica eval │ compile │
  577. 767.04 s gammaloop-nextest-integration> ├───────────┼───────┼─────────┼──────────────┼─────────────┼────────────────┼──────────────┤
  578. 767.04 s gammaloop-nextest-integration> │ 1L_ppmm │ GL0 │ 13 │ 480ms (3.6%) │ 1.34s (10%) │ 5.55s (42%) │ 5.99s (45%) │
  579. 767.04 s gammaloop-nextest-integration> │ 1L_ppmm │ GL2 │ 13 │ 475ms (3.5%) │ 1.50s (11%) │ 5.42s (40%) │ 6.29s (46%) │
  580. 767.04 s gammaloop-nextest-integration> │ 1L_ppmm │ GL4 │ 11 │ 462ms (3.6%) │ 1.41s (11%) │ 5.47s (43%) │ 5.37s (42%) │
  581. 767.04 s gammaloop-nextest-integration> ├───────────┼───────┼─────────┼──────────────┼─────────────┼────────────────┼──────────────┤
  582. 767.04 s gammaloop-nextest-integration> │ Total │ │ 37 │ 1.42s (3.6%) │ 4.25s (11%) │ 16.44s (41%) │ 17.65s (44%) │
  583. 767.04 s gammaloop-nextest-integration> ╰───────────┴───────┴─────────┴──────────────┴─────────────┴────────────────┴──────────────╯
  584. 767.04 s gammaloop-nextest-integration> [2026-09-06 07:47:29.455] @gammaloop_api::se... INFO : Running command set process -p aa_aa_all_helicities -i 1L_ppmm string '
  585. 767.04 s gammaloop-nextest-integration> [stability]
  586. 767.04 s gammaloop-nextest-integration> check_on_norm = true
  587. 767.04 s gammaloop-nextest-integration> escalate_if_exact_zero = false
  588. 767.04 s gammaloop-nextest-integration> loop_momenta_norm_escalation_factor = -1.0
  589. 767.04 s gammaloop-nextest-integration> [...]
  590. 767.04 s gammaloop-nextest-integration> [2026-09-06 07:47:29.456] @gammaloop_api::se... INFO : Running command set process -p aa_aa_all_helicities_assembly -i 1L_ppmm string '
  591. 767.04 s gammaloop-nextest-integration> [stability]
  592. 767.04 s gammaloop-nextest-integration> check_on_norm = true
  593. 767.04 s gammaloop-nextest-integration> escalate_if_exact_zero = false
  594. 767.04 s gammaloop-nextest-integration> loop_momenta_norm_escalation_factor = -1.0
  595. 767.04 s gammaloop-nextest-integration> [...]
  596. 767.04 s gammaloop-nextest-integration> [2026-09-06 07:47:29.457] @gammaloop_api::se... INFO : Running command set process -p aa_aa_all_helicities -i 1L_mpmm string '
  597. 767.04 s gammaloop-nextest-integration> [stability]
  598. 767.04 s gammaloop-nextest-integration> check_on_norm = true
  599. 767.04 s gammaloop-nextest-integration> escalate_if_exact_zero = false
  600. 767.04 s gammaloop-nextest-integration> loop_momenta_norm_escalation_factor = -1.0
  601. 767.04 s gammaloop-nextest-integration> [...]
  602. 767.04 s gammaloop-nextest-integration> [2026-09-06 07:47:29.458] @gammaloop_api::se... INFO : Running command set process -p aa_aa_all_helicities_assembly -i 1L_mpmm string '
  603. 767.04 s gammaloop-nextest-integration> [stability]
  604. 767.04 s gammaloop-nextest-integration> check_on_norm = true
  605. 767.04 s gammaloop-nextest-integration> escalate_if_exact_zero = false
  606. 767.04 s gammaloop-nextest-integration> loop_momenta_norm_escalation_factor = -1.0
  607. 767.04 s gammaloop-nextest-integration> [...]
  608. 767.04 s gammaloop-nextest-integration> [2026-09-06 07:47:29.458] @gammaloop_api::se... INFO : Running command set process -p aa_aa_all_helicities -i 1L_mmmm string '
  609. 767.04 s gammaloop-nextest-integration> [stability]
  610. 767.04 s gammaloop-nextest-integration> check_on_norm = true
  611. 767.04 s gammaloop-nextest-integration> escalate_if_exact_zero = false
  612. 767.04 s gammaloop-nextest-integration> loop_momenta_norm_escalation_factor = -1.0
  613. 767.04 s gammaloop-nextest-integration> [...]
  614. 767.04 s gammaloop-nextest-integration> [2026-09-06 07:47:29.459] @gammaloop_api::se... INFO : Running command set process -p aa_aa_all_helicities_assembly -i 1L_mmmm string '
  615. 767.04 s gammaloop-nextest-integration> [stability]
  616. 767.04 s gammaloop-nextest-integration> check_on_norm = true
  617. 767.04 s gammaloop-nextest-integration> escalate_if_exact_zero = false
  618. 767.04 s gammaloop-nextest-integration> loop_momenta_norm_escalation_factor = -1.0
  619. 767.04 s gammaloop-nextest-integration> [...]
  620. 767.04 s gammaloop-nextest-integration> [2026-09-06 07:47:29.460] @gammaloop_api::se... INFO : Running command set process -p aa_aa_all_helicities -i 1L_pmmp string '
  621. 767.04 s gammaloop-nextest-integration> [stability]
  622. 767.04 s gammaloop-nextest-integration> check_on_norm = true
  623. 767.04 s gammaloop-nextest-integration> escalate_if_exact_zero = false
  624. 767.04 s gammaloop-nextest-integration> loop_momenta_norm_escalation_factor = -1.0
  625. 767.04 s gammaloop-nextest-integration> ... omitted 84 more lines; see full nextest output above
  626. 767.04 s gammaloop-nextest-integration> =========================================
  627. 767.13 s error: Cannot build '/nix/store/xaf9bwgnrhpb0jrkx6mcwl1pfl8pk1ly-gammaloop-nextest-integration.drv'.
  628. 767.13 s Reason: builder failed with exit code 100.
  629. 767.13 s Output paths:
  630. 767.13 s /nix/store/nwjsprs0wh86kdyq96q44q9sagn61pgk-gammaloop-nextest-integration
  631. 767.13 s Last 586 log lines:
  632. 767.13 s > Extracting 13 binaries, 1 build script output directory, and 3 linked paths to /build/nextest-archive-Oo48Rf
  633. 767.13 s > Extracted 30 files to /build/nextest-archive-Oo48Rf in 2.08s
  634. 767.13 s > ------------
  635. 767.13 s > Nextest run ID 0d0c8672-4518-4ec7-94f1-f2c6fef7350e with nextest profile: ci_gammaloop
  636. 767.13 s > Starting 152 tests across 13 binaries (208 tests skipped, including 207 tests via profile.ci_gammaloop.default-filter)
  637. 767.13 s > FAIL [ 66.679s] ( 54/152) gammaloop-integration-tests::test_runs aa_aa::important::aa_aa_local_inspect_backend_consistency
  638. 767.13 s > stdout ---
  639. 767.13 s >
  640. 767.13 s > running 1 test
  641. 767.13 s > test aa_aa::important::aa_aa_local_inspect_backend_consistency has been running for over 60 seconds
  642. 767.13 s > test aa_aa::important::aa_aa_local_inspect_backend_consistency ... FAILED
  643. 767.13 s >
  644. 767.13 s > failures:
  645. 767.13 s >
  646. 767.13 s > failures:
  647. 767.13 s > aa_aa::important::aa_aa_local_inspect_backend_consistency
  648. 767.13 s >
  649. 767.13 s > test result: FAILED. 0 passed; 1 failed; 0 ignored; 0 measured; 258 filtered out; finished in 66.52s
  650. 767.13 s >
  651. 767.13 s > stderr ---
  652. 767.13 s > [2026-09-06 07:46:23.373] @gammaloop_api::se... INFO : Running command import model sm-default.json
  653. 767.13 s > [2026-09-06 07:46:23.373] @import::model INFO : Loading built-in JSON model sm-default
  654. 767.13 s > [2026-09-06 07:46:23.391] @gammalooprs::model INFO : The following 11 external parameters were forced to zero by the restriction card:
  655. 767.13 s > lamWS, AWS, rhoWS, etaWS, ymc, yme, ymm, MC, Me, MM, WTau
  656. 767.13 s > [2026-09-06 07:46:23.391] @gammalooprs::model INFO : The following 34 vertex rules were removed by the restriction card:
  657. 767.13 s > V_82 -> (c~, d, G+) | V_83 -> (t~, d, G+) | V_84 -> (c~, s, G+) | V_85 -> (t~, s, G+) | V_86 -> (u~, b, G+) | V_87 -> (c~, b, G+) | V_90 -> (c~, d, W+) | V_91 -> (t~, d, W+) | V_92 -> (u~, s, W+) | V_94 -> (t~, s, W+) | V_95 -> (u~, b, W+) | V_96 -> (c~, b, W+) | V_101 -> (e+, e-, G0) | V_102 -> (mu+, mu-, G0) | V_104 -> (e+, e-, H) | V_105 -> (mu+, mu-, H) | V_110 -> (ve~, e-, G+) | V_111 -> (vm~, mu-, G+) | V_116 -> (b~, u, G-) | V_117 -> (d~, c, G-) | V_118 -> (s~, c, G-) | V_119 -> (b~, c, G-) | V_120 -> (d~, t, G-) | V_121 -> (s~, t, G-) | V_124 -> (s~, u, W-) | V_125 -> (b~, u, W-) | V_126 -> (d~, c, W-) | V_128 -> (b~, c, W-) | V_129 -> (d~, t, W-) | V_130 -> (s~, t, W-) | V_138 -> (c~, c, G0) | V_140 -> (c~, c, H) | V_145 -> (e+, ve, G-) | V_146 -> (mu+, vm, G-)
  658. 767.13 s > [2026-09-06 07:46:23.391] @gammalooprs::model INFO : The following 36 couplings were removed by the restriction card:
  659. 767.13 s > GC_13, GC_14, GC_16, GC_17, GC_18, GC_19, GC_20, GC_22, GC_23, GC_24, GC_25, GC_26, GC_28, GC_29, GC_42, GC_43, GC_44, GC_46, GC_47, GC_48, GC_84, GC_85, GC_86, GC_87, GC_88, GC_89, GC_90, GC_91, GC_92, GC_93, GC_101, GC_102, GC_103, GC_105, GC_106, GC_107
  660. 767.13 s > [2026-09-06 07:46:23.392] @gammaloop_api::se... INFO : Running command run set_model_parameters
  661. 767.13 s > [2026-09-06 07:46:23.392] @gammaloop_api::se... INFO : Starting command block set_model_parameters
  662. 767.13 s > [2026-09-06 07:46:23.392] @gammaloop_api::se... INFO : Running command set model MT=173.0
  663. 767.13 s > [2026-09-06 07:46:23.395] @gammaloop_api::se... INFO : Running command set model WT=0.0
  664. 767.13 s > [2026-09-06 07:46:23.398] @gammaloop_api::se... INFO : Running command set model ymt=173.0
  665. 767.13 s > [2026-09-06 07:46:23.402] @gammaloop_api::se... INFO : Running command set model aS=0.118
  666. 767.13 s > [2026-09-06 07:46:23.405] @gammaloop_api::se... INFO : Running command set model aEWM1=137.036
  667. 767.13 s > [2026-09-06 07:46:23.408] @gammaloop_api::se... INFO : Running command set model Gf=1.166390e-05
  668. 767.13 s > [2026-09-06 07:46:23.411] @gammaloop_api::se... INFO : Running command set model MZ=91.188
  669. 767.13 s > [2026-09-06 07:46:23.415] @gammaloop_api::se... INFO : Running command set global string '
  670. 767.13 s > [global.generation.compile]
  671. 767.13 s > compilation_mode = "symjit"
  672. 767.13 s > optimization_level = "O0"
  673. 767.13 s > fast_math = false
  674. 767.13 s > [...]
  675. 767.13 s > [2026-09-06 07:46:23.416] @gammaloop_api::se... INFO : Running command import graphs ./examples/cli/aa_aa/1L/aa_aa_1L.dot -p aa_aa_all_helicities -i 1L_ppmm -o
  676. 767.13 s > [2026-09-06 07:46:23.416] @commands::import INFO : Loading graphs from '/build/source/examples/cli/aa_aa/1L/aa_aa_1L.dot'
  677. 767.13 s > [2026-09-06 07:46:23.423] @gammaloop_api::se... INFO : Running command generate existing -p aa_aa_all_helicities
  678. 767.13 s > [2026-09-06 07:46:48.360] @commands::generate INFO :
  679. 767.13 s > Integrand generation summary
  680. 767.13 s > peak RAM 1012.75 MiB | cores 1
  681. 767.13 s > ╭───────────┬───────┬─────────┬──────────────┬─────────────┬────────────────┬───────────────╮
  682. 767.13 s > │ integrand │ graph │ # evals │ expr build │ spenso │ symbolica eval │ compile │
  683. 767.13 s > ├───────────┼───────┼─────────┼──────────────┼─────────────┼────────────────┼───────────────┤
  684. 767.13 s > │ 1L_ppmm │ GL0 │ 13 │ 498ms (5.9%) │ 1.62s (19%) │ 5.50s (65%) │ 842ms (10.0%) │
  685. 767.13 s > │ 1L_ppmm │ GL2 │ 13 │ 477ms (5.7%) │ 1.47s (18%) │ 5.62s (67%) │ 803ms (9.6%) │
  686. 767.13 s > │ 1L_ppmm │ GL4 │ 11 │ 463ms (5.8%) │ 1.37s (17%) │ 5.43s (68%) │ 756ms (9.4%) │
  687. 767.13 s > ├───────────┼───────┼─────────┼──────────────┼─────────────┼────────────────┼───────────────┤
  688. 767.13 s > │ Total │ │ 37 │ 1.44s (5.8%) │ 4.46s (18%) │ 16.55s (67%) │ 2.40s (9.7%) │
  689. 767.13 s > ╰───────────┴───────┴─────────┴──────────────┴─────────────┴────────────────┴───────────────╯
  690. 767.13 s > [2026-09-06 07:46:48.993] @gammaloop_api::se... INFO : Running command import model sm-default.json
  691. 767.13 s > [2026-09-06 07:46:48.993] @import::model INFO : Loading built-in JSON model sm-default
  692. 767.13 s > [2026-09-06 07:46:49.010] @gammalooprs::model INFO : The following 11 external parameters were forced to zero by the restriction card:
  693. 767.13 s > lamWS, AWS, rhoWS, etaWS, ymc, yme, ymm, MC, Me, MM, WTau
  694. 767.13 s > [2026-09-06 07:46:49.010] @gammalooprs::model INFO : The following 34 vertex rules were removed by the restriction card:
  695. 767.13 s > V_82 -> (c~, d, G+) | V_83 -> (t~, d, G+) | V_84 -> (c~, s, G+) | V_85 -> (t~, s, G+) | V_86 -> (u~, b, G+) | V_87 -> (c~, b, G+) | V_90 -> (c~, d, W+) | V_91 -> (t~, d, W+) | V_92 -> (u~, s, W+) | V_94 -> (t~, s, W+) | V_95 -> (u~, b, W+) | V_96 -> (c~, b, W+) | V_101 -> (e+, e-, G0) | V_102 -> (mu+, mu-, G0) | V_104 -> (e+, e-, H) | V_105 -> (mu+, mu-, H) | V_110 -> (ve~, e-, G+) | V_111 -> (vm~, mu-, G+) | V_116 -> (b~, u, G-) | V_117 -> (d~, c, G-) | V_118 -> (s~, c, G-) | V_119 -> (b~, c, G-) | V_120 -> (d~, t, G-) | V_121 -> (s~, t, G-) | V_124 -> (s~, u, W-) | V_125 -> (b~, u, W-) | V_126 -> (d~, c, W-) | V_128 -> (b~, c, W-) | V_129 -> (d~, t, W-) | V_130 -> (s~, t, W-) | V_138 -> (c~, c, G0) | V_140 -> (c~, c, H) | V_145 -> (e+, ve, G-) | V_146 -> (mu+, vm, G-)
  696. 767.13 s > [2026-09-06 07:46:49.010] @gammalooprs::model INFO : The following 36 couplings were removed by the restriction card:
  697. 767.13 s > GC_13, GC_14, GC_16, GC_17, GC_18, GC_19, GC_20, GC_22, GC_23, GC_24, GC_25, GC_26, GC_28, GC_29, GC_42, GC_43, GC_44, GC_46, GC_47, GC_48, GC_84, GC_85, GC_86, GC_87, GC_88, GC_89, GC_90, GC_91, GC_92, GC_93, GC_101, GC_102, GC_103, GC_105, GC_106, GC_107
  698. 767.13 s > [2026-09-06 07:46:49.011] @gammaloop_api::se... INFO : Running command run set_model_parameters
  699. 767.13 s > [2026-09-06 07:46:49.011] @gammaloop_api::se... INFO : Starting command block set_model_parameters
  700. 767.13 s > [2026-09-06 07:46:49.011] @gammaloop_api::se... INFO : Running command set model MT=173.0
  701. 767.13 s > [2026-09-06 07:46:49.014] @gammaloop_api::se... INFO : Running command set model WT=0.0
  702. 767.13 s > [2026-09-06 07:46:49.017] @gammaloop_api::se... INFO : Running command set model ymt=173.0
  703. 767.13 s > [2026-09-06 07:46:49.020] @gammaloop_api::se... INFO : Running command set model aS=0.118
  704. 767.13 s > [2026-09-06 07:46:49.024] @gammaloop_api::se... INFO : Running command set model aEWM1=137.036
  705. 767.13 s > [2026-09-06 07:46:49.027] @gammaloop_api::se... INFO : Running command set model Gf=1.166390e-05
  706. 767.13 s > [2026-09-06 07:46:49.030] @gammaloop_api::se... INFO : Running command set model MZ=91.188
  707. 767.13 s > [2026-09-06 07:46:49.033] @gammaloop_api::se... INFO : Running command set global string '
  708. 767.13 s > [global.generation.compile]
  709. 767.13 s > compilation_mode = "assembly"
  710. 767.13 s > optimization_level = "O0"
  711. 767.13 s > fast_math = false
  712. 767.13 s > [...]
  713. 767.13 s > [2026-09-06 07:46:49.034] @gammaloop_api::se... INFO : Running command import graphs ./examples/cli/aa_aa/1L/aa_aa_1L.dot -p aa_aa_all_helicities_assembly -i 1L_ppmm -o
  714. 767.13 s > [2026-09-06 07:46:49.034] @commands::import INFO : Loading graphs from '/build/source/examples/cli/aa_aa/1L/aa_aa_1L.dot'
  715. 767.13 s > [2026-09-06 07:46:49.041] @gammaloop_api::se... INFO : Running command generate existing -p aa_aa_all_helicities_assembly
  716. 767.13 s > [2026-09-06 07:47:11.191] @processes::amplitude INFO : Compiling amplitude 1L_ppmm
  717. 767.13 s > [2026-09-06 07:47:28.850] @commands::generate INFO : Removed 34 generated C++ source file(s). Use '--keep-sources' to keep them.
  718. 767.13 s > [2026-09-06 07:47:28.850] @commands::generate INFO :
  719. 767.13 s > Integrand generation summary
  720. 767.13 s > peak RAM 2.32 GiB | cores 1
  721. 767.13 s > ╭───────────┬───────┬─────────┬──────────────┬─────────────┬────────────────┬──────────────╮
  722. 767.13 s > │ integrand │ graph │ # evals │ expr build │ spenso │ symbolica eval │ compile │
  723. 767.13 s > ├───────────┼───────┼─────────┼──────────────┼─────────────┼────────────────┼──────────────┤
  724. 767.13 s > │ 1L_ppmm │ GL0 │ 13 │ 480ms (3.6%) │ 1.34s (10%) │ 5.55s (42%) │ 5.99s (45%) │
  725. 767.13 s > │ 1L_ppmm │ GL2 │ 13 │ 475ms (3.5%) │ 1.50s (11%) │ 5.42s (40%) │ 6.29s (46%) │
  726. 767.13 s > │ 1L_ppmm │ GL4 │ 11 │ 462ms (3.6%) │ 1.41s (11%) │ 5.47s (43%) │ 5.37s (42%) │
  727. 767.13 s > ├───────────┼───────┼─────────┼──────────────┼─────────────┼────────────────┼──────────────┤
  728. 767.13 s > │ Total │ │ 37 │ 1.42s (3.6%) │ 4.25s (11%) │ 16.44s (41%) │ 17.65s (44%) │
  729. 767.13 s > ╰───────────┴───────┴─────────┴──────────────┴─────────────┴────────────────┴──────────────╯
  730. 767.13 s > [2026-09-06 07:47:29.455] @gammaloop_api::se... INFO : Running command set process -p aa_aa_all_helicities -i 1L_ppmm string '
  731. 767.13 s > [stability]
  732. 767.13 s > check_on_norm = true
  733. 767.13 s > escalate_if_exact_zero = false
  734. 767.13 s > loop_momenta_norm_escalation_factor = -1.0
  735. 767.13 s > [...]
  736. 767.13 s > [2026-09-06 07:47:29.456] @gammaloop_api::se... INFO : Running command set process -p aa_aa_all_helicities_assembly -i 1L_ppmm string '
  737. 767.13 s > [stability]
  738. 767.13 s > check_on_norm = true
  739. 767.13 s > escalate_if_exact_zero = false
  740. 767.13 s > loop_momenta_norm_escalation_factor = -1.0
  741. 767.13 s > [...]
  742. 767.13 s > [2026-09-06 07:47:29.457] @gammaloop_api::se... INFO : Running command set process -p aa_aa_all_helicities -i 1L_mpmm string '
  743. 767.13 s > [stability]
  744. 767.13 s > check_on_norm = true
  745. 767.13 s > escalate_if_exact_zero = false
  746. 767.13 s > loop_momenta_norm_escalation_factor = -1.0
  747. 767.13 s > [...]
  748. 767.13 s > [2026-09-06 07:47:29.458] @gammaloop_api::se... INFO : Running command set process -p aa_aa_all_helicities_assembly -i 1L_mpmm string '
  749. 767.13 s > [stability]
  750. 767.13 s > check_on_norm = true
  751. 767.13 s > escalate_if_exact_zero = false
  752. 767.13 s > loop_momenta_norm_escalation_factor = -1.0
  753. 767.13 s > [...]
  754. 767.13 s > [2026-09-06 07:47:29.458] @gammaloop_api::se... INFO : Running command set process -p aa_aa_all_helicities -i 1L_mmmm string '
  755. 767.13 s > [stability]
  756. 767.13 s > check_on_norm = true
  757. 767.13 s > escalate_if_exact_zero = false
  758. 767.13 s > loop_momenta_norm_escalation_factor = -1.0
  759. 767.13 s > [...]
  760. 767.13 s > [2026-09-06 07:47:29.459] @gammaloop_api::se... INFO : Running command set process -p aa_aa_all_helicities_assembly -i 1L_mmmm string '
  761. 767.13 s > [stability]
  762. 767.13 s > check_on_norm = true
  763. 767.13 s > escalate_if_exact_zero = false
  764. 767.13 s > loop_momenta_norm_escalation_factor = -1.0
  765. 767.13 s > [...]
  766. 767.13 s > [2026-09-06 07:47:29.460] @gammaloop_api::se... INFO : Running command set process -p aa_aa_all_helicities -i 1L_pmmp string '
  767. 767.13 s > [stability]
  768. 767.13 s > check_on_norm = true
  769. 767.13 s > escalate_if_exact_zero = false
  770. 767.13 s > loop_momenta_norm_escalation_factor = -1.0
  771. 767.13 s > [...]
  772. 767.13 s > [2026-09-06 07:47:29.460] @gammaloop_api::se... INFO : Running command set process -p aa_aa_all_helicities_assembly -i 1L_pmmp string '
  773. 767.13 s > [stability]
  774. 767.13 s > check_on_norm = true
  775. 767.13 s > escalate_if_exact_zero = false
  776. 767.13 s > loop_momenta_norm_escalation_factor = -1.0
  777. 767.13 s > [...]
  778. 767.13 s > [2026-09-06 07:47:29.461] @gammaloop_api::se... INFO : Running command set process -p aa_aa_all_helicities -i 1L_pmpm string '
  779. 767.13 s > [stability]
  780. 767.13 s > check_on_norm = true
  781. 767.13 s > escalate_if_exact_zero = false
  782. 767.13 s > loop_momenta_norm_escalation_factor = -1.0
  783. 767.13 s > [...]
  784. 767.13 s > [2026-09-06 07:47:29.461] @gammaloop_api::se... INFO : Running command set process -p aa_aa_all_helicities_assembly -i 1L_pmpm string '
  785. 767.13 s > [stability]
  786. 767.13 s > check_on_norm = true
  787. 767.13 s > escalate_if_exact_zero = false
  788. 767.13 s > loop_momenta_norm_escalation_factor = -1.0
  789. 767.13 s > [...]
  790. 767.13 s > [2026-09-06 07:47:29.466] @process::amplitude INFO : Input is below threshold: 0 existing threshold E-surfaces across 0/1 graph groups
  791. 767.13 s > [2026-09-06 07:47:29.466] @process::amplitude INFO : overlap structure of group 0: [0: []]
  792. 767.13 s > [2026-09-06 07:47:29.466] @integrands::process [{#im_is_nan, #re_is_nan}] WARNING : final process evaluation is nonfinite
  793. 767.13 s > [2026-09-06 07:47:29.466] @commands::inspect INFO :
  794. 767.13 s > Input point in momentum space:
  795. 767.13 s >
  796. 767.13 s > ( 0.1100000000000000, -0.0700000000000000, 0.1900000000000000 )
  797. 767.13 s >
  798. 767.13 s > The evaluation of integrand '1L_ppmm' is:
  799. 767.13 s >
  800. 767.13 s > ( +0.0000000000000000e0, +0.0000000000000000e0 i)
  801. 767.13 s >
  802. 767.13 s > [2026-09-06 07:47:29.470] @process::amplitude INFO : Input is below threshold: 0 existing threshold E-surfaces across 0/1 graph groups
  803. 767.13 s > [2026-09-06 07:47:29.470] @process::amplitude INFO : overlap structure of group 0: [0: []]
  804. 767.13 s > [2026-09-06 07:47:29.470] @commands::inspect INFO :
  805. 767.13 s > Input point in momentum space:
  806. 767.13 s >
  807. 767.13 s > ( 0.1100000000000000, -0.0700000000000000, 0.1900000000000000 )
  808. 767.13 s >
  809. 767.13 s > The evaluation of integrand '1L_ppmm' is:
  810. 767.13 s >
  811. 767.13 s > ( -1.7132462539328486e-28, -8.7105072229446864e-10 i)
  812. 767.13 s >
  813. 767.13 s > The application panicked (crashed).
  814. 767.13 s > Message: kinematics=a, integrand=1L_ppmm, graph_id=0: assembly vs symjit inspect: actual=(-0.00000000000000000000000000017132462539328486+-0.0000000008710507222944686i), expected=(0+0i), tolerance=0.0000000001
  815. 767.13 s > Location: tests/tests/test_runs/utils.rs:466
  816. 767.13 s >
  817. 767.13 s > ━━━━━━━━━━━━━━━━━━━━━━━━━━━━━━━━━━ BACKTRACE ━━━━━━━━━━━━━━━━━━━━━━━━━━━━━━━━━━━
  818. 767.13 s > 1: <color_eyre[51793ea62743adbd]::config::PanicHook>::panic_report<unknown>
  819. 767.13 s > at <unknown source file>:<unknown line>
  820. 767.13 s > 2: <color_eyre[51793ea62743adbd]::config::PanicHook>::into_panic_hook::{closure#0}<unknown>
  821. 767.13 s > at <unknown source file>:<unknown line>
  822. 767.13 s > 3: std[bcb96dfbba0ab899]::panicking::panic_with_hook<unknown>
  823. 767.13 s > at <unknown source file>:<unknown line>
  824. 767.13 s > 4: std[bcb96dfbba0ab899]::panicking::panic_handler::{closure#0}<unknown>
  825. 767.13 s > at <unknown source file>:<unknown line>
  826. 767.13 s > 5: std[bcb96dfbba0ab899]::sys::backtrace::__rust_end_short_backtrace::<std[bcb96dfbba0ab899]::panicking::panic_handler::{closure#0}, !><unknown>
  827. 767.13 s > at <unknown source file>:<unknown line>
  828. 767.13 s > 6: __rustc[6c289b9f9c454d21]::rust_begin_unwind<unknown>
  829. 767.13 s > at <unknown source file>:<unknown line>
  830. 767.13 s > 7: core[940e698046960fd5]::panicking::panic_fmt<unknown>
  831. 767.13 s > at <unknown source file>:<unknown line>
  832. 767.13 s > 8: <test_runs[66584badfeb6c7be]::aa_aa::important::aa_aa_local_inspect_backend_consistency::{closure#0} as core[940e698046960fd5]::ops::function::FnOnce<()>>::call_once<unknown>
  833. 767.13 s > at <unknown source file>:<unknown line>
  834. 767.13 s > 9: serial_test[cd99724524a2f1c0]::serial_code_lock::local_serial_core_with_return::<(), eyre[cb2fd339c0c40fca]::Report><unknown>
  835. 767.13 s > at <unknown source file>:<unknown line>
  836. 767.13 s > 10: <test_runs[66584badfeb6c7be]::aa_aa::important::aa_aa_local_inspect_backend_consistency::{closure#0} as core[940e698046960fd5]::ops::function::FnOnce<()>>::call_once<unknown>
  837. 767.13 s > at <unknown source file>:<unknown line>
  838. 767.13 s > 11: test[75d6903177b1d7e9]::__rust_begin_short_backtrace::<core[940e698046960fd5]::result::Result<(), alloc[2ea6bcb46fca0c42]::string::String>, fn() -> core[940e698046960fd5]::result::Result<(), alloc[2ea6bcb46fca0c42]::string::String>><unknown>
  839. 767.13 s > at <unknown source file>:<unknown line>
  840. 767.13 s > 12: test[75d6903177b1d7e9]::run_test::{closure#0}<unknown>
  841. 767.13 s > at <unknown source file>:<unknown line>
  842. 767.13 s > 13: std[bcb96dfbba0ab899]::sys::backtrace::__rust_begin_short_backtrace::<test[75d6903177b1d7e9]::run_test::{closure#1}, ()><unknown>
  843. 767.13 s > at <unknown source file>:<unknown line>
  844. 767.13 s > 14: <std[bcb96dfbba0ab899]::thread::lifecycle::spawn_unchecked<test[75d6903177b1d7e9]::run_test::{closure#1}, ()>::{closure#1} as core[940e698046960fd5]::ops::function::FnOnce<()>>::call_once::{shim:vtable#0}<unknown>
  845. 767.13 s > at <unknown source file>:<unknown line>
  846. 767.13 s > 15: <std[bcb96dfbba0ab899]::sys::thread::unix::Thread>::new::thread_start<unknown>
  847. 767.13 s > at <unknown source file>:<unknown line>
  848. 767.13 s > 16: start_thread<unknown>
  849. 767.13 s > at <unknown source file>:<unknown line>
  850. 767.13 s > 17: __clone3<unknown>
  851. 767.13 s > at <unknown source file>:<unknown line>
  852. 767.13 s >
  853. 767.13 s > Run with COLORBT_SHOW_HIDDEN=1 environment variable to disable frame filtering.
  854. 767.13 s > Run with RUST_BACKTRACE=full to include source snippets.
  855. 767.13 s >
  856. 767.13 s > ------------
  857. 767.13 s > Summary [ 743.943s] 152 tests run: 151 passed, 1 failed, 208 skipped
  858. 767.13 s > FAIL [ 66.679s] ( 54/152) gammaloop-integration-tests::test_runs aa_aa::important::aa_aa_local_inspect_backend_consistency
  859. 767.13 s > stdout ---
  860. 767.13 s >
  861. 767.13 s > running 1 test
  862. 767.13 s > test aa_aa::important::aa_aa_local_inspect_backend_consistency has been running for over 60 seconds
  863. 767.13 s > test aa_aa::important::aa_aa_local_inspect_backend_consistency ... FAILED
  864. 767.13 s >
  865. 767.13 s > failures:
  866. 767.13 s >
  867. 767.13 s > failures:
  868. 767.13 s > aa_aa::important::aa_aa_local_inspect_backend_consistency
  869. 767.13 s >
  870. 767.13 s > test result: FAILED. 0 passed; 1 failed; 0 ignored; 0 measured; 258 filtered out; finished in 66.52s
  871. 767.13 s >
  872. 767.13 s > stderr ---
  873. 767.13 s > [2026-09-06 07:46:23.373] @gammaloop_api::se... INFO : Running command import model sm-default.json
  874. 767.13 s > [2026-09-06 07:46:23.373] @import::model INFO : Loading built-in JSON model sm-default
  875. 767.13 s > [2026-09-06 07:46:23.391] @gammalooprs::model INFO : The following 11 external parameters were forced to zero by the restriction card:
  876. 767.13 s > lamWS, AWS, rhoWS, etaWS, ymc, yme, ymm, MC, Me, MM, WTau
  877. 767.13 s > [2026-09-06 07:46:23.391] @gammalooprs::model INFO : The following 34 vertex rules were removed by the restriction card:
  878. 767.13 s > V_82 -> (c~, d, G+) | V_83 -> (t~, d, G+) | V_84 -> (c~, s, G+) | V_85 -> (t~, s, G+) | V_86 -> (u~, b, G+) | V_87 -> (c~, b, G+) | V_90 -> (c~, d, W+) | V_91 -> (t~, d, W+) | V_92 -> (u~, s, W+) | V_94 -> (t~, s, W+) | V_95 -> (u~, b, W+) | V_96 -> (c~, b, W+) | V_101 -> (e+, e-, G0) | V_102 -> (mu+, mu-, G0) | V_104 -> (e+, e-, H) | V_105 -> (mu+, mu-, H) | V_110 -> (ve~, e-, G+) | V_111 -> (vm~, mu-, G+) | V_116 -> (b~, u, G-) | V_117 -> (d~, c, G-) | V_118 -> (s~, c, G-) | V_119 -> (b~, c, G-) | V_120 -> (d~, t, G-) | V_121 -> (s~, t, G-) | V_124 -> (s~, u, W-) | V_125 -> (b~, u, W-) | V_126 -> (d~, c, W-) | V_128 -> (b~, c, W-) | V_129 -> (d~, t, W-) | V_130 -> (s~, t, W-) | V_138 -> (c~, c, G0) | V_140 -> (c~, c, H) | V_145 -> (e+, ve, G-) | V_146 -> (mu+, vm, G-)
  879. 767.13 s > [2026-09-06 07:46:23.391] @gammalooprs::model INFO : The following 36 couplings were removed by the restriction card:
  880. 767.13 s > GC_13, GC_14, GC_16, GC_17, GC_18, GC_19, GC_20, GC_22, GC_23, GC_24, GC_25, GC_26, GC_28, GC_29, GC_42, GC_43, GC_44, GC_46, GC_47, GC_48, GC_84, GC_85, GC_86, GC_87, GC_88, GC_89, GC_90, GC_91, GC_92, GC_93, GC_101, GC_102, GC_103, GC_105, GC_106, GC_107
  881. 767.13 s > [2026-09-06 07:46:23.392] @gammaloop_api::se... INFO : Running command run set_model_parameters
  882. 767.13 s > [2026-09-06 07:46:23.392] @gammaloop_api::se... INFO : Starting command block set_model_parameters
  883. 767.13 s > [2026-09-06 07:46:23.392] @gammaloop_api::se... INFO : Running command set model MT=173.0
  884. 767.13 s > [2026-09-06 07:46:23.395] @gammaloop_api::se... INFO : Running command set model WT=0.0
  885. 767.13 s > [2026-09-06 07:46:23.398] @gammaloop_api::se... INFO : Running command set model ymt=173.0
  886. 767.13 s > [2026-09-06 07:46:23.402] @gammaloop_api::se... INFO : Running command set model aS=0.118
  887. 767.13 s > [2026-09-06 07:46:23.405] @gammaloop_api::se... INFO : Running command set model aEWM1=137.036
  888. 767.13 s > [2026-09-06 07:46:23.408] @gammaloop_api::se... INFO : Running command set model Gf=1.166390e-05
  889. 767.13 s > [2026-09-06 07:46:23.411] @gammaloop_api::se... INFO : Running command set model MZ=91.188
  890. 767.13 s > [2026-09-06 07:46:23.415] @gammaloop_api::se... INFO : Running command set global string '
  891. 767.13 s > [global.generation.compile]
  892. 767.13 s > compilation_mode = "symjit"
  893. 767.13 s > optimization_level = "O0"
  894. 767.13 s > fast_math = false
  895. 767.13 s > [...]
  896. 767.13 s > [2026-09-06 07:46:23.416] @gammaloop_api::se... INFO : Running command import graphs ./examples/cli/aa_aa/1L/aa_aa_1L.dot -p aa_aa_all_helicities -i 1L_ppmm -o
  897. 767.13 s > [2026-09-06 07:46:23.416] @commands::import INFO : Loading graphs from '/build/source/examples/cli/aa_aa/1L/aa_aa_1L.dot'
  898. 767.13 s > [2026-09-06 07:46:23.423] @gammaloop_api::se... INFO : Running command generate existing -p aa_aa_all_helicities
  899. 767.13 s > [2026-09-06 07:46:48.360] @commands::generate INFO :
  900. 767.13 s > Integrand generation summary
  901. 767.13 s > peak RAM 1012.75 MiB | cores 1
  902. 767.13 s > ╭───────────┬───────┬─────────┬──────────────┬─────────────┬────────────────┬───────────────╮
  903. 767.13 s > │ integrand │ graph │ # evals │ expr build │ spenso │ symbolica eval │ compile │
  904. 767.13 s > ├───────────┼───────┼─────────┼──────────────┼─────────────┼────────────────┼───────────────┤
  905. 767.13 s > │ 1L_ppmm │ GL0 │ 13 │ 498ms (5.9%) │ 1.62s (19%) │ 5.50s (65%) │ 842ms (10.0%) │
  906. 767.13 s > │ 1L_ppmm │ GL2 │ 13 │ 477ms (5.7%) │ 1.47s (18%) │ 5.62s (67%) │ 803ms (9.6%) │
  907. 767.13 s > │ 1L_ppmm │ GL4 │ 11 │ 463ms (5.8%) │ 1.37s (17%) │ 5.43s (68%) │ 756ms (9.4%) │
  908. 767.13 s > ├───────────┼───────┼─────────┼──────────────┼─────────────┼────────────────┼───────────────┤
  909. 767.13 s > │ Total │ │ 37 │ 1.44s (5.8%) │ 4.46s (18%) │ 16.55s (67%) │ 2.40s (9.7%) │
  910. 767.13 s > ╰───────────┴───────┴─────────┴──────────────┴─────────────┴────────────────┴───────────────╯
  911. 767.13 s > [2026-09-06 07:46:48.993] @gammaloop_api::se... INFO : Running command import model sm-default.json
  912. 767.13 s > [2026-09-06 07:46:48.993] @import::model INFO : Loading built-in JSON model sm-default
  913. 767.13 s > [2026-09-06 07:46:49.010] @gammalooprs::model INFO : The following 11 external parameters were forced to zero by the restriction card:
  914. 767.13 s > lamWS, AWS, rhoWS, etaWS, ymc, yme, ymm, MC, Me, MM, WTau
  915. 767.13 s > [2026-09-06 07:46:49.010] @gammalooprs::model INFO : The following 34 vertex rules were removed by the restriction card:
  916. 767.13 s > V_82 -> (c~, d, G+) | V_83 -> (t~, d, G+) | V_84 -> (c~, s, G+) | V_85 -> (t~, s, G+) | V_86 -> (u~, b, G+) | V_87 -> (c~, b, G+) | V_90 -> (c~, d, W+) | V_91 -> (t~, d, W+) | V_92 -> (u~, s, W+) | V_94 -> (t~, s, W+) | V_95 -> (u~, b, W+) | V_96 -> (c~, b, W+) | V_101 -> (e+, e-, G0) | V_102 -> (mu+, mu-, G0) | V_104 -> (e+, e-, H) | V_105 -> (mu+, mu-, H) | V_110 -> (ve~, e-, G+) | V_111 -> (vm~, mu-, G+) | V_116 -> (b~, u, G-) | V_117 -> (d~, c, G-) | V_118 -> (s~, c, G-) | V_119 -> (b~, c, G-) | V_120 -> (d~, t, G-) | V_121 -> (s~, t, G-) | V_124 -> (s~, u, W-) | V_125 -> (b~, u, W-) | V_126 -> (d~, c, W-) | V_128 -> (b~, c, W-) | V_129 -> (d~, t, W-) | V_130 -> (s~, t, W-) | V_138 -> (c~, c, G0) | V_140 -> (c~, c, H) | V_145 -> (e+, ve, G-) | V_146 -> (mu+, vm, G-)
  917. 767.13 s > [2026-09-06 07:46:49.010] @gammalooprs::model INFO : The following 36 couplings were removed by the restriction card:
  918. 767.13 s > GC_13, GC_14, GC_16, GC_17, GC_18, GC_19, GC_20, GC_22, GC_23, GC_24, GC_25, GC_26, GC_28, GC_29, GC_42, GC_43, GC_44, GC_46, GC_47, GC_48, GC_84, GC_85, GC_86, GC_87, GC_88, GC_89, GC_90, GC_91, GC_92, GC_93, GC_101, GC_102, GC_103, GC_105, GC_106, GC_107
  919. 767.13 s > [2026-09-06 07:46:49.011] @gammaloop_api::se... INFO : Running command run set_model_parameters
  920. 767.13 s > [2026-09-06 07:46:49.011] @gammaloop_api::se... INFO : Starting command block set_model_parameters
  921. 767.13 s > [2026-09-06 07:46:49.011] @gammaloop_api::se... INFO : Running command set model MT=173.0
  922. 767.13 s > [2026-09-06 07:46:49.014] @gammaloop_api::se... INFO : Running command set model WT=0.0
  923. 767.13 s > [2026-09-06 07:46:49.017] @gammaloop_api::se... INFO : Running command set model ymt=173.0
  924. 767.13 s > [2026-09-06 07:46:49.020] @gammaloop_api::se... INFO : Running command set model aS=0.118
  925. 767.13 s > [2026-09-06 07:46:49.024] @gammaloop_api::se... INFO : Running command set model aEWM1=137.036
  926. 767.13 s > [2026-09-06 07:46:49.027] @gammaloop_api::se... INFO : Running command set model Gf=1.166390e-05
  927. 767.13 s > [2026-09-06 07:46:49.030] @gammaloop_api::se... INFO : Running command set model MZ=91.188
  928. 767.13 s > [2026-09-06 07:46:49.033] @gammaloop_api::se... INFO : Running command set global string '
  929. 767.13 s > [global.generation.compile]
  930. 767.13 s > compilation_mode = "assembly"
  931. 767.13 s > optimization_level = "O0"
  932. 767.13 s > fast_math = false
  933. 767.13 s > [...]
  934. 767.13 s > [2026-09-06 07:46:49.034] @gammaloop_api::se... INFO : Running command import graphs ./examples/cli/aa_aa/1L/aa_aa_1L.dot -p aa_aa_all_helicities_assembly -i 1L_ppmm -o
  935. 767.13 s > [2026-09-06 07:46:49.034] @commands::import INFO : Loading graphs from '/build/source/examples/cli/aa_aa/1L/aa_aa_1L.dot'
  936. 767.13 s > [2026-09-06 07:46:49.041] @gammaloop_api::se... INFO : Running command generate existing -p aa_aa_all_helicities_assembly
  937. 767.13 s > [2026-09-06 07:47:11.191] @processes::amplitude INFO : Compiling amplitude 1L_ppmm
  938. 767.13 s > [2026-09-06 07:47:28.850] @commands::generate INFO : Removed 34 generated C++ source file(s). Use '--keep-sources' to keep them.
  939. 767.13 s > [2026-09-06 07:47:28.850] @commands::generate INFO :
  940. 767.13 s > Integrand generation summary
  941. 767.13 s > peak RAM 2.32 GiB | cores 1
  942. 767.13 s > ╭───────────┬───────┬─────────┬──────────────┬─────────────┬────────────────┬──────────────╮
  943. 767.13 s > │ integrand │ graph │ # evals │ expr build │ spenso │ symbolica eval │ compile │
  944. 767.13 s > ├───────────┼───────┼─────────┼──────────────┼─────────────┼────────────────┼──────────────┤
  945. 767.13 s > │ 1L_ppmm │ GL0 │ 13 │ 480ms (3.6%) │ 1.34s (10%) │ 5.55s (42%) │ 5.99s (45%) │
  946. 767.13 s > │ 1L_ppmm │ GL2 │ 13 │ 475ms (3.5%) │ 1.50s (11%) │ 5.42s (40%) │ 6.29s (46%) │
  947. 767.13 s > │ 1L_ppmm │ GL4 │ 11 │ 462ms (3.6%) │ 1.41s (11%) │ 5.47s (43%) │ 5.37s (42%) │
  948. 767.13 s > ├───────────┼───────┼─────────┼──────────────┼─────────────┼────────────────┼──────────────┤
  949. 767.13 s > │ Total │ │ 37 │ 1.42s (3.6%) │ 4.25s (11%) │ 16.44s (41%) │ 17.65s (44%) │
  950. 767.13 s > ╰───────────┴───────┴─────────┴──────────────┴─────────────┴────────────────┴──────────────╯
  951. 767.13 s > [2026-09-06 07:47:29.455] @gammaloop_api::se... INFO : Running command set process -p aa_aa_all_helicities -i 1L_ppmm string '
  952. 767.13 s > [stability]
  953. 767.13 s > check_on_norm = true
  954. 767.13 s > escalate_if_exact_zero = false
  955. 767.13 s > loop_momenta_norm_escalation_factor = -1.0
  956. 767.13 s > [...]
  957. 767.13 s > [2026-09-06 07:47:29.456] @gammaloop_api::se... INFO : Running command set process -p aa_aa_all_helicities_assembly -i 1L_ppmm string '
  958. 767.13 s > [stability]
  959. 767.13 s > check_on_norm = true
  960. 767.13 s > escalate_if_exact_zero = false
  961. 767.13 s > loop_momenta_norm_escalation_factor = -1.0
  962. 767.13 s > [...]
  963. 767.13 s > [2026-09-06 07:47:29.457] @gammaloop_api::se... INFO : Running command set process -p aa_aa_all_helicities -i 1L_mpmm string '
  964. 767.13 s > [stability]
  965. 767.13 s > check_on_norm = true
  966. 767.13 s > escalate_if_exact_zero = false
  967. 767.13 s > loop_momenta_norm_escalation_factor = -1.0
  968. 767.13 s > [...]
  969. 767.13 s > [2026-09-06 07:47:29.458] @gammaloop_api::se... INFO : Running command set process -p aa_aa_all_helicities_assembly -i 1L_mpmm string '
  970. 767.13 s > [stability]
  971. 767.13 s > check_on_norm = true
  972. 767.13 s > escalate_if_exact_zero = false
  973. 767.13 s > loop_momenta_norm_escalation_factor = -1.0
  974. 767.13 s > [...]
  975. 767.13 s > [2026-09-06 07:47:29.458] @gammaloop_api::se... INFO : Running command set process -p aa_aa_all_helicities -i 1L_mmmm string '
  976. 767.13 s > [stability]
  977. 767.13 s > check_on_norm = true
  978. 767.13 s > escalate_if_exact_zero = false
  979. 767.13 s > loop_momenta_norm_escalation_factor = -1.0
  980. 767.13 s > [...]
  981. 767.13 s > [2026-09-06 07:47:29.459] @gammaloop_api::se... INFO : Running command set process -p aa_aa_all_helicities_assembly -i 1L_mmmm string '
  982. 767.13 s > [stability]
  983. 767.13 s > check_on_norm = true
  984. 767.13 s > escalate_if_exact_zero = false
  985. 767.13 s > loop_momenta_norm_escalation_factor = -1.0
  986. 767.13 s > [...]
  987. 767.13 s > [2026-09-06 07:47:29.460] @gammaloop_api::se... INFO : Running command set process -p aa_aa_all_helicities -i 1L_pmmp string '
  988. 767.13 s > [stability]
  989. 767.13 s > check_on_norm = true
  990. 767.13 s > escalate_if_exact_zero = false
  991. 767.13 s > loop_momenta_norm_escalation_factor = -1.0
  992. 767.13 s > [...]
  993. 767.13 s > [2026-09-06 07:47:29.460] @gammaloop_api::se... INFO : Running command set process -p aa_aa_all_helicities_assembly -i 1L_pmmp string '
  994. 767.13 s > [stability]
  995. 767.13 s > check_on_norm = true
  996. 767.13 s > escalate_if_exact_zero = false
  997. 767.13 s > loop_momenta_norm_escalation_factor = -1.0
  998. 767.13 s > [...]
  999. 767.13 s > [2026-09-06 07:47:29.461] @gammaloop_api::se... INFO : Running command set process -p aa_aa_all_helicities -i 1L_pmpm string '
  1000. 767.13 s > [stability]
  1001. 767.13 s > check_on_norm = true
  1002. 767.13 s > escalate_if_exact_zero = false
  1003. 767.13 s > loop_momenta_norm_escalation_factor = -1.0
  1004. 767.13 s > [...]
  1005. 767.13 s > [2026-09-06 07:47:29.461] @gammaloop_api::se... INFO : Running command set process -p aa_aa_all_helicities_assembly -i 1L_pmpm string '
  1006. 767.13 s > [stability]
  1007. 767.13 s > check_on_norm = true
  1008. 767.13 s > escalate_if_exact_zero = false
  1009. 767.14 s > loop_momenta_norm_escalation_factor = -1.0
  1010. 767.14 s > [...]
  1011. 767.14 s > [2026-09-06 07:47:29.466] @process::amplitude INFO : Input is below threshold: 0 existing threshold E-surfaces across 0/1 graph groups
  1012. 767.14 s > [2026-09-06 07:47:29.466] @process::amplitude INFO : overlap structure of group 0: [0: []]
  1013. 767.14 s > [2026-09-06 07:47:29.466] @integrands::process [{#im_is_nan, #re_is_nan}] WARNING : final process evaluation is nonfinite
  1014. 767.14 s > [2026-09-06 07:47:29.466] @commands::inspect INFO :
  1015. 767.14 s > Input point in momentum space:
  1016. 767.14 s >
  1017. 767.14 s > ( 0.1100000000000000, -0.0700000000000000, 0.1900000000000000 )
  1018. 767.14 s >
  1019. 767.14 s > The evaluation of integrand '1L_ppmm' is:
  1020. 767.14 s >
  1021. 767.14 s > ( +0.0000000000000000e0, +0.0000000000000000e0 i)
  1022. 767.14 s >
  1023. 767.14 s > [2026-09-06 07:47:29.470] @process::amplitude INFO : Input is below threshold: 0 existing threshold E-surfaces across 0/1 graph groups
  1024. 767.14 s > [2026-09-06 07:47:29.470] @process::amplitude INFO : overlap structure of group 0: [0: []]
  1025. 767.14 s > [2026-09-06 07:47:29.470] @commands::inspect INFO :
  1026. 767.14 s > Input point in momentum space:
  1027. 767.14 s >
  1028. 767.14 s > ( 0.1100000000000000, -0.0700000000000000, 0.1900000000000000 )
  1029. 767.14 s >
  1030. 767.14 s > The evaluation of integrand '1L_ppmm' is:
  1031. 767.14 s >
  1032. 767.14 s > ( -1.7132462539328486e-28, -8.7105072229446864e-10 i)
  1033. 767.14 s >
  1034. 767.14 s > The application panicked (crashed).
  1035. 767.14 s > Message: kinematics=a, integrand=1L_ppmm, graph_id=0: assembly vs symjit inspect: actual=(-0.00000000000000000000000000017132462539328486+-0.0000000008710507222944686i), expected=(0+0i), tolerance=0.0000000001
  1036. 767.14 s > Location: tests/tests/test_runs/utils.rs:466
  1037. 767.14 s >
  1038. 767.14 s > ━━━━━━━━━━━━━━━━━━━━━━━━━━━━━━━━━━ BACKTRACE ━━━━━━━━━━━━━━━━━━━━━━━━━━━━━━━━━━━
  1039. 767.14 s > 1: <color_eyre[51793ea62743adbd]::config::PanicHook>::panic_report<unknown>
  1040. 767.14 s > at <unknown source file>:<unknown line>
  1041. 767.14 s > 2: <color_eyre[51793ea62743adbd]::config::PanicHook>::into_panic_hook::{closure#0}<unknown>
  1042. 767.14 s > at <unknown source file>:<unknown line>
  1043. 767.14 s > 3: std[bcb96dfbba0ab899]::panicking::panic_with_hook<unknown>
  1044. 767.14 s > at <unknown source file>:<unknown line>
  1045. 767.14 s > 4: std[bcb96dfbba0ab899]::panicking::panic_handler::{closure#0}<unknown>
  1046. 767.14 s > at <unknown source file>:<unknown line>
  1047. 767.14 s > 5: std[bcb96dfbba0ab899]::sys::backtrace::__rust_end_short_backtrace::<std[bcb96dfbba0ab899]::panicking::panic_handler::{closure#0}, !><unknown>
  1048. 767.14 s > at <unknown source file>:<unknown line>
  1049. 767.14 s > 6: __rustc[6c289b9f9c454d21]::rust_begin_unwind<unknown>
  1050. 767.14 s > at <unknown source file>:<unknown line>
  1051. 767.14 s > 7: core[940e698046960fd5]::panicking::panic_fmt<unknown>
  1052. 767.14 s > at <unknown source file>:<unknown line>
  1053. 767.14 s > 8: <test_runs[66584badfeb6c7be]::aa_aa::important::aa_aa_local_inspect_backend_consistency::{closure#0} as core[940e698046960fd5]::ops::function::FnOnce<()>>::call_once<unknown>
  1054. 767.14 s > at <unknown source file>:<unknown line>
  1055. 767.14 s > 9: serial_test[cd99724524a2f1c0]::serial_code_lock::local_serial_core_with_return::<(), eyre[cb2fd339c0c40fca]::Report><unknown>
  1056. 767.14 s > at <unknown source file>:<unknown line>
  1057. 767.14 s > 10: <test_runs[66584badfeb6c7be]::aa_aa::important::aa_aa_local_inspect_backend_consistency::{closure#0} as core[940e698046960fd5]::ops::function::FnOnce<()>>::call_once<unknown>
  1058. 767.14 s > at <unknown source file>:<unknown line>
  1059. 767.14 s > 11: test[75d6903177b1d7e9]::__rust_begin_short_backtrace::<core[940e698046960fd5]::result::Result<(), alloc[2ea6bcb46fca0c42]::string::String>, fn() -> core[940e698046960fd5]::result::Result<(), alloc[2ea6bcb46fca0c42]::string::String>><unknown>
  1060. 767.14 s > at <unknown source file>:<unknown line>
  1061. 767.14 s > 12: test[75d6903177b1d7e9]::run_test::{closure#0}<unknown>
  1062. 767.14 s > at <unknown source file>:<unknown line>
  1063. 767.14 s > 13: std[bcb96dfbba0ab899]::sys::backtrace::__rust_begin_short_backtrace::<test[75d6903177b1d7e9]::run_test::{closure#1}, ()><unknown>
  1064. 767.14 s > at <unknown source file>:<unknown line>
  1065. 767.14 s > 14: <std[bcb96dfbba0ab899]::thread::lifecycle::spawn_unchecked<test[75d6903177b1d7e9]::run_test::{closure#1}, ()>::{closure#1} as core[940e698046960fd5]::ops::function::FnOnce<()>>::call_once::{shim:vtable#0}<unknown>
  1066. 767.14 s > at <unknown source file>:<unknown line>
  1067. 767.14 s > 15: <std[bcb96dfbba0ab899]::sys::thread::unix::Thread>::new::thread_start<unknown>
  1068. 767.14 s > at <unknown source file>:<unknown line>
  1069. 767.14 s > 16: start_thread<unknown>
  1070. 767.14 s > at <unknown source file>:<unknown line>
  1071. 767.14 s > 17: __clone3<unknown>
  1072. 767.14 s > at <unknown source file>:<unknown line>
  1073. 767.14 s >
  1074. 767.14 s > Run with COLORBT_SHOW_HIDDEN=1 environment variable to disable frame filtering.
  1075. 767.14 s > Run with RUST_BACKTRACE=full to include source snippets.
  1076. 767.14 s >
  1077. 767.14 s > error: test run failed
  1078. 767.14 s >
  1079. 767.14 s > ========== nextest test summary ==========
  1080. 767.14 s > report: target/nextest/ci_gammaloop/junit.xml
  1081. 767.14 s > tests: 152, failures: 1, errors: 0
  1082. 767.14 s >
  1083. 767.14 s > 1. gammaloop-integration-tests::test_runs::aa_aa::important::aa_aa_local_inspect_backend_consistency
  1084. 767.14 s > failure: test failure with exit code 101
  1085. 767.14 s > system-out
  1086. 767.14 s > running 1 test
  1087. 767.14 s > test aa_aa::important::aa_aa_local_inspect_backend_consistency has been running for over 60 seconds
  1088. 767.14 s > test aa_aa::important::aa_aa_local_inspect_backend_consistency ... FAILED
  1089. 767.14 s >
  1090. 767.14 s > failures:
  1091. 767.14 s >
  1092. 767.14 s > failures:
  1093. 767.14 s > aa_aa::important::aa_aa_local_inspect_backend_consistency
  1094. 767.14 s >
  1095. 767.14 s > test result: FAILED. 0 passed; 1 failed; 0 ignored; 0 measured; 258 filtered out; finished in 66.52s
  1096. 767.14 s > system-err
  1097. 767.14 s > [2026-09-06 07:46:23.373] @gammaloop_api::se... INFO : Running command import model sm-default.json
  1098. 767.14 s > [2026-09-06 07:46:23.373] @import::model INFO : Loading built-in JSON model sm-default
  1099. 767.14 s > [2026-09-06 07:46:23.391] @gammalooprs::model INFO : The following 11 external parameters were forced to zero by the restriction card:
  1100. 767.14 s > lamWS, AWS, rhoWS, etaWS, ymc, yme, ymm, MC, Me, MM, WTau
  1101. 767.14 s > [2026-09-06 07:46:23.391] @gammalooprs::model INFO : The following 34 vertex rules were removed by the restriction card:
  1102. 767.14 s > V_82 -> (c~, d, G+) | V_83 -> (t~, d, G+) | V_84 -> (c~, s, G+) | V_85 -> (t~, s, G+) | V_86 -> (u~, b, G+) | V_87 -> (c~, b, G+) | V_90 -> (c~, d, W+) | V_91 -> (t~, d, W+) | V_92 -> (u~, s, W+) | V_94 -> (t~, s, W+) | V_95 -> (u~, b, W+) | V_96 -> (c~, b, W+) | V_101 -> (e+, e-, G0) | V_102 -> (mu+, mu-, G0) | V_104 -> (e+, e-, H) | V_105 -> (mu+, mu-, H) | V_110 -> (ve~, e-, G+) | V_111 -> (vm~, mu-, G+) | V_116 -> (b~, u, G-) | V_117 -> (d~, c, G-) | V_118 -> (s~, c, G-) | V_119 -> (b~, c, G-) | V_120 -> (d~, t, G-) | V_121 -> (s~, t, G-) | V_124 -> (s~, u, W-) | V_125 -> (b~, u, W-) | V_126 -> (d~, c, W-) | V_128 -> (b~, c, W-) | V_129 -> (d~, t, W-) | V_130 -> (s~, t, W-) | V_138 -> (c~, c, G0) | V_140 -> (c~, c, H) | V_145 -> (e+, ve, G-) | V_146 -> (mu+, vm, G-)
  1103. 767.14 s > [2026-09-06 07:46:23.391] @gammalooprs::model INFO : The following 36 couplings were removed by the restriction card:
  1104. 767.14 s > GC_13, GC_14, GC_16, GC_17, GC_18, GC_19, GC_20, GC_22, GC_23, GC_24, GC_25, GC_26, GC_28, GC_29, GC_42, GC_43, GC_44, GC_46, GC_47, GC_48, GC_84, GC_85, GC_86, GC_87, GC_88, GC_89, GC_90, GC_91, GC_92, GC_93, GC_101, GC_102, GC_103, GC_105, GC_106, GC_107
  1105. 767.14 s > [2026-09-06 07:46:23.392] @gammaloop_api::se... INFO : Running command run set_model_parameters
  1106. 767.14 s > [2026-09-06 07:46:23.392] @gammaloop_api::se... INFO : Starting command block set_model_parameters
  1107. 767.14 s > [2026-09-06 07:46:23.392] @gammaloop_api::se... INFO : Running command set model MT=173.0
  1108. 767.14 s > [2026-09-06 07:46:23.395] @gammaloop_api::se... INFO : Running command set model WT=0.0
  1109. 767.14 s > [2026-09-06 07:46:23.398] @gammaloop_api::se... INFO : Running command set model ymt=173.0
  1110. 767.14 s > [2026-09-06 07:46:23.402] @gammaloop_api::se... INFO : Running command set model aS=0.118
  1111. 767.14 s > [2026-09-06 07:46:23.405] @gammaloop_api::se... INFO : Running command set model aEWM1=137.036
  1112. 767.14 s > [2026-09-06 07:46:23.408] @gammaloop_api::se... INFO : Running command set model Gf=1.166390e-05
  1113. 767.14 s > [2026-09-06 07:46:23.411] @gammaloop_api::se... INFO : Running command set model MZ=91.188
  1114. 767.14 s > [2026-09-06 07:46:23.415] @gammaloop_api::se... INFO : Running command set global string '
  1115. 767.14 s > [global.generation.compile]
  1116. 767.14 s > compilation_mode = "symjit"
  1117. 767.14 s > optimization_level = "O0"
  1118. 767.14 s > fast_math = false
  1119. 767.14 s > [...]
  1120. 767.14 s > [2026-09-06 07:46:23.416] @gammaloop_api::se... INFO : Running command import graphs ./examples/cli/aa_aa/1L/aa_aa_1L.dot -p aa_aa_all_helicities -i 1L_ppmm -o
  1121. 767.14 s > [2026-09-06 07:46:23.416] @commands::import INFO : Loading graphs from '/build/source/examples/cli/aa_aa/1L/aa_aa_1L.dot'
  1122. 767.14 s > [2026-09-06 07:46:23.423] @gammaloop_api::se... INFO : Running command generate existing -p aa_aa_all_helicities
  1123. 767.14 s > [2026-09-06 07:46:48.360] @commands::generate INFO :
  1124. 767.14 s > Integrand generation summary
  1125. 767.14 s > peak RAM 1012.75 MiB | cores 1
  1126. 767.14 s > ╭───────────┬───────┬─────────┬──────────────┬─────────────┬────────────────┬───────────────╮
  1127. 767.14 s > │ integrand │ graph │ # evals │ expr build │ spenso │ symbolica eval │ compile │
  1128. 767.14 s > ├───────────┼───────┼─────────┼──────────────┼─────────────┼────────────────┼───────────────┤
  1129. 767.14 s > │ 1L_ppmm │ GL0 │ 13 │ 498ms (5.9%) │ 1.62s (19%) │ 5.50s (65%) │ 842ms (10.0%) │
  1130. 767.14 s > │ 1L_ppmm │ GL2 │ 13 │ 477ms (5.7%) │ 1.47s (18%) │ 5.62s (67%) │ 803ms (9.6%) │
  1131. 767.14 s > │ 1L_ppmm │ GL4 │ 11 │ 463ms (5.8%) │ 1.37s (17%) │ 5.43s (68%) │ 756ms (9.4%) │
  1132. 767.14 s > ├───────────┼───────┼─────────┼──────────────┼─────────────┼────────────────┼───────────────┤
  1133. 767.14 s > │ Total │ │ 37 │ 1.44s (5.8%) │ 4.46s (18%) │ 16.55s (67%) │ 2.40s (9.7%) │
  1134. 767.14 s > ╰───────────┴───────┴─────────┴──────────────┴─────────────┴────────────────┴───────────────╯
  1135. 767.14 s > [2026-09-06 07:46:48.993] @gammaloop_api::se... INFO : Running command import model sm-default.json
  1136. 767.14 s > [2026-09-06 07:46:48.993] @import::model INFO : Loading built-in JSON model sm-default
  1137. 767.14 s > [2026-09-06 07:46:49.010] @gammalooprs::model INFO : The following 11 external parameters were forced to zero by the restriction card:
  1138. 767.14 s > lamWS, AWS, rhoWS, etaWS, ymc, yme, ymm, MC, Me, MM, WTau
  1139. 767.14 s > [2026-09-06 07:46:49.010] @gammalooprs::model INFO : The following 34 vertex rules were removed by the restriction card:
  1140. 767.14 s > V_82 -> (c~, d, G+) | V_83 -> (t~, d, G+) | V_84 -> (c~, s, G+) | V_85 -> (t~, s, G+) | V_86 -> (u~, b, G+) | V_87 -> (c~, b, G+) | V_90 -> (c~, d, W+) | V_91 -> (t~, d, W+) | V_92 -> (u~, s, W+) | V_94 -> (t~, s, W+) | V_95 -> (u~, b, W+) | V_96 -> (c~, b, W+) | V_101 -> (e+, e-, G0) | V_102 -> (mu+, mu-, G0) | V_104 -> (e+, e-, H) | V_105 -> (mu+, mu-, H) | V_110 -> (ve~, e-, G+) | V_111 -> (vm~, mu-, G+) | V_116 -> (b~, u, G-) | V_117 -> (d~, c, G-) | V_118 -> (s~, c, G-) | V_119 -> (b~, c, G-) | V_120 -> (d~, t, G-) | V_121 -> (s~, t, G-) | V_124 -> (s~, u, W-) | V_125 -> (b~, u, W-) | V_126 -> (d~, c, W-) | V_128 -> (b~, c, W-) | V_129 -> (d~, t, W-) | V_130 -> (s~, t, W-) | V_138 -> (c~, c, G0) | V_140 -> (c~, c, H) | V_145 -> (e+, ve, G-) | V_146 -> (mu+, vm, G-)
  1141. 767.14 s > [2026-09-06 07:46:49.010] @gammalooprs::model INFO : The following 36 couplings were removed by the restriction card:
  1142. 767.14 s > GC_13, GC_14, GC_16, GC_17, GC_18, GC_19, GC_20, GC_22, GC_23, GC_24, GC_25, GC_26, GC_28, GC_29, GC_42, GC_43, GC_44, GC_46, GC_47, GC_48, GC_84, GC_85, GC_86, GC_87, GC_88, GC_89, GC_90, GC_91, GC_92, GC_93, GC_101, GC_102, GC_103, GC_105, GC_106, GC_107
  1143. 767.14 s > [2026-09-06 07:46:49.011] @gammaloop_api::se... INFO : Running command run set_model_parameters
  1144. 767.14 s > [2026-09-06 07:46:49.011] @gammaloop_api::se... INFO : Starting command block set_model_parameters
  1145. 767.14 s > [2026-09-06 07:46:49.011] @gammaloop_api::se... INFO : Running command set model MT=173.0
  1146. 767.14 s > [2026-09-06 07:46:49.014] @gammaloop_api::se... INFO : Running command set model WT=0.0
  1147. 767.14 s > [2026-09-06 07:46:49.017] @gammaloop_api::se... INFO : Running command set model ymt=173.0
  1148. 767.14 s > [2026-09-06 07:46:49.020] @gammaloop_api::se... INFO : Running command set model aS=0.118
  1149. 767.14 s > [2026-09-06 07:46:49.024] @gammaloop_api::se... INFO : Running command set model aEWM1=137.036
  1150. 767.14 s > [2026-09-06 07:46:49.027] @gammaloop_api::se... INFO : Running command set model Gf=1.166390e-05
  1151. 767.14 s > [2026-09-06 07:46:49.030] @gammaloop_api::se... INFO : Running command set model MZ=91.188
  1152. 767.14 s > [2026-09-06 07:46:49.033] @gammaloop_api::se... INFO : Running command set global string '
  1153. 767.14 s > [global.generation.compile]
  1154. 767.14 s > compilation_mode = "assembly"
  1155. 767.14 s > optimization_level = "O0"
  1156. 767.14 s > fast_math = false
  1157. 767.14 s > [...]
  1158. 767.14 s > [2026-09-06 07:46:49.034] @gammaloop_api::se... INFO : Running command import graphs ./examples/cli/aa_aa/1L/aa_aa_1L.dot -p aa_aa_all_helicities_assembly -i 1L_ppmm -o
  1159. 767.14 s > [2026-09-06 07:46:49.034] @commands::import INFO : Loading graphs from '/build/source/examples/cli/aa_aa/1L/aa_aa_1L.dot'
  1160. 767.14 s > [2026-09-06 07:46:49.041] @gammaloop_api::se... INFO : Running command generate existing -p aa_aa_all_helicities_assembly
  1161. 767.14 s > [2026-09-06 07:47:11.191] @processes::amplitude INFO : Compiling amplitude 1L_ppmm
  1162. 767.14 s > [2026-09-06 07:47:28.850] @commands::generate INFO : Removed 34 generated C++ source file(s). Use '--keep-sources' to keep them.
  1163. 767.14 s > [2026-09-06 07:47:28.850] @commands::generate INFO :
  1164. 767.14 s > Integrand generation summary
  1165. 767.14 s > peak RAM 2.32 GiB | cores 1
  1166. 767.14 s > ╭───────────┬───────┬─────────┬──────────────┬─────────────┬────────────────┬──────────────╮
  1167. 767.14 s > │ integrand │ graph │ # evals │ expr build │ spenso │ symbolica eval │ compile │
  1168. 767.14 s > ├───────────┼───────┼─────────┼──────────────┼─────────────┼────────────────┼──────────────┤
  1169. 767.14 s > │ 1L_ppmm │ GL0 │ 13 │ 480ms (3.6%) │ 1.34s (10%) │ 5.55s (42%) │ 5.99s (45%) │
  1170. 767.14 s > │ 1L_ppmm │ GL2 │ 13 │ 475ms (3.5%) │ 1.50s (11%) │ 5.42s (40%) │ 6.29s (46%) │
  1171. 767.14 s > │ 1L_ppmm │ GL4 │ 11 │ 462ms (3.6%) │ 1.41s (11%) │ 5.47s (43%) │ 5.37s (42%) │
  1172. 767.14 s > ├───────────┼───────┼─────────┼──────────────┼─────────────┼────────────────┼──────────────┤
  1173. 767.14 s > │ Total │ │ 37 │ 1.42s (3.6%) │ 4.25s (11%) │ 16.44s (41%) │ 17.65s (44%) │
  1174. 767.14 s > ╰───────────┴───────┴─────────┴──────────────┴─────────────┴────────────────┴──────────────╯
  1175. 767.14 s > [2026-09-06 07:47:29.455] @gammaloop_api::se... INFO : Running command set process -p aa_aa_all_helicities -i 1L_ppmm string '
  1176. 767.14 s > [stability]
  1177. 767.14 s > check_on_norm = true
  1178. 767.14 s > escalate_if_exact_zero = false
  1179. 767.14 s > loop_momenta_norm_escalation_factor = -1.0
  1180. 767.14 s > [...]
  1181. 767.14 s > [2026-09-06 07:47:29.456] @gammaloop_api::se... INFO : Running command set process -p aa_aa_all_helicities_assembly -i 1L_ppmm string '
  1182. 767.14 s > [stability]
  1183. 767.14 s > check_on_norm = true
  1184. 767.14 s > escalate_if_exact_zero = false
  1185. 767.14 s > loop_momenta_norm_escalation_factor = -1.0
  1186. 767.14 s > [...]
  1187. 767.14 s > [2026-09-06 07:47:29.457] @gammaloop_api::se... INFO : Running command set process -p aa_aa_all_helicities -i 1L_mpmm string '
  1188. 767.14 s > [stability]
  1189. 767.14 s > check_on_norm = true
  1190. 767.14 s > escalate_if_exact_zero = false
  1191. 767.14 s > loop_momenta_norm_escalation_factor = -1.0
  1192. 767.14 s > [...]
  1193. 767.14 s > [2026-09-06 07:47:29.458] @gammaloop_api::se... INFO : Running command set process -p aa_aa_all_helicities_assembly -i 1L_mpmm string '
  1194. 767.14 s > [stability]
  1195. 767.14 s > check_on_norm = true
  1196. 767.14 s > escalate_if_exact_zero = false
  1197. 767.14 s > loop_momenta_norm_escalation_factor = -1.0
  1198. 767.14 s > [...]
  1199. 767.14 s > [2026-09-06 07:47:29.458] @gammaloop_api::se... INFO : Running command set process -p aa_aa_all_helicities -i 1L_mmmm string '
  1200. 767.14 s > [stability]
  1201. 767.14 s > check_on_norm = true
  1202. 767.14 s > escalate_if_exact_zero = false
  1203. 767.14 s > loop_momenta_norm_escalation_factor = -1.0
  1204. 767.14 s > [...]
  1205. 767.14 s > [2026-09-06 07:47:29.459] @gammaloop_api::se... INFO : Running command set process -p aa_aa_all_helicities_assembly -i 1L_mmmm string '
  1206. 767.14 s > [stability]
  1207. 767.14 s > check_on_norm = true
  1208. 767.14 s > escalate_if_exact_zero = false
  1209. 767.14 s > loop_momenta_norm_escalation_factor = -1.0
  1210. 767.14 s > [...]
  1211. 767.14 s > [2026-09-06 07:47:29.460] @gammaloop_api::se... INFO : Running command set process -p aa_aa_all_helicities -i 1L_pmmp string '
  1212. 767.14 s > [stability]
  1213. 767.14 s > check_on_norm = true
  1214. 767.14 s > escalate_if_exact_zero = false
  1215. 767.14 s > loop_momenta_norm_escalation_factor = -1.0
  1216. 767.14 s > ... omitted 84 more lines; see full nextest output above
  1217. 767.14 s > =========================================
  1218. 767.14 s For full logs, run:
  1219. 767.14 s nix log /nix/store/xaf9bwgnrhpb0jrkx6mcwl1pfl8pk1ly-gammaloop-nextest-integration.drv
  1220. 767.25 s [0 built (1 failed), 0.0Run failed.