test packages.x86_64-linux.nix-ci-check-gammaloop-nextest-integration

Reproduce this run
Original Run
  1. 0.00 s $ /nix/store/9ypz3flqsrl5xl495mm8h645gadjsxi1-coreutils-9.11/bin/timeout --kill-after=15s 7200s /nix/store/23zk8sgzamrbmj1fday15szf7f2279s8-nix-2.34.7/bin/nix --extra-experimental-features nix-command --extra-experimental-features flakes flake clone git+https://github.com/alphal00p/gammaloop --dest /tmp/nix-ci-worker/stable-pwd/repo/
  2. 0.07 s Cloning into '/tmp/nix-ci-worker/stable-pwd/repo'...
  3. 0.97 s remote: Enumerating objects: 78074, done.
  4. 1.20 s remote: Counting objects: 0% (1/13917) remote: Counting objects: 1% (140/13917) remote: Counting objects: 2% (279/13917) remote: Counting objects: 3% (418/13917) remote: Counting objects: 4% (557/13917) remote: Counting objects: 5% (696/13917) remote: Counting objects: 6% (836/13917) remote: Counting objects: 7% (975/13917) remote: Counting objects: 8% (1114/13917) remote: Counting objects: 9% (1253/13917) remote: Counting objects: 10% (1392/13917) remote: Counting objects: 11% (1531/13917) remote: Counting objects: 12% (1671/13917) remote: Counting objects: 13% (1810/13917) remote: Counting objects: 14% (1949/13917) remote: Counting objects: 15% (2088/13917) remote: Counting objects: 16% (2227/13917) remote: Counting objects: 17% (2366/13917) remote: Counting objects: 18% (2506/13917) remote: Counting objects: 19% (2645/13917) remote: Counting objects: 20% (2784/13917) remote: Counting objects: 21% (2923/13917) remote: Counting objects: 22% (3062/13917) remote: Counting objects: 23% (3201/13917) remote: Counting objects: 24% (3341/13917) remote: Counting objects: 25% (3480/13917) remote: Counting objects: 26% (3619/13917) remote: Counting objects: 27% (3758/13917) remote: Counting objects: 28% (3897/13917) remote: Counting objects: 29% (4036/13917) remote: Counting objects: 30% (4176/13917) remote: Counting objects: 31% (4315/13917) remote: Counting objects: 32% (4454/13917) remote: Counting objects: 33% (4593/13917) remote: Counting objects: 34% (4732/13917) remote: Counting objects: 35% (4871/13917) remote: Counting objects: 36% (5011/13917) remote: Counting objects: 37% (5150/13917) remote: Counting objects: 38% (5289/13917) remote: Counting objects: 39% (5428/13917) remote: Counting objects: 40% (5567/13917) remote: Counting objects: 41% (5706/13917) remote: Counting objects: 42% (5846/13917) remote: Counting objects: 43% (5985/13917) remote: Counting objects: 44% (6124/13917) remote: Counting objects: 45% (6263/13917) remote: Counting objects: 46% (6402/13917) remote: Counting objects: 47% (6541/13917) remote: Counting objects: 48% (6681/13917) remote: Counting objects: 49% (6820/13917) remote: Counting objects: 50% (6959/13917) remote: Counting objects: 51% (7098/13917) remote: Counting objects: 52% (7237/13917) remote: Counting objects: 53% (7377/13917) remote: Counting objects: 54% (7516/13917) remote: Counting objects: 55% (7655/13917) remote: Counting objects: 56% (7794/13917) remote: Counting objects: 57% (7933/13917) remote: Counting objects: 58% (8072/13917) remote: Counting objects: 59% (8212/13917) remote: Counting objects: 60% (8351/13917) remote: Counting objects: 61% (8490/13917) remote: Counting objects: 62% (8629/13917) remote: Counting objects: 63% (8768/13917) remote: Counting objects: 64% (8907/13917) remote: Counting objects: 65% (9047/13917) remote: Counting objects: 66% (9186/13917) remote: Counting objects: 67% (9325/13917) remote: Counting objects: 68% (9464/13917) remote: Counting objects: 69% (9603/13917) remote: Counting objects: 70% (9742/13917) remote: Counting objects: 71% (9882/13917) remote: Counting objects: 72% (10021/13917) remote: Counting objects: 73% (10160/13917) remote: Counting objects: 74% (10299/13917) remote: Counting objects: 75% (10438/13917) remote: Counting objects: 76% (10577/13917) remote: Counting objects: 77% (10717/13917) remote: Counting objects: 78% (10856/13917) remote: Counting objects: 79% (10995/13917) remote: Counting objects: 80% (11134/13917) remote: Counting objects: 81% (11273/13917) remote: Counting objects: 82% (11412/13917) remote: Counting objects: 83% (11552/13917) remote: Counting objects: 84% (11691/13917) remote: Counting objects: 85% (11830/13917) remote: Counting objects: 86% (11969/13917) remote: Counting objects: 87% (12108/13917) remote: Counting objects: 88% (12247/13917) remote: Counting objects: 89% (12387/13917) remote: Counting objects: 90% (12526/13917) remote: Counting objects: 91% (12665/13917) remote: Counting objects: 92% (12804/13917) remote: Counting objects: 93% (12943/13917) remote: Counting objects: 94% (13082/13917) remote: Counting objects: 95% (13222/13917) remote: Counting objects: 96% (13361/13917) remote: Counting objects: 97% (13500/13917) remote: Counting objects: 98% (13639/13917) remote: Counting objects: 99% (13778/13917) remote: Counting objects: 100% (13917/13917) remote: Counting objects: 100% (13917/13917), done.
  5. 4.11 s remote: Compressing objects: 0% (1/3084) remote: Compressing objects: 1% (31/3084) remote: Compressing objects: 2% (62/3084) remote: Compressing objects: 3% (93/3084) remote: Compressing objects: 4% (124/3084) remote: Compressing objects: 5% (155/3084) remote: Compressing objects: 6% (186/3084) remote: Compressing objects: 7% (216/3084) remote: Compressing objects: 8% (247/3084) remote: Compressing objects: 9% (278/3084) remote: Compressing objects: 10% (309/3084) remote: Compressing objects: 11% (340/3084) remote: Compressing objects: 12% (371/3084) remote: Compressing objects: 13% (401/3084) remote: Compressing objects: 14% (432/3084) remote: Compressing objects: 15% (463/3084) remote: Compressing objects: 16% (494/3084) remote: Compressing objects: 17% (525/3084) remote: Compressing objects: 18% (556/3084) remote: Compressing objects: 19% (586/3084) remote: Compressing objects: 20% (617/3084) remote: Compressing objects: 21% (648/3084) remote: Compressing objects: 22% (679/3084) remote: Compressing objects: 23% (710/3084) remote: Compressing objects: 24% (741/3084) remote: Compressing objects: 24% (768/3084) remote: Compressing objects: 25% (771/3084) remote: Compressing objects: 26% (802/3084) remote: Compressing objects: 27% (833/3084) remote: Compressing objects: 27% (847/3084) remote: Compressing objects: 28% (864/3084) remote: Compressing objects: 29% (895/3084) remote: Compressing objects: 30% (926/3084) remote: Compressing objects: 31% (957/3084) remote: Compressing objects: 32% (987/3084) remote: Compressing objects: 33% (1018/3084) remote: Compressing objects: 34% (1049/3084) remote: Compressing objects: 35% (1080/3084) remote: Compressing objects: 36% (1111/3084) remote: Compressing objects: 37% (1142/3084) remote: Compressing objects: 38% (1172/3084) remote: Compressing objects: 38% (1201/3084) remote: Compressing objects: 39% (1203/3084) remote: Compressing objects: 40% (1234/3084) remote: Compressing objects: 41% (1265/3084) remote: Compressing objects: 42% (1296/3084) remote: Compressing objects: 43% (1327/3084) remote: Compressing objects: 44% (1357/3084) remote: Compressing objects: 45% (1388/3084) remote: Compressing objects: 46% (1419/3084) remote: Compressing objects: 47% (1450/3084) remote: Compressing objects: 48% (1481/3084) remote: Compressing objects: 49% (1512/3084) remote: Compressing objects: 50% (1542/3084) remote: Compressing objects: 51% (1573/3084) remote: Compressing objects: 52% (1604/3084) remote: Compressing objects: 53% (1635/3084) remote: Compressing objects: 54% (1666/3084) remote: Compressing objects: 55% (1697/3084) remote: Compressing objects: 56% (1728/3084) remote: Compressing objects: 57% (1758/3084) remote: Compressing objects: 58% (1789/3084) remote: Compressing objects: 59% (1820/3084) remote: Compressing objects: 60% (1851/3084) remote: Compressing objects: 61% (1882/3084) remote: Compressing objects: 62% (1913/3084) remote: Compressing objects: 63% (1943/3084) remote: Compressing objects: 64% (1974/3084) remote: Compressing objects: 65% (2005/3084) remote: Compressing objects: 66% (2036/3084) remote: Compressing objects: 67% (2067/3084) remote: Compressing objects: 68% (2098/3084) remote: Compressing objects: 69% (2128/3084) remote: Compressing objects: 70% (2159/3084) remote: Compressing objects: 71% (2190/3084) remote: Compressing objects: 72% (2221/3084) remote: Compressing objects: 73% (2252/3084) remote: Compressing objects: 74% (2283/3084) remote: Compressing objects: 75% (2313/3084) remote: Compressing objects: 76% (2344/3084) remote: Compressing objects: 77% (2375/3084) remote: Compressing objects: 78% (2406/3084) remote: Compressing objects: 79% (2437/3084) remote: Compressing objects: 80% (2468/3084) remote: Compressing objects: 81% (2499/3084) remote: Compressing objects: 82% (2529/3084) remote: Compressing objects: 83% (2560/3084) remote: Compressing objects: 84% (2591/3084) remote: Compressing objects: 85% (2622/3084) remote: Compressing objects: 86% (2653/3084) remote: Compressing objects: 87% (2684/3084) remote: Compressing objects: 88% (2714/3084) remote: Compressing objects: 89% (2745/3084) remote: Compressing objects: 90% (2776/3084) remote: Compressing objects: 91% (2807/3084) remote: Compressing objects: 92% (2838/3084) remote: Compressing objects: 93% (2869/3084) remote: Compressing objects: 94% (2899/3084) remote: Compressing objects: 95% (2930/3084) remote: Compressing objects: 96% (2961/3084) remote: Compressing objects: 97% (2992/3084) remote: Compressing objects: 98% (3023/3084) remote: Compressing objects: 99% (3054/3084) remote: Compressing objects: 100% (3084/3084) remote: Compressing objects: 100% (3084/3084), done.
  6. 7.79 s Receiving objects: 0% (1/78074) Receiving objects: 1% (781/78074) Receiving objects: 2% (1562/78074) Receiving objects: 3% (2343/78074) Receiving objects: 4% (3123/78074) Receiving objects: 5% (3904/78074) Receiving objects: 6% (4685/78074) Receiving objects: 7% (5466/78074) Receiving objects: 8% (6246/78074) Receiving objects: 9% (7027/78074) Receiving objects: 10% (7808/78074), 16.34 MiB | 32.66 MiB/s Receiving objects: 11% (8589/78074), 16.34 MiB | 32.66 MiB/s Receiving objects: 12% (9369/78074), 16.34 MiB | 32.66 MiB/s Receiving objects: 13% (10150/78074), 16.34 MiB | 32.66 MiB/s Receiving objects: 14% (10931/78074), 16.34 MiB | 32.66 MiB/s Receiving objects: 15% (11712/78074), 16.34 MiB | 32.66 MiB/s Receiving objects: 16% (12492/78074), 16.34 MiB | 32.66 MiB/s Receiving objects: 17% (13273/78074), 16.34 MiB | 32.66 MiB/s Receiving objects: 18% (14054/78074), 16.34 MiB | 32.66 MiB/s Receiving objects: 19% (14835/78074), 16.34 MiB | 32.66 MiB/s Receiving objects: 20% (15615/78074), 16.34 MiB | 32.66 MiB/s Receiving objects: 21% (16396/78074), 16.34 MiB | 32.66 MiB/s Receiving objects: 22% (17177/78074), 16.34 MiB | 32.66 MiB/s Receiving objects: 23% (17958/78074), 16.34 MiB | 32.66 MiB/s Receiving objects: 24% (18738/78074), 16.34 MiB | 32.66 MiB/s Receiving objects: 25% (19519/78074), 16.34 MiB | 32.66 MiB/s Receiving objects: 26% (20300/78074), 16.34 MiB | 32.66 MiB/s Receiving objects: 27% (21080/78074), 16.34 MiB | 32.66 MiB/s Receiving objects: 28% (21861/78074), 16.34 MiB | 32.66 MiB/s Receiving objects: 29% (22642/78074), 16.34 MiB | 32.66 MiB/s Receiving objects: 30% (23423/78074), 16.34 MiB | 32.66 MiB/s Receiving objects: 31% (24203/78074), 16.34 MiB | 32.66 MiB/s Receiving objects: 32% (24984/78074), 16.34 MiB | 32.66 MiB/s Receiving objects: 33% (25765/78074), 16.34 MiB | 32.66 MiB/s Receiving objects: 34% (26546/78074), 16.34 MiB | 32.66 MiB/s Receiving objects: 35% (27326/78074), 16.34 MiB | 32.66 MiB/s Receiving objects: 36% (28107/78074), 16.34 MiB | 32.66 MiB/s Receiving objects: 37% (28888/78074), 16.34 MiB | 32.66 MiB/s Receiving objects: 38% (29669/78074), 16.34 MiB | 32.66 MiB/s Receiving objects: 39% (30449/78074), 16.34 MiB | 32.66 MiB/s Receiving objects: 40% (31230/78074), 16.34 MiB | 32.66 MiB/s Receiving objects: 41% (32011/78074), 16.34 MiB | 32.66 MiB/s Receiving objects: 42% (32792/78074), 16.34 MiB | 32.66 MiB/s Receiving objects: 43% (33572/78074), 16.34 MiB | 32.66 MiB/s Receiving objects: 43% (33603/78074), 31.94 MiB | 31.26 MiB/s Receiving objects: 44% (34353/78074), 31.94 MiB | 31.26 MiB/s Receiving objects: 45% (35134/78074), 31.94 MiB | 31.26 MiB/s Receiving objects: 46% (35915/78074), 31.94 MiB | 31.26 MiB/s Receiving objects: 47% (36695/78074), 31.94 MiB | 31.26 MiB/s Receiving objects: 48% (37476/78074), 31.94 MiB | 31.26 MiB/s Receiving objects: 49% (38257/78074), 31.94 MiB | 31.26 MiB/s Receiving objects: 50% (39037/78074), 31.94 MiB | 31.26 MiB/s Receiving objects: 51% (39818/78074), 31.94 MiB | 31.26 MiB/s Receiving objects: 52% (40599/78074), 31.94 MiB | 31.26 MiB/s Receiving objects: 53% (41380/78074), 31.94 MiB | 31.26 MiB/s Receiving objects: 54% (42160/78074), 50.24 MiB | 33.01 MiB/s Receiving objects: 55% (42941/78074), 50.24 MiB | 33.01 MiB/s Receiving objects: 56% (43722/78074), 50.24 MiB | 33.01 MiB/s Receiving objects: 57% (44503/78074), 50.24 MiB | 33.01 MiB/s Receiving objects: 58% (45283/78074), 50.24 MiB | 33.01 MiB/s Receiving objects: 59% (46064/78074), 50.24 MiB | 33.01 MiB/s Receiving objects: 60% (46845/78074), 50.24 MiB | 33.01 MiB/s Receiving objects: 61% (47626/78074), 50.24 MiB | 33.01 MiB/s Receiving objects: 62% (48406/78074), 50.24 MiB | 33.01 MiB/s Receiving objects: 62% (48902/78074), 66.06 MiB | 32.21 MiB/s Receiving objects: 63% (49187/78074), 66.06 MiB | 32.21 MiB/s Receiving objects: 64% (49968/78074), 66.06 MiB | 32.21 MiB/s Receiving objects: 65% (50749/78074), 66.06 MiB | 32.21 MiB/s Receiving objects: 66% (51529/78074), 66.06 MiB | 32.21 MiB/s Receiving objects: 67% (52310/78074), 66.06 MiB | 32.21 MiB/s Receiving objects: 68% (53091/78074), 66.06 MiB | 32.21 MiB/s Receiving objects: 69% (53872/78074), 66.06 MiB | 32.21 MiB/s Receiving objects: 70% (54652/78074), 66.06 MiB | 32.21 MiB/s Receiving objects: 71% (55433/78074), 66.06 MiB | 32.21 MiB/s Receiving objects: 72% (56214/78074), 66.06 MiB | 32.21 MiB/s Receiving objects: 73% (56995/78074), 66.06 MiB | 32.21 MiB/s Receiving objects: 74% (57775/78074), 66.06 MiB | 32.21 MiB/s Receiving objects: 75% (58556/78074), 84.30 MiB | 33.05 MiB/s Receiving objects: 76% (59337/78074), 84.30 MiB | 33.05 MiB/s Receiving objects: 77% (60117/78074), 84.30 MiB | 33.05 MiB/s Receiving objects: 78% (60898/78074), 84.30 MiB | 33.05 MiB/s Receiving objects: 79% (61679/78074), 84.30 MiB | 33.05 MiB/s Receiving objects: 80% (62460/78074), 84.30 MiB | 33.05 MiB/s Receiving objects: 80% (62627/78074), 84.30 MiB | 33.05 MiB/s Receiving objects: 81% (63240/78074), 84.30 MiB | 33.05 MiB/s Receiving objects: 82% (64021/78074), 100.32 MiB | 32.56 MiB/s Receiving objects: 83% (64802/78074), 100.32 MiB | 32.56 MiB/s Receiving objects: 84% (65583/78074), 100.32 MiB | 32.56 MiB/s Receiving objects: 85% (66363/78074), 100.32 MiB | 32.56 MiB/s Receiving objects: 86% (67144/78074), 100.32 MiB | 32.56 MiB/s Receiving objects: 87% (67925/78074), 100.32 MiB | 32.56 MiB/s Receiving objects: 88% (68706/78074), 100.32 MiB | 32.56 MiB/s Receiving objects: 89% (69486/78074), 100.32 MiB | 32.56 MiB/s Receiving objects: 90% (70267/78074), 100.32 MiB | 32.56 MiB/s Receiving objects: 91% (71048/78074), 100.32 MiB | 32.56 MiB/s Receiving objects: 92% (71829/78074), 100.32 MiB | 32.56 MiB/s Receiving objects: 93% (72609/78074), 100.32 MiB | 32.56 MiB/s Receiving objects: 94% (73390/78074), 100.32 MiB | 32.56 MiB/s Receiving objects: 95% (74171/78074), 118.02 MiB | 32.95 MiB/s Receiving objects: 96% (74952/78074), 118.02 MiB | 32.95 MiB/s Receiving objects: 97% (75732/78074), 118.02 MiB | 32.95 MiB/s Receiving objects: 98% (76513/78074), 118.02 MiB | 32.95 MiB/s Receiving objects: 99% (77294/78074), 118.02 MiB | 32.95 MiB/s remote: Total 78074 (delta 9819), reused 11690 (delta 8736), pack-reused 64157 (from 2)
  7. 7.79 s Receiving objects: 100% (78074/78074), 118.02 MiB | 32.95 MiB/s Receiving objects: 100% (78074/78074), 120.78 MiB | 32.85 MiB/s, done.
  8. 8.65 s Resolving deltas: 0% (0/53117) Resolving deltas: 1% (532/53117) Resolving deltas: 2% (1063/53117) Resolving deltas: 3% (1595/53117) Resolving deltas: 4% (2125/53117) Resolving deltas: 5% (2656/53117) Resolving deltas: 6% (3188/53117) Resolving deltas: 7% (3719/53117) Resolving deltas: 8% (4250/53117) Resolving deltas: 9% (4781/53117) Resolving deltas: 10% (5312/53117) Resolving deltas: 11% (5843/53117) Resolving deltas: 12% (6376/53117) Resolving deltas: 13% (6906/53117) Resolving deltas: 14% (7437/53117) Resolving deltas: 15% (7968/53117) Resolving deltas: 16% (8499/53117) Resolving deltas: 17% (9030/53117) Resolving deltas: 18% (9562/53117) Resolving deltas: 19% (10093/53117) Resolving deltas: 20% (10626/53117) Resolving deltas: 21% (11155/53117) Resolving deltas: 22% (11686/53117) Resolving deltas: 23% (12217/53117) Resolving deltas: 24% (12750/53117) Resolving deltas: 25% (13280/53117) Resolving deltas: 26% (13811/53117) Resolving deltas: 27% (14342/53117) Resolving deltas: 28% (14873/53117) Resolving deltas: 29% (15404/53117) Resolving deltas: 30% (15936/53117) Resolving deltas: 31% (16467/53117) Resolving deltas: 32% (16998/53117) Resolving deltas: 33% (17530/53117) Resolving deltas: 34% (18060/53117) Resolving deltas: 35% (18591/53117) Resolving deltas: 36% (19123/53117) Resolving deltas: 37% (19654/53117) Resolving deltas: 38% (20185/53117) Resolving deltas: 39% (20717/53117) Resolving deltas: 40% (21247/53117) Resolving deltas: 41% (21778/53117) Resolving deltas: 42% (22310/53117) Resolving deltas: 43% (22841/53117) Resolving deltas: 44% (23372/53117) Resolving deltas: 45% (23903/53117) Resolving deltas: 46% (24434/53117) Resolving deltas: 47% (24968/53117) Resolving deltas: 48% (25497/53117) Resolving deltas: 49% (26028/53117) Resolving deltas: 50% (26559/53117) Resolving deltas: 51% (27091/53117) Resolving deltas: 52% (27621/53117) Resolving deltas: 53% (28153/53117) Resolving deltas: 54% (28684/53117) Resolving deltas: 55% (29215/53117) Resolving deltas: 56% (29746/53117) Resolving deltas: 57% (30277/53117) Resolving deltas: 58% (30808/53117) Resolving deltas: 59% (31340/53117) Resolving deltas: 60% (31871/53117) Resolving deltas: 61% (32404/53117) Resolving deltas: 62% (32934/53117) Resolving deltas: 63% (33465/53117) Resolving deltas: 64% (33996/53117) Resolving deltas: 65% (34530/53117) Resolving deltas: 66% (35058/53117) Resolving deltas: 67% (35589/53117) Resolving deltas: 68% (36123/53117) Resolving deltas: 69% (36651/53117) Resolving deltas: 70% (37184/53117) Resolving deltas: 71% (37714/53117) Resolving deltas: 72% (38245/53117) Resolving deltas: 73% (38776/53117) Resolving deltas: 74% (39308/53117) Resolving deltas: 75% (39838/53117) Resolving deltas: 76% (40369/53117) Resolving deltas: 77% (40902/53117) Resolving deltas: 78% (41432/53117) Resolving deltas: 79% (41963/53117) Resolving deltas: 80% (42494/53117) Resolving deltas: 81% (43025/53117) Resolving deltas: 82% (43556/53117) Resolving deltas: 83% (44088/53117) Resolving deltas: 84% (44619/53117) Resolving deltas: 85% (45150/53117) Resolving deltas: 86% (45681/53117) Resolving deltas: 87% (46212/53117) Resolving deltas: 88% (46743/53117) Resolving deltas: 89% (47275/53117) Resolving deltas: 90% (47806/53117) Resolving deltas: 91% (48337/53117) Resolving deltas: 92% (48871/53117) Resolving deltas: 93% (49399/53117) Resolving deltas: 94% (49930/53117) Resolving deltas: 95% (50462/53117) Resolving deltas: 96% (50993/53117) Resolving deltas: 97% (51524/53117) Resolving deltas: 98% (52056/53117) Resolving deltas: 99% (52586/53117) Resolving deltas: 100% (53117/53117) Resolving deltas: 100% (53117/53117), done.
  9. 9.00 s Fetching commit ed57fed921fd95d2832e02eb6340b77e3db01418 for codex/aa-aa-identical-program-d3 ...
  10. 9.00 s $ /nix/store/bcnisk3ydfgv26v2gw3zlky24g00yww2-git-2.54.0/bin/git fetch origin ed57fed921fd95d2832e02eb6340b77e3db01418
  11. 9.41 s From https://github.com/alphal00p/gammaloop
  12. 9.41 s * branch ed57fed921fd95d2832e02eb6340b77e3db01418 -> FETCH_HEAD
  13. 9.42 s $ /nix/store/9ypz3flqsrl5xl495mm8h645gadjsxi1-coreutils-9.11/bin/timeout --kill-after=15s 7200s /nix/store/bcnisk3ydfgv26v2gw3zlky24g00yww2-git-2.54.0/bin/git -c advice.detachedHead=false checkout ed57fed921fd95d2832e02eb6340b77e3db01418
  14. 9.61 s HEAD is now at ed57fed92 capture identical Linux evaluator programs
  15. 9.62 s $ /nix/store/9ypz3flqsrl5xl495mm8h645gadjsxi1-coreutils-9.11/bin/timeout --kill-after=15s 7200s /nix/store/23zk8sgzamrbmj1fday15szf7f2279s8-nix-2.34.7/bin/nix --extra-experimental-features nix-command --extra-experimental-features flakes --log-format internal-json run .#packages.x86_64-linux.nix-ci-check-gammaloop-nextest-integration --print-build-logs
  16. 13.56 s
  17. 13.65 s Downloading cached gammaloop-nextest-binaries-integration-gammaloop-integration-tests from https://cache.nix-ci.com
  18. 16.18 s Downloaded cached gammaloop-nextest-binaries-integration-gammaloop-integration-tests (415.8 MiB) in 2.5s
  19. 16.18 s Progress: 0 of 1 built, 1 of 3 downloaded from cache
  20. 16.18 s Downloading cached gammaloop-nextest-binaries-integration from https://cache.nix-ci.com
  21. 16.19 s Downloaded cached gammaloop-nextest-binaries-integration (528 B) in 2ms
  22. 16.19 s Progress: 0 of 1 built, 2 of 3 downloaded from cache
  23. 16.19 s Downloading cached nix-ci-check-gammaloop-nextest-integration from https://cache.nix-ci.com
  24. 16.19 s Downloaded cached nix-ci-check-gammaloop-nextest-integration (1032 B) in 2ms
  25. 16.19 s Progress: 0 of 1 built, 3 of 3 downloaded from cache
  26. 20.73 s evaluating derivation 'g copying '/nix/store/msjs evaluating derivation 'g copying '/nix/store/msjs evaluating derivation 'g copying '/nix/store/msjs evaluating derivation 'g copying '/nix/store/msjs evaluating derivation 'g copying '/nix/store/msjs evaluating derivation 'g copying '/nix/store/msjs evaluating derivation 'g querying gammaloop-nexte [0/1 built, 0.0 KiB DL] [1/0/1 built, 0.0 KiB DLgammaloop-nextest-integration> Extracting 13 binaries, 1 build script output directory, and 3 linked paths to /build/nextest-archive-qc6Wm1
  27. 22.93 s gammaloop-nextest-integration> Extracted 30 files to /build/nextest-archive-qc6Wm1 in 2.20s
  28. 22.95 s gammaloop-nextest-integration> ------------
  29. 22.95 s gammaloop-nextest-integration> Nextest run ID 444c8f1b-f9cd-476a-8808-57b11fabd3fc with nextest profile: ci_gammaloop
  30. 22.95 s gammaloop-nextest-integration> Starting 152 tests across 13 binaries (208 tests skipped, including 207 tests via profile.ci_gammaloop.default-filter)
  31. 343.07 s gammaloop-nextest-integration> FAIL [ 67.481s] ( 54/152) gammaloop-integration-tests::test_runs aa_aa::important::aa_aa_local_inspect_backend_consistency
  32. 343.07 s gammaloop-nextest-integration> stdout ---
  33. 343.07 s gammaloop-nextest-integration>
  34. 343.07 s gammaloop-nextest-integration> running 1 test
  35. 343.07 s gammaloop-nextest-integration> test aa_aa::important::aa_aa_local_inspect_backend_consistency has been running for over 60 seconds
  36. 343.07 s gammaloop-nextest-integration> test aa_aa::important::aa_aa_local_inspect_backend_consistency ... FAILED
  37. 343.07 s gammaloop-nextest-integration>
  38. 343.07 s gammaloop-nextest-integration> failures:
  39. 343.07 s gammaloop-nextest-integration>
  40. 343.07 s gammaloop-nextest-integration> failures:
  41. 343.07 s gammaloop-nextest-integration> aa_aa::important::aa_aa_local_inspect_backend_consistency
  42. 343.07 s gammaloop-nextest-integration>
  43. 343.07 s gammaloop-nextest-integration> test result: FAILED. 0 passed; 1 failed; 0 ignored; 0 measured; 258 filtered out; finished in 67.33s
  44. 343.07 s gammaloop-nextest-integration>
  45. 343.07 s gammaloop-nextest-integration> stderr ---
  46. 343.07 s gammaloop-nextest-integration> [2026-09-06 07:59:19.222] @gammaloop_api::se... INFO : Running command import model sm-default.json
  47. 343.07 s gammaloop-nextest-integration> [2026-09-06 07:59:19.222] @import::model INFO : Loading built-in JSON model sm-default
  48. 343.07 s gammaloop-nextest-integration> [2026-09-06 07:59:19.243] @gammalooprs::model INFO : The following 11 external parameters were forced to zero by the restriction card:
  49. 343.07 s gammaloop-nextest-integration> lamWS, AWS, rhoWS, etaWS, ymc, yme, ymm, MC, Me, MM, WTau
  50. 343.07 s gammaloop-nextest-integration> [2026-09-06 07:59:19.243] @gammalooprs::model INFO : The following 34 vertex rules were removed by the restriction card:
  51. 343.07 s gammaloop-nextest-integration> V_82 -> (c~, d, G+) | V_83 -> (t~, d, G+) | V_84 -> (c~, s, G+) | V_85 -> (t~, s, G+) | V_86 -> (u~, b, G+) | V_87 -> (c~, b, G+) | V_90 -> (c~, d, W+) | V_91 -> (t~, d, W+) | V_92 -> (u~, s, W+) | V_94 -> (t~, s, W+) | V_95 -> (u~, b, W+) | V_96 -> (c~, b, W+) | V_101 -> (e+, e-, G0) | V_102 -> (mu+, mu-, G0) | V_104 -> (e+, e-, H) | V_105 -> (mu+, mu-, H) | V_110 -> (ve~, e-, G+) | V_111 -> (vm~, mu-, G+) | V_116 -> (b~, u, G-) | V_117 -> (d~, c, G-) | V_118 -> (s~, c, G-) | V_119 -> (b~, c, G-) | V_120 -> (d~, t, G-) | V_121 -> (s~, t, G-) | V_124 -> (s~, u, W-) | V_125 -> (b~, u, W-) | V_126 -> (d~, c, W-) | V_128 -> (b~, c, W-) | V_129 -> (d~, t, W-) | V_130 -> (s~, t, W-) | V_138 -> (c~, c, G0) | V_140 -> (c~, c, H) | V_145 -> (e+, ve, G-) | V_146 -> (mu+, vm, G-)
  52. 343.07 s gammaloop-nextest-integration> [2026-09-06 07:59:19.243] @gammalooprs::model INFO : The following 36 couplings were removed by the restriction card:
  53. 343.07 s gammaloop-nextest-integration> GC_13, GC_14, GC_16, GC_17, GC_18, GC_19, GC_20, GC_22, GC_23, GC_24, GC_25, GC_26, GC_28, GC_29, GC_42, GC_43, GC_44, GC_46, GC_47, GC_48, GC_84, GC_85, GC_86, GC_87, GC_88, GC_89, GC_90, GC_91, GC_92, GC_93, GC_101, GC_102, GC_103, GC_105, GC_106, GC_107
  54. 343.07 s gammaloop-nextest-integration> [2026-09-06 07:59:19.243] @gammaloop_api::se... INFO : Running command run set_model_parameters
  55. 343.07 s gammaloop-nextest-integration> [2026-09-06 07:59:19.243] @gammaloop_api::se... INFO : Starting command block set_model_parameters
  56. 343.07 s gammaloop-nextest-integration> [2026-09-06 07:59:19.244] @gammaloop_api::se... INFO : Running command set model MT=173.0
  57. 343.07 s gammaloop-nextest-integration> [2026-09-06 07:59:19.247] @gammaloop_api::se... INFO : Running command set model WT=0.0
  58. 343.07 s gammaloop-nextest-integration> [2026-09-06 07:59:19.251] @gammaloop_api::se... INFO : Running command set model ymt=173.0
  59. 343.07 s gammaloop-nextest-integration> [2026-09-06 07:59:19.255] @gammaloop_api::se... INFO : Running command set model aS=0.118
  60. 343.07 s gammaloop-nextest-integration> [2026-09-06 07:59:19.258] @gammaloop_api::se... INFO : Running command set model aEWM1=137.036
  61. 343.07 s gammaloop-nextest-integration> [2026-09-06 07:59:19.262] @gammaloop_api::se... INFO : Running command set model Gf=1.166390e-05
  62. 343.07 s gammaloop-nextest-integration> [2026-09-06 07:59:19.265] @gammaloop_api::se... INFO : Running command set model MZ=91.188
  63. 343.07 s gammaloop-nextest-integration> [2026-09-06 07:59:19.269] @gammaloop_api::se... INFO : Running command set global string '
  64. 343.07 s gammaloop-nextest-integration> [global.generation.compile]
  65. 343.07 s gammaloop-nextest-integration> compilation_mode = "symjit"
  66. 343.07 s gammaloop-nextest-integration> optimization_level = "O0"
  67. 343.07 s gammaloop-nextest-integration> fast_math = false
  68. 343.07 s gammaloop-nextest-integration> [...]
  69. 343.07 s gammaloop-nextest-integration> [2026-09-06 07:59:19.270] @gammaloop_api::se... INFO : Running command import graphs ./examples/cli/aa_aa/1L/aa_aa_1L.dot -p aa_aa_all_helicities -i 1L_ppmm -o
  70. 343.07 s gammaloop-nextest-integration> [2026-09-06 07:59:19.270] @commands::import INFO : Loading graphs from '/build/source/examples/cli/aa_aa/1L/aa_aa_1L.dot'
  71. 343.07 s gammaloop-nextest-integration> [2026-09-06 07:59:19.279] @gammaloop_api::se... INFO : Running command generate existing -p aa_aa_all_helicities
  72. 343.07 s gammaloop-nextest-integration> [2026-09-06 07:59:44.213] @commands::generate INFO :
  73. 343.07 s gammaloop-nextest-integration> Integrand generation summary
  74. 343.07 s gammaloop-nextest-integration> peak RAM 1.10 GiB | cores 1
  75. 343.07 s gammaloop-nextest-integration> ╭───────────┬───────┬─────────┬──────────────┬─────────────┬────────────────┬──────────────╮
  76. 343.07 s gammaloop-nextest-integration> │ integrand │ graph │ # evals │ expr build │ spenso │ symbolica eval │ compile │
  77. 343.07 s gammaloop-nextest-integration> ├───────────┼───────┼─────────┼──────────────┼─────────────┼────────────────┼──────────────┤
  78. 343.07 s gammaloop-nextest-integration> │ 1L_ppmm │ GL0 │ 13 │ 521ms (6.2%) │ 1.61s (19%) │ 5.40s (64%) │ 866ms (10%) │
  79. 343.07 s gammaloop-nextest-integration> │ 1L_ppmm │ GL2 │ 13 │ 524ms (6.3%) │ 1.43s (17%) │ 5.53s (67%) │ 799ms (9.6%) │
  80. 343.07 s gammaloop-nextest-integration> │ 1L_ppmm │ GL4 │ 11 │ 519ms (6.4%) │ 1.40s (17%) │ 5.46s (67%) │ 760ms (9.3%) │
  81. 343.07 s gammaloop-nextest-integration> ├───────────┼───────┼─────────┼──────────────┼─────────────┼────────────────┼──────────────┤
  82. 343.07 s gammaloop-nextest-integration> │ Total │ │ 37 │ 1.57s (6.3%) │ 4.45s (18%) │ 16.39s (66%) │ 2.43s (9.8%) │
  83. 343.07 s gammaloop-nextest-integration> ╰───────────┴───────┴─────────┴──────────────┴─────────────┴────────────────┴──────────────╯
  84. 343.07 s gammaloop-nextest-integration> [2026-09-06 07:59:44.858] @gammaloop_api::se... INFO : Running command import model sm-default.json
  85. 343.07 s gammaloop-nextest-integration> [2026-09-06 07:59:44.858] @import::model INFO : Loading built-in JSON model sm-default
  86. 343.07 s gammaloop-nextest-integration> [2026-09-06 07:59:44.879] @gammalooprs::model INFO : The following 11 external parameters were forced to zero by the restriction card:
  87. 343.07 s gammaloop-nextest-integration> lamWS, AWS, rhoWS, etaWS, ymc, yme, ymm, MC, Me, MM, WTau
  88. 343.07 s gammaloop-nextest-integration> [2026-09-06 07:59:44.879] @gammalooprs::model INFO : The following 34 vertex rules were removed by the restriction card:
  89. 343.07 s gammaloop-nextest-integration> V_82 -> (c~, d, G+) | V_83 -> (t~, d, G+) | V_84 -> (c~, s, G+) | V_85 -> (t~, s, G+) | V_86 -> (u~, b, G+) | V_87 -> (c~, b, G+) | V_90 -> (c~, d, W+) | V_91 -> (t~, d, W+) | V_92 -> (u~, s, W+) | V_94 -> (t~, s, W+) | V_95 -> (u~, b, W+) | V_96 -> (c~, b, W+) | V_101 -> (e+, e-, G0) | V_102 -> (mu+, mu-, G0) | V_104 -> (e+, e-, H) | V_105 -> (mu+, mu-, H) | V_110 -> (ve~, e-, G+) | V_111 -> (vm~, mu-, G+) | V_116 -> (b~, u, G-) | V_117 -> (d~, c, G-) | V_118 -> (s~, c, G-) | V_119 -> (b~, c, G-) | V_120 -> (d~, t, G-) | V_121 -> (s~, t, G-) | V_124 -> (s~, u, W-) | V_125 -> (b~, u, W-) | V_126 -> (d~, c, W-) | V_128 -> (b~, c, W-) | V_129 -> (d~, t, W-) | V_130 -> (s~, t, W-) | V_138 -> (c~, c, G0) | V_140 -> (c~, c, H) | V_145 -> (e+, ve, G-) | V_146 -> (mu+, vm, G-)
  90. 343.07 s gammaloop-nextest-integration> [2026-09-06 07:59:44.879] @gammalooprs::model INFO : The following 36 couplings were removed by the restriction card:
  91. 343.07 s gammaloop-nextest-integration> GC_13, GC_14, GC_16, GC_17, GC_18, GC_19, GC_20, GC_22, GC_23, GC_24, GC_25, GC_26, GC_28, GC_29, GC_42, GC_43, GC_44, GC_46, GC_47, GC_48, GC_84, GC_85, GC_86, GC_87, GC_88, GC_89, GC_90, GC_91, GC_92, GC_93, GC_101, GC_102, GC_103, GC_105, GC_106, GC_107
  92. 343.07 s gammaloop-nextest-integration> [2026-09-06 07:59:44.880] @gammaloop_api::se... INFO : Running command run set_model_parameters
  93. 343.07 s gammaloop-nextest-integration> [2026-09-06 07:59:44.880] @gammaloop_api::se... INFO : Starting command block set_model_parameters
  94. 343.07 s gammaloop-nextest-integration> [2026-09-06 07:59:44.880] @gammaloop_api::se... INFO : Running command set model MT=173.0
  95. 343.07 s gammaloop-nextest-integration> [2026-09-06 07:59:44.883] @gammaloop_api::se... INFO : Running command set model WT=0.0
  96. 343.07 s gammaloop-nextest-integration> [2026-09-06 07:59:44.887] @gammaloop_api::se... INFO : Running command set model ymt=173.0
  97. 343.07 s gammaloop-nextest-integration> [2026-09-06 07:59:44.890] @gammaloop_api::se... INFO : Running command set model aS=0.118
  98. 343.07 s gammaloop-nextest-integration> [2026-09-06 07:59:44.894] @gammaloop_api::se... INFO : Running command set model aEWM1=137.036
  99. 343.07 s gammaloop-nextest-integration> [2026-09-06 07:59:44.897] @gammaloop_api::se... INFO : Running command set model Gf=1.166390e-05
  100. 343.07 s gammaloop-nextest-integration> [2026-09-06 07:59:44.900] @gammaloop_api::se... INFO : Running command set model MZ=91.188
  101. 343.07 s gammaloop-nextest-integration> [2026-09-06 07:59:44.904] @gammaloop_api::se... INFO : Running command set global string '
  102. 343.07 s gammaloop-nextest-integration> [global.generation.compile]
  103. 343.07 s gammaloop-nextest-integration> compilation_mode = "assembly"
  104. 343.07 s gammaloop-nextest-integration> optimization_level = "O0"
  105. 343.07 s gammaloop-nextest-integration> fast_math = false
  106. 343.07 s gammaloop-nextest-integration> [...]
  107. 343.07 s gammaloop-nextest-integration> [2026-09-06 07:59:44.905] @gammaloop_api::se... INFO : Running command import graphs ./examples/cli/aa_aa/1L/aa_aa_1L.dot -p aa_aa_all_helicities_assembly -i 1L_ppmm -o
  108. 343.07 s gammaloop-nextest-integration> [2026-09-06 07:59:44.905] @commands::import INFO : Loading graphs from '/build/source/examples/cli/aa_aa/1L/aa_aa_1L.dot'
  109. 343.07 s gammaloop-nextest-integration> [2026-09-06 07:59:44.912] @gammaloop_api::se... INFO : Running command generate existing -p aa_aa_all_helicities_assembly
  110. 343.07 s gammaloop-nextest-integration> [2026-09-06 08:00:07.227] @processes::amplitude INFO : Compiling amplitude 1L_ppmm
  111. 343.07 s gammaloop-nextest-integration> [2026-09-06 08:00:25.499] @commands::generate INFO : Removed 34 generated C++ source file(s). Use '--keep-sources' to keep them.
  112. 343.07 s gammaloop-nextest-integration> [2026-09-06 08:00:25.499] @commands::generate INFO :
  113. 343.07 s gammaloop-nextest-integration> Integrand generation summary
  114. 343.07 s gammaloop-nextest-integration> peak RAM 2.24 GiB | cores 1
  115. 343.07 s gammaloop-nextest-integration> ╭───────────┬───────┬─────────┬──────────────┬─────────────┬────────────────┬──────────────╮
  116. 343.07 s gammaloop-nextest-integration> │ integrand │ graph │ # evals │ expr build │ spenso │ symbolica eval │ compile │
  117. 343.07 s gammaloop-nextest-integration> ├───────────┼───────┼─────────┼──────────────┼─────────────┼────────────────┼──────────────┤
  118. 343.07 s gammaloop-nextest-integration> │ 1L_ppmm │ GL0 │ 13 │ 485ms (3.5%) │ 1.39s (10%) │ 5.48s (40%) │ 6.50s (47%) │
  119. 343.07 s gammaloop-nextest-integration> │ 1L_ppmm │ GL2 │ 13 │ 500ms (3.6%) │ 1.44s (11%) │ 5.47s (40%) │ 6.30s (46%) │
  120. 343.07 s gammaloop-nextest-integration> │ 1L_ppmm │ GL4 │ 11 │ 486ms (3.7%) │ 1.43s (11%) │ 5.60s (43%) │ 5.46s (42%) │
  121. 343.07 s gammaloop-nextest-integration> ├───────────┼───────┼─────────┼──────────────┼─────────────┼────────────────┼──────────────┤
  122. 343.07 s gammaloop-nextest-integration> │ Total │ │ 37 │ 1.47s (3.6%) │ 4.26s (11%) │ 16.55s (41%) │ 18.26s (45%) │
  123. 343.07 s gammaloop-nextest-integration> ╰───────────┴───────┴─────────┴──────────────┴─────────────┴────────────────┴──────────────╯
  124. 343.07 s gammaloop-nextest-integration> [2026-09-06 08:00:26.109] @gammaloop_api::se... INFO : Running command set process -p aa_aa_all_helicities -i 1L_ppmm string '
  125. 343.07 s gammaloop-nextest-integration> [stability]
  126. 343.07 s gammaloop-nextest-integration> check_on_norm = true
  127. 343.07 s gammaloop-nextest-integration> escalate_if_exact_zero = false
  128. 343.07 s gammaloop-nextest-integration> loop_momenta_norm_escalation_factor = -1.0
  129. 343.07 s gammaloop-nextest-integration> [...]
  130. 343.07 s gammaloop-nextest-integration> [2026-09-06 08:00:26.110] @gammaloop_api::se... INFO : Running command set process -p aa_aa_all_helicities_assembly -i 1L_ppmm string '
  131. 343.07 s gammaloop-nextest-integration> [stability]
  132. 343.07 s gammaloop-nextest-integration> check_on_norm = true
  133. 343.07 s gammaloop-nextest-integration> escalate_if_exact_zero = false
  134. 343.07 s gammaloop-nextest-integration> loop_momenta_norm_escalation_factor = -1.0
  135. 343.07 s gammaloop-nextest-integration> [...]
  136. 343.07 s gammaloop-nextest-integration> [2026-09-06 08:00:26.111] @gammaloop_api::se... INFO : Running command set process -p aa_aa_all_helicities -i 1L_mpmm string '
  137. 343.07 s gammaloop-nextest-integration> [stability]
  138. 343.07 s gammaloop-nextest-integration> check_on_norm = true
  139. 343.07 s gammaloop-nextest-integration> escalate_if_exact_zero = false
  140. 343.07 s gammaloop-nextest-integration> loop_momenta_norm_escalation_factor = -1.0
  141. 343.07 s gammaloop-nextest-integration> [...]
  142. 343.07 s gammaloop-nextest-integration> [2026-09-06 08:00:26.112] @gammaloop_api::se... INFO : Running command set process -p aa_aa_all_helicities_assembly -i 1L_mpmm string '
  143. 343.07 s gammaloop-nextest-integration> [stability]
  144. 343.07 s gammaloop-nextest-integration> check_on_norm = true
  145. 343.07 s gammaloop-nextest-integration> escalate_if_exact_zero = false
  146. 343.07 s gammaloop-nextest-integration> loop_momenta_norm_escalation_factor = -1.0
  147. 343.07 s gammaloop-nextest-integration> [...]
  148. 343.07 s gammaloop-nextest-integration> [2026-09-06 08:00:26.112] @gammaloop_api::se... INFO : Running command set process -p aa_aa_all_helicities -i 1L_mmmm string '
  149. 343.07 s gammaloop-nextest-integration> [stability]
  150. 343.07 s gammaloop-nextest-integration> check_on_norm = true
  151. 343.07 s gammaloop-nextest-integration> escalate_if_exact_zero = false
  152. 343.07 s gammaloop-nextest-integration> loop_momenta_norm_escalation_factor = -1.0
  153. 343.07 s gammaloop-nextest-integration> [...]
  154. 343.07 s gammaloop-nextest-integration> [2026-09-06 08:00:26.113] @gammaloop_api::se... INFO : Running command set process -p aa_aa_all_helicities_assembly -i 1L_mmmm string '
  155. 343.07 s gammaloop-nextest-integration> [stability]
  156. 343.07 s gammaloop-nextest-integration> check_on_norm = true
  157. 343.07 s gammaloop-nextest-integration> escalate_if_exact_zero = false
  158. 343.07 s gammaloop-nextest-integration> loop_momenta_norm_escalation_factor = -1.0
  159. 343.07 s gammaloop-nextest-integration> [...]
  160. 343.07 s gammaloop-nextest-integration> [2026-09-06 08:00:26.114] @gammaloop_api::se... INFO : Running command set process -p aa_aa_all_helicities -i 1L_pmmp string '
  161. 343.07 s gammaloop-nextest-integration> [stability]
  162. 343.07 s gammaloop-nextest-integration> check_on_norm = true
  163. 343.07 s gammaloop-nextest-integration> escalate_if_exact_zero = false
  164. 343.07 s gammaloop-nextest-integration> loop_momenta_norm_escalation_factor = -1.0
  165. 343.07 s gammaloop-nextest-integration> [...]
  166. 343.07 s gammaloop-nextest-integration> [2026-09-06 08:00:26.114] @gammaloop_api::se... INFO : Running command set process -p aa_aa_all_helicities_assembly -i 1L_pmmp string '
  167. 343.07 s gammaloop-nextest-integration> [stability]
  168. 343.07 s gammaloop-nextest-integration> check_on_norm = true
  169. 343.07 s gammaloop-nextest-integration> escalate_if_exact_zero = false
  170. 343.07 s gammaloop-nextest-integration> loop_momenta_norm_escalation_factor = -1.0
  171. 343.07 s gammaloop-nextest-integration> [...]
  172. 343.07 s gammaloop-nextest-integration> [2026-09-06 08:00:26.115] @gammaloop_api::se... INFO : Running command set process -p aa_aa_all_helicities -i 1L_pmpm string '
  173. 343.07 s gammaloop-nextest-integration> [stability]
  174. 343.07 s gammaloop-nextest-integration> check_on_norm = true
  175. 343.07 s gammaloop-nextest-integration> escalate_if_exact_zero = false
  176. 343.07 s gammaloop-nextest-integration> loop_momenta_norm_escalation_factor = -1.0
  177. 343.07 s gammaloop-nextest-integration> [...]
  178. 343.07 s gammaloop-nextest-integration> [2026-09-06 08:00:26.116] @gammaloop_api::se... INFO : Running command set process -p aa_aa_all_helicities_assembly -i 1L_pmpm string '
  179. 343.07 s gammaloop-nextest-integration> [stability]
  180. 343.07 s gammaloop-nextest-integration> check_on_norm = true
  181. 343.07 s gammaloop-nextest-integration> escalate_if_exact_zero = false
  182. 343.07 s gammaloop-nextest-integration> loop_momenta_norm_escalation_factor = -1.0
  183. 343.07 s gammaloop-nextest-integration> [...]
  184. 343.07 s gammaloop-nextest-integration> [2026-09-06 08:00:26.120] @process::amplitude INFO : Input is below threshold: 0 existing threshold E-surfaces across 0/1 graph groups
  185. 343.07 s gammaloop-nextest-integration> [2026-09-06 08:00:26.120] @process::amplitude INFO : overlap structure of group 0: [0: []]
  186. 343.07 s gammaloop-nextest-integration> [2026-09-06 08:00:26.121] @integrands::process [{#im_is_nan, #re_is_nan}] WARNING : final process evaluation is nonfinite
  187. 343.07 s gammaloop-nextest-integration> [2026-09-06 08:00:26.121] @commands::inspect INFO :
  188. 343.07 s gammaloop-nextest-integration> Input point in momentum space:
  189. 343.07 s gammaloop-nextest-integration>
  190. 343.07 s gammaloop-nextest-integration> ( 0.1100000000000000, -0.0700000000000000, 0.1900000000000000 )
  191. 343.07 s gammaloop-nextest-integration>
  192. 343.07 s gammaloop-nextest-integration> The evaluation of integrand '1L_ppmm' is:
  193. 343.07 s gammaloop-nextest-integration>
  194. 343.07 s gammaloop-nextest-integration> ( +0.0000000000000000e0, +0.0000000000000000e0 i)
  195. 343.07 s gammaloop-nextest-integration>
  196. 343.07 s gammaloop-nextest-integration> [2026-09-06 08:00:26.124] @process::amplitude INFO : Input is below threshold: 0 existing threshold E-surfaces across 0/1 graph groups
  197. 343.07 s gammaloop-nextest-integration> [2026-09-06 08:00:26.124] @process::amplitude INFO : overlap structure of group 0: [0: []]
  198. 343.07 s gammaloop-nextest-integration> [2026-09-06 08:00:26.125] @commands::inspect INFO :
  199. 343.07 s gammaloop-nextest-integration> Input point in momentum space:
  200. 343.07 s gammaloop-nextest-integration>
  201. 343.07 s gammaloop-nextest-integration> ( 0.1100000000000000, -0.0700000000000000, 0.1900000000000000 )
  202. 343.07 s gammaloop-nextest-integration>
  203. 343.07 s gammaloop-nextest-integration> The evaluation of integrand '1L_ppmm' is:
  204. 343.07 s gammaloop-nextest-integration>
  205. 343.07 s gammaloop-nextest-integration> ( -1.7132462539328486e-28, -8.7105072229446864e-10 i)
  206. 343.07 s gammaloop-nextest-integration>
  207. 343.07 s gammaloop-nextest-integration> The application panicked (crashed).
  208. 343.07 s gammaloop-nextest-integration> Message: kinematics=a, integrand=1L_ppmm, graph_id=0: assembly vs symjit inspect: actual=(-0.00000000000000000000000000017132462539328486+-0.0000000008710507222944686i), expected=(0+0i), tolerance=0.0000000001
  209. 343.07 s gammaloop-nextest-integration> Location: tests/tests/test_runs/utils.rs:466
  210. 343.07 s gammaloop-nextest-integration>
  211. 343.07 s gammaloop-nextest-integration> ━━━━━━━━━━━━━━━━━━━━━━━━━━━━━━━━━━ BACKTRACE ━━━━━━━━━━━━━━━━━━━━━━━━━━━━━━━━━━━
  212. 343.07 s gammaloop-nextest-integration> 1: <color_eyre[51793ea62743adbd]::config::PanicHook>::panic_report<unknown>
  213. 343.07 s gammaloop-nextest-integration> at <unknown source file>:<unknown line>
  214. 343.07 s gammaloop-nextest-integration> 2: <color_eyre[51793ea62743adbd]::config::PanicHook>::into_panic_hook::{closure#0}<unknown>
  215. 343.07 s gammaloop-nextest-integration> at <unknown source file>:<unknown line>
  216. 343.07 s gammaloop-nextest-integration> 3: std[bcb96dfbba0ab899]::panicking::panic_with_hook<unknown>
  217. 343.07 s gammaloop-nextest-integration> at <unknown source file>:<unknown line>
  218. 343.07 s gammaloop-nextest-integration> 4: std[bcb96dfbba0ab899]::panicking::panic_handler::{closure#0}<unknown>
  219. 343.07 s gammaloop-nextest-integration> at <unknown source file>:<unknown line>
  220. 343.07 s gammaloop-nextest-integration> 5: std[bcb96dfbba0ab899]::sys::backtrace::__rust_end_short_backtrace::<std[bcb96dfbba0ab899]::panicking::panic_handler::{closure#0}, !><unknown>
  221. 343.07 s gammaloop-nextest-integration> at <unknown source file>:<unknown line>
  222. 343.07 s gammaloop-nextest-integration> 6: __rustc[6c289b9f9c454d21]::rust_begin_unwind<unknown>
  223. 343.07 s gammaloop-nextest-integration> at <unknown source file>:<unknown line>
  224. 343.07 s gammaloop-nextest-integration> 7: core[940e698046960fd5]::panicking::panic_fmt<unknown>
  225. 343.07 s gammaloop-nextest-integration> at <unknown source file>:<unknown line>
  226. 343.07 s gammaloop-nextest-integration> 8: <test_runs[66584badfeb6c7be]::aa_aa::important::aa_aa_local_inspect_backend_consistency::{closure#0} as core[940e698046960fd5]::ops::function::FnOnce<()>>::call_once<unknown>
  227. 343.07 s gammaloop-nextest-integration> at <unknown source file>:<unknown line>
  228. 343.07 s gammaloop-nextest-integration> 9: serial_test[cd99724524a2f1c0]::serial_code_lock::local_serial_core_with_return::<(), eyre[cb2fd339c0c40fca]::Report><unknown>
  229. 343.07 s gammaloop-nextest-integration> at <unknown source file>:<unknown line>
  230. 343.07 s gammaloop-nextest-integration> 10: <test_runs[66584badfeb6c7be]::aa_aa::important::aa_aa_local_inspect_backend_consistency::{closure#0} as core[940e698046960fd5]::ops::function::FnOnce<()>>::call_once<unknown>
  231. 343.07 s gammaloop-nextest-integration> at <unknown source file>:<unknown line>
  232. 343.07 s gammaloop-nextest-integration> 11: test[75d6903177b1d7e9]::__rust_begin_short_backtrace::<core[940e698046960fd5]::result::Result<(), alloc[2ea6bcb46fca0c42]::string::String>, fn() -> core[940e698046960fd5]::result::Result<(), alloc[2ea6bcb46fca0c42]::string::String>><unknown>
  233. 343.07 s gammaloop-nextest-integration> at <unknown source file>:<unknown line>
  234. 343.07 s gammaloop-nextest-integration> 12: test[75d6903177b1d7e9]::run_test::{closure#0}<unknown>
  235. 343.07 s gammaloop-nextest-integration> at <unknown source file>:<unknown line>
  236. 343.07 s gammaloop-nextest-integration> 13: std[bcb96dfbba0ab899]::sys::backtrace::__rust_begin_short_backtrace::<test[75d6903177b1d7e9]::run_test::{closure#1}, ()><unknown>
  237. 343.07 s gammaloop-nextest-integration> at <unknown source file>:<unknown line>
  238. 343.07 s gammaloop-nextest-integration> 14: <std[bcb96dfbba0ab899]::thread::lifecycle::spawn_unchecked<test[75d6903177b1d7e9]::run_test::{closure#1}, ()>::{closure#1} as core[940e698046960fd5]::ops::function::FnOnce<()>>::call_once::{shim:vtable#0}<unknown>
  239. 343.07 s gammaloop-nextest-integration> at <unknown source file>:<unknown line>
  240. 343.07 s gammaloop-nextest-integration> 15: <std[bcb96dfbba0ab899]::sys::thread::unix::Thread>::new::thread_start<unknown>
  241. 343.07 s gammaloop-nextest-integration> at <unknown source file>:<unknown line>
  242. 343.07 s gammaloop-nextest-integration> 16: start_thread<unknown>
  243. 343.07 s gammaloop-nextest-integration> at <unknown source file>:<unknown line>
  244. 343.07 s gammaloop-nextest-integration> 17: __clone3<unknown>
  245. 343.07 s gammaloop-nextest-integration> at <unknown source file>:<unknown line>
  246. 343.07 s gammaloop-nextest-integration>
  247. 343.07 s gammaloop-nextest-integration> Run with COLORBT_SHOW_HIDDEN=1 environment variable to disable frame filtering.
  248. 343.07 s gammaloop-nextest-integration> Run with RUST_BACKTRACE=full to include source snippets.
  249. 343.07 s gammaloop-nextest-integration>
  250. 766.83 s gammaloop-nextest-integration> ------------
  251. 766.83 s gammaloop-nextest-integration> Summary [ 743.881s] 152 tests run: 151 passed, 1 failed, 208 skipped
  252. 766.83 s gammaloop-nextest-integration> FAIL [ 67.481s] ( 54/152) gammaloop-integration-tests::test_runs aa_aa::important::aa_aa_local_inspect_backend_consistency
  253. 766.83 s gammaloop-nextest-integration> stdout ---
  254. 766.83 s gammaloop-nextest-integration>
  255. 766.83 s gammaloop-nextest-integration> running 1 test
  256. 766.83 s gammaloop-nextest-integration> test aa_aa::important::aa_aa_local_inspect_backend_consistency has been running for over 60 seconds
  257. 766.83 s gammaloop-nextest-integration> test aa_aa::important::aa_aa_local_inspect_backend_consistency ... FAILED
  258. 766.83 s gammaloop-nextest-integration>
  259. 766.83 s gammaloop-nextest-integration> failures:
  260. 766.83 s gammaloop-nextest-integration>
  261. 766.83 s gammaloop-nextest-integration> failures:
  262. 766.83 s gammaloop-nextest-integration> aa_aa::important::aa_aa_local_inspect_backend_consistency
  263. 766.83 s gammaloop-nextest-integration>
  264. 766.83 s gammaloop-nextest-integration> test result: FAILED. 0 passed; 1 failed; 0 ignored; 0 measured; 258 filtered out; finished in 67.33s
  265. 766.83 s gammaloop-nextest-integration>
  266. 766.83 s gammaloop-nextest-integration> stderr ---
  267. 766.83 s gammaloop-nextest-integration> [2026-09-06 07:59:19.222] @gammaloop_api::se... INFO : Running command import model sm-default.json
  268. 766.83 s gammaloop-nextest-integration> [2026-09-06 07:59:19.222] @import::model INFO : Loading built-in JSON model sm-default
  269. 766.83 s gammaloop-nextest-integration> [2026-09-06 07:59:19.243] @gammalooprs::model INFO : The following 11 external parameters were forced to zero by the restriction card:
  270. 766.83 s gammaloop-nextest-integration> lamWS, AWS, rhoWS, etaWS, ymc, yme, ymm, MC, Me, MM, WTau
  271. 766.83 s gammaloop-nextest-integration> [2026-09-06 07:59:19.243] @gammalooprs::model INFO : The following 34 vertex rules were removed by the restriction card:
  272. 766.83 s gammaloop-nextest-integration> V_82 -> (c~, d, G+) | V_83 -> (t~, d, G+) | V_84 -> (c~, s, G+) | V_85 -> (t~, s, G+) | V_86 -> (u~, b, G+) | V_87 -> (c~, b, G+) | V_90 -> (c~, d, W+) | V_91 -> (t~, d, W+) | V_92 -> (u~, s, W+) | V_94 -> (t~, s, W+) | V_95 -> (u~, b, W+) | V_96 -> (c~, b, W+) | V_101 -> (e+, e-, G0) | V_102 -> (mu+, mu-, G0) | V_104 -> (e+, e-, H) | V_105 -> (mu+, mu-, H) | V_110 -> (ve~, e-, G+) | V_111 -> (vm~, mu-, G+) | V_116 -> (b~, u, G-) | V_117 -> (d~, c, G-) | V_118 -> (s~, c, G-) | V_119 -> (b~, c, G-) | V_120 -> (d~, t, G-) | V_121 -> (s~, t, G-) | V_124 -> (s~, u, W-) | V_125 -> (b~, u, W-) | V_126 -> (d~, c, W-) | V_128 -> (b~, c, W-) | V_129 -> (d~, t, W-) | V_130 -> (s~, t, W-) | V_138 -> (c~, c, G0) | V_140 -> (c~, c, H) | V_145 -> (e+, ve, G-) | V_146 -> (mu+, vm, G-)
  273. 766.83 s gammaloop-nextest-integration> [2026-09-06 07:59:19.243] @gammalooprs::model INFO : The following 36 couplings were removed by the restriction card:
  274. 766.83 s gammaloop-nextest-integration> GC_13, GC_14, GC_16, GC_17, GC_18, GC_19, GC_20, GC_22, GC_23, GC_24, GC_25, GC_26, GC_28, GC_29, GC_42, GC_43, GC_44, GC_46, GC_47, GC_48, GC_84, GC_85, GC_86, GC_87, GC_88, GC_89, GC_90, GC_91, GC_92, GC_93, GC_101, GC_102, GC_103, GC_105, GC_106, GC_107
  275. 766.83 s gammaloop-nextest-integration> [2026-09-06 07:59:19.243] @gammaloop_api::se... INFO : Running command run set_model_parameters
  276. 766.83 s gammaloop-nextest-integration> [2026-09-06 07:59:19.243] @gammaloop_api::se... INFO : Starting command block set_model_parameters
  277. 766.83 s gammaloop-nextest-integration> [2026-09-06 07:59:19.244] @gammaloop_api::se... INFO : Running command set model MT=173.0
  278. 766.83 s gammaloop-nextest-integration> [2026-09-06 07:59:19.247] @gammaloop_api::se... INFO : Running command set model WT=0.0
  279. 766.83 s gammaloop-nextest-integration> [2026-09-06 07:59:19.251] @gammaloop_api::se... INFO : Running command set model ymt=173.0
  280. 766.83 s gammaloop-nextest-integration> [2026-09-06 07:59:19.255] @gammaloop_api::se... INFO : Running command set model aS=0.118
  281. 766.83 s gammaloop-nextest-integration> [2026-09-06 07:59:19.258] @gammaloop_api::se... INFO : Running command set model aEWM1=137.036
  282. 766.83 s gammaloop-nextest-integration> [2026-09-06 07:59:19.262] @gammaloop_api::se... INFO : Running command set model Gf=1.166390e-05
  283. 766.83 s gammaloop-nextest-integration> [2026-09-06 07:59:19.265] @gammaloop_api::se... INFO : Running command set model MZ=91.188
  284. 766.83 s gammaloop-nextest-integration> [2026-09-06 07:59:19.269] @gammaloop_api::se... INFO : Running command set global string '
  285. 766.83 s gammaloop-nextest-integration> [global.generation.compile]
  286. 766.83 s gammaloop-nextest-integration> compilation_mode = "symjit"
  287. 766.83 s gammaloop-nextest-integration> optimization_level = "O0"
  288. 766.83 s gammaloop-nextest-integration> fast_math = false
  289. 766.83 s gammaloop-nextest-integration> [...]
  290. 766.83 s gammaloop-nextest-integration> [2026-09-06 07:59:19.270] @gammaloop_api::se... INFO : Running command import graphs ./examples/cli/aa_aa/1L/aa_aa_1L.dot -p aa_aa_all_helicities -i 1L_ppmm -o
  291. 766.83 s gammaloop-nextest-integration> [2026-09-06 07:59:19.270] @commands::import INFO : Loading graphs from '/build/source/examples/cli/aa_aa/1L/aa_aa_1L.dot'
  292. 766.83 s gammaloop-nextest-integration> [2026-09-06 07:59:19.279] @gammaloop_api::se... INFO : Running command generate existing -p aa_aa_all_helicities
  293. 766.83 s gammaloop-nextest-integration> [2026-09-06 07:59:44.213] @commands::generate INFO :
  294. 766.83 s gammaloop-nextest-integration> Integrand generation summary
  295. 766.83 s gammaloop-nextest-integration> peak RAM 1.10 GiB | cores 1
  296. 766.83 s gammaloop-nextest-integration> ╭───────────┬───────┬─────────┬──────────────┬─────────────┬────────────────┬──────────────╮
  297. 766.83 s gammaloop-nextest-integration> │ integrand │ graph │ # evals │ expr build │ spenso │ symbolica eval │ compile │
  298. 766.83 s gammaloop-nextest-integration> ├───────────┼───────┼─────────┼──────────────┼─────────────┼────────────────┼──────────────┤
  299. 766.83 s gammaloop-nextest-integration> │ 1L_ppmm │ GL0 │ 13 │ 521ms (6.2%) │ 1.61s (19%) │ 5.40s (64%) │ 866ms (10%) │
  300. 766.83 s gammaloop-nextest-integration> │ 1L_ppmm │ GL2 │ 13 │ 524ms (6.3%) │ 1.43s (17%) │ 5.53s (67%) │ 799ms (9.6%) │
  301. 766.83 s gammaloop-nextest-integration> │ 1L_ppmm │ GL4 │ 11 │ 519ms (6.4%) │ 1.40s (17%) │ 5.46s (67%) │ 760ms (9.3%) │
  302. 766.83 s gammaloop-nextest-integration> ├───────────┼───────┼─────────┼──────────────┼─────────────┼────────────────┼──────────────┤
  303. 766.83 s gammaloop-nextest-integration> │ Total │ │ 37 │ 1.57s (6.3%) │ 4.45s (18%) │ 16.39s (66%) │ 2.43s (9.8%) │
  304. 766.83 s gammaloop-nextest-integration> ╰───────────┴───────┴─────────┴──────────────┴─────────────┴────────────────┴──────────────╯
  305. 766.83 s gammaloop-nextest-integration> [2026-09-06 07:59:44.858] @gammaloop_api::se... INFO : Running command import model sm-default.json
  306. 766.83 s gammaloop-nextest-integration> [2026-09-06 07:59:44.858] @import::model INFO : Loading built-in JSON model sm-default
  307. 766.83 s gammaloop-nextest-integration> [2026-09-06 07:59:44.879] @gammalooprs::model INFO : The following 11 external parameters were forced to zero by the restriction card:
  308. 766.83 s gammaloop-nextest-integration> lamWS, AWS, rhoWS, etaWS, ymc, yme, ymm, MC, Me, MM, WTau
  309. 766.83 s gammaloop-nextest-integration> [2026-09-06 07:59:44.879] @gammalooprs::model INFO : The following 34 vertex rules were removed by the restriction card:
  310. 766.83 s gammaloop-nextest-integration> V_82 -> (c~, d, G+) | V_83 -> (t~, d, G+) | V_84 -> (c~, s, G+) | V_85 -> (t~, s, G+) | V_86 -> (u~, b, G+) | V_87 -> (c~, b, G+) | V_90 -> (c~, d, W+) | V_91 -> (t~, d, W+) | V_92 -> (u~, s, W+) | V_94 -> (t~, s, W+) | V_95 -> (u~, b, W+) | V_96 -> (c~, b, W+) | V_101 -> (e+, e-, G0) | V_102 -> (mu+, mu-, G0) | V_104 -> (e+, e-, H) | V_105 -> (mu+, mu-, H) | V_110 -> (ve~, e-, G+) | V_111 -> (vm~, mu-, G+) | V_116 -> (b~, u, G-) | V_117 -> (d~, c, G-) | V_118 -> (s~, c, G-) | V_119 -> (b~, c, G-) | V_120 -> (d~, t, G-) | V_121 -> (s~, t, G-) | V_124 -> (s~, u, W-) | V_125 -> (b~, u, W-) | V_126 -> (d~, c, W-) | V_128 -> (b~, c, W-) | V_129 -> (d~, t, W-) | V_130 -> (s~, t, W-) | V_138 -> (c~, c, G0) | V_140 -> (c~, c, H) | V_145 -> (e+, ve, G-) | V_146 -> (mu+, vm, G-)
  311. 766.83 s gammaloop-nextest-integration> [2026-09-06 07:59:44.879] @gammalooprs::model INFO : The following 36 couplings were removed by the restriction card:
  312. 766.83 s gammaloop-nextest-integration> GC_13, GC_14, GC_16, GC_17, GC_18, GC_19, GC_20, GC_22, GC_23, GC_24, GC_25, GC_26, GC_28, GC_29, GC_42, GC_43, GC_44, GC_46, GC_47, GC_48, GC_84, GC_85, GC_86, GC_87, GC_88, GC_89, GC_90, GC_91, GC_92, GC_93, GC_101, GC_102, GC_103, GC_105, GC_106, GC_107
  313. 766.83 s gammaloop-nextest-integration> [2026-09-06 07:59:44.880] @gammaloop_api::se... INFO : Running command run set_model_parameters
  314. 766.83 s gammaloop-nextest-integration> [2026-09-06 07:59:44.880] @gammaloop_api::se... INFO : Starting command block set_model_parameters
  315. 766.83 s gammaloop-nextest-integration> [2026-09-06 07:59:44.880] @gammaloop_api::se... INFO : Running command set model MT=173.0
  316. 766.83 s gammaloop-nextest-integration> [2026-09-06 07:59:44.883] @gammaloop_api::se... INFO : Running command set model WT=0.0
  317. 766.83 s gammaloop-nextest-integration> [2026-09-06 07:59:44.887] @gammaloop_api::se... INFO : Running command set model ymt=173.0
  318. 766.83 s gammaloop-nextest-integration> [2026-09-06 07:59:44.890] @gammaloop_api::se... INFO : Running command set model aS=0.118
  319. 766.83 s gammaloop-nextest-integration> [2026-09-06 07:59:44.894] @gammaloop_api::se... INFO : Running command set model aEWM1=137.036
  320. 766.83 s gammaloop-nextest-integration> [2026-09-06 07:59:44.897] @gammaloop_api::se... INFO : Running command set model Gf=1.166390e-05
  321. 766.83 s gammaloop-nextest-integration> [2026-09-06 07:59:44.900] @gammaloop_api::se... INFO : Running command set model MZ=91.188
  322. 766.83 s gammaloop-nextest-integration> [2026-09-06 07:59:44.904] @gammaloop_api::se... INFO : Running command set global string '
  323. 766.83 s gammaloop-nextest-integration> [global.generation.compile]
  324. 766.83 s gammaloop-nextest-integration> compilation_mode = "assembly"
  325. 766.83 s gammaloop-nextest-integration> optimization_level = "O0"
  326. 766.83 s gammaloop-nextest-integration> fast_math = false
  327. 766.83 s gammaloop-nextest-integration> [...]
  328. 766.83 s gammaloop-nextest-integration> [2026-09-06 07:59:44.905] @gammaloop_api::se... INFO : Running command import graphs ./examples/cli/aa_aa/1L/aa_aa_1L.dot -p aa_aa_all_helicities_assembly -i 1L_ppmm -o
  329. 766.83 s gammaloop-nextest-integration> [2026-09-06 07:59:44.905] @commands::import INFO : Loading graphs from '/build/source/examples/cli/aa_aa/1L/aa_aa_1L.dot'
  330. 766.83 s gammaloop-nextest-integration> [2026-09-06 07:59:44.912] @gammaloop_api::se... INFO : Running command generate existing -p aa_aa_all_helicities_assembly
  331. 766.83 s gammaloop-nextest-integration> [2026-09-06 08:00:07.227] @processes::amplitude INFO : Compiling amplitude 1L_ppmm
  332. 766.83 s gammaloop-nextest-integration> [2026-09-06 08:00:25.499] @commands::generate INFO : Removed 34 generated C++ source file(s). Use '--keep-sources' to keep them.
  333. 766.83 s gammaloop-nextest-integration> [2026-09-06 08:00:25.499] @commands::generate INFO :
  334. 766.83 s gammaloop-nextest-integration> Integrand generation summary
  335. 766.83 s gammaloop-nextest-integration> peak RAM 2.24 GiB | cores 1
  336. 766.83 s gammaloop-nextest-integration> ╭───────────┬───────┬─────────┬──────────────┬─────────────┬────────────────┬──────────────╮
  337. 766.83 s gammaloop-nextest-integration> │ integrand │ graph │ # evals │ expr build │ spenso │ symbolica eval │ compile │
  338. 766.83 s gammaloop-nextest-integration> ├───────────┼───────┼─────────┼──────────────┼─────────────┼────────────────┼──────────────┤
  339. 766.83 s gammaloop-nextest-integration> │ 1L_ppmm │ GL0 │ 13 │ 485ms (3.5%) │ 1.39s (10%) │ 5.48s (40%) │ 6.50s (47%) │
  340. 766.83 s gammaloop-nextest-integration> │ 1L_ppmm │ GL2 │ 13 │ 500ms (3.6%) │ 1.44s (11%) │ 5.47s (40%) │ 6.30s (46%) │
  341. 766.83 s gammaloop-nextest-integration> │ 1L_ppmm │ GL4 │ 11 │ 486ms (3.7%) │ 1.43s (11%) │ 5.60s (43%) │ 5.46s (42%) │
  342. 766.83 s gammaloop-nextest-integration> ├───────────┼───────┼─────────┼──────────────┼─────────────┼────────────────┼──────────────┤
  343. 766.83 s gammaloop-nextest-integration> │ Total │ │ 37 │ 1.47s (3.6%) │ 4.26s (11%) │ 16.55s (41%) │ 18.26s (45%) │
  344. 766.83 s gammaloop-nextest-integration> ╰───────────┴───────┴─────────┴──────────────┴─────────────┴────────────────┴──────────────╯
  345. 766.83 s gammaloop-nextest-integration> [2026-09-06 08:00:26.109] @gammaloop_api::se... INFO : Running command set process -p aa_aa_all_helicities -i 1L_ppmm string '
  346. 766.83 s gammaloop-nextest-integration> [stability]
  347. 766.83 s gammaloop-nextest-integration> check_on_norm = true
  348. 766.83 s gammaloop-nextest-integration> escalate_if_exact_zero = false
  349. 766.83 s gammaloop-nextest-integration> loop_momenta_norm_escalation_factor = -1.0
  350. 766.83 s gammaloop-nextest-integration> [...]
  351. 766.83 s gammaloop-nextest-integration> [2026-09-06 08:00:26.110] @gammaloop_api::se... INFO : Running command set process -p aa_aa_all_helicities_assembly -i 1L_ppmm string '
  352. 766.83 s gammaloop-nextest-integration> [stability]
  353. 766.83 s gammaloop-nextest-integration> check_on_norm = true
  354. 766.83 s gammaloop-nextest-integration> escalate_if_exact_zero = false
  355. 766.83 s gammaloop-nextest-integration> loop_momenta_norm_escalation_factor = -1.0
  356. 766.83 s gammaloop-nextest-integration> [...]
  357. 766.83 s gammaloop-nextest-integration> [2026-09-06 08:00:26.111] @gammaloop_api::se... INFO : Running command set process -p aa_aa_all_helicities -i 1L_mpmm string '
  358. 766.83 s gammaloop-nextest-integration> [stability]
  359. 766.83 s gammaloop-nextest-integration> check_on_norm = true
  360. 766.83 s gammaloop-nextest-integration> escalate_if_exact_zero = false
  361. 766.83 s gammaloop-nextest-integration> loop_momenta_norm_escalation_factor = -1.0
  362. 766.83 s gammaloop-nextest-integration> [...]
  363. 766.83 s gammaloop-nextest-integration> [2026-09-06 08:00:26.112] @gammaloop_api::se... INFO : Running command set process -p aa_aa_all_helicities_assembly -i 1L_mpmm string '
  364. 766.83 s gammaloop-nextest-integration> [stability]
  365. 766.83 s gammaloop-nextest-integration> check_on_norm = true
  366. 766.83 s gammaloop-nextest-integration> escalate_if_exact_zero = false
  367. 766.83 s gammaloop-nextest-integration> loop_momenta_norm_escalation_factor = -1.0
  368. 766.83 s gammaloop-nextest-integration> [...]
  369. 766.83 s gammaloop-nextest-integration> [2026-09-06 08:00:26.112] @gammaloop_api::se... INFO : Running command set process -p aa_aa_all_helicities -i 1L_mmmm string '
  370. 766.83 s gammaloop-nextest-integration> [stability]
  371. 766.83 s gammaloop-nextest-integration> check_on_norm = true
  372. 766.83 s gammaloop-nextest-integration> escalate_if_exact_zero = false
  373. 766.83 s gammaloop-nextest-integration> loop_momenta_norm_escalation_factor = -1.0
  374. 766.83 s gammaloop-nextest-integration> [...]
  375. 766.83 s gammaloop-nextest-integration> [2026-09-06 08:00:26.113] @gammaloop_api::se... INFO : Running command set process -p aa_aa_all_helicities_assembly -i 1L_mmmm string '
  376. 766.83 s gammaloop-nextest-integration> [stability]
  377. 766.83 s gammaloop-nextest-integration> check_on_norm = true
  378. 766.83 s gammaloop-nextest-integration> escalate_if_exact_zero = false
  379. 766.83 s gammaloop-nextest-integration> loop_momenta_norm_escalation_factor = -1.0
  380. 766.83 s gammaloop-nextest-integration> [...]
  381. 766.83 s gammaloop-nextest-integration> [2026-09-06 08:00:26.114] @gammaloop_api::se... INFO : Running command set process -p aa_aa_all_helicities -i 1L_pmmp string '
  382. 766.83 s gammaloop-nextest-integration> [stability]
  383. 766.83 s gammaloop-nextest-integration> check_on_norm = true
  384. 766.83 s gammaloop-nextest-integration> escalate_if_exact_zero = false
  385. 766.83 s gammaloop-nextest-integration> loop_momenta_norm_escalation_factor = -1.0
  386. 766.83 s gammaloop-nextest-integration> [...]
  387. 766.83 s gammaloop-nextest-integration> [2026-09-06 08:00:26.114] @gammaloop_api::se... INFO : Running command set process -p aa_aa_all_helicities_assembly -i 1L_pmmp string '
  388. 766.83 s gammaloop-nextest-integration> [stability]
  389. 766.83 s gammaloop-nextest-integration> check_on_norm = true
  390. 766.83 s gammaloop-nextest-integration> escalate_if_exact_zero = false
  391. 766.83 s gammaloop-nextest-integration> loop_momenta_norm_escalation_factor = -1.0
  392. 766.83 s gammaloop-nextest-integration> [...]
  393. 766.83 s gammaloop-nextest-integration> [2026-09-06 08:00:26.115] @gammaloop_api::se... INFO : Running command set process -p aa_aa_all_helicities -i 1L_pmpm string '
  394. 766.83 s gammaloop-nextest-integration> [stability]
  395. 766.83 s gammaloop-nextest-integration> check_on_norm = true
  396. 766.83 s gammaloop-nextest-integration> escalate_if_exact_zero = false
  397. 766.83 s gammaloop-nextest-integration> loop_momenta_norm_escalation_factor = -1.0
  398. 766.83 s gammaloop-nextest-integration> [...]
  399. 766.83 s gammaloop-nextest-integration> [2026-09-06 08:00:26.116] @gammaloop_api::se... INFO : Running command set process -p aa_aa_all_helicities_assembly -i 1L_pmpm string '
  400. 766.83 s gammaloop-nextest-integration> [stability]
  401. 766.83 s gammaloop-nextest-integration> check_on_norm = true
  402. 766.83 s gammaloop-nextest-integration> escalate_if_exact_zero = false
  403. 766.83 s gammaloop-nextest-integration> loop_momenta_norm_escalation_factor = -1.0
  404. 766.83 s gammaloop-nextest-integration> [...]
  405. 766.83 s gammaloop-nextest-integration> [2026-09-06 08:00:26.120] @process::amplitude INFO : Input is below threshold: 0 existing threshold E-surfaces across 0/1 graph groups
  406. 766.83 s gammaloop-nextest-integration> [2026-09-06 08:00:26.120] @process::amplitude INFO : overlap structure of group 0: [0: []]
  407. 766.83 s gammaloop-nextest-integration> [2026-09-06 08:00:26.121] @integrands::process [{#im_is_nan, #re_is_nan}] WARNING : final process evaluation is nonfinite
  408. 766.83 s gammaloop-nextest-integration> [2026-09-06 08:00:26.121] @commands::inspect INFO :
  409. 766.83 s gammaloop-nextest-integration> Input point in momentum space:
  410. 766.83 s gammaloop-nextest-integration>
  411. 766.83 s gammaloop-nextest-integration> ( 0.1100000000000000, -0.0700000000000000, 0.1900000000000000 )
  412. 766.83 s gammaloop-nextest-integration>
  413. 766.83 s gammaloop-nextest-integration> The evaluation of integrand '1L_ppmm' is:
  414. 766.83 s gammaloop-nextest-integration>
  415. 766.83 s gammaloop-nextest-integration> ( +0.0000000000000000e0, +0.0000000000000000e0 i)
  416. 766.83 s gammaloop-nextest-integration>
  417. 766.83 s gammaloop-nextest-integration> [2026-09-06 08:00:26.124] @process::amplitude INFO : Input is below threshold: 0 existing threshold E-surfaces across 0/1 graph groups
  418. 766.83 s gammaloop-nextest-integration> [2026-09-06 08:00:26.124] @process::amplitude INFO : overlap structure of group 0: [0: []]
  419. 766.83 s gammaloop-nextest-integration> [2026-09-06 08:00:26.125] @commands::inspect INFO :
  420. 766.83 s gammaloop-nextest-integration> Input point in momentum space:
  421. 766.83 s gammaloop-nextest-integration>
  422. 766.83 s gammaloop-nextest-integration> ( 0.1100000000000000, -0.0700000000000000, 0.1900000000000000 )
  423. 766.83 s gammaloop-nextest-integration>
  424. 766.83 s gammaloop-nextest-integration> The evaluation of integrand '1L_ppmm' is:
  425. 766.83 s gammaloop-nextest-integration>
  426. 766.83 s gammaloop-nextest-integration> ( -1.7132462539328486e-28, -8.7105072229446864e-10 i)
  427. 766.83 s gammaloop-nextest-integration>
  428. 766.83 s gammaloop-nextest-integration> The application panicked (crashed).
  429. 766.83 s gammaloop-nextest-integration> Message: kinematics=a, integrand=1L_ppmm, graph_id=0: assembly vs symjit inspect: actual=(-0.00000000000000000000000000017132462539328486+-0.0000000008710507222944686i), expected=(0+0i), tolerance=0.0000000001
  430. 766.83 s gammaloop-nextest-integration> Location: tests/tests/test_runs/utils.rs:466
  431. 766.83 s gammaloop-nextest-integration>
  432. 766.83 s gammaloop-nextest-integration> ━━━━━━━━━━━━━━━━━━━━━━━━━━━━━━━━━━ BACKTRACE ━━━━━━━━━━━━━━━━━━━━━━━━━━━━━━━━━━━
  433. 766.83 s gammaloop-nextest-integration> 1: <color_eyre[51793ea62743adbd]::config::PanicHook>::panic_report<unknown>
  434. 766.83 s gammaloop-nextest-integration> at <unknown source file>:<unknown line>
  435. 766.83 s gammaloop-nextest-integration> 2: <color_eyre[51793ea62743adbd]::config::PanicHook>::into_panic_hook::{closure#0}<unknown>
  436. 766.83 s gammaloop-nextest-integration> at <unknown source file>:<unknown line>
  437. 766.83 s gammaloop-nextest-integration> 3: std[bcb96dfbba0ab899]::panicking::panic_with_hook<unknown>
  438. 766.83 s gammaloop-nextest-integration> at <unknown source file>:<unknown line>
  439. 766.83 s gammaloop-nextest-integration> 4: std[bcb96dfbba0ab899]::panicking::panic_handler::{closure#0}<unknown>
  440. 766.83 s gammaloop-nextest-integration> at <unknown source file>:<unknown line>
  441. 766.83 s gammaloop-nextest-integration> 5: std[bcb96dfbba0ab899]::sys::backtrace::__rust_end_short_backtrace::<std[bcb96dfbba0ab899]::panicking::panic_handler::{closure#0}, !><unknown>
  442. 766.83 s gammaloop-nextest-integration> at <unknown source file>:<unknown line>
  443. 766.83 s gammaloop-nextest-integration> 6: __rustc[6c289b9f9c454d21]::rust_begin_unwind<unknown>
  444. 766.83 s gammaloop-nextest-integration> at <unknown source file>:<unknown line>
  445. 766.83 s gammaloop-nextest-integration> 7: core[940e698046960fd5]::panicking::panic_fmt<unknown>
  446. 766.83 s gammaloop-nextest-integration> at <unknown source file>:<unknown line>
  447. 766.83 s gammaloop-nextest-integration> 8: <test_runs[66584badfeb6c7be]::aa_aa::important::aa_aa_local_inspect_backend_consistency::{closure#0} as core[940e698046960fd5]::ops::function::FnOnce<()>>::call_once<unknown>
  448. 766.83 s gammaloop-nextest-integration> at <unknown source file>:<unknown line>
  449. 766.83 s gammaloop-nextest-integration> 9: serial_test[cd99724524a2f1c0]::serial_code_lock::local_serial_core_with_return::<(), eyre[cb2fd339c0c40fca]::Report><unknown>
  450. 766.83 s gammaloop-nextest-integration> at <unknown source file>:<unknown line>
  451. 766.83 s gammaloop-nextest-integration> 10: <test_runs[66584badfeb6c7be]::aa_aa::important::aa_aa_local_inspect_backend_consistency::{closure#0} as core[940e698046960fd5]::ops::function::FnOnce<()>>::call_once<unknown>
  452. 766.83 s gammaloop-nextest-integration> at <unknown source file>:<unknown line>
  453. 766.83 s gammaloop-nextest-integration> 11: test[75d6903177b1d7e9]::__rust_begin_short_backtrace::<core[940e698046960fd5]::result::Result<(), alloc[2ea6bcb46fca0c42]::string::String>, fn() -> core[940e698046960fd5]::result::Result<(), alloc[2ea6bcb46fca0c42]::string::String>><unknown>
  454. 766.83 s gammaloop-nextest-integration> at <unknown source file>:<unknown line>
  455. 766.83 s gammaloop-nextest-integration> 12: test[75d6903177b1d7e9]::run_test::{closure#0}<unknown>
  456. 766.83 s gammaloop-nextest-integration> at <unknown source file>:<unknown line>
  457. 766.83 s gammaloop-nextest-integration> 13: std[bcb96dfbba0ab899]::sys::backtrace::__rust_begin_short_backtrace::<test[75d6903177b1d7e9]::run_test::{closure#1}, ()><unknown>
  458. 766.83 s gammaloop-nextest-integration> at <unknown source file>:<unknown line>
  459. 766.83 s gammaloop-nextest-integration> 14: <std[bcb96dfbba0ab899]::thread::lifecycle::spawn_unchecked<test[75d6903177b1d7e9]::run_test::{closure#1}, ()>::{closure#1} as core[940e698046960fd5]::ops::function::FnOnce<()>>::call_once::{shim:vtable#0}<unknown>
  460. 766.83 s gammaloop-nextest-integration> at <unknown source file>:<unknown line>
  461. 766.83 s gammaloop-nextest-integration> 15: <std[bcb96dfbba0ab899]::sys::thread::unix::Thread>::new::thread_start<unknown>
  462. 766.83 s gammaloop-nextest-integration> at <unknown source file>:<unknown line>
  463. 766.83 s gammaloop-nextest-integration> 16: start_thread<unknown>
  464. 766.83 s gammaloop-nextest-integration> at <unknown source file>:<unknown line>
  465. 766.83 s gammaloop-nextest-integration> 17: __clone3<unknown>
  466. 766.83 s gammaloop-nextest-integration> at <unknown source file>:<unknown line>
  467. 766.83 s gammaloop-nextest-integration>
  468. 766.83 s gammaloop-nextest-integration> Run with COLORBT_SHOW_HIDDEN=1 environment variable to disable frame filtering.
  469. 766.83 s gammaloop-nextest-integration> Run with RUST_BACKTRACE=full to include source snippets.
  470. 766.83 s gammaloop-nextest-integration>
  471. 767.09 s gammaloop-nextest-integration> error: test run failed
  472. 767.12 s gammaloop-nextest-integration>
  473. 767.12 s gammaloop-nextest-integration> ========== nextest test summary ==========
  474. 767.12 s gammaloop-nextest-integration> report: target/nextest/ci_gammaloop/junit.xml
  475. 767.12 s gammaloop-nextest-integration> tests: 152, failures: 1, errors: 0
  476. 767.12 s gammaloop-nextest-integration>
  477. 767.12 s gammaloop-nextest-integration> 1. gammaloop-integration-tests::test_runs::aa_aa::important::aa_aa_local_inspect_backend_consistency
  478. 767.12 s gammaloop-nextest-integration> failure: test failure with exit code 101
  479. 767.12 s gammaloop-nextest-integration> system-out
  480. 767.12 s gammaloop-nextest-integration> running 1 test
  481. 767.12 s gammaloop-nextest-integration> test aa_aa::important::aa_aa_local_inspect_backend_consistency has been running for over 60 seconds
  482. 767.12 s gammaloop-nextest-integration> test aa_aa::important::aa_aa_local_inspect_backend_consistency ... FAILED
  483. 767.12 s gammaloop-nextest-integration>
  484. 767.12 s gammaloop-nextest-integration> failures:
  485. 767.12 s gammaloop-nextest-integration>
  486. 767.12 s gammaloop-nextest-integration> failures:
  487. 767.12 s gammaloop-nextest-integration> aa_aa::important::aa_aa_local_inspect_backend_consistency
  488. 767.12 s gammaloop-nextest-integration>
  489. 767.12 s gammaloop-nextest-integration> test result: FAILED. 0 passed; 1 failed; 0 ignored; 0 measured; 258 filtered out; finished in 67.33s
  490. 767.12 s gammaloop-nextest-integration> system-err
  491. 767.12 s gammaloop-nextest-integration> [2026-09-06 07:59:19.222] @gammaloop_api::se... INFO : Running command import model sm-default.json
  492. 767.12 s gammaloop-nextest-integration> [2026-09-06 07:59:19.222] @import::model INFO : Loading built-in JSON model sm-default
  493. 767.12 s gammaloop-nextest-integration> [2026-09-06 07:59:19.243] @gammalooprs::model INFO : The following 11 external parameters were forced to zero by the restriction card:
  494. 767.12 s gammaloop-nextest-integration> lamWS, AWS, rhoWS, etaWS, ymc, yme, ymm, MC, Me, MM, WTau
  495. 767.12 s gammaloop-nextest-integration> [2026-09-06 07:59:19.243] @gammalooprs::model INFO : The following 34 vertex rules were removed by the restriction card:
  496. 767.12 s gammaloop-nextest-integration> V_82 -> (c~, d, G+) | V_83 -> (t~, d, G+) | V_84 -> (c~, s, G+) | V_85 -> (t~, s, G+) | V_86 -> (u~, b, G+) | V_87 -> (c~, b, G+) | V_90 -> (c~, d, W+) | V_91 -> (t~, d, W+) | V_92 -> (u~, s, W+) | V_94 -> (t~, s, W+) | V_95 -> (u~, b, W+) | V_96 -> (c~, b, W+) | V_101 -> (e+, e-, G0) | V_102 -> (mu+, mu-, G0) | V_104 -> (e+, e-, H) | V_105 -> (mu+, mu-, H) | V_110 -> (ve~, e-, G+) | V_111 -> (vm~, mu-, G+) | V_116 -> (b~, u, G-) | V_117 -> (d~, c, G-) | V_118 -> (s~, c, G-) | V_119 -> (b~, c, G-) | V_120 -> (d~, t, G-) | V_121 -> (s~, t, G-) | V_124 -> (s~, u, W-) | V_125 -> (b~, u, W-) | V_126 -> (d~, c, W-) | V_128 -> (b~, c, W-) | V_129 -> (d~, t, W-) | V_130 -> (s~, t, W-) | V_138 -> (c~, c, G0) | V_140 -> (c~, c, H) | V_145 -> (e+, ve, G-) | V_146 -> (mu+, vm, G-)
  497. 767.12 s gammaloop-nextest-integration> [2026-09-06 07:59:19.243] @gammalooprs::model INFO : The following 36 couplings were removed by the restriction card:
  498. 767.12 s gammaloop-nextest-integration> GC_13, GC_14, GC_16, GC_17, GC_18, GC_19, GC_20, GC_22, GC_23, GC_24, GC_25, GC_26, GC_28, GC_29, GC_42, GC_43, GC_44, GC_46, GC_47, GC_48, GC_84, GC_85, GC_86, GC_87, GC_88, GC_89, GC_90, GC_91, GC_92, GC_93, GC_101, GC_102, GC_103, GC_105, GC_106, GC_107
  499. 767.12 s gammaloop-nextest-integration> [2026-09-06 07:59:19.243] @gammaloop_api::se... INFO : Running command run set_model_parameters
  500. 767.12 s gammaloop-nextest-integration> [2026-09-06 07:59:19.243] @gammaloop_api::se... INFO : Starting command block set_model_parameters
  501. 767.12 s gammaloop-nextest-integration> [2026-09-06 07:59:19.244] @gammaloop_api::se... INFO : Running command set model MT=173.0
  502. 767.12 s gammaloop-nextest-integration> [2026-09-06 07:59:19.247] @gammaloop_api::se... INFO : Running command set model WT=0.0
  503. 767.12 s gammaloop-nextest-integration> [2026-09-06 07:59:19.251] @gammaloop_api::se... INFO : Running command set model ymt=173.0
  504. 767.12 s gammaloop-nextest-integration> [2026-09-06 07:59:19.255] @gammaloop_api::se... INFO : Running command set model aS=0.118
  505. 767.12 s gammaloop-nextest-integration> [2026-09-06 07:59:19.258] @gammaloop_api::se... INFO : Running command set model aEWM1=137.036
  506. 767.12 s gammaloop-nextest-integration> [2026-09-06 07:59:19.262] @gammaloop_api::se... INFO : Running command set model Gf=1.166390e-05
  507. 767.12 s gammaloop-nextest-integration> [2026-09-06 07:59:19.265] @gammaloop_api::se... INFO : Running command set model MZ=91.188
  508. 767.12 s gammaloop-nextest-integration> [2026-09-06 07:59:19.269] @gammaloop_api::se... INFO : Running command set global string '
  509. 767.12 s gammaloop-nextest-integration> [global.generation.compile]
  510. 767.12 s gammaloop-nextest-integration> compilation_mode = "symjit"
  511. 767.12 s gammaloop-nextest-integration> optimization_level = "O0"
  512. 767.12 s gammaloop-nextest-integration> fast_math = false
  513. 767.12 s gammaloop-nextest-integration> [...]
  514. 767.12 s gammaloop-nextest-integration> [2026-09-06 07:59:19.270] @gammaloop_api::se... INFO : Running command import graphs ./examples/cli/aa_aa/1L/aa_aa_1L.dot -p aa_aa_all_helicities -i 1L_ppmm -o
  515. 767.12 s gammaloop-nextest-integration> [2026-09-06 07:59:19.270] @commands::import INFO : Loading graphs from '/build/source/examples/cli/aa_aa/1L/aa_aa_1L.dot'
  516. 767.12 s gammaloop-nextest-integration> [2026-09-06 07:59:19.279] @gammaloop_api::se... INFO : Running command generate existing -p aa_aa_all_helicities
  517. 767.12 s gammaloop-nextest-integration> [2026-09-06 07:59:44.213] @commands::generate INFO :
  518. 767.12 s gammaloop-nextest-integration> Integrand generation summary
  519. 767.12 s gammaloop-nextest-integration> peak RAM 1.10 GiB | cores 1
  520. 767.12 s gammaloop-nextest-integration> ╭───────────┬───────┬─────────┬──────────────┬─────────────┬────────────────┬──────────────╮
  521. 767.12 s gammaloop-nextest-integration> │ integrand │ graph │ # evals │ expr build │ spenso │ symbolica eval │ compile │
  522. 767.12 s gammaloop-nextest-integration> ├───────────┼───────┼─────────┼──────────────┼─────────────┼────────────────┼──────────────┤
  523. 767.12 s gammaloop-nextest-integration> │ 1L_ppmm │ GL0 │ 13 │ 521ms (6.2%) │ 1.61s (19%) │ 5.40s (64%) │ 866ms (10%) │
  524. 767.12 s gammaloop-nextest-integration> │ 1L_ppmm │ GL2 │ 13 │ 524ms (6.3%) │ 1.43s (17%) │ 5.53s (67%) │ 799ms (9.6%) │
  525. 767.12 s gammaloop-nextest-integration> │ 1L_ppmm │ GL4 │ 11 │ 519ms (6.4%) │ 1.40s (17%) │ 5.46s (67%) │ 760ms (9.3%) │
  526. 767.12 s gammaloop-nextest-integration> ├───────────┼───────┼─────────┼──────────────┼─────────────┼────────────────┼──────────────┤
  527. 767.12 s gammaloop-nextest-integration> │ Total │ │ 37 │ 1.57s (6.3%) │ 4.45s (18%) │ 16.39s (66%) │ 2.43s (9.8%) │
  528. 767.12 s gammaloop-nextest-integration> ╰───────────┴───────┴─────────┴──────────────┴─────────────┴────────────────┴──────────────╯
  529. 767.12 s gammaloop-nextest-integration> [2026-09-06 07:59:44.858] @gammaloop_api::se... INFO : Running command import model sm-default.json
  530. 767.12 s gammaloop-nextest-integration> [2026-09-06 07:59:44.858] @import::model INFO : Loading built-in JSON model sm-default
  531. 767.12 s gammaloop-nextest-integration> [2026-09-06 07:59:44.879] @gammalooprs::model INFO : The following 11 external parameters were forced to zero by the restriction card:
  532. 767.12 s gammaloop-nextest-integration> lamWS, AWS, rhoWS, etaWS, ymc, yme, ymm, MC, Me, MM, WTau
  533. 767.12 s gammaloop-nextest-integration> [2026-09-06 07:59:44.879] @gammalooprs::model INFO : The following 34 vertex rules were removed by the restriction card:
  534. 767.12 s gammaloop-nextest-integration> V_82 -> (c~, d, G+) | V_83 -> (t~, d, G+) | V_84 -> (c~, s, G+) | V_85 -> (t~, s, G+) | V_86 -> (u~, b, G+) | V_87 -> (c~, b, G+) | V_90 -> (c~, d, W+) | V_91 -> (t~, d, W+) | V_92 -> (u~, s, W+) | V_94 -> (t~, s, W+) | V_95 -> (u~, b, W+) | V_96 -> (c~, b, W+) | V_101 -> (e+, e-, G0) | V_102 -> (mu+, mu-, G0) | V_104 -> (e+, e-, H) | V_105 -> (mu+, mu-, H) | V_110 -> (ve~, e-, G+) | V_111 -> (vm~, mu-, G+) | V_116 -> (b~, u, G-) | V_117 -> (d~, c, G-) | V_118 -> (s~, c, G-) | V_119 -> (b~, c, G-) | V_120 -> (d~, t, G-) | V_121 -> (s~, t, G-) | V_124 -> (s~, u, W-) | V_125 -> (b~, u, W-) | V_126 -> (d~, c, W-) | V_128 -> (b~, c, W-) | V_129 -> (d~, t, W-) | V_130 -> (s~, t, W-) | V_138 -> (c~, c, G0) | V_140 -> (c~, c, H) | V_145 -> (e+, ve, G-) | V_146 -> (mu+, vm, G-)
  535. 767.12 s gammaloop-nextest-integration> [2026-09-06 07:59:44.879] @gammalooprs::model INFO : The following 36 couplings were removed by the restriction card:
  536. 767.12 s gammaloop-nextest-integration> GC_13, GC_14, GC_16, GC_17, GC_18, GC_19, GC_20, GC_22, GC_23, GC_24, GC_25, GC_26, GC_28, GC_29, GC_42, GC_43, GC_44, GC_46, GC_47, GC_48, GC_84, GC_85, GC_86, GC_87, GC_88, GC_89, GC_90, GC_91, GC_92, GC_93, GC_101, GC_102, GC_103, GC_105, GC_106, GC_107
  537. 767.12 s gammaloop-nextest-integration> [2026-09-06 07:59:44.880] @gammaloop_api::se... INFO : Running command run set_model_parameters
  538. 767.12 s gammaloop-nextest-integration> [2026-09-06 07:59:44.880] @gammaloop_api::se... INFO : Starting command block set_model_parameters
  539. 767.12 s gammaloop-nextest-integration> [2026-09-06 07:59:44.880] @gammaloop_api::se... INFO : Running command set model MT=173.0
  540. 767.12 s gammaloop-nextest-integration> [2026-09-06 07:59:44.883] @gammaloop_api::se... INFO : Running command set model WT=0.0
  541. 767.12 s gammaloop-nextest-integration> [2026-09-06 07:59:44.887] @gammaloop_api::se... INFO : Running command set model ymt=173.0
  542. 767.12 s gammaloop-nextest-integration> [2026-09-06 07:59:44.890] @gammaloop_api::se... INFO : Running command set model aS=0.118
  543. 767.12 s gammaloop-nextest-integration> [2026-09-06 07:59:44.894] @gammaloop_api::se... INFO : Running command set model aEWM1=137.036
  544. 767.12 s gammaloop-nextest-integration> [2026-09-06 07:59:44.897] @gammaloop_api::se... INFO : Running command set model Gf=1.166390e-05
  545. 767.12 s gammaloop-nextest-integration> [2026-09-06 07:59:44.900] @gammaloop_api::se... INFO : Running command set model MZ=91.188
  546. 767.12 s gammaloop-nextest-integration> [2026-09-06 07:59:44.904] @gammaloop_api::se... INFO : Running command set global string '
  547. 767.12 s gammaloop-nextest-integration> [global.generation.compile]
  548. 767.12 s gammaloop-nextest-integration> compilation_mode = "assembly"
  549. 767.12 s gammaloop-nextest-integration> optimization_level = "O0"
  550. 767.12 s gammaloop-nextest-integration> fast_math = false
  551. 767.12 s gammaloop-nextest-integration> [...]
  552. 767.12 s gammaloop-nextest-integration> [2026-09-06 07:59:44.905] @gammaloop_api::se... INFO : Running command import graphs ./examples/cli/aa_aa/1L/aa_aa_1L.dot -p aa_aa_all_helicities_assembly -i 1L_ppmm -o
  553. 767.12 s gammaloop-nextest-integration> [2026-09-06 07:59:44.905] @commands::import INFO : Loading graphs from '/build/source/examples/cli/aa_aa/1L/aa_aa_1L.dot'
  554. 767.12 s gammaloop-nextest-integration> [2026-09-06 07:59:44.912] @gammaloop_api::se... INFO : Running command generate existing -p aa_aa_all_helicities_assembly
  555. 767.12 s gammaloop-nextest-integration> [2026-09-06 08:00:07.227] @processes::amplitude INFO : Compiling amplitude 1L_ppmm
  556. 767.12 s gammaloop-nextest-integration> [2026-09-06 08:00:25.499] @commands::generate INFO : Removed 34 generated C++ source file(s). Use '--keep-sources' to keep them.
  557. 767.12 s gammaloop-nextest-integration> [2026-09-06 08:00:25.499] @commands::generate INFO :
  558. 767.12 s gammaloop-nextest-integration> Integrand generation summary
  559. 767.12 s gammaloop-nextest-integration> peak RAM 2.24 GiB | cores 1
  560. 767.12 s gammaloop-nextest-integration> ╭───────────┬───────┬─────────┬──────────────┬─────────────┬────────────────┬──────────────╮
  561. 767.12 s gammaloop-nextest-integration> │ integrand │ graph │ # evals │ expr build │ spenso │ symbolica eval │ compile │
  562. 767.12 s gammaloop-nextest-integration> ├───────────┼───────┼─────────┼──────────────┼─────────────┼────────────────┼──────────────┤
  563. 767.12 s gammaloop-nextest-integration> │ 1L_ppmm │ GL0 │ 13 │ 485ms (3.5%) │ 1.39s (10%) │ 5.48s (40%) │ 6.50s (47%) │
  564. 767.12 s gammaloop-nextest-integration> │ 1L_ppmm │ GL2 │ 13 │ 500ms (3.6%) │ 1.44s (11%) │ 5.47s (40%) │ 6.30s (46%) │
  565. 767.12 s gammaloop-nextest-integration> │ 1L_ppmm │ GL4 │ 11 │ 486ms (3.7%) │ 1.43s (11%) │ 5.60s (43%) │ 5.46s (42%) │
  566. 767.12 s gammaloop-nextest-integration> ├───────────┼───────┼─────────┼──────────────┼─────────────┼────────────────┼──────────────┤
  567. 767.12 s gammaloop-nextest-integration> │ Total │ │ 37 │ 1.47s (3.6%) │ 4.26s (11%) │ 16.55s (41%) │ 18.26s (45%) │
  568. 767.12 s gammaloop-nextest-integration> ╰───────────┴───────┴─────────┴──────────────┴─────────────┴────────────────┴──────────────╯
  569. 767.12 s gammaloop-nextest-integration> [2026-09-06 08:00:26.109] @gammaloop_api::se... INFO : Running command set process -p aa_aa_all_helicities -i 1L_ppmm string '
  570. 767.12 s gammaloop-nextest-integration> [stability]
  571. 767.12 s gammaloop-nextest-integration> check_on_norm = true
  572. 767.12 s gammaloop-nextest-integration> escalate_if_exact_zero = false
  573. 767.12 s gammaloop-nextest-integration> loop_momenta_norm_escalation_factor = -1.0
  574. 767.12 s gammaloop-nextest-integration> [...]
  575. 767.12 s gammaloop-nextest-integration> [2026-09-06 08:00:26.110] @gammaloop_api::se... INFO : Running command set process -p aa_aa_all_helicities_assembly -i 1L_ppmm string '
  576. 767.12 s gammaloop-nextest-integration> [stability]
  577. 767.12 s gammaloop-nextest-integration> check_on_norm = true
  578. 767.12 s gammaloop-nextest-integration> escalate_if_exact_zero = false
  579. 767.12 s gammaloop-nextest-integration> loop_momenta_norm_escalation_factor = -1.0
  580. 767.12 s gammaloop-nextest-integration> [...]
  581. 767.12 s gammaloop-nextest-integration> [2026-09-06 08:00:26.111] @gammaloop_api::se... INFO : Running command set process -p aa_aa_all_helicities -i 1L_mpmm string '
  582. 767.12 s gammaloop-nextest-integration> [stability]
  583. 767.12 s gammaloop-nextest-integration> check_on_norm = true
  584. 767.12 s gammaloop-nextest-integration> escalate_if_exact_zero = false
  585. 767.12 s gammaloop-nextest-integration> loop_momenta_norm_escalation_factor = -1.0
  586. 767.12 s gammaloop-nextest-integration> [...]
  587. 767.12 s gammaloop-nextest-integration> [2026-09-06 08:00:26.112] @gammaloop_api::se... INFO : Running command set process -p aa_aa_all_helicities_assembly -i 1L_mpmm string '
  588. 767.12 s gammaloop-nextest-integration> [stability]
  589. 767.12 s gammaloop-nextest-integration> check_on_norm = true
  590. 767.12 s gammaloop-nextest-integration> escalate_if_exact_zero = false
  591. 767.12 s gammaloop-nextest-integration> loop_momenta_norm_escalation_factor = -1.0
  592. 767.12 s gammaloop-nextest-integration> [...]
  593. 767.12 s gammaloop-nextest-integration> [2026-09-06 08:00:26.112] @gammaloop_api::se... INFO : Running command set process -p aa_aa_all_helicities -i 1L_mmmm string '
  594. 767.12 s gammaloop-nextest-integration> [stability]
  595. 767.12 s gammaloop-nextest-integration> check_on_norm = true
  596. 767.12 s gammaloop-nextest-integration> escalate_if_exact_zero = false
  597. 767.12 s gammaloop-nextest-integration> loop_momenta_norm_escalation_factor = -1.0
  598. 767.12 s gammaloop-nextest-integration> [...]
  599. 767.12 s gammaloop-nextest-integration> [2026-09-06 08:00:26.113] @gammaloop_api::se... INFO : Running command set process -p aa_aa_all_helicities_assembly -i 1L_mmmm string '
  600. 767.12 s gammaloop-nextest-integration> [stability]
  601. 767.12 s gammaloop-nextest-integration> check_on_norm = true
  602. 767.12 s gammaloop-nextest-integration> escalate_if_exact_zero = false
  603. 767.12 s gammaloop-nextest-integration> loop_momenta_norm_escalation_factor = -1.0
  604. 767.12 s gammaloop-nextest-integration> [...]
  605. 767.12 s gammaloop-nextest-integration> [2026-09-06 08:00:26.114] @gammaloop_api::se... INFO : Running command set process -p aa_aa_all_helicities -i 1L_pmmp string '
  606. 767.12 s gammaloop-nextest-integration> [stability]
  607. 767.12 s gammaloop-nextest-integration> check_on_norm = true
  608. 767.12 s gammaloop-nextest-integration> escalate_if_exact_zero = false
  609. 767.12 s gammaloop-nextest-integration> loop_momenta_norm_escalation_factor = -1.0
  610. 767.12 s gammaloop-nextest-integration> ... omitted 84 more lines; see full nextest output above
  611. 767.12 s gammaloop-nextest-integration> =========================================
  612. 767.23 s error: Cannot build '/nix/store/xaf9bwgnrhpb0jrkx6mcwl1pfl8pk1ly-gammaloop-nextest-integration.drv'.
  613. 767.23 s Reason: builder failed with exit code 100.
  614. 767.23 s Output paths:
  615. 767.23 s /nix/store/nwjsprs0wh86kdyq96q44q9sagn61pgk-gammaloop-nextest-integration
  616. 767.23 s Last 586 log lines:
  617. 767.23 s > Extracting 13 binaries, 1 build script output directory, and 3 linked paths to /build/nextest-archive-qc6Wm1
  618. 767.23 s > Extracted 30 files to /build/nextest-archive-qc6Wm1 in 2.20s
  619. 767.23 s > ------------
  620. 767.23 s > Nextest run ID 444c8f1b-f9cd-476a-8808-57b11fabd3fc with nextest profile: ci_gammaloop
  621. 767.23 s > Starting 152 tests across 13 binaries (208 tests skipped, including 207 tests via profile.ci_gammaloop.default-filter)
  622. 767.23 s > FAIL [ 67.481s] ( 54/152) gammaloop-integration-tests::test_runs aa_aa::important::aa_aa_local_inspect_backend_consistency
  623. 767.23 s > stdout ---
  624. 767.23 s >
  625. 767.23 s > running 1 test
  626. 767.23 s > test aa_aa::important::aa_aa_local_inspect_backend_consistency has been running for over 60 seconds
  627. 767.23 s > test aa_aa::important::aa_aa_local_inspect_backend_consistency ... FAILED
  628. 767.23 s >
  629. 767.23 s > failures:
  630. 767.23 s >
  631. 767.23 s > failures:
  632. 767.23 s > aa_aa::important::aa_aa_local_inspect_backend_consistency
  633. 767.23 s >
  634. 767.23 s > test result: FAILED. 0 passed; 1 failed; 0 ignored; 0 measured; 258 filtered out; finished in 67.33s
  635. 767.23 s >
  636. 767.23 s > stderr ---
  637. 767.23 s > [2026-09-06 07:59:19.222] @gammaloop_api::se... INFO : Running command import model sm-default.json
  638. 767.23 s > [2026-09-06 07:59:19.222] @import::model INFO : Loading built-in JSON model sm-default
  639. 767.23 s > [2026-09-06 07:59:19.243] @gammalooprs::model INFO : The following 11 external parameters were forced to zero by the restriction card:
  640. 767.23 s > lamWS, AWS, rhoWS, etaWS, ymc, yme, ymm, MC, Me, MM, WTau
  641. 767.23 s > [2026-09-06 07:59:19.243] @gammalooprs::model INFO : The following 34 vertex rules were removed by the restriction card:
  642. 767.23 s > V_82 -> (c~, d, G+) | V_83 -> (t~, d, G+) | V_84 -> (c~, s, G+) | V_85 -> (t~, s, G+) | V_86 -> (u~, b, G+) | V_87 -> (c~, b, G+) | V_90 -> (c~, d, W+) | V_91 -> (t~, d, W+) | V_92 -> (u~, s, W+) | V_94 -> (t~, s, W+) | V_95 -> (u~, b, W+) | V_96 -> (c~, b, W+) | V_101 -> (e+, e-, G0) | V_102 -> (mu+, mu-, G0) | V_104 -> (e+, e-, H) | V_105 -> (mu+, mu-, H) | V_110 -> (ve~, e-, G+) | V_111 -> (vm~, mu-, G+) | V_116 -> (b~, u, G-) | V_117 -> (d~, c, G-) | V_118 -> (s~, c, G-) | V_119 -> (b~, c, G-) | V_120 -> (d~, t, G-) | V_121 -> (s~, t, G-) | V_124 -> (s~, u, W-) | V_125 -> (b~, u, W-) | V_126 -> (d~, c, W-) | V_128 -> (b~, c, W-) | V_129 -> (d~, t, W-) | V_130 -> (s~, t, W-) | V_138 -> (c~, c, G0) | V_140 -> (c~, c, H) | V_145 -> (e+, ve, G-) | V_146 -> (mu+, vm, G-)
  643. 767.23 s > [2026-09-06 07:59:19.243] @gammalooprs::model INFO : The following 36 couplings were removed by the restriction card:
  644. 767.23 s > GC_13, GC_14, GC_16, GC_17, GC_18, GC_19, GC_20, GC_22, GC_23, GC_24, GC_25, GC_26, GC_28, GC_29, GC_42, GC_43, GC_44, GC_46, GC_47, GC_48, GC_84, GC_85, GC_86, GC_87, GC_88, GC_89, GC_90, GC_91, GC_92, GC_93, GC_101, GC_102, GC_103, GC_105, GC_106, GC_107
  645. 767.23 s > [2026-09-06 07:59:19.243] @gammaloop_api::se... INFO : Running command run set_model_parameters
  646. 767.23 s > [2026-09-06 07:59:19.243] @gammaloop_api::se... INFO : Starting command block set_model_parameters
  647. 767.23 s > [2026-09-06 07:59:19.244] @gammaloop_api::se... INFO : Running command set model MT=173.0
  648. 767.23 s > [2026-09-06 07:59:19.247] @gammaloop_api::se... INFO : Running command set model WT=0.0
  649. 767.23 s > [2026-09-06 07:59:19.251] @gammaloop_api::se... INFO : Running command set model ymt=173.0
  650. 767.23 s > [2026-09-06 07:59:19.255] @gammaloop_api::se... INFO : Running command set model aS=0.118
  651. 767.23 s > [2026-09-06 07:59:19.258] @gammaloop_api::se... INFO : Running command set model aEWM1=137.036
  652. 767.23 s > [2026-09-06 07:59:19.262] @gammaloop_api::se... INFO : Running command set model Gf=1.166390e-05
  653. 767.23 s > [2026-09-06 07:59:19.265] @gammaloop_api::se... INFO : Running command set model MZ=91.188
  654. 767.23 s > [2026-09-06 07:59:19.269] @gammaloop_api::se... INFO : Running command set global string '
  655. 767.23 s > [global.generation.compile]
  656. 767.23 s > compilation_mode = "symjit"
  657. 767.23 s > optimization_level = "O0"
  658. 767.23 s > fast_math = false
  659. 767.23 s > [...]
  660. 767.23 s > [2026-09-06 07:59:19.270] @gammaloop_api::se... INFO : Running command import graphs ./examples/cli/aa_aa/1L/aa_aa_1L.dot -p aa_aa_all_helicities -i 1L_ppmm -o
  661. 767.23 s > [2026-09-06 07:59:19.270] @commands::import INFO : Loading graphs from '/build/source/examples/cli/aa_aa/1L/aa_aa_1L.dot'
  662. 767.23 s > [2026-09-06 07:59:19.279] @gammaloop_api::se... INFO : Running command generate existing -p aa_aa_all_helicities
  663. 767.23 s > [2026-09-06 07:59:44.213] @commands::generate INFO :
  664. 767.23 s > Integrand generation summary
  665. 767.23 s > peak RAM 1.10 GiB | cores 1
  666. 767.23 s > ╭───────────┬───────┬─────────┬──────────────┬─────────────┬────────────────┬──────────────╮
  667. 767.23 s > │ integrand │ graph │ # evals │ expr build │ spenso │ symbolica eval │ compile │
  668. 767.23 s > ├───────────┼───────┼─────────┼──────────────┼─────────────┼────────────────┼──────────────┤
  669. 767.23 s > │ 1L_ppmm │ GL0 │ 13 │ 521ms (6.2%) │ 1.61s (19%) │ 5.40s (64%) │ 866ms (10%) │
  670. 767.23 s > │ 1L_ppmm │ GL2 │ 13 │ 524ms (6.3%) │ 1.43s (17%) │ 5.53s (67%) │ 799ms (9.6%) │
  671. 767.23 s > │ 1L_ppmm │ GL4 │ 11 │ 519ms (6.4%) │ 1.40s (17%) │ 5.46s (67%) │ 760ms (9.3%) │
  672. 767.23 s > ├───────────┼───────┼─────────┼──────────────┼─────────────┼────────────────┼──────────────┤
  673. 767.23 s > │ Total │ │ 37 │ 1.57s (6.3%) │ 4.45s (18%) │ 16.39s (66%) │ 2.43s (9.8%) │
  674. 767.23 s > ╰───────────┴───────┴─────────┴──────────────┴─────────────┴────────────────┴──────────────╯
  675. 767.23 s > [2026-09-06 07:59:44.858] @gammaloop_api::se... INFO : Running command import model sm-default.json
  676. 767.23 s > [2026-09-06 07:59:44.858] @import::model INFO : Loading built-in JSON model sm-default
  677. 767.23 s > [2026-09-06 07:59:44.879] @gammalooprs::model INFO : The following 11 external parameters were forced to zero by the restriction card:
  678. 767.23 s > lamWS, AWS, rhoWS, etaWS, ymc, yme, ymm, MC, Me, MM, WTau
  679. 767.23 s > [2026-09-06 07:59:44.879] @gammalooprs::model INFO : The following 34 vertex rules were removed by the restriction card:
  680. 767.23 s > V_82 -> (c~, d, G+) | V_83 -> (t~, d, G+) | V_84 -> (c~, s, G+) | V_85 -> (t~, s, G+) | V_86 -> (u~, b, G+) | V_87 -> (c~, b, G+) | V_90 -> (c~, d, W+) | V_91 -> (t~, d, W+) | V_92 -> (u~, s, W+) | V_94 -> (t~, s, W+) | V_95 -> (u~, b, W+) | V_96 -> (c~, b, W+) | V_101 -> (e+, e-, G0) | V_102 -> (mu+, mu-, G0) | V_104 -> (e+, e-, H) | V_105 -> (mu+, mu-, H) | V_110 -> (ve~, e-, G+) | V_111 -> (vm~, mu-, G+) | V_116 -> (b~, u, G-) | V_117 -> (d~, c, G-) | V_118 -> (s~, c, G-) | V_119 -> (b~, c, G-) | V_120 -> (d~, t, G-) | V_121 -> (s~, t, G-) | V_124 -> (s~, u, W-) | V_125 -> (b~, u, W-) | V_126 -> (d~, c, W-) | V_128 -> (b~, c, W-) | V_129 -> (d~, t, W-) | V_130 -> (s~, t, W-) | V_138 -> (c~, c, G0) | V_140 -> (c~, c, H) | V_145 -> (e+, ve, G-) | V_146 -> (mu+, vm, G-)
  681. 767.23 s > [2026-09-06 07:59:44.879] @gammalooprs::model INFO : The following 36 couplings were removed by the restriction card:
  682. 767.23 s > GC_13, GC_14, GC_16, GC_17, GC_18, GC_19, GC_20, GC_22, GC_23, GC_24, GC_25, GC_26, GC_28, GC_29, GC_42, GC_43, GC_44, GC_46, GC_47, GC_48, GC_84, GC_85, GC_86, GC_87, GC_88, GC_89, GC_90, GC_91, GC_92, GC_93, GC_101, GC_102, GC_103, GC_105, GC_106, GC_107
  683. 767.23 s > [2026-09-06 07:59:44.880] @gammaloop_api::se... INFO : Running command run set_model_parameters
  684. 767.23 s > [2026-09-06 07:59:44.880] @gammaloop_api::se... INFO : Starting command block set_model_parameters
  685. 767.23 s > [2026-09-06 07:59:44.880] @gammaloop_api::se... INFO : Running command set model MT=173.0
  686. 767.23 s > [2026-09-06 07:59:44.883] @gammaloop_api::se... INFO : Running command set model WT=0.0
  687. 767.23 s > [2026-09-06 07:59:44.887] @gammaloop_api::se... INFO : Running command set model ymt=173.0
  688. 767.23 s > [2026-09-06 07:59:44.890] @gammaloop_api::se... INFO : Running command set model aS=0.118
  689. 767.23 s > [2026-09-06 07:59:44.894] @gammaloop_api::se... INFO : Running command set model aEWM1=137.036
  690. 767.23 s > [2026-09-06 07:59:44.897] @gammaloop_api::se... INFO : Running command set model Gf=1.166390e-05
  691. 767.23 s > [2026-09-06 07:59:44.900] @gammaloop_api::se... INFO : Running command set model MZ=91.188
  692. 767.23 s > [2026-09-06 07:59:44.904] @gammaloop_api::se... INFO : Running command set global string '
  693. 767.23 s > [global.generation.compile]
  694. 767.23 s > compilation_mode = "assembly"
  695. 767.23 s > optimization_level = "O0"
  696. 767.23 s > fast_math = false
  697. 767.23 s > [...]
  698. 767.23 s > [2026-09-06 07:59:44.905] @gammaloop_api::se... INFO : Running command import graphs ./examples/cli/aa_aa/1L/aa_aa_1L.dot -p aa_aa_all_helicities_assembly -i 1L_ppmm -o
  699. 767.23 s > [2026-09-06 07:59:44.905] @commands::import INFO : Loading graphs from '/build/source/examples/cli/aa_aa/1L/aa_aa_1L.dot'
  700. 767.23 s > [2026-09-06 07:59:44.912] @gammaloop_api::se... INFO : Running command generate existing -p aa_aa_all_helicities_assembly
  701. 767.23 s > [2026-09-06 08:00:07.227] @processes::amplitude INFO : Compiling amplitude 1L_ppmm
  702. 767.23 s > [2026-09-06 08:00:25.499] @commands::generate INFO : Removed 34 generated C++ source file(s). Use '--keep-sources' to keep them.
  703. 767.23 s > [2026-09-06 08:00:25.499] @commands::generate INFO :
  704. 767.23 s > Integrand generation summary
  705. 767.23 s > peak RAM 2.24 GiB | cores 1
  706. 767.23 s > ╭───────────┬───────┬─────────┬──────────────┬─────────────┬────────────────┬──────────────╮
  707. 767.23 s > │ integrand │ graph │ # evals │ expr build │ spenso │ symbolica eval │ compile │
  708. 767.23 s > ├───────────┼───────┼─────────┼──────────────┼─────────────┼────────────────┼──────────────┤
  709. 767.23 s > │ 1L_ppmm │ GL0 │ 13 │ 485ms (3.5%) │ 1.39s (10%) │ 5.48s (40%) │ 6.50s (47%) │
  710. 767.23 s > │ 1L_ppmm │ GL2 │ 13 │ 500ms (3.6%) │ 1.44s (11%) │ 5.47s (40%) │ 6.30s (46%) │
  711. 767.23 s > │ 1L_ppmm │ GL4 │ 11 │ 486ms (3.7%) │ 1.43s (11%) │ 5.60s (43%) │ 5.46s (42%) │
  712. 767.23 s > ├───────────┼───────┼─────────┼──────────────┼─────────────┼────────────────┼──────────────┤
  713. 767.23 s > │ Total │ │ 37 │ 1.47s (3.6%) │ 4.26s (11%) │ 16.55s (41%) │ 18.26s (45%) │
  714. 767.23 s > ╰───────────┴───────┴─────────┴──────────────┴─────────────┴────────────────┴──────────────╯
  715. 767.23 s > [2026-09-06 08:00:26.109] @gammaloop_api::se... INFO : Running command set process -p aa_aa_all_helicities -i 1L_ppmm string '
  716. 767.23 s > [stability]
  717. 767.23 s > check_on_norm = true
  718. 767.23 s > escalate_if_exact_zero = false
  719. 767.23 s > loop_momenta_norm_escalation_factor = -1.0
  720. 767.23 s > [...]
  721. 767.23 s > [2026-09-06 08:00:26.110] @gammaloop_api::se... INFO : Running command set process -p aa_aa_all_helicities_assembly -i 1L_ppmm string '
  722. 767.23 s > [stability]
  723. 767.23 s > check_on_norm = true
  724. 767.23 s > escalate_if_exact_zero = false
  725. 767.23 s > loop_momenta_norm_escalation_factor = -1.0
  726. 767.23 s > [...]
  727. 767.23 s > [2026-09-06 08:00:26.111] @gammaloop_api::se... INFO : Running command set process -p aa_aa_all_helicities -i 1L_mpmm string '
  728. 767.23 s > [stability]
  729. 767.23 s > check_on_norm = true
  730. 767.23 s > escalate_if_exact_zero = false
  731. 767.23 s > loop_momenta_norm_escalation_factor = -1.0
  732. 767.23 s > [...]
  733. 767.23 s > [2026-09-06 08:00:26.112] @gammaloop_api::se... INFO : Running command set process -p aa_aa_all_helicities_assembly -i 1L_mpmm string '
  734. 767.23 s > [stability]
  735. 767.23 s > check_on_norm = true
  736. 767.23 s > escalate_if_exact_zero = false
  737. 767.23 s > loop_momenta_norm_escalation_factor = -1.0
  738. 767.23 s > [...]
  739. 767.23 s > [2026-09-06 08:00:26.112] @gammaloop_api::se... INFO : Running command set process -p aa_aa_all_helicities -i 1L_mmmm string '
  740. 767.23 s > [stability]
  741. 767.23 s > check_on_norm = true
  742. 767.23 s > escalate_if_exact_zero = false
  743. 767.23 s > loop_momenta_norm_escalation_factor = -1.0
  744. 767.23 s > [...]
  745. 767.23 s > [2026-09-06 08:00:26.113] @gammaloop_api::se... INFO : Running command set process -p aa_aa_all_helicities_assembly -i 1L_mmmm string '
  746. 767.23 s > [stability]
  747. 767.23 s > check_on_norm = true
  748. 767.23 s > escalate_if_exact_zero = false
  749. 767.23 s > loop_momenta_norm_escalation_factor = -1.0
  750. 767.23 s > [...]
  751. 767.23 s > [2026-09-06 08:00:26.114] @gammaloop_api::se... INFO : Running command set process -p aa_aa_all_helicities -i 1L_pmmp string '
  752. 767.23 s > [stability]
  753. 767.23 s > check_on_norm = true
  754. 767.23 s > escalate_if_exact_zero = false
  755. 767.23 s > loop_momenta_norm_escalation_factor = -1.0
  756. 767.23 s > [...]
  757. 767.23 s > [2026-09-06 08:00:26.114] @gammaloop_api::se... INFO : Running command set process -p aa_aa_all_helicities_assembly -i 1L_pmmp string '
  758. 767.23 s > [stability]
  759. 767.23 s > check_on_norm = true
  760. 767.23 s > escalate_if_exact_zero = false
  761. 767.23 s > loop_momenta_norm_escalation_factor = -1.0
  762. 767.23 s > [...]
  763. 767.23 s > [2026-09-06 08:00:26.115] @gammaloop_api::se... INFO : Running command set process -p aa_aa_all_helicities -i 1L_pmpm string '
  764. 767.23 s > [stability]
  765. 767.23 s > check_on_norm = true
  766. 767.23 s > escalate_if_exact_zero = false
  767. 767.23 s > loop_momenta_norm_escalation_factor = -1.0
  768. 767.23 s > [...]
  769. 767.23 s > [2026-09-06 08:00:26.116] @gammaloop_api::se... INFO : Running command set process -p aa_aa_all_helicities_assembly -i 1L_pmpm string '
  770. 767.23 s > [stability]
  771. 767.23 s > check_on_norm = true
  772. 767.23 s > escalate_if_exact_zero = false
  773. 767.23 s > loop_momenta_norm_escalation_factor = -1.0
  774. 767.23 s > [...]
  775. 767.23 s > [2026-09-06 08:00:26.120] @process::amplitude INFO : Input is below threshold: 0 existing threshold E-surfaces across 0/1 graph groups
  776. 767.23 s > [2026-09-06 08:00:26.120] @process::amplitude INFO : overlap structure of group 0: [0: []]
  777. 767.23 s > [2026-09-06 08:00:26.121] @integrands::process [{#im_is_nan, #re_is_nan}] WARNING : final process evaluation is nonfinite
  778. 767.23 s > [2026-09-06 08:00:26.121] @commands::inspect INFO :
  779. 767.23 s > Input point in momentum space:
  780. 767.23 s >
  781. 767.23 s > ( 0.1100000000000000, -0.0700000000000000, 0.1900000000000000 )
  782. 767.23 s >
  783. 767.23 s > The evaluation of integrand '1L_ppmm' is:
  784. 767.23 s >
  785. 767.23 s > ( +0.0000000000000000e0, +0.0000000000000000e0 i)
  786. 767.23 s >
  787. 767.23 s > [2026-09-06 08:00:26.124] @process::amplitude INFO : Input is below threshold: 0 existing threshold E-surfaces across 0/1 graph groups
  788. 767.23 s > [2026-09-06 08:00:26.124] @process::amplitude INFO : overlap structure of group 0: [0: []]
  789. 767.23 s > [2026-09-06 08:00:26.125] @commands::inspect INFO :
  790. 767.23 s > Input point in momentum space:
  791. 767.23 s >
  792. 767.23 s > ( 0.1100000000000000, -0.0700000000000000, 0.1900000000000000 )
  793. 767.23 s >
  794. 767.23 s > The evaluation of integrand '1L_ppmm' is:
  795. 767.23 s >
  796. 767.23 s > ( -1.7132462539328486e-28, -8.7105072229446864e-10 i)
  797. 767.23 s >
  798. 767.23 s > The application panicked (crashed).
  799. 767.23 s > Message: kinematics=a, integrand=1L_ppmm, graph_id=0: assembly vs symjit inspect: actual=(-0.00000000000000000000000000017132462539328486+-0.0000000008710507222944686i), expected=(0+0i), tolerance=0.0000000001
  800. 767.23 s > Location: tests/tests/test_runs/utils.rs:466
  801. 767.23 s >
  802. 767.23 s > ━━━━━━━━━━━━━━━━━━━━━━━━━━━━━━━━━━ BACKTRACE ━━━━━━━━━━━━━━━━━━━━━━━━━━━━━━━━━━━
  803. 767.23 s > 1: <color_eyre[51793ea62743adbd]::config::PanicHook>::panic_report<unknown>
  804. 767.23 s > at <unknown source file>:<unknown line>
  805. 767.23 s > 2: <color_eyre[51793ea62743adbd]::config::PanicHook>::into_panic_hook::{closure#0}<unknown>
  806. 767.23 s > at <unknown source file>:<unknown line>
  807. 767.23 s > 3: std[bcb96dfbba0ab899]::panicking::panic_with_hook<unknown>
  808. 767.23 s > at <unknown source file>:<unknown line>
  809. 767.23 s > 4: std[bcb96dfbba0ab899]::panicking::panic_handler::{closure#0}<unknown>
  810. 767.23 s > at <unknown source file>:<unknown line>
  811. 767.23 s > 5: std[bcb96dfbba0ab899]::sys::backtrace::__rust_end_short_backtrace::<std[bcb96dfbba0ab899]::panicking::panic_handler::{closure#0}, !><unknown>
  812. 767.23 s > at <unknown source file>:<unknown line>
  813. 767.23 s > 6: __rustc[6c289b9f9c454d21]::rust_begin_unwind<unknown>
  814. 767.23 s > at <unknown source file>:<unknown line>
  815. 767.23 s > 7: core[940e698046960fd5]::panicking::panic_fmt<unknown>
  816. 767.23 s > at <unknown source file>:<unknown line>
  817. 767.23 s > 8: <test_runs[66584badfeb6c7be]::aa_aa::important::aa_aa_local_inspect_backend_consistency::{closure#0} as core[940e698046960fd5]::ops::function::FnOnce<()>>::call_once<unknown>
  818. 767.23 s > at <unknown source file>:<unknown line>
  819. 767.23 s > 9: serial_test[cd99724524a2f1c0]::serial_code_lock::local_serial_core_with_return::<(), eyre[cb2fd339c0c40fca]::Report><unknown>
  820. 767.23 s > at <unknown source file>:<unknown line>
  821. 767.23 s > 10: <test_runs[66584badfeb6c7be]::aa_aa::important::aa_aa_local_inspect_backend_consistency::{closure#0} as core[940e698046960fd5]::ops::function::FnOnce<()>>::call_once<unknown>
  822. 767.23 s > at <unknown source file>:<unknown line>
  823. 767.23 s > 11: test[75d6903177b1d7e9]::__rust_begin_short_backtrace::<core[940e698046960fd5]::result::Result<(), alloc[2ea6bcb46fca0c42]::string::String>, fn() -> core[940e698046960fd5]::result::Result<(), alloc[2ea6bcb46fca0c42]::string::String>><unknown>
  824. 767.23 s > at <unknown source file>:<unknown line>
  825. 767.23 s > 12: test[75d6903177b1d7e9]::run_test::{closure#0}<unknown>
  826. 767.23 s > at <unknown source file>:<unknown line>
  827. 767.23 s > 13: std[bcb96dfbba0ab899]::sys::backtrace::__rust_begin_short_backtrace::<test[75d6903177b1d7e9]::run_test::{closure#1}, ()><unknown>
  828. 767.23 s > at <unknown source file>:<unknown line>
  829. 767.23 s > 14: <std[bcb96dfbba0ab899]::thread::lifecycle::spawn_unchecked<test[75d6903177b1d7e9]::run_test::{closure#1}, ()>::{closure#1} as core[940e698046960fd5]::ops::function::FnOnce<()>>::call_once::{shim:vtable#0}<unknown>
  830. 767.23 s > at <unknown source file>:<unknown line>
  831. 767.23 s > 15: <std[bcb96dfbba0ab899]::sys::thread::unix::Thread>::new::thread_start<unknown>
  832. 767.23 s > at <unknown source file>:<unknown line>
  833. 767.23 s > 16: start_thread<unknown>
  834. 767.23 s > at <unknown source file>:<unknown line>
  835. 767.23 s > 17: __clone3<unknown>
  836. 767.23 s > at <unknown source file>:<unknown line>
  837. 767.23 s >
  838. 767.23 s > Run with COLORBT_SHOW_HIDDEN=1 environment variable to disable frame filtering.
  839. 767.23 s > Run with RUST_BACKTRACE=full to include source snippets.
  840. 767.23 s >
  841. 767.23 s > ------------
  842. 767.23 s > Summary [ 743.881s] 152 tests run: 151 passed, 1 failed, 208 skipped
  843. 767.23 s > FAIL [ 67.481s] ( 54/152) gammaloop-integration-tests::test_runs aa_aa::important::aa_aa_local_inspect_backend_consistency
  844. 767.23 s > stdout ---
  845. 767.23 s >
  846. 767.23 s > running 1 test
  847. 767.23 s > test aa_aa::important::aa_aa_local_inspect_backend_consistency has been running for over 60 seconds
  848. 767.23 s > test aa_aa::important::aa_aa_local_inspect_backend_consistency ... FAILED
  849. 767.23 s >
  850. 767.23 s > failures:
  851. 767.23 s >
  852. 767.23 s > failures:
  853. 767.23 s > aa_aa::important::aa_aa_local_inspect_backend_consistency
  854. 767.23 s >
  855. 767.23 s > test result: FAILED. 0 passed; 1 failed; 0 ignored; 0 measured; 258 filtered out; finished in 67.33s
  856. 767.23 s >
  857. 767.23 s > stderr ---
  858. 767.23 s > [2026-09-06 07:59:19.222] @gammaloop_api::se... INFO : Running command import model sm-default.json
  859. 767.23 s > [2026-09-06 07:59:19.222] @import::model INFO : Loading built-in JSON model sm-default
  860. 767.23 s > [2026-09-06 07:59:19.243] @gammalooprs::model INFO : The following 11 external parameters were forced to zero by the restriction card:
  861. 767.23 s > lamWS, AWS, rhoWS, etaWS, ymc, yme, ymm, MC, Me, MM, WTau
  862. 767.23 s > [2026-09-06 07:59:19.243] @gammalooprs::model INFO : The following 34 vertex rules were removed by the restriction card:
  863. 767.23 s > V_82 -> (c~, d, G+) | V_83 -> (t~, d, G+) | V_84 -> (c~, s, G+) | V_85 -> (t~, s, G+) | V_86 -> (u~, b, G+) | V_87 -> (c~, b, G+) | V_90 -> (c~, d, W+) | V_91 -> (t~, d, W+) | V_92 -> (u~, s, W+) | V_94 -> (t~, s, W+) | V_95 -> (u~, b, W+) | V_96 -> (c~, b, W+) | V_101 -> (e+, e-, G0) | V_102 -> (mu+, mu-, G0) | V_104 -> (e+, e-, H) | V_105 -> (mu+, mu-, H) | V_110 -> (ve~, e-, G+) | V_111 -> (vm~, mu-, G+) | V_116 -> (b~, u, G-) | V_117 -> (d~, c, G-) | V_118 -> (s~, c, G-) | V_119 -> (b~, c, G-) | V_120 -> (d~, t, G-) | V_121 -> (s~, t, G-) | V_124 -> (s~, u, W-) | V_125 -> (b~, u, W-) | V_126 -> (d~, c, W-) | V_128 -> (b~, c, W-) | V_129 -> (d~, t, W-) | V_130 -> (s~, t, W-) | V_138 -> (c~, c, G0) | V_140 -> (c~, c, H) | V_145 -> (e+, ve, G-) | V_146 -> (mu+, vm, G-)
  864. 767.23 s > [2026-09-06 07:59:19.243] @gammalooprs::model INFO : The following 36 couplings were removed by the restriction card:
  865. 767.23 s > GC_13, GC_14, GC_16, GC_17, GC_18, GC_19, GC_20, GC_22, GC_23, GC_24, GC_25, GC_26, GC_28, GC_29, GC_42, GC_43, GC_44, GC_46, GC_47, GC_48, GC_84, GC_85, GC_86, GC_87, GC_88, GC_89, GC_90, GC_91, GC_92, GC_93, GC_101, GC_102, GC_103, GC_105, GC_106, GC_107
  866. 767.23 s > [2026-09-06 07:59:19.243] @gammaloop_api::se... INFO : Running command run set_model_parameters
  867. 767.23 s > [2026-09-06 07:59:19.243] @gammaloop_api::se... INFO : Starting command block set_model_parameters
  868. 767.23 s > [2026-09-06 07:59:19.244] @gammaloop_api::se... INFO : Running command set model MT=173.0
  869. 767.23 s > [2026-09-06 07:59:19.247] @gammaloop_api::se... INFO : Running command set model WT=0.0
  870. 767.23 s > [2026-09-06 07:59:19.251] @gammaloop_api::se... INFO : Running command set model ymt=173.0
  871. 767.23 s > [2026-09-06 07:59:19.255] @gammaloop_api::se... INFO : Running command set model aS=0.118
  872. 767.23 s > [2026-09-06 07:59:19.258] @gammaloop_api::se... INFO : Running command set model aEWM1=137.036
  873. 767.23 s > [2026-09-06 07:59:19.262] @gammaloop_api::se... INFO : Running command set model Gf=1.166390e-05
  874. 767.23 s > [2026-09-06 07:59:19.265] @gammaloop_api::se... INFO : Running command set model MZ=91.188
  875. 767.23 s > [2026-09-06 07:59:19.269] @gammaloop_api::se... INFO : Running command set global string '
  876. 767.23 s > [global.generation.compile]
  877. 767.23 s > compilation_mode = "symjit"
  878. 767.23 s > optimization_level = "O0"
  879. 767.23 s > fast_math = false
  880. 767.23 s > [...]
  881. 767.23 s > [2026-09-06 07:59:19.270] @gammaloop_api::se... INFO : Running command import graphs ./examples/cli/aa_aa/1L/aa_aa_1L.dot -p aa_aa_all_helicities -i 1L_ppmm -o
  882. 767.23 s > [2026-09-06 07:59:19.270] @commands::import INFO : Loading graphs from '/build/source/examples/cli/aa_aa/1L/aa_aa_1L.dot'
  883. 767.23 s > [2026-09-06 07:59:19.279] @gammaloop_api::se... INFO : Running command generate existing -p aa_aa_all_helicities
  884. 767.23 s > [2026-09-06 07:59:44.213] @commands::generate INFO :
  885. 767.23 s > Integrand generation summary
  886. 767.23 s > peak RAM 1.10 GiB | cores 1
  887. 767.23 s > ╭───────────┬───────┬─────────┬──────────────┬─────────────┬────────────────┬──────────────╮
  888. 767.23 s > │ integrand │ graph │ # evals │ expr build │ spenso │ symbolica eval │ compile │
  889. 767.23 s > ├───────────┼───────┼─────────┼──────────────┼─────────────┼────────────────┼──────────────┤
  890. 767.23 s > │ 1L_ppmm │ GL0 │ 13 │ 521ms (6.2%) │ 1.61s (19%) │ 5.40s (64%) │ 866ms (10%) │
  891. 767.23 s > │ 1L_ppmm │ GL2 │ 13 │ 524ms (6.3%) │ 1.43s (17%) │ 5.53s (67%) │ 799ms (9.6%) │
  892. 767.23 s > │ 1L_ppmm │ GL4 │ 11 │ 519ms (6.4%) │ 1.40s (17%) │ 5.46s (67%) │ 760ms (9.3%) │
  893. 767.23 s > ├───────────┼───────┼─────────┼──────────────┼─────────────┼────────────────┼──────────────┤
  894. 767.23 s > │ Total │ │ 37 │ 1.57s (6.3%) │ 4.45s (18%) │ 16.39s (66%) │ 2.43s (9.8%) │
  895. 767.23 s > ╰───────────┴───────┴─────────┴──────────────┴─────────────┴────────────────┴──────────────╯
  896. 767.23 s > [2026-09-06 07:59:44.858] @gammaloop_api::se... INFO : Running command import model sm-default.json
  897. 767.23 s > [2026-09-06 07:59:44.858] @import::model INFO : Loading built-in JSON model sm-default
  898. 767.23 s > [2026-09-06 07:59:44.879] @gammalooprs::model INFO : The following 11 external parameters were forced to zero by the restriction card:
  899. 767.23 s > lamWS, AWS, rhoWS, etaWS, ymc, yme, ymm, MC, Me, MM, WTau
  900. 767.23 s > [2026-09-06 07:59:44.879] @gammalooprs::model INFO : The following 34 vertex rules were removed by the restriction card:
  901. 767.23 s > V_82 -> (c~, d, G+) | V_83 -> (t~, d, G+) | V_84 -> (c~, s, G+) | V_85 -> (t~, s, G+) | V_86 -> (u~, b, G+) | V_87 -> (c~, b, G+) | V_90 -> (c~, d, W+) | V_91 -> (t~, d, W+) | V_92 -> (u~, s, W+) | V_94 -> (t~, s, W+) | V_95 -> (u~, b, W+) | V_96 -> (c~, b, W+) | V_101 -> (e+, e-, G0) | V_102 -> (mu+, mu-, G0) | V_104 -> (e+, e-, H) | V_105 -> (mu+, mu-, H) | V_110 -> (ve~, e-, G+) | V_111 -> (vm~, mu-, G+) | V_116 -> (b~, u, G-) | V_117 -> (d~, c, G-) | V_118 -> (s~, c, G-) | V_119 -> (b~, c, G-) | V_120 -> (d~, t, G-) | V_121 -> (s~, t, G-) | V_124 -> (s~, u, W-) | V_125 -> (b~, u, W-) | V_126 -> (d~, c, W-) | V_128 -> (b~, c, W-) | V_129 -> (d~, t, W-) | V_130 -> (s~, t, W-) | V_138 -> (c~, c, G0) | V_140 -> (c~, c, H) | V_145 -> (e+, ve, G-) | V_146 -> (mu+, vm, G-)
  902. 767.23 s > [2026-09-06 07:59:44.879] @gammalooprs::model INFO : The following 36 couplings were removed by the restriction card:
  903. 767.23 s > GC_13, GC_14, GC_16, GC_17, GC_18, GC_19, GC_20, GC_22, GC_23, GC_24, GC_25, GC_26, GC_28, GC_29, GC_42, GC_43, GC_44, GC_46, GC_47, GC_48, GC_84, GC_85, GC_86, GC_87, GC_88, GC_89, GC_90, GC_91, GC_92, GC_93, GC_101, GC_102, GC_103, GC_105, GC_106, GC_107
  904. 767.23 s > [2026-09-06 07:59:44.880] @gammaloop_api::se... INFO : Running command run set_model_parameters
  905. 767.23 s > [2026-09-06 07:59:44.880] @gammaloop_api::se... INFO : Starting command block set_model_parameters
  906. 767.23 s > [2026-09-06 07:59:44.880] @gammaloop_api::se... INFO : Running command set model MT=173.0
  907. 767.23 s > [2026-09-06 07:59:44.883] @gammaloop_api::se... INFO : Running command set model WT=0.0
  908. 767.23 s > [2026-09-06 07:59:44.887] @gammaloop_api::se... INFO : Running command set model ymt=173.0
  909. 767.23 s > [2026-09-06 07:59:44.890] @gammaloop_api::se... INFO : Running command set model aS=0.118
  910. 767.23 s > [2026-09-06 07:59:44.894] @gammaloop_api::se... INFO : Running command set model aEWM1=137.036
  911. 767.23 s > [2026-09-06 07:59:44.897] @gammaloop_api::se... INFO : Running command set model Gf=1.166390e-05
  912. 767.23 s > [2026-09-06 07:59:44.900] @gammaloop_api::se... INFO : Running command set model MZ=91.188
  913. 767.23 s > [2026-09-06 07:59:44.904] @gammaloop_api::se... INFO : Running command set global string '
  914. 767.23 s > [global.generation.compile]
  915. 767.23 s > compilation_mode = "assembly"
  916. 767.23 s > optimization_level = "O0"
  917. 767.23 s > fast_math = false
  918. 767.23 s > [...]
  919. 767.23 s > [2026-09-06 07:59:44.905] @gammaloop_api::se... INFO : Running command import graphs ./examples/cli/aa_aa/1L/aa_aa_1L.dot -p aa_aa_all_helicities_assembly -i 1L_ppmm -o
  920. 767.23 s > [2026-09-06 07:59:44.905] @commands::import INFO : Loading graphs from '/build/source/examples/cli/aa_aa/1L/aa_aa_1L.dot'
  921. 767.23 s > [2026-09-06 07:59:44.912] @gammaloop_api::se... INFO : Running command generate existing -p aa_aa_all_helicities_assembly
  922. 767.23 s > [2026-09-06 08:00:07.227] @processes::amplitude INFO : Compiling amplitude 1L_ppmm
  923. 767.23 s > [2026-09-06 08:00:25.499] @commands::generate INFO : Removed 34 generated C++ source file(s). Use '--keep-sources' to keep them.
  924. 767.23 s > [2026-09-06 08:00:25.499] @commands::generate INFO :
  925. 767.23 s > Integrand generation summary
  926. 767.23 s > peak RAM 2.24 GiB | cores 1
  927. 767.23 s > ╭───────────┬───────┬─────────┬──────────────┬─────────────┬────────────────┬──────────────╮
  928. 767.23 s > │ integrand │ graph │ # evals │ expr build │ spenso │ symbolica eval │ compile │
  929. 767.23 s > ├───────────┼───────┼─────────┼──────────────┼─────────────┼────────────────┼──────────────┤
  930. 767.23 s > │ 1L_ppmm │ GL0 │ 13 │ 485ms (3.5%) │ 1.39s (10%) │ 5.48s (40%) │ 6.50s (47%) │
  931. 767.23 s > │ 1L_ppmm │ GL2 │ 13 │ 500ms (3.6%) │ 1.44s (11%) │ 5.47s (40%) │ 6.30s (46%) │
  932. 767.23 s > │ 1L_ppmm │ GL4 │ 11 │ 486ms (3.7%) │ 1.43s (11%) │ 5.60s (43%) │ 5.46s (42%) │
  933. 767.23 s > ├───────────┼───────┼─────────┼──────────────┼─────────────┼────────────────┼──────────────┤
  934. 767.23 s > │ Total │ │ 37 │ 1.47s (3.6%) │ 4.26s (11%) │ 16.55s (41%) │ 18.26s (45%) │
  935. 767.23 s > ╰───────────┴───────┴─────────┴──────────────┴─────────────┴────────────────┴──────────────╯
  936. 767.23 s > [2026-09-06 08:00:26.109] @gammaloop_api::se... INFO : Running command set process -p aa_aa_all_helicities -i 1L_ppmm string '
  937. 767.23 s > [stability]
  938. 767.23 s > check_on_norm = true
  939. 767.23 s > escalate_if_exact_zero = false
  940. 767.23 s > loop_momenta_norm_escalation_factor = -1.0
  941. 767.23 s > [...]
  942. 767.23 s > [2026-09-06 08:00:26.110] @gammaloop_api::se... INFO : Running command set process -p aa_aa_all_helicities_assembly -i 1L_ppmm string '
  943. 767.23 s > [stability]
  944. 767.23 s > check_on_norm = true
  945. 767.23 s > escalate_if_exact_zero = false
  946. 767.23 s > loop_momenta_norm_escalation_factor = -1.0
  947. 767.23 s > [...]
  948. 767.23 s > [2026-09-06 08:00:26.111] @gammaloop_api::se... INFO : Running command set process -p aa_aa_all_helicities -i 1L_mpmm string '
  949. 767.23 s > [stability]
  950. 767.23 s > check_on_norm = true
  951. 767.23 s > escalate_if_exact_zero = false
  952. 767.23 s > loop_momenta_norm_escalation_factor = -1.0
  953. 767.23 s > [...]
  954. 767.23 s > [2026-09-06 08:00:26.112] @gammaloop_api::se... INFO : Running command set process -p aa_aa_all_helicities_assembly -i 1L_mpmm string '
  955. 767.23 s > [stability]
  956. 767.23 s > check_on_norm = true
  957. 767.23 s > escalate_if_exact_zero = false
  958. 767.23 s > loop_momenta_norm_escalation_factor = -1.0
  959. 767.23 s > [...]
  960. 767.23 s > [2026-09-06 08:00:26.112] @gammaloop_api::se... INFO : Running command set process -p aa_aa_all_helicities -i 1L_mmmm string '
  961. 767.23 s > [stability]
  962. 767.23 s > check_on_norm = true
  963. 767.23 s > escalate_if_exact_zero = false
  964. 767.23 s > loop_momenta_norm_escalation_factor = -1.0
  965. 767.23 s > [...]
  966. 767.23 s > [2026-09-06 08:00:26.113] @gammaloop_api::se... INFO : Running command set process -p aa_aa_all_helicities_assembly -i 1L_mmmm string '
  967. 767.23 s > [stability]
  968. 767.23 s > check_on_norm = true
  969. 767.23 s > escalate_if_exact_zero = false
  970. 767.23 s > loop_momenta_norm_escalation_factor = -1.0
  971. 767.23 s > [...]
  972. 767.23 s > [2026-09-06 08:00:26.114] @gammaloop_api::se... INFO : Running command set process -p aa_aa_all_helicities -i 1L_pmmp string '
  973. 767.23 s > [stability]
  974. 767.23 s > check_on_norm = true
  975. 767.23 s > escalate_if_exact_zero = false
  976. 767.23 s > loop_momenta_norm_escalation_factor = -1.0
  977. 767.23 s > [...]
  978. 767.23 s > [2026-09-06 08:00:26.114] @gammaloop_api::se... INFO : Running command set process -p aa_aa_all_helicities_assembly -i 1L_pmmp string '
  979. 767.23 s > [stability]
  980. 767.23 s > check_on_norm = true
  981. 767.23 s > escalate_if_exact_zero = false
  982. 767.23 s > loop_momenta_norm_escalation_factor = -1.0
  983. 767.23 s > [...]
  984. 767.23 s > [2026-09-06 08:00:26.115] @gammaloop_api::se... INFO : Running command set process -p aa_aa_all_helicities -i 1L_pmpm string '
  985. 767.23 s > [stability]
  986. 767.23 s > check_on_norm = true
  987. 767.23 s > escalate_if_exact_zero = false
  988. 767.23 s > loop_momenta_norm_escalation_factor = -1.0
  989. 767.23 s > [...]
  990. 767.23 s > [2026-09-06 08:00:26.116] @gammaloop_api::se... INFO : Running command set process -p aa_aa_all_helicities_assembly -i 1L_pmpm string '
  991. 767.23 s > [stability]
  992. 767.23 s > check_on_norm = true
  993. 767.23 s > escalate_if_exact_zero = false
  994. 767.23 s > loop_momenta_norm_escalation_factor = -1.0
  995. 767.23 s > [...]
  996. 767.23 s > [2026-09-06 08:00:26.120] @process::amplitude INFO : Input is below threshold: 0 existing threshold E-surfaces across 0/1 graph groups
  997. 767.23 s > [2026-09-06 08:00:26.120] @process::amplitude INFO : overlap structure of group 0: [0: []]
  998. 767.23 s > [2026-09-06 08:00:26.121] @integrands::process [{#im_is_nan, #re_is_nan}] WARNING : final process evaluation is nonfinite
  999. 767.23 s > [2026-09-06 08:00:26.121] @commands::inspect INFO :
  1000. 767.23 s > Input point in momentum space:
  1001. 767.23 s >
  1002. 767.23 s > ( 0.1100000000000000, -0.0700000000000000, 0.1900000000000000 )
  1003. 767.23 s >
  1004. 767.23 s > The evaluation of integrand '1L_ppmm' is:
  1005. 767.23 s >
  1006. 767.23 s > ( +0.0000000000000000e0, +0.0000000000000000e0 i)
  1007. 767.23 s >
  1008. 767.23 s > [2026-09-06 08:00:26.124] @process::amplitude INFO : Input is below threshold: 0 existing threshold E-surfaces across 0/1 graph groups
  1009. 767.23 s > [2026-09-06 08:00:26.124] @process::amplitude INFO : overlap structure of group 0: [0: []]
  1010. 767.23 s > [2026-09-06 08:00:26.125] @commands::inspect INFO :
  1011. 767.23 s > Input point in momentum space:
  1012. 767.23 s >
  1013. 767.23 s > ( 0.1100000000000000, -0.0700000000000000, 0.1900000000000000 )
  1014. 767.23 s >
  1015. 767.23 s > The evaluation of integrand '1L_ppmm' is:
  1016. 767.23 s >
  1017. 767.23 s > ( -1.7132462539328486e-28, -8.7105072229446864e-10 i)
  1018. 767.23 s >
  1019. 767.23 s > The application panicked (crashed).
  1020. 767.23 s > Message: kinematics=a, integrand=1L_ppmm, graph_id=0: assembly vs symjit inspect: actual=(-0.00000000000000000000000000017132462539328486+-0.0000000008710507222944686i), expected=(0+0i), tolerance=0.0000000001
  1021. 767.23 s > Location: tests/tests/test_runs/utils.rs:466
  1022. 767.23 s >
  1023. 767.23 s > ━━━━━━━━━━━━━━━━━━━━━━━━━━━━━━━━━━ BACKTRACE ━━━━━━━━━━━━━━━━━━━━━━━━━━━━━━━━━━━
  1024. 767.23 s > 1: <color_eyre[51793ea62743adbd]::config::PanicHook>::panic_report<unknown>
  1025. 767.23 s > at <unknown source file>:<unknown line>
  1026. 767.23 s > 2: <color_eyre[51793ea62743adbd]::config::PanicHook>::into_panic_hook::{closure#0}<unknown>
  1027. 767.23 s > at <unknown source file>:<unknown line>
  1028. 767.23 s > 3: std[bcb96dfbba0ab899]::panicking::panic_with_hook<unknown>
  1029. 767.23 s > at <unknown source file>:<unknown line>
  1030. 767.23 s > 4: std[bcb96dfbba0ab899]::panicking::panic_handler::{closure#0}<unknown>
  1031. 767.23 s > at <unknown source file>:<unknown line>
  1032. 767.23 s > 5: std[bcb96dfbba0ab899]::sys::backtrace::__rust_end_short_backtrace::<std[bcb96dfbba0ab899]::panicking::panic_handler::{closure#0}, !><unknown>
  1033. 767.23 s > at <unknown source file>:<unknown line>
  1034. 767.23 s > 6: __rustc[6c289b9f9c454d21]::rust_begin_unwind<unknown>
  1035. 767.23 s > at <unknown source file>:<unknown line>
  1036. 767.23 s > 7: core[940e698046960fd5]::panicking::panic_fmt<unknown>
  1037. 767.23 s > at <unknown source file>:<unknown line>
  1038. 767.23 s > 8: <test_runs[66584badfeb6c7be]::aa_aa::important::aa_aa_local_inspect_backend_consistency::{closure#0} as core[940e698046960fd5]::ops::function::FnOnce<()>>::call_once<unknown>
  1039. 767.23 s > at <unknown source file>:<unknown line>
  1040. 767.23 s > 9: serial_test[cd99724524a2f1c0]::serial_code_lock::local_serial_core_with_return::<(), eyre[cb2fd339c0c40fca]::Report><unknown>
  1041. 767.23 s > at <unknown source file>:<unknown line>
  1042. 767.23 s > 10: <test_runs[66584badfeb6c7be]::aa_aa::important::aa_aa_local_inspect_backend_consistency::{closure#0} as core[940e698046960fd5]::ops::function::FnOnce<()>>::call_once<unknown>
  1043. 767.23 s > at <unknown source file>:<unknown line>
  1044. 767.23 s > 11: test[75d6903177b1d7e9]::__rust_begin_short_backtrace::<core[940e698046960fd5]::result::Result<(), alloc[2ea6bcb46fca0c42]::string::String>, fn() -> core[940e698046960fd5]::result::Result<(), alloc[2ea6bcb46fca0c42]::string::String>><unknown>
  1045. 767.23 s > at <unknown source file>:<unknown line>
  1046. 767.23 s > 12: test[75d6903177b1d7e9]::run_test::{closure#0}<unknown>
  1047. 767.23 s > at <unknown source file>:<unknown line>
  1048. 767.23 s > 13: std[bcb96dfbba0ab899]::sys::backtrace::__rust_begin_short_backtrace::<test[75d6903177b1d7e9]::run_test::{closure#1}, ()><unknown>
  1049. 767.23 s > at <unknown source file>:<unknown line>
  1050. 767.23 s > 14: <std[bcb96dfbba0ab899]::thread::lifecycle::spawn_unchecked<test[75d6903177b1d7e9]::run_test::{closure#1}, ()>::{closure#1} as core[940e698046960fd5]::ops::function::FnOnce<()>>::call_once::{shim:vtable#0}<unknown>
  1051. 767.23 s > at <unknown source file>:<unknown line>
  1052. 767.23 s > 15: <std[bcb96dfbba0ab899]::sys::thread::unix::Thread>::new::thread_start<unknown>
  1053. 767.23 s > at <unknown source file>:<unknown line>
  1054. 767.23 s > 16: start_thread<unknown>
  1055. 767.23 s > at <unknown source file>:<unknown line>
  1056. 767.23 s > 17: __clone3<unknown>
  1057. 767.23 s > at <unknown source file>:<unknown line>
  1058. 767.23 s >
  1059. 767.23 s > Run with COLORBT_SHOW_HIDDEN=1 environment variable to disable frame filtering.
  1060. 767.23 s > Run with RUST_BACKTRACE=full to include source snippets.
  1061. 767.23 s >
  1062. 767.23 s > error: test run failed
  1063. 767.23 s >
  1064. 767.23 s > ========== nextest test summary ==========
  1065. 767.23 s > report: target/nextest/ci_gammaloop/junit.xml
  1066. 767.23 s > tests: 152, failures: 1, errors: 0
  1067. 767.23 s >
  1068. 767.23 s > 1. gammaloop-integration-tests::test_runs::aa_aa::important::aa_aa_local_inspect_backend_consistency
  1069. 767.23 s > failure: test failure with exit code 101
  1070. 767.23 s > system-out
  1071. 767.23 s > running 1 test
  1072. 767.23 s > test aa_aa::important::aa_aa_local_inspect_backend_consistency has been running for over 60 seconds
  1073. 767.23 s > test aa_aa::important::aa_aa_local_inspect_backend_consistency ... FAILED
  1074. 767.23 s >
  1075. 767.23 s > failures:
  1076. 767.23 s >
  1077. 767.23 s > failures:
  1078. 767.23 s > aa_aa::important::aa_aa_local_inspect_backend_consistency
  1079. 767.23 s >
  1080. 767.23 s > test result: FAILED. 0 passed; 1 failed; 0 ignored; 0 measured; 258 filtered out; finished in 67.33s
  1081. 767.23 s > system-err
  1082. 767.23 s > [2026-09-06 07:59:19.222] @gammaloop_api::se... INFO : Running command import model sm-default.json
  1083. 767.23 s > [2026-09-06 07:59:19.222] @import::model INFO : Loading built-in JSON model sm-default
  1084. 767.23 s > [2026-09-06 07:59:19.243] @gammalooprs::model INFO : The following 11 external parameters were forced to zero by the restriction card:
  1085. 767.23 s > lamWS, AWS, rhoWS, etaWS, ymc, yme, ymm, MC, Me, MM, WTau
  1086. 767.23 s > [2026-09-06 07:59:19.243] @gammalooprs::model INFO : The following 34 vertex rules were removed by the restriction card:
  1087. 767.23 s > V_82 -> (c~, d, G+) | V_83 -> (t~, d, G+) | V_84 -> (c~, s, G+) | V_85 -> (t~, s, G+) | V_86 -> (u~, b, G+) | V_87 -> (c~, b, G+) | V_90 -> (c~, d, W+) | V_91 -> (t~, d, W+) | V_92 -> (u~, s, W+) | V_94 -> (t~, s, W+) | V_95 -> (u~, b, W+) | V_96 -> (c~, b, W+) | V_101 -> (e+, e-, G0) | V_102 -> (mu+, mu-, G0) | V_104 -> (e+, e-, H) | V_105 -> (mu+, mu-, H) | V_110 -> (ve~, e-, G+) | V_111 -> (vm~, mu-, G+) | V_116 -> (b~, u, G-) | V_117 -> (d~, c, G-) | V_118 -> (s~, c, G-) | V_119 -> (b~, c, G-) | V_120 -> (d~, t, G-) | V_121 -> (s~, t, G-) | V_124 -> (s~, u, W-) | V_125 -> (b~, u, W-) | V_126 -> (d~, c, W-) | V_128 -> (b~, c, W-) | V_129 -> (d~, t, W-) | V_130 -> (s~, t, W-) | V_138 -> (c~, c, G0) | V_140 -> (c~, c, H) | V_145 -> (e+, ve, G-) | V_146 -> (mu+, vm, G-)
  1088. 767.23 s > [2026-09-06 07:59:19.243] @gammalooprs::model INFO : The following 36 couplings were removed by the restriction card:
  1089. 767.23 s > GC_13, GC_14, GC_16, GC_17, GC_18, GC_19, GC_20, GC_22, GC_23, GC_24, GC_25, GC_26, GC_28, GC_29, GC_42, GC_43, GC_44, GC_46, GC_47, GC_48, GC_84, GC_85, GC_86, GC_87, GC_88, GC_89, GC_90, GC_91, GC_92, GC_93, GC_101, GC_102, GC_103, GC_105, GC_106, GC_107
  1090. 767.23 s > [2026-09-06 07:59:19.243] @gammaloop_api::se... INFO : Running command run set_model_parameters
  1091. 767.23 s > [2026-09-06 07:59:19.243] @gammaloop_api::se... INFO : Starting command block set_model_parameters
  1092. 767.23 s > [2026-09-06 07:59:19.244] @gammaloop_api::se... INFO : Running command set model MT=173.0
  1093. 767.23 s > [2026-09-06 07:59:19.247] @gammaloop_api::se... INFO : Running command set model WT=0.0
  1094. 767.23 s > [2026-09-06 07:59:19.251] @gammaloop_api::se... INFO : Running command set model ymt=173.0
  1095. 767.23 s > [2026-09-06 07:59:19.255] @gammaloop_api::se... INFO : Running command set model aS=0.118
  1096. 767.23 s > [2026-09-06 07:59:19.258] @gammaloop_api::se... INFO : Running command set model aEWM1=137.036
  1097. 767.23 s > [2026-09-06 07:59:19.262] @gammaloop_api::se... INFO : Running command set model Gf=1.166390e-05
  1098. 767.23 s > [2026-09-06 07:59:19.265] @gammaloop_api::se... INFO : Running command set model MZ=91.188
  1099. 767.23 s > [2026-09-06 07:59:19.269] @gammaloop_api::se... INFO : Running command set global string '
  1100. 767.23 s > [global.generation.compile]
  1101. 767.23 s > compilation_mode = "symjit"
  1102. 767.23 s > optimization_level = "O0"
  1103. 767.23 s > fast_math = false
  1104. 767.23 s > [...]
  1105. 767.23 s > [2026-09-06 07:59:19.270] @gammaloop_api::se... INFO : Running command import graphs ./examples/cli/aa_aa/1L/aa_aa_1L.dot -p aa_aa_all_helicities -i 1L_ppmm -o
  1106. 767.23 s > [2026-09-06 07:59:19.270] @commands::import INFO : Loading graphs from '/build/source/examples/cli/aa_aa/1L/aa_aa_1L.dot'
  1107. 767.23 s > [2026-09-06 07:59:19.279] @gammaloop_api::se... INFO : Running command generate existing -p aa_aa_all_helicities
  1108. 767.23 s > [2026-09-06 07:59:44.213] @commands::generate INFO :
  1109. 767.23 s > Integrand generation summary
  1110. 767.23 s > peak RAM 1.10 GiB | cores 1
  1111. 767.23 s > ╭───────────┬───────┬─────────┬──────────────┬─────────────┬────────────────┬──────────────╮
  1112. 767.23 s > │ integrand │ graph │ # evals │ expr build │ spenso │ symbolica eval │ compile │
  1113. 767.23 s > ├───────────┼───────┼─────────┼──────────────┼─────────────┼────────────────┼──────────────┤
  1114. 767.23 s > │ 1L_ppmm │ GL0 │ 13 │ 521ms (6.2%) │ 1.61s (19%) │ 5.40s (64%) │ 866ms (10%) │
  1115. 767.23 s > │ 1L_ppmm │ GL2 │ 13 │ 524ms (6.3%) │ 1.43s (17%) │ 5.53s (67%) │ 799ms (9.6%) │
  1116. 767.23 s > │ 1L_ppmm │ GL4 │ 11 │ 519ms (6.4%) │ 1.40s (17%) │ 5.46s (67%) │ 760ms (9.3%) │
  1117. 767.23 s > ├───────────┼───────┼─────────┼──────────────┼─────────────┼────────────────┼──────────────┤
  1118. 767.23 s > │ Total │ │ 37 │ 1.57s (6.3%) │ 4.45s (18%) │ 16.39s (66%) │ 2.43s (9.8%) │
  1119. 767.23 s > ╰───────────┴───────┴─────────┴──────────────┴─────────────┴────────────────┴──────────────╯
  1120. 767.23 s > [2026-09-06 07:59:44.858] @gammaloop_api::se... INFO : Running command import model sm-default.json
  1121. 767.23 s > [2026-09-06 07:59:44.858] @import::model INFO : Loading built-in JSON model sm-default
  1122. 767.23 s > [2026-09-06 07:59:44.879] @gammalooprs::model INFO : The following 11 external parameters were forced to zero by the restriction card:
  1123. 767.23 s > lamWS, AWS, rhoWS, etaWS, ymc, yme, ymm, MC, Me, MM, WTau
  1124. 767.23 s > [2026-09-06 07:59:44.879] @gammalooprs::model INFO : The following 34 vertex rules were removed by the restriction card:
  1125. 767.23 s > V_82 -> (c~, d, G+) | V_83 -> (t~, d, G+) | V_84 -> (c~, s, G+) | V_85 -> (t~, s, G+) | V_86 -> (u~, b, G+) | V_87 -> (c~, b, G+) | V_90 -> (c~, d, W+) | V_91 -> (t~, d, W+) | V_92 -> (u~, s, W+) | V_94 -> (t~, s, W+) | V_95 -> (u~, b, W+) | V_96 -> (c~, b, W+) | V_101 -> (e+, e-, G0) | V_102 -> (mu+, mu-, G0) | V_104 -> (e+, e-, H) | V_105 -> (mu+, mu-, H) | V_110 -> (ve~, e-, G+) | V_111 -> (vm~, mu-, G+) | V_116 -> (b~, u, G-) | V_117 -> (d~, c, G-) | V_118 -> (s~, c, G-) | V_119 -> (b~, c, G-) | V_120 -> (d~, t, G-) | V_121 -> (s~, t, G-) | V_124 -> (s~, u, W-) | V_125 -> (b~, u, W-) | V_126 -> (d~, c, W-) | V_128 -> (b~, c, W-) | V_129 -> (d~, t, W-) | V_130 -> (s~, t, W-) | V_138 -> (c~, c, G0) | V_140 -> (c~, c, H) | V_145 -> (e+, ve, G-) | V_146 -> (mu+, vm, G-)
  1126. 767.23 s > [2026-09-06 07:59:44.879] @gammalooprs::model INFO : The following 36 couplings were removed by the restriction card:
  1127. 767.23 s > GC_13, GC_14, GC_16, GC_17, GC_18, GC_19, GC_20, GC_22, GC_23, GC_24, GC_25, GC_26, GC_28, GC_29, GC_42, GC_43, GC_44, GC_46, GC_47, GC_48, GC_84, GC_85, GC_86, GC_87, GC_88, GC_89, GC_90, GC_91, GC_92, GC_93, GC_101, GC_102, GC_103, GC_105, GC_106, GC_107
  1128. 767.23 s > [2026-09-06 07:59:44.880] @gammaloop_api::se... INFO : Running command run set_model_parameters
  1129. 767.23 s > [2026-09-06 07:59:44.880] @gammaloop_api::se... INFO : Starting command block set_model_parameters
  1130. 767.23 s > [2026-09-06 07:59:44.880] @gammaloop_api::se... INFO : Running command set model MT=173.0
  1131. 767.23 s > [2026-09-06 07:59:44.883] @gammaloop_api::se... INFO : Running command set model WT=0.0
  1132. 767.23 s > [2026-09-06 07:59:44.887] @gammaloop_api::se... INFO : Running command set model ymt=173.0
  1133. 767.23 s > [2026-09-06 07:59:44.890] @gammaloop_api::se... INFO : Running command set model aS=0.118
  1134. 767.23 s > [2026-09-06 07:59:44.894] @gammaloop_api::se... INFO : Running command set model aEWM1=137.036
  1135. 767.23 s > [2026-09-06 07:59:44.897] @gammaloop_api::se... INFO : Running command set model Gf=1.166390e-05
  1136. 767.23 s > [2026-09-06 07:59:44.900] @gammaloop_api::se... INFO : Running command set model MZ=91.188
  1137. 767.23 s > [2026-09-06 07:59:44.904] @gammaloop_api::se... INFO : Running command set global string '
  1138. 767.23 s > [global.generation.compile]
  1139. 767.23 s > compilation_mode = "assembly"
  1140. 767.23 s > optimization_level = "O0"
  1141. 767.23 s > fast_math = false
  1142. 767.23 s > [...]
  1143. 767.23 s > [2026-09-06 07:59:44.905] @gammaloop_api::se... INFO : Running command import graphs ./examples/cli/aa_aa/1L/aa_aa_1L.dot -p aa_aa_all_helicities_assembly -i 1L_ppmm -o
  1144. 767.23 s > [2026-09-06 07:59:44.905] @commands::import INFO : Loading graphs from '/build/source/examples/cli/aa_aa/1L/aa_aa_1L.dot'
  1145. 767.23 s > [2026-09-06 07:59:44.912] @gammaloop_api::se... INFO : Running command generate existing -p aa_aa_all_helicities_assembly
  1146. 767.23 s > [2026-09-06 08:00:07.227] @processes::amplitude INFO : Compiling amplitude 1L_ppmm
  1147. 767.23 s > [2026-09-06 08:00:25.499] @commands::generate INFO : Removed 34 generated C++ source file(s). Use '--keep-sources' to keep them.
  1148. 767.23 s > [2026-09-06 08:00:25.499] @commands::generate INFO :
  1149. 767.23 s > Integrand generation summary
  1150. 767.23 s > peak RAM 2.24 GiB | cores 1
  1151. 767.23 s > ╭───────────┬───────┬─────────┬──────────────┬─────────────┬────────────────┬──────────────╮
  1152. 767.23 s > │ integrand │ graph │ # evals │ expr build │ spenso │ symbolica eval │ compile │
  1153. 767.23 s > ├───────────┼───────┼─────────┼──────────────┼─────────────┼────────────────┼──────────────┤
  1154. 767.23 s > │ 1L_ppmm │ GL0 │ 13 │ 485ms (3.5%) │ 1.39s (10%) │ 5.48s (40%) │ 6.50s (47%) │
  1155. 767.23 s > │ 1L_ppmm │ GL2 │ 13 │ 500ms (3.6%) │ 1.44s (11%) │ 5.47s (40%) │ 6.30s (46%) │
  1156. 767.23 s > │ 1L_ppmm │ GL4 │ 11 │ 486ms (3.7%) │ 1.43s (11%) │ 5.60s (43%) │ 5.46s (42%) │
  1157. 767.23 s > ├───────────┼───────┼─────────┼──────────────┼─────────────┼────────────────┼──────────────┤
  1158. 767.23 s > │ Total │ │ 37 │ 1.47s (3.6%) │ 4.26s (11%) │ 16.55s (41%) │ 18.26s (45%) │
  1159. 767.23 s > ╰───────────┴───────┴─────────┴──────────────┴─────────────┴────────────────┴──────────────╯
  1160. 767.23 s > [2026-09-06 08:00:26.109] @gammaloop_api::se... INFO : Running command set process -p aa_aa_all_helicities -i 1L_ppmm string '
  1161. 767.23 s > [stability]
  1162. 767.23 s > check_on_norm = true
  1163. 767.23 s > escalate_if_exact_zero = false
  1164. 767.23 s > loop_momenta_norm_escalation_factor = -1.0
  1165. 767.23 s > [...]
  1166. 767.23 s > [2026-09-06 08:00:26.110] @gammaloop_api::se... INFO : Running command set process -p aa_aa_all_helicities_assembly -i 1L_ppmm string '
  1167. 767.23 s > [stability]
  1168. 767.23 s > check_on_norm = true
  1169. 767.23 s > escalate_if_exact_zero = false
  1170. 767.23 s > loop_momenta_norm_escalation_factor = -1.0
  1171. 767.23 s > [...]
  1172. 767.23 s > [2026-09-06 08:00:26.111] @gammaloop_api::se... INFO : Running command set process -p aa_aa_all_helicities -i 1L_mpmm string '
  1173. 767.23 s > [stability]
  1174. 767.23 s > check_on_norm = true
  1175. 767.23 s > escalate_if_exact_zero = false
  1176. 767.23 s > loop_momenta_norm_escalation_factor = -1.0
  1177. 767.23 s > [...]
  1178. 767.23 s > [2026-09-06 08:00:26.112] @gammaloop_api::se... INFO : Running command set process -p aa_aa_all_helicities_assembly -i 1L_mpmm string '
  1179. 767.23 s > [stability]
  1180. 767.23 s > check_on_norm = true
  1181. 767.23 s > escalate_if_exact_zero = false
  1182. 767.23 s > loop_momenta_norm_escalation_factor = -1.0
  1183. 767.23 s > [...]
  1184. 767.23 s > [2026-09-06 08:00:26.112] @gammaloop_api::se... INFO : Running command set process -p aa_aa_all_helicities -i 1L_mmmm string '
  1185. 767.23 s > [stability]
  1186. 767.23 s > check_on_norm = true
  1187. 767.23 s > escalate_if_exact_zero = false
  1188. 767.23 s > loop_momenta_norm_escalation_factor = -1.0
  1189. 767.23 s > [...]
  1190. 767.23 s > [2026-09-06 08:00:26.113] @gammaloop_api::se... INFO : Running command set process -p aa_aa_all_helicities_assembly -i 1L_mmmm string '
  1191. 767.23 s > [stability]
  1192. 767.23 s > check_on_norm = true
  1193. 767.23 s > escalate_if_exact_zero = false
  1194. 767.23 s > loop_momenta_norm_escalation_factor = -1.0
  1195. 767.23 s > [...]
  1196. 767.23 s > [2026-09-06 08:00:26.114] @gammaloop_api::se... INFO : Running command set process -p aa_aa_all_helicities -i 1L_pmmp string '
  1197. 767.23 s > [stability]
  1198. 767.23 s > check_on_norm = true
  1199. 767.23 s > escalate_if_exact_zero = false
  1200. 767.23 s > loop_momenta_norm_escalation_factor = -1.0
  1201. 767.23 s > ... omitted 84 more lines; see full nextest output above
  1202. 767.23 s > =========================================
  1203. 767.23 s For full logs, run:
  1204. 767.23 s nix log /nix/store/xaf9bwgnrhpb0jrkx6mcwl1pfl8pk1ly-gammaloop-nextest-integration.drv
  1205. 767.35 s [0 built (1 failed), 0.0Run failed.