test packages.x86_64-linux.nix-ci-check-gammaloop-nextest-linnet

Reproduce this run
Original Run
  1. 0.00 s $ /nix/store/9ypz3flqsrl5xl495mm8h645gadjsxi1-coreutils-9.11/bin/timeout --kill-after=15s 7200s /nix/store/23zk8sgzamrbmj1fday15szf7f2279s8-nix-2.34.7/bin/nix --extra-experimental-features nix-command --extra-experimental-features flakes flake clone git+https://github.com/alphal00p/gammaloop --dest /tmp/nix-ci-worker/stable-pwd/repo/
  2. 0.09 s Cloning into '/tmp/nix-ci-worker/stable-pwd/repo'...
  3. 1.06 s remote: Enumerating objects: 87989, done.
  4. 1.17 s remote: Counting objects: 0% (1/10557) remote: Counting objects: 1% (106/10557) remote: Counting objects: 2% (212/10557) remote: Counting objects: 3% (317/10557) remote: Counting objects: 4% (423/10557) remote: Counting objects: 5% (528/10557) remote: Counting objects: 6% (634/10557) remote: Counting objects: 7% (739/10557) remote: Counting objects: 8% (845/10557) remote: Counting objects: 9% (951/10557) remote: Counting objects: 10% (1056/10557) remote: Counting objects: 11% (1162/10557) remote: Counting objects: 12% (1267/10557) remote: Counting objects: 13% (1373/10557) remote: Counting objects: 14% (1478/10557) remote: Counting objects: 15% (1584/10557) remote: Counting objects: 16% (1690/10557) remote: Counting objects: 17% (1795/10557) remote: Counting objects: 18% (1901/10557) remote: Counting objects: 19% (2006/10557) remote: Counting objects: 20% (2112/10557) remote: Counting objects: 21% (2217/10557) remote: Counting objects: 22% (2323/10557) remote: Counting objects: 23% (2429/10557) remote: Counting objects: 24% (2534/10557) remote: Counting objects: 25% (2640/10557) remote: Counting objects: 26% (2745/10557) remote: Counting objects: 27% (2851/10557) remote: Counting objects: 28% (2956/10557) remote: Counting objects: 29% (3062/10557) remote: Counting objects: 30% (3168/10557) remote: Counting objects: 31% (3273/10557) remote: Counting objects: 32% (3379/10557) remote: Counting objects: 33% (3484/10557) remote: Counting objects: 34% (3590/10557) remote: Counting objects: 35% (3695/10557) remote: Counting objects: 36% (3801/10557) remote: Counting objects: 37% (3907/10557) remote: Counting objects: 38% (4012/10557) remote: Counting objects: 39% (4118/10557) remote: Counting objects: 40% (4223/10557) remote: Counting objects: 41% (4329/10557) remote: Counting objects: 42% (4434/10557) remote: Counting objects: 43% (4540/10557) remote: Counting objects: 44% (4646/10557) remote: Counting objects: 45% (4751/10557) remote: Counting objects: 46% (4857/10557) remote: Counting objects: 47% (4962/10557) remote: Counting objects: 48% (5068/10557) remote: Counting objects: 49% (5173/10557) remote: Counting objects: 50% (5279/10557) remote: Counting objects: 51% (5385/10557) remote: Counting objects: 52% (5490/10557) remote: Counting objects: 53% (5596/10557) remote: Counting objects: 54% (5701/10557) remote: Counting objects: 55% (5807/10557) remote: Counting objects: 56% (5912/10557) remote: Counting objects: 57% (6018/10557) remote: Counting objects: 58% (6124/10557) remote: Counting objects: 59% (6229/10557) remote: Counting objects: 60% (6335/10557) remote: Counting objects: 61% (6440/10557) remote: Counting objects: 62% (6546/10557) remote: Counting objects: 63% (6651/10557) remote: Counting objects: 64% (6757/10557) remote: Counting objects: 65% (6863/10557) remote: Counting objects: 66% (6968/10557) remote: Counting objects: 67% (7074/10557) remote: Counting objects: 68% (7179/10557) remote: Counting objects: 69% (7285/10557) remote: Counting objects: 70% (7390/10557) remote: Counting objects: 71% (7496/10557) remote: Counting objects: 72% (7602/10557) remote: Counting objects: 73% (7707/10557) remote: Counting objects: 74% (7813/10557) remote: Counting objects: 75% (7918/10557) remote: Counting objects: 76% (8024/10557) remote: Counting objects: 77% (8129/10557) remote: Counting objects: 78% (8235/10557) remote: Counting objects: 79% (8341/10557) remote: Counting objects: 80% (8446/10557) remote: Counting objects: 81% (8552/10557) remote: Counting objects: 82% (8657/10557) remote: Counting objects: 83% (8763/10557) remote: Counting objects: 84% (8868/10557) remote: Counting objects: 85% (8974/10557) remote: Counting objects: 86% (9080/10557) remote: Counting objects: 87% (9185/10557) remote: Counting objects: 88% (9291/10557) remote: Counting objects: 89% (9396/10557) remote: Counting objects: 90% (9502/10557) remote: Counting objects: 91% (9607/10557) remote: Counting objects: 92% (9713/10557) remote: Counting objects: 93% (9819/10557) remote: Counting objects: 94% (9924/10557) remote: Counting objects: 95% (10030/10557) remote: Counting objects: 96% (10135/10557) remote: Counting objects: 97% (10241/10557) remote: Counting objects: 98% (10346/10557) remote: Counting objects: 99% (10452/10557) remote: Counting objects: 100% (10557/10557) remote: Counting objects: 100% (10557/10557), done.
  5. 4.07 s remote: Compressing objects: 0% (1/2952) remote: Compressing objects: 1% (30/2952) remote: Compressing objects: 2% (60/2952) remote: Compressing objects: 3% (89/2952) remote: Compressing objects: 4% (119/2952) remote: Compressing objects: 5% (148/2952) remote: Compressing objects: 6% (178/2952) remote: Compressing objects: 7% (207/2952) remote: Compressing objects: 8% (237/2952) remote: Compressing objects: 9% (266/2952) remote: Compressing objects: 10% (296/2952) remote: Compressing objects: 11% (325/2952) remote: Compressing objects: 12% (355/2952) remote: Compressing objects: 13% (384/2952) remote: Compressing objects: 14% (414/2952) remote: Compressing objects: 15% (443/2952) remote: Compressing objects: 15% (450/2952) remote: Compressing objects: 16% (473/2952) remote: Compressing objects: 17% (502/2952) remote: Compressing objects: 18% (532/2952) remote: Compressing objects: 19% (561/2952) remote: Compressing objects: 20% (591/2952) remote: Compressing objects: 21% (620/2952) remote: Compressing objects: 22% (650/2952) remote: Compressing objects: 23% (679/2952) remote: Compressing objects: 24% (709/2952) remote: Compressing objects: 25% (738/2952) remote: Compressing objects: 26% (768/2952) remote: Compressing objects: 26% (777/2952) remote: Compressing objects: 27% (798/2952) remote: Compressing objects: 28% (827/2952) remote: Compressing objects: 29% (857/2952) remote: Compressing objects: 30% (886/2952) remote: Compressing objects: 31% (916/2952) remote: Compressing objects: 32% (945/2952) remote: Compressing objects: 33% (975/2952) remote: Compressing objects: 34% (1004/2952) remote: Compressing objects: 35% (1034/2952) remote: Compressing objects: 36% (1063/2952) remote: Compressing objects: 37% (1093/2952) remote: Compressing objects: 38% (1122/2952) remote: Compressing objects: 39% (1152/2952) remote: Compressing objects: 40% (1181/2952) remote: Compressing objects: 41% (1211/2952) remote: Compressing objects: 42% (1240/2952) remote: Compressing objects: 43% (1270/2952) remote: Compressing objects: 44% (1299/2952) remote: Compressing objects: 45% (1329/2952) remote: Compressing objects: 46% (1358/2952) remote: Compressing objects: 47% (1388/2952) remote: Compressing objects: 48% (1417/2952) remote: Compressing objects: 49% (1447/2952) remote: Compressing objects: 50% (1476/2952) remote: Compressing objects: 51% (1506/2952) remote: Compressing objects: 52% (1536/2952) remote: Compressing objects: 53% (1565/2952) remote: Compressing objects: 54% (1595/2952) remote: Compressing objects: 55% (1624/2952) remote: Compressing objects: 56% (1654/2952) remote: Compressing objects: 57% (1683/2952) remote: Compressing objects: 58% (1713/2952) remote: Compressing objects: 59% (1742/2952) remote: Compressing objects: 60% (1772/2952) remote: Compressing objects: 61% (1801/2952) remote: Compressing objects: 62% (1831/2952) remote: Compressing objects: 63% (1860/2952) remote: Compressing objects: 64% (1890/2952) remote: Compressing objects: 65% (1919/2952) remote: Compressing objects: 66% (1949/2952) remote: Compressing objects: 67% (1978/2952) remote: Compressing objects: 68% (2008/2952) remote: Compressing objects: 69% (2037/2952) remote: Compressing objects: 70% (2067/2952) remote: Compressing objects: 71% (2096/2952) remote: Compressing objects: 72% (2126/2952) remote: Compressing objects: 73% (2155/2952) remote: Compressing objects: 74% (2185/2952) remote: Compressing objects: 75% (2214/2952) remote: Compressing objects: 76% (2244/2952) remote: Compressing objects: 77% (2274/2952) remote: Compressing objects: 78% (2303/2952) remote: Compressing objects: 79% (2333/2952) remote: Compressing objects: 80% (2362/2952) remote: Compressing objects: 81% (2392/2952) remote: Compressing objects: 82% (2421/2952) remote: Compressing objects: 83% (2451/2952) remote: Compressing objects: 84% (2480/2952) remote: Compressing objects: 85% (2510/2952) remote: Compressing objects: 86% (2539/2952) remote: Compressing objects: 87% (2569/2952) remote: Compressing objects: 88% (2598/2952) remote: Compressing objects: 89% (2628/2952) remote: Compressing objects: 90% (2657/2952) remote: Compressing objects: 90% (2681/2952) remote: Compressing objects: 91% (2687/2952) remote: Compressing objects: 92% (2716/2952) remote: Compressing objects: 93% (2746/2952) remote: Compressing objects: 94% (2775/2952) remote: Compressing objects: 95% (2805/2952) remote: Compressing objects: 96% (2834/2952) remote: Compressing objects: 97% (2864/2952) remote: Compressing objects: 98% (2893/2952) remote: Compressing objects: 99% (2923/2952) remote: Compressing objects: 100% (2952/2952) remote: Compressing objects: 100% (2952/2952), done.
  6. 10.42 s Receiving objects: 0% (1/87989) Receiving objects: 1% (880/87989) Receiving objects: 2% (1760/87989) Receiving objects: 3% (2640/87989), 6.49 MiB | 12.97 MiB/s Receiving objects: 4% (3520/87989), 6.49 MiB | 12.97 MiB/s Receiving objects: 5% (4400/87989), 6.49 MiB | 12.97 MiB/s Receiving objects: 6% (5280/87989), 6.49 MiB | 12.97 MiB/s Receiving objects: 7% (6160/87989), 6.49 MiB | 12.97 MiB/s Receiving objects: 8% (7040/87989), 6.49 MiB | 12.97 MiB/s Receiving objects: 9% (7920/87989), 6.49 MiB | 12.97 MiB/s Receiving objects: 10% (8799/87989), 6.49 MiB | 12.97 MiB/s Receiving objects: 11% (9679/87989), 6.49 MiB | 12.97 MiB/s Receiving objects: 12% (10559/87989), 6.49 MiB | 12.97 MiB/s Receiving objects: 13% (11439/87989), 6.49 MiB | 12.97 MiB/s Receiving objects: 14% (12319/87989), 6.49 MiB | 12.97 MiB/s Receiving objects: 15% (13199/87989), 6.49 MiB | 12.97 MiB/s Receiving objects: 16% (14079/87989), 6.49 MiB | 12.97 MiB/s Receiving objects: 17% (14959/87989), 6.49 MiB | 12.97 MiB/s Receiving objects: 18% (15839/87989), 6.49 MiB | 12.97 MiB/s Receiving objects: 19% (16718/87989), 6.49 MiB | 12.97 MiB/s Receiving objects: 20% (17598/87989), 6.49 MiB | 12.97 MiB/s Receiving objects: 21% (18478/87989), 6.49 MiB | 12.97 MiB/s Receiving objects: 22% (19358/87989), 6.49 MiB | 12.97 MiB/s Receiving objects: 23% (20238/87989), 6.49 MiB | 12.97 MiB/s Receiving objects: 24% (21118/87989), 6.49 MiB | 12.97 MiB/s Receiving objects: 25% (21998/87989), 6.49 MiB | 12.97 MiB/s Receiving objects: 25% (22649/87989), 25.29 MiB | 24.73 MiB/s Receiving objects: 26% (22878/87989), 25.29 MiB | 24.73 MiB/s Receiving objects: 27% (23758/87989), 25.29 MiB | 24.73 MiB/s Receiving objects: 28% (24637/87989), 25.29 MiB | 24.73 MiB/s Receiving objects: 29% (25517/87989), 25.29 MiB | 24.73 MiB/s Receiving objects: 30% (26397/87989), 25.29 MiB | 24.73 MiB/s Receiving objects: 31% (27277/87989), 25.29 MiB | 24.73 MiB/s Receiving objects: 32% (28157/87989), 25.29 MiB | 24.73 MiB/s Receiving objects: 33% (29037/87989), 25.29 MiB | 24.73 MiB/s Receiving objects: 34% (29917/87989), 25.29 MiB | 24.73 MiB/s Receiving objects: 35% (30797/87989), 25.29 MiB | 24.73 MiB/s Receiving objects: 36% (31677/87989), 25.29 MiB | 24.73 MiB/s Receiving objects: 37% (32556/87989), 25.29 MiB | 24.73 MiB/s Receiving objects: 38% (33436/87989), 25.29 MiB | 24.73 MiB/s Receiving objects: 39% (34316/87989), 25.29 MiB | 24.73 MiB/s Receiving objects: 40% (35196/87989), 25.29 MiB | 24.73 MiB/s Receiving objects: 41% (36076/87989), 25.29 MiB | 24.73 MiB/s Receiving objects: 42% (36956/87989), 25.29 MiB | 24.73 MiB/s Receiving objects: 43% (37836/87989), 40.84 MiB | 26.82 MiB/s Receiving objects: 44% (38716/87989), 40.84 MiB | 26.82 MiB/s Receiving objects: 45% (39596/87989), 40.84 MiB | 26.82 MiB/s Receiving objects: 46% (40475/87989), 40.84 MiB | 26.82 MiB/s Receiving objects: 47% (41355/87989), 40.84 MiB | 26.82 MiB/s Receiving objects: 48% (42235/87989), 40.84 MiB | 26.82 MiB/s Receiving objects: 49% (43115/87989), 40.84 MiB | 26.82 MiB/s Receiving objects: 50% (43995/87989), 40.84 MiB | 26.82 MiB/s Receiving objects: 51% (44875/87989), 40.84 MiB | 26.82 MiB/s Receiving objects: 52% (45755/87989), 40.84 MiB | 26.82 MiB/s Receiving objects: 52% (46265/87989), 40.84 MiB | 26.82 MiB/s Receiving objects: 53% (46635/87989), 56.27 MiB | 27.42 MiB/s Receiving objects: 54% (47515/87989), 56.27 MiB | 27.42 MiB/s Receiving objects: 55% (48394/87989), 56.27 MiB | 27.42 MiB/s Receiving objects: 56% (49274/87989), 56.27 MiB | 27.42 MiB/s Receiving objects: 57% (50154/87989), 56.27 MiB | 27.42 MiB/s Receiving objects: 58% (51034/87989), 71.54 MiB | 27.91 MiB/s Receiving objects: 59% (51914/87989), 71.54 MiB | 27.91 MiB/s Receiving objects: 60% (52794/87989), 71.54 MiB | 27.91 MiB/s Receiving objects: 61% (53674/87989), 71.54 MiB | 27.91 MiB/s Receiving objects: 62% (54554/87989), 71.54 MiB | 27.91 MiB/s Receiving objects: 63% (55434/87989), 71.54 MiB | 27.91 MiB/s Receiving objects: 64% (56313/87989), 71.54 MiB | 27.91 MiB/s Receiving objects: 65% (57193/87989), 71.54 MiB | 27.91 MiB/s Receiving objects: 65% (57359/87989), 87.90 MiB | 28.69 MiB/s Receiving objects: 66% (58073/87989), 101.58 MiB | 28.50 MiB/s Receiving objects: 67% (58953/87989), 101.58 MiB | 28.50 MiB/s Receiving objects: 68% (59833/87989), 101.58 MiB | 28.50 MiB/s Receiving objects: 69% (60713/87989), 101.58 MiB | 28.50 MiB/s Receiving objects: 70% (61593/87989), 101.58 MiB | 28.50 MiB/s Receiving objects: 71% (62473/87989), 101.58 MiB | 28.50 MiB/s Receiving objects: 71% (63014/87989), 101.58 MiB | 28.50 MiB/s Receiving objects: 72% (63353/87989), 117.89 MiB | 28.98 MiB/s Receiving objects: 73% (64232/87989), 117.89 MiB | 28.98 MiB/s Receiving objects: 74% (65112/87989), 131.34 MiB | 28.76 MiB/s Receiving objects: 75% (65992/87989), 131.34 MiB | 28.76 MiB/s Receiving objects: 76% (66872/87989), 131.34 MiB | 28.76 MiB/s Receiving objects: 77% (67752/87989), 131.34 MiB | 28.76 MiB/s Receiving objects: 78% (68632/87989), 131.34 MiB | 28.76 MiB/s Receiving objects: 79% (69512/87989), 131.34 MiB | 28.76 MiB/s Receiving objects: 80% (70392/87989), 131.34 MiB | 28.76 MiB/s Receiving objects: 81% (71272/87989), 131.34 MiB | 28.76 MiB/s Receiving objects: 82% (72151/87989), 131.34 MiB | 28.76 MiB/s Receiving objects: 83% (73031/87989), 131.34 MiB | 28.76 MiB/s Receiving objects: 84% (73911/87989), 131.34 MiB | 28.76 MiB/s Receiving objects: 84% (74152/87989), 131.34 MiB | 28.76 MiB/s Receiving objects: 85% (74791/87989), 146.87 MiB | 30.74 MiB/s Receiving objects: 86% (75671/87989), 146.87 MiB | 30.74 MiB/s Receiving objects: 87% (76551/87989), 146.87 MiB | 30.74 MiB/s Receiving objects: 88% (77431/87989), 146.87 MiB | 30.74 MiB/s Receiving objects: 89% (78311/87989), 146.87 MiB | 30.74 MiB/s Receiving objects: 90% (79191/87989), 146.87 MiB | 30.74 MiB/s Receiving objects: 91% (80070/87989), 146.87 MiB | 30.74 MiB/s Receiving objects: 92% (80950/87989), 146.87 MiB | 30.74 MiB/s Receiving objects: 93% (81830/87989), 146.87 MiB | 30.74 MiB/s Receiving objects: 94% (82710/87989), 146.87 MiB | 30.74 MiB/s Receiving objects: 95% (83590/87989), 146.87 MiB | 30.74 MiB/s Receiving objects: 96% (84470/87989), 146.87 MiB | 30.74 MiB/s Receiving objects: 97% (85350/87989), 146.87 MiB | 30.74 MiB/s Receiving objects: 98% (86230/87989), 146.87 MiB | 30.74 MiB/s Receiving objects: 98% (86800/87989), 172.79 MiB | 27.63 MiB/s Receiving objects: 99% (87110/87989), 172.79 MiB | 27.63 MiB/s remote: Total 87989 (delta 8613), reused 8381 (delta 7579), pack-reused 77432 (from 3)
  7. 10.42 s Receiving objects: 100% (87989/87989), 172.79 MiB | 27.63 MiB/s Receiving objects: 100% (87989/87989), 176.53 MiB | 27.79 MiB/s, done.
  8. 11.52 s Resolving deltas: 0% (0/59508) Resolving deltas: 1% (597/59508) Resolving deltas: 2% (1192/59508) Resolving deltas: 3% (1786/59508) Resolving deltas: 4% (2383/59508) Resolving deltas: 5% (2976/59508) Resolving deltas: 6% (3571/59508) Resolving deltas: 7% (4166/59508) Resolving deltas: 8% (4761/59508) Resolving deltas: 9% (5356/59508) Resolving deltas: 10% (5953/59508) Resolving deltas: 11% (6546/59508) Resolving deltas: 12% (7141/59508) Resolving deltas: 13% (7737/59508) Resolving deltas: 14% (8332/59508) Resolving deltas: 15% (8927/59508) Resolving deltas: 16% (9522/59508) Resolving deltas: 17% (10118/59508) Resolving deltas: 18% (10713/59508) Resolving deltas: 19% (11307/59508) Resolving deltas: 20% (11902/59508) Resolving deltas: 21% (12497/59508) Resolving deltas: 22% (13093/59508) Resolving deltas: 23% (13688/59508) Resolving deltas: 24% (14285/59508) Resolving deltas: 25% (14877/59508) Resolving deltas: 26% (15474/59508) Resolving deltas: 27% (16068/59508) Resolving deltas: 28% (16664/59508) Resolving deltas: 29% (17258/59508) Resolving deltas: 30% (17853/59508) Resolving deltas: 31% (18449/59508) Resolving deltas: 32% (19044/59508) Resolving deltas: 33% (19638/59508) Resolving deltas: 34% (20233/59508) Resolving deltas: 35% (20828/59508) Resolving deltas: 36% (21423/59508) Resolving deltas: 37% (22018/59508) Resolving deltas: 38% (22614/59508) Resolving deltas: 39% (23209/59508) Resolving deltas: 40% (23804/59508) Resolving deltas: 41% (24399/59508) Resolving deltas: 42% (24998/59508) Resolving deltas: 43% (25590/59508) Resolving deltas: 44% (26184/59508) Resolving deltas: 45% (26779/59508) Resolving deltas: 46% (27374/59508) Resolving deltas: 47% (27969/59508) Resolving deltas: 48% (28564/59508) Resolving deltas: 49% (29159/59508) Resolving deltas: 50% (29754/59508) Resolving deltas: 51% (30350/59508) Resolving deltas: 52% (30945/59508) Resolving deltas: 53% (31540/59508) Resolving deltas: 54% (32135/59508) Resolving deltas: 55% (32731/59508) Resolving deltas: 56% (33325/59508) Resolving deltas: 57% (33920/59508) Resolving deltas: 58% (34515/59508) Resolving deltas: 59% (35110/59508) Resolving deltas: 60% (35705/59508) Resolving deltas: 61% (36300/59508) Resolving deltas: 62% (36895/59508) Resolving deltas: 63% (37494/59508) Resolving deltas: 64% (38086/59508) Resolving deltas: 65% (38681/59508) Resolving deltas: 66% (39276/59508) Resolving deltas: 67% (39871/59508) Resolving deltas: 68% (40466/59508) Resolving deltas: 69% (41061/59508) Resolving deltas: 70% (41656/59508) Resolving deltas: 71% (42251/59508) Resolving deltas: 72% (42848/59508) Resolving deltas: 73% (43441/59508) Resolving deltas: 74% (44036/59508) Resolving deltas: 75% (44631/59508) Resolving deltas: 76% (45227/59508) Resolving deltas: 77% (45822/59508) Resolving deltas: 78% (46417/59508) Resolving deltas: 79% (47012/59508) Resolving deltas: 80% (47607/59508) Resolving deltas: 81% (48202/59508) Resolving deltas: 82% (48799/59508) Resolving deltas: 83% (49392/59508) Resolving deltas: 84% (49987/59508) Resolving deltas: 85% (50582/59508) Resolving deltas: 86% (51177/59508) Resolving deltas: 87% (51772/59508) Resolving deltas: 88% (52368/59508) Resolving deltas: 89% (52963/59508) Resolving deltas: 90% (53558/59508) Resolving deltas: 91% (54154/59508) Resolving deltas: 92% (54748/59508) Resolving deltas: 92% (54809/59508) Resolving deltas: 93% (55343/59508) Resolving deltas: 94% (55939/59508) Resolving deltas: 95% (56533/59508) Resolving deltas: 96% (57128/59508) Resolving deltas: 97% (57723/59508) Resolving deltas: 98% (58318/59508) Resolving deltas: 99% (58913/59508) Resolving deltas: 100% (59508/59508) Resolving deltas: 100% (59508/59508), done.
  9. 12.15 s Fetching commit 891dec7c25b5d9026c099da021ec7ae3b757dee9 for codex/docs-before-consolidation-20260914 ...
  10. 12.15 s $ /nix/store/bcnisk3ydfgv26v2gw3zlky24g00yww2-git-2.54.0/bin/git fetch origin 891dec7c25b5d9026c099da021ec7ae3b757dee9
  11. 12.64 s From https://github.com/alphal00p/gammaloop
  12. 12.64 s * branch 891dec7c25b5d9026c099da021ec7ae3b757dee9 -> FETCH_HEAD
  13. 12.65 s $ /nix/store/9ypz3flqsrl5xl495mm8h645gadjsxi1-coreutils-9.11/bin/timeout --kill-after=15s 7200s /nix/store/bcnisk3ydfgv26v2gw3zlky24g00yww2-git-2.54.0/bin/git -c advice.detachedHead=false checkout 891dec7c25b5d9026c099da021ec7ae3b757dee9
  14. 12.88 s HEAD is now at 891dec7c2 change photos
  15. 12.89 s $ /nix/store/9ypz3flqsrl5xl495mm8h645gadjsxi1-coreutils-9.11/bin/timeout --kill-after=15s 7200s /nix/store/23zk8sgzamrbmj1fday15szf7f2279s8-nix-2.34.7/bin/nix --extra-experimental-features nix-command --extra-experimental-features flakes --log-format internal-json run .#packages.x86_64-linux.nix-ci-check-gammaloop-nextest-linnet --print-build-logs
  16. 16.91 s
  17. 17.18 s Downloading cached gammaloop-nextest-binaries-linnet-kurvst from https://cache.nix-ci.com
  18. 17.18 s Downloading cached gammaloop-nextest-binaries-linnet-linnest from https://cache.nix-ci.com
  19. 17.18 s Downloading cached gammaloop-nextest-binaries-linnet-linnet from https://cache.nix-ci.com
  20. 17.18 s Downloading cached gammaloop-nextest-binaries-linnet-linnet-py from https://cache.nix-ci.com
  21. 18.38 s Downloaded cached gammaloop-nextest-binaries-linnet-kurvst (3.2 MiB) in 1.2s
  22. 18.38 s Progress: 0 of 1 built, 1 of 6 downloaded from cache (3 downloading)
  23. 19.32 s Downloaded cached gammaloop-nextest-binaries-linnet-linnest (7.4 MiB) in 2.1s
  24. 19.32 s Progress: 0 of 1 built, 2 of 6 downloaded from cache (2 downloading)
  25. 19.72 s Downloaded cached gammaloop-nextest-binaries-linnet-linnet (20.5 MiB) in 2.5s
  26. 19.72 s Progress: 0 of 1 built, 3 of 6 downloaded from cache (1 downloading)
  27. 19.96 s Downloaded cached gammaloop-nextest-binaries-linnet-linnet-py (37 MiB) in 2.7s
  28. 19.96 s Progress: 0 of 1 built, 4 of 6 downloaded from cache
  29. 19.96 s Downloading cached gammaloop-nextest-binaries-linnet from https://cache.nix-ci.com
  30. 20.43 s Downloaded cached gammaloop-nextest-binaries-linnet (1512 B) in 475ms
  31. 20.43 s Progress: 0 of 1 built, 5 of 6 downloaded from cache
  32. 20.43 s Downloading cached nix-ci-check-gammaloop-nextest-linnet from https://cache.nix-ci.com
  33. 21.57 s Downloaded cached nix-ci-check-gammaloop-nextest-linnet (1016 B) in 1.1s
  34. 21.57 s Progress: 0 of 1 built, 6 of 6 downloaded from cache
  35. 25.53 s evaluating derivation 'g querying gammaloop-nexte [0.0 KiB DL] querying in [0/1 built, 0.0 KiB DL] [1/0/1 built, 0.0 KiB DLgammaloop-nextest-linnet> Extracting 2 binaries (including 1 non-test binary) to /build/source
  36. 25.57 s gammaloop-nextest-linnet> Extracted 6 files to /build/source in 0.04s
  37. 25.57 s gammaloop-nextest-linnet> ------------
  38. 25.57 s gammaloop-nextest-linnet> Nextest run ID 89120fb5-5204-46da-96c7-94ac1d5c94d7 with nextest profile: ci_gammaloop
  39. 25.57 s gammaloop-nextest-linnet> Starting 24 tests across 1 binary
  40. 25.59 s gammaloop-nextest-linnet> ------------
  41. 25.59 s gammaloop-nextest-linnet> Summary [ 0.013s] 24 tests run: 24 passed, 0 skipped
  42. 25.62 s gammaloop-nextest-linnet>
  43. 25.62 s gammaloop-nextest-linnet> ========== nextest test summary ==========
  44. 25.62 s gammaloop-nextest-linnet> report: target/nextest/ci_gammaloop/junit.xml
  45. 25.62 s gammaloop-nextest-linnet> tests: 24, failures: 0, errors: 0
  46. 25.62 s gammaloop-nextest-linnet> No failing testcases found.
  47. 25.62 s gammaloop-nextest-linnet> =========================================
  48. 25.63 s gammaloop-nextest-linnet> Extracting 2 binaries (including 1 non-test binary) and 1 linked path to /build/source
  49. 25.77 s gammaloop-nextest-linnet> Extracted 9 files to /build/source in 0.13s
  50. 25.78 s gammaloop-nextest-linnet> ------------
  51. 25.78 s gammaloop-nextest-linnet> Nextest run ID 3d8d5824-c9ac-415a-9ede-346e950545ef with nextest profile: ci_gammaloop
  52. 25.78 s gammaloop-nextest-linnet> Starting 183 tests across 1 binary
  53. 25.90 s gammaloop-nextest-linnet> ------------
  54. 25.90 s gammaloop-nextest-linnet> Summary [ 0.123s] 183 tests run: 183 passed, 0 skipped
  55. 25.93 s gammaloop-nextest-linnet>
  56. 25.93 s gammaloop-nextest-linnet> ========== nextest test summary ==========
  57. 25.93 s gammaloop-nextest-linnet> report: target/nextest/ci_gammaloop/junit.xml
  58. 25.93 s gammaloop-nextest-linnet> tests: 183, failures: 0, errors: 0
  59. 25.93 s gammaloop-nextest-linnet> No failing testcases found.
  60. 25.93 s gammaloop-nextest-linnet> =========================================
  61. 25.95 s gammaloop-nextest-linnet> Extracting 4 binaries (including 3 non-test binaries), 1 build script output directory, and 1 linked path to /build/source
  62. 26.18 s gammaloop-nextest-linnet> Extracted 13 files to /build/source in 0.23s
  63. 26.19 s gammaloop-nextest-linnet> ------------
  64. 26.19 s gammaloop-nextest-linnet> Nextest run ID 3f8d6edd-6ca3-48af-b55a-e4d393dd4826 with nextest profile: ci_gammaloop
  65. 26.19 s gammaloop-nextest-linnet> Starting 0 tests across 1 binary
  66. 26.19 s gammaloop-nextest-linnet> ------------
  67. 26.19 s gammaloop-nextest-linnet> Summary [ 0.000s] 0 tests run: 0 passed, 0 skipped
  68. 26.22 s gammaloop-nextest-linnet>
  69. 26.22 s gammaloop-nextest-linnet> ========== nextest test summary ==========
  70. 26.22 s gammaloop-nextest-linnet> report: target/nextest/ci_gammaloop/junit.xml
  71. 26.22 s gammaloop-nextest-linnet> tests: 0, failures: 0, errors: 0
  72. 26.22 s gammaloop-nextest-linnet> No failing testcases found.
  73. 26.22 s gammaloop-nextest-linnet> =========================================
  74. 26.23 s gammaloop-nextest-linnet> Extracting 2 binaries (including 1 non-test binary) and 1 linked path to /build/source
  75. 26.30 s gammaloop-nextest-linnet> Extracted 9 files to /build/source in 0.07s
  76. 26.31 s gammaloop-nextest-linnet> ------------
  77. 26.31 s gammaloop-nextest-linnet> Nextest run ID 9fc86cc2-8c6d-4617-a27f-ef2a0eb0b01c with nextest profile: ci_gammaloop
  78. 26.31 s gammaloop-nextest-linnet> Starting 128 tests across 1 binary
  79. 26.36 s gammaloop-nextest-linnet> FAIL [ 0.008s] (107/128) linnest tests::test_graph_structural_axis_merge_preserves_edge_positions_and_constraints
  80. 26.36 s gammaloop-nextest-linnet> stdout ---
  81. 26.36 s gammaloop-nextest-linnet>
  82. 26.36 s gammaloop-nextest-linnet> running 1 test
  83. 26.36 s gammaloop-nextest-linnet> test tests::test_graph_structural_axis_merge_preserves_edge_positions_and_constraints ... FAILED
  84. 26.36 s gammaloop-nextest-linnet>
  85. 26.36 s gammaloop-nextest-linnet> failures:
  86. 26.36 s gammaloop-nextest-linnet>
  87. 26.36 s gammaloop-nextest-linnet> failures:
  88. 26.36 s gammaloop-nextest-linnet> tests::test_graph_structural_axis_merge_preserves_edge_positions_and_constraints
  89. 26.36 s gammaloop-nextest-linnet>
  90. 26.36 s gammaloop-nextest-linnet> test result: FAILED. 0 passed; 1 failed; 0 ignored; 0 measured; 127 filtered out; finished in 0.00s
  91. 26.36 s gammaloop-nextest-linnet>
  92. 26.36 s gammaloop-nextest-linnet> stderr ---
  93. 26.36 s gammaloop-nextest-linnet>
  94. 26.36 s gammaloop-nextest-linnet> thread 'tests::test_graph_structural_axis_merge_preserves_edge_positions_and_constraints' (930) panicked at crates/linnest/src/tests.rs:1721:32:
  95. 26.36 s gammaloop-nextest-linnet> no entry found for key
  96. 26.36 s gammaloop-nextest-linnet> stack backtrace:
  97. 26.36 s gammaloop-nextest-linnet> 0: __rustc::rust_begin_unwind
  98. 26.36 s gammaloop-nextest-linnet> 1: core::panicking::panic_fmt
  99. 26.36 s gammaloop-nextest-linnet> 2: core::option::expect_failed
  100. 26.36 s gammaloop-nextest-linnet> 3: linnest::tests::test_graph_structural_axis_merge_preserves_edge_positions_and_constraints
  101. 26.36 s gammaloop-nextest-linnet> 4: <linnest::tests::test_graph_structural_axis_merge_preserves_edge_positions_and_constraints::{closure#0} as core::ops::function::FnOnce<()>>::call_once
  102. 26.36 s gammaloop-nextest-linnet> note: Some details are omitted, run with `RUST_BACKTRACE=full` for a verbose backtrace.
  103. 26.36 s gammaloop-nextest-linnet>
  104. 26.37 s gammaloop-nextest-linnet> ------------
  105. 26.37 s gammaloop-nextest-linnet> Summary [ 0.061s] 128 tests run: 127 passed, 1 failed, 0 skipped
  106. 26.37 s gammaloop-nextest-linnet> FAIL [ 0.008s] (107/128) linnest tests::test_graph_structural_axis_merge_preserves_edge_positions_and_constraints
  107. 26.37 s gammaloop-nextest-linnet> stdout ---
  108. 26.37 s gammaloop-nextest-linnet>
  109. 26.37 s gammaloop-nextest-linnet> running 1 test
  110. 26.37 s gammaloop-nextest-linnet> test tests::test_graph_structural_axis_merge_preserves_edge_positions_and_constraints ... FAILED
  111. 26.37 s gammaloop-nextest-linnet>
  112. 26.37 s gammaloop-nextest-linnet> failures:
  113. 26.37 s gammaloop-nextest-linnet>
  114. 26.37 s gammaloop-nextest-linnet> failures:
  115. 26.37 s gammaloop-nextest-linnet> tests::test_graph_structural_axis_merge_preserves_edge_positions_and_constraints
  116. 26.37 s gammaloop-nextest-linnet>
  117. 26.37 s gammaloop-nextest-linnet> test result: FAILED. 0 passed; 1 failed; 0 ignored; 0 measured; 127 filtered out; finished in 0.00s
  118. 26.37 s gammaloop-nextest-linnet>
  119. 26.37 s gammaloop-nextest-linnet> stderr ---
  120. 26.37 s gammaloop-nextest-linnet>
  121. 26.37 s gammaloop-nextest-linnet> thread 'tests::test_graph_structural_axis_merge_preserves_edge_positions_and_constraints' (930) panicked at crates/linnest/src/tests.rs:1721:32:
  122. 26.37 s gammaloop-nextest-linnet> no entry found for key
  123. 26.37 s gammaloop-nextest-linnet> stack backtrace:
  124. 26.37 s gammaloop-nextest-linnet> 0: __rustc::rust_begin_unwind
  125. 26.37 s gammaloop-nextest-linnet> 1: core::panicking::panic_fmt
  126. 26.37 s gammaloop-nextest-linnet> 2: core::option::expect_failed
  127. 26.37 s gammaloop-nextest-linnet> 3: linnest::tests::test_graph_structural_axis_merge_preserves_edge_positions_and_constraints
  128. 26.37 s gammaloop-nextest-linnet> 4: <linnest::tests::test_graph_structural_axis_merge_preserves_edge_positions_and_constraints::{closure#0} as core::ops::function::FnOnce<()>>::call_once
  129. 26.37 s gammaloop-nextest-linnet> note: Some details are omitted, run with `RUST_BACKTRACE=full` for a verbose backtrace.
  130. 26.37 s gammaloop-nextest-linnet>
  131. 26.38 s gammaloop-nextest-linnet> error: test run failed
  132. 26.40 s gammaloop-nextest-linnet>
  133. 26.40 s gammaloop-nextest-linnet> ========== nextest test summary ==========
  134. 26.40 s gammaloop-nextest-linnet> report: target/nextest/ci_gammaloop/junit.xml
  135. 26.40 s gammaloop-nextest-linnet> tests: 128, failures: 1, errors: 0
  136. 26.40 s gammaloop-nextest-linnet>
  137. 26.40 s gammaloop-nextest-linnet> 1. linnest::tests::test_graph_structural_axis_merge_preserves_edge_positions_and_constraints
  138. 26.40 s gammaloop-nextest-linnet> failure: test failure with exit code 101
  139. 26.40 s gammaloop-nextest-linnet> thread 'tests::test_graph_structural_axis_merge_preserves_edge_positions_and_constraints' (930) panicked at crates/linnest/src/tests.rs:1721:32:
  140. 26.40 s gammaloop-nextest-linnet> no entry found for key
  141. 26.40 s gammaloop-nextest-linnet> stack backtrace:
  142. 26.40 s gammaloop-nextest-linnet> 0: __rustc::rust_begin_unwind
  143. 26.40 s gammaloop-nextest-linnet> 1: core::panicking::panic_fmt
  144. 26.40 s gammaloop-nextest-linnet> 2: core::option::expect_failed
  145. 26.40 s gammaloop-nextest-linnet> 3: linnest::tests::test_graph_structural_axis_merge_preserves_edge_positions_and_constraints
  146. 26.40 s gammaloop-nextest-linnet> 4: <linnest::tests::test_graph_structural_axis_merge_preserves_edge_positions_and_constraints::{closure#0} as core::ops::function::FnOnce<()>>::call_once
  147. 26.40 s gammaloop-nextest-linnet> note: Some details are omitted, run with `RUST_BACKTRACE=full` for a verbose backtrace.
  148. 26.40 s gammaloop-nextest-linnet> system-out
  149. 26.40 s gammaloop-nextest-linnet> running 1 test
  150. 26.40 s gammaloop-nextest-linnet> test tests::test_graph_structural_axis_merge_preserves_edge_positions_and_constraints ... FAILED
  151. 26.40 s gammaloop-nextest-linnet>
  152. 26.40 s gammaloop-nextest-linnet> failures:
  153. 26.40 s gammaloop-nextest-linnet>
  154. 26.40 s gammaloop-nextest-linnet> failures:
  155. 26.40 s gammaloop-nextest-linnet> tests::test_graph_structural_axis_merge_preserves_edge_positions_and_constraints
  156. 26.40 s gammaloop-nextest-linnet>
  157. 26.40 s gammaloop-nextest-linnet> test result: FAILED. 0 passed; 1 failed; 0 ignored; 0 measured; 127 filtered out; finished in 0.00s
  158. 26.40 s gammaloop-nextest-linnet> system-err
  159. 26.40 s gammaloop-nextest-linnet> thread 'tests::test_graph_structural_axis_merge_preserves_edge_positions_and_constraints' (930) panicked at crates/linnest/src/tests.rs:1721:32:
  160. 26.40 s gammaloop-nextest-linnet> no entry found for key
  161. 26.40 s gammaloop-nextest-linnet> stack backtrace:
  162. 26.40 s gammaloop-nextest-linnet> 0: __rustc::rust_begin_unwind
  163. 26.40 s gammaloop-nextest-linnet> 1: core::panicking::panic_fmt
  164. 26.40 s gammaloop-nextest-linnet> 2: core::option::expect_failed
  165. 26.40 s gammaloop-nextest-linnet> 3: linnest::tests::test_graph_structural_axis_merge_preserves_edge_positions_and_constraints
  166. 26.40 s gammaloop-nextest-linnet> 4: <linnest::tests::test_graph_structural_axis_merge_preserves_edge_positions_and_constraints::{closure#0} as core::ops::function::FnOnce<()>>::call_once
  167. 26.40 s gammaloop-nextest-linnet> note: Some details are omitted, run with `RUST_BACKTRACE=full` for a verbose backtrace.
  168. 26.40 s gammaloop-nextest-linnet> =========================================
  169. 26.48 s [0 built (1 failed), 0.0error: Cannot build '/nix/store/3a6s86hhbf2g1hgbkmcq3zdrmaha78qr-gammaloop-nextest-linnet.drv'.
  170. 26.48 s Reason: builder failed with exit code 100.
  171. 26.48 s Output paths:
  172. 26.48 s /nix/store/v4cbh6ql60kq7xlziivk5va382nw7f4v-gammaloop-nextest-linnet
  173. 26.48 s Last 134 log lines:
  174. 26.48 s > Extracting 2 binaries (including 1 non-test binary) to /build/source
  175. 26.48 s > Extracted 6 files to /build/source in 0.04s
  176. 26.48 s > ------------
  177. 26.48 s > Nextest run ID 89120fb5-5204-46da-96c7-94ac1d5c94d7 with nextest profile: ci_gammaloop
  178. 26.48 s > Starting 24 tests across 1 binary
  179. 26.48 s > ------------
  180. 26.48 s > Summary [ 0.013s] 24 tests run: 24 passed, 0 skipped
  181. 26.48 s >
  182. 26.48 s > ========== nextest test summary ==========
  183. 26.48 s > report: target/nextest/ci_gammaloop/junit.xml
  184. 26.48 s > tests: 24, failures: 0, errors: 0
  185. 26.48 s > No failing testcases found.
  186. 26.48 s > =========================================
  187. 26.48 s > Extracting 2 binaries (including 1 non-test binary) and 1 linked path to /build/source
  188. 26.48 s > Extracted 9 files to /build/source in 0.13s
  189. 26.48 s > ------------
  190. 26.48 s > Nextest run ID 3d8d5824-c9ac-415a-9ede-346e950545ef with nextest profile: ci_gammaloop
  191. 26.48 s > Starting 183 tests across 1 binary
  192. 26.48 s > ------------
  193. 26.48 s > Summary [ 0.123s] 183 tests run: 183 passed, 0 skipped
  194. 26.48 s >
  195. 26.48 s > ========== nextest test summary ==========
  196. 26.48 s > report: target/nextest/ci_gammaloop/junit.xml
  197. 26.48 s > tests: 183, failures: 0, errors: 0
  198. 26.48 s > No failing testcases found.
  199. 26.48 s > =========================================
  200. 26.48 s > Extracting 4 binaries (including 3 non-test binaries), 1 build script output directory, and 1 linked path to /build/source
  201. 26.48 s > Extracted 13 files to /build/source in 0.23s
  202. 26.48 s > ------------
  203. 26.48 s > Nextest run ID 3f8d6edd-6ca3-48af-b55a-e4d393dd4826 with nextest profile: ci_gammaloop
  204. 26.48 s > Starting 0 tests across 1 binary
  205. 26.48 s > ------------
  206. 26.48 s > Summary [ 0.000s] 0 tests run: 0 passed, 0 skipped
  207. 26.48 s >
  208. 26.48 s > ========== nextest test summary ==========
  209. 26.48 s > report: target/nextest/ci_gammaloop/junit.xml
  210. 26.48 s > tests: 0, failures: 0, errors: 0
  211. 26.48 s > No failing testcases found.
  212. 26.48 s > =========================================
  213. 26.48 s > Extracting 2 binaries (including 1 non-test binary) and 1 linked path to /build/source
  214. 26.48 s > Extracted 9 files to /build/source in 0.07s
  215. 26.48 s > ------------
  216. 26.48 s > Nextest run ID 9fc86cc2-8c6d-4617-a27f-ef2a0eb0b01c with nextest profile: ci_gammaloop
  217. 26.48 s > Starting 128 tests across 1 binary
  218. 26.48 s > FAIL [ 0.008s] (107/128) linnest tests::test_graph_structural_axis_merge_preserves_edge_positions_and_constraints
  219. 26.48 s > stdout ---
  220. 26.48 s >
  221. 26.48 s > running 1 test
  222. 26.48 s > test tests::test_graph_structural_axis_merge_preserves_edge_positions_and_constraints ... FAILED
  223. 26.48 s >
  224. 26.48 s > failures:
  225. 26.48 s >
  226. 26.48 s > failures:
  227. 26.48 s > tests::test_graph_structural_axis_merge_preserves_edge_positions_and_constraints
  228. 26.48 s >
  229. 26.48 s > test result: FAILED. 0 passed; 1 failed; 0 ignored; 0 measured; 127 filtered out; finished in 0.00s
  230. 26.48 s >
  231. 26.49 s > stderr ---
  232. 26.49 s >
  233. 26.49 s > thread 'tests::test_graph_structural_axis_merge_preserves_edge_positions_and_constraints' (930) panicked at crates/linnest/src/tests.rs:1721:32:
  234. 26.49 s > no entry found for key
  235. 26.49 s > stack backtrace:
  236. 26.49 s > 0: __rustc::rust_begin_unwind
  237. 26.49 s > 1: core::panicking::panic_fmt
  238. 26.49 s > 2: core::option::expect_failed
  239. 26.49 s > 3: linnest::tests::test_graph_structural_axis_merge_preserves_edge_positions_and_constraints
  240. 26.49 s > 4: <linnest::tests::test_graph_structural_axis_merge_preserves_edge_positions_and_constraints::{closure#0} as core::ops::function::FnOnce<()>>::call_once
  241. 26.49 s > note: Some details are omitted, run with `RUST_BACKTRACE=full` for a verbose backtrace.
  242. 26.49 s >
  243. 26.49 s > ------------
  244. 26.49 s > Summary [ 0.061s] 128 tests run: 127 passed, 1 failed, 0 skipped
  245. 26.49 s > FAIL [ 0.008s] (107/128) linnest tests::test_graph_structural_axis_merge_preserves_edge_positions_and_constraints
  246. 26.49 s > stdout ---
  247. 26.49 s >
  248. 26.49 s > running 1 test
  249. 26.49 s > test tests::test_graph_structural_axis_merge_preserves_edge_positions_and_constraints ... FAILED
  250. 26.49 s >
  251. 26.49 s > failures:
  252. 26.49 s >
  253. 26.49 s > failures:
  254. 26.49 s > tests::test_graph_structural_axis_merge_preserves_edge_positions_and_constraints
  255. 26.49 s >
  256. 26.49 s > test result: FAILED. 0 passed; 1 failed; 0 ignored; 0 measured; 127 filtered out; finished in 0.00s
  257. 26.49 s >
  258. 26.49 s > stderr ---
  259. 26.49 s >
  260. 26.49 s > thread 'tests::test_graph_structural_axis_merge_preserves_edge_positions_and_constraints' (930) panicked at crates/linnest/src/tests.rs:1721:32:
  261. 26.49 s > no entry found for key
  262. 26.49 s > stack backtrace:
  263. 26.49 s > 0: __rustc::rust_begin_unwind
  264. 26.49 s > 1: core::panicking::panic_fmt
  265. 26.49 s > 2: core::option::expect_failed
  266. 26.49 s > 3: linnest::tests::test_graph_structural_axis_merge_preserves_edge_positions_and_constraints
  267. 26.49 s > 4: <linnest::tests::test_graph_structural_axis_merge_preserves_edge_positions_and_constraints::{closure#0} as core::ops::function::FnOnce<()>>::call_once
  268. 26.49 s > note: Some details are omitted, run with `RUST_BACKTRACE=full` for a verbose backtrace.
  269. 26.49 s >
  270. 26.49 s > error: test run failed
  271. 26.49 s >
  272. 26.49 s > ========== nextest test summary ==========
  273. 26.49 s > report: target/nextest/ci_gammaloop/junit.xml
  274. 26.49 s > tests: 128, failures: 1, errors: 0
  275. 26.49 s >
  276. 26.49 s > 1. linnest::tests::test_graph_structural_axis_merge_preserves_edge_positions_and_constraints
  277. 26.49 s > failure: test failure with exit code 101
  278. 26.49 s > thread 'tests::test_graph_structural_axis_merge_preserves_edge_positions_and_constraints' (930) panicked at crates/linnest/src/tests.rs:1721:32:
  279. 26.49 s > no entry found for key
  280. 26.49 s > stack backtrace:
  281. 26.49 s > 0: __rustc::rust_begin_unwind
  282. 26.49 s > 1: core::panicking::panic_fmt
  283. 26.49 s > 2: core::option::expect_failed
  284. 26.49 s > 3: linnest::tests::test_graph_structural_axis_merge_preserves_edge_positions_and_constraints
  285. 26.49 s > 4: <linnest::tests::test_graph_structural_axis_merge_preserves_edge_positions_and_constraints::{closure#0} as core::ops::function::FnOnce<()>>::call_once
  286. 26.49 s > note: Some details are omitted, run with `RUST_BACKTRACE=full` for a verbose backtrace.
  287. 26.49 s > system-out
  288. 26.49 s > running 1 test
  289. 26.49 s > test tests::test_graph_structural_axis_merge_preserves_edge_positions_and_constraints ... FAILED
  290. 26.49 s >
  291. 26.49 s > failures:
  292. 26.49 s >
  293. 26.49 s > failures:
  294. 26.49 s > tests::test_graph_structural_axis_merge_preserves_edge_positions_and_constraints
  295. 26.49 s >
  296. 26.49 s > test result: FAILED. 0 passed; 1 failed; 0 ignored; 0 measured; 127 filtered out; finished in 0.00s
  297. 26.49 s > system-err
  298. 26.49 s > thread 'tests::test_graph_structural_axis_merge_preserves_edge_positions_and_constraints' (930) panicked at crates/linnest/src/tests.rs:1721:32:
  299. 26.49 s > no entry found for key
  300. 26.49 s > stack backtrace:
  301. 26.49 s > 0: __rustc::rust_begin_unwind
  302. 26.49 s > 1: core::panicking::panic_fmt
  303. 26.49 s > 2: core::option::expect_failed
  304. 26.49 s > 3: linnest::tests::test_graph_structural_axis_merge_preserves_edge_positions_and_constraints
  305. 26.49 s > 4: <linnest::tests::test_graph_structural_axis_merge_preserves_edge_positions_and_constraints::{closure#0} as core::ops::function::FnOnce<()>>::call_once
  306. 26.49 s > note: Some details are omitted, run with `RUST_BACKTRACE=full` for a verbose backtrace.
  307. 26.49 s > =========================================
  308. 26.49 s For full logs, run:
  309. 26.49 s nix log /nix/store/3a6s86hhbf2g1hgbkmcq3zdrmaha78qr-gammaloop-nextest-linnet.drv
  310. 26.60 s Run failed.