test packages.x86_64-linux.nix-ci-check-gammaloop-nextest-linnet

Reproduce this run
Retry Run
  1. 0.01 s $ /nix/store/9ypz3flqsrl5xl495mm8h645gadjsxi1-coreutils-9.11/bin/timeout --kill-after=15s 7200s /nix/store/23zk8sgzamrbmj1fday15szf7f2279s8-nix-2.34.7/bin/nix --extra-experimental-features nix-command --extra-experimental-features flakes flake clone git+https://github.com/alphal00p/gammaloop --dest /tmp/nix-ci-worker/stable-pwd/repo/
  2. 0.19 s Cloning into '/tmp/nix-ci-worker/stable-pwd/repo'...
  3. 0.96 s remote: Enumerating objects: 87989, done.
  4. 1.06 s remote: Counting objects: 0% (1/10557) remote: Counting objects: 1% (106/10557) remote: Counting objects: 2% (212/10557) remote: Counting objects: 3% (317/10557) remote: Counting objects: 4% (423/10557) remote: Counting objects: 5% (528/10557) remote: Counting objects: 6% (634/10557) remote: Counting objects: 7% (739/10557) remote: Counting objects: 8% (845/10557) remote: Counting objects: 9% (951/10557) remote: Counting objects: 10% (1056/10557) remote: Counting objects: 11% (1162/10557) remote: Counting objects: 12% (1267/10557) remote: Counting objects: 13% (1373/10557) remote: Counting objects: 14% (1478/10557) remote: Counting objects: 15% (1584/10557) remote: Counting objects: 16% (1690/10557) remote: Counting objects: 17% (1795/10557) remote: Counting objects: 18% (1901/10557) remote: Counting objects: 19% (2006/10557) remote: Counting objects: 20% (2112/10557) remote: Counting objects: 21% (2217/10557) remote: Counting objects: 22% (2323/10557) remote: Counting objects: 23% (2429/10557) remote: Counting objects: 24% (2534/10557) remote: Counting objects: 25% (2640/10557) remote: Counting objects: 26% (2745/10557) remote: Counting objects: 27% (2851/10557) remote: Counting objects: 28% (2956/10557) remote: Counting objects: 29% (3062/10557) remote: Counting objects: 30% (3168/10557) remote: Counting objects: 31% (3273/10557) remote: Counting objects: 32% (3379/10557) remote: Counting objects: 33% (3484/10557) remote: Counting objects: 34% (3590/10557) remote: Counting objects: 35% (3695/10557) remote: Counting objects: 36% (3801/10557) remote: Counting objects: 37% (3907/10557) remote: Counting objects: 38% (4012/10557) remote: Counting objects: 39% (4118/10557) remote: Counting objects: 40% (4223/10557) remote: Counting objects: 41% (4329/10557) remote: Counting objects: 42% (4434/10557) remote: Counting objects: 43% (4540/10557) remote: Counting objects: 44% (4646/10557) remote: Counting objects: 45% (4751/10557) remote: Counting objects: 46% (4857/10557) remote: Counting objects: 47% (4962/10557) remote: Counting objects: 48% (5068/10557) remote: Counting objects: 49% (5173/10557) remote: Counting objects: 50% (5279/10557) remote: Counting objects: 51% (5385/10557) remote: Counting objects: 52% (5490/10557) remote: Counting objects: 53% (5596/10557) remote: Counting objects: 54% (5701/10557) remote: Counting objects: 55% (5807/10557) remote: Counting objects: 56% (5912/10557) remote: Counting objects: 57% (6018/10557) remote: Counting objects: 58% (6124/10557) remote: Counting objects: 59% (6229/10557) remote: Counting objects: 60% (6335/10557) remote: Counting objects: 61% (6440/10557) remote: Counting objects: 62% (6546/10557) remote: Counting objects: 63% (6651/10557) remote: Counting objects: 64% (6757/10557) remote: Counting objects: 65% (6863/10557) remote: Counting objects: 66% (6968/10557) remote: Counting objects: 67% (7074/10557) remote: Counting objects: 68% (7179/10557) remote: Counting objects: 69% (7285/10557) remote: Counting objects: 70% (7390/10557) remote: Counting objects: 71% (7496/10557) remote: Counting objects: 72% (7602/10557) remote: Counting objects: 73% (7707/10557) remote: Counting objects: 74% (7813/10557) remote: Counting objects: 75% (7918/10557) remote: Counting objects: 76% (8024/10557) remote: Counting objects: 77% (8129/10557) remote: Counting objects: 78% (8235/10557) remote: Counting objects: 79% (8341/10557) remote: Counting objects: 80% (8446/10557) remote: Counting objects: 81% (8552/10557) remote: Counting objects: 82% (8657/10557) remote: Counting objects: 83% (8763/10557) remote: Counting objects: 84% (8868/10557) remote: Counting objects: 85% (8974/10557) remote: Counting objects: 86% (9080/10557) remote: Counting objects: 87% (9185/10557) remote: Counting objects: 88% (9291/10557) remote: Counting objects: 89% (9396/10557) remote: Counting objects: 90% (9502/10557) remote: Counting objects: 91% (9607/10557) remote: Counting objects: 92% (9713/10557) remote: Counting objects: 93% (9819/10557) remote: Counting objects: 94% (9924/10557) remote: Counting objects: 95% (10030/10557) remote: Counting objects: 96% (10135/10557) remote: Counting objects: 97% (10241/10557) remote: Counting objects: 98% (10346/10557) remote: Counting objects: 99% (10452/10557) remote: Counting objects: 100% (10557/10557) remote: Counting objects: 100% (10557/10557), done.
  5. 3.86 s remote: Compressing objects: 0% (1/2952) remote: Compressing objects: 1% (30/2952) remote: Compressing objects: 2% (60/2952) remote: Compressing objects: 3% (89/2952) remote: Compressing objects: 4% (119/2952) remote: Compressing objects: 5% (148/2952) remote: Compressing objects: 6% (178/2952) remote: Compressing objects: 7% (207/2952) remote: Compressing objects: 8% (237/2952) remote: Compressing objects: 9% (266/2952) remote: Compressing objects: 10% (296/2952) remote: Compressing objects: 11% (325/2952) remote: Compressing objects: 12% (355/2952) remote: Compressing objects: 13% (384/2952) remote: Compressing objects: 14% (414/2952) remote: Compressing objects: 15% (443/2952) remote: Compressing objects: 16% (473/2952) remote: Compressing objects: 17% (502/2952) remote: Compressing objects: 18% (532/2952) remote: Compressing objects: 18% (538/2952) remote: Compressing objects: 19% (561/2952) remote: Compressing objects: 20% (591/2952) remote: Compressing objects: 21% (620/2952) remote: Compressing objects: 22% (650/2952) remote: Compressing objects: 23% (679/2952) remote: Compressing objects: 24% (709/2952) remote: Compressing objects: 25% (738/2952) remote: Compressing objects: 26% (768/2952) remote: Compressing objects: 26% (793/2952) remote: Compressing objects: 27% (798/2952) remote: Compressing objects: 28% (827/2952) remote: Compressing objects: 29% (857/2952) remote: Compressing objects: 30% (886/2952) remote: Compressing objects: 31% (916/2952) remote: Compressing objects: 32% (945/2952) remote: Compressing objects: 33% (975/2952) remote: Compressing objects: 34% (1004/2952) remote: Compressing objects: 35% (1034/2952) remote: Compressing objects: 36% (1063/2952) remote: Compressing objects: 37% (1093/2952) remote: Compressing objects: 38% (1122/2952) remote: Compressing objects: 39% (1152/2952) remote: Compressing objects: 40% (1181/2952) remote: Compressing objects: 41% (1211/2952) remote: Compressing objects: 42% (1240/2952) remote: Compressing objects: 43% (1270/2952) remote: Compressing objects: 44% (1299/2952) remote: Compressing objects: 45% (1329/2952) remote: Compressing objects: 46% (1358/2952) remote: Compressing objects: 47% (1388/2952) remote: Compressing objects: 48% (1417/2952) remote: Compressing objects: 49% (1447/2952) remote: Compressing objects: 50% (1476/2952) remote: Compressing objects: 51% (1506/2952) remote: Compressing objects: 52% (1536/2952) remote: Compressing objects: 53% (1565/2952) remote: Compressing objects: 54% (1595/2952) remote: Compressing objects: 55% (1624/2952) remote: Compressing objects: 56% (1654/2952) remote: Compressing objects: 57% (1683/2952) remote: Compressing objects: 58% (1713/2952) remote: Compressing objects: 59% (1742/2952) remote: Compressing objects: 60% (1772/2952) remote: Compressing objects: 61% (1801/2952) remote: Compressing objects: 62% (1831/2952) remote: Compressing objects: 63% (1860/2952) remote: Compressing objects: 64% (1890/2952) remote: Compressing objects: 65% (1919/2952) remote: Compressing objects: 66% (1949/2952) remote: Compressing objects: 67% (1978/2952) remote: Compressing objects: 68% (2008/2952) remote: Compressing objects: 69% (2037/2952) remote: Compressing objects: 70% (2067/2952) remote: Compressing objects: 71% (2096/2952) remote: Compressing objects: 72% (2126/2952) remote: Compressing objects: 73% (2155/2952) remote: Compressing objects: 74% (2185/2952) remote: Compressing objects: 75% (2214/2952) remote: Compressing objects: 76% (2244/2952) remote: Compressing objects: 77% (2274/2952) remote: Compressing objects: 78% (2303/2952) remote: Compressing objects: 79% (2333/2952) remote: Compressing objects: 80% (2362/2952) remote: Compressing objects: 81% (2392/2952) remote: Compressing objects: 82% (2421/2952) remote: Compressing objects: 83% (2451/2952) remote: Compressing objects: 84% (2480/2952) remote: Compressing objects: 85% (2510/2952) remote: Compressing objects: 86% (2539/2952) remote: Compressing objects: 87% (2569/2952) remote: Compressing objects: 88% (2598/2952) remote: Compressing objects: 89% (2628/2952) remote: Compressing objects: 90% (2657/2952) remote: Compressing objects: 91% (2687/2952) remote: Compressing objects: 92% (2716/2952) remote: Compressing objects: 93% (2746/2952) remote: Compressing objects: 94% (2775/2952) remote: Compressing objects: 95% (2805/2952) remote: Compressing objects: 96% (2834/2952) remote: Compressing objects: 97% (2864/2952) remote: Compressing objects: 98% (2893/2952) remote: Compressing objects: 99% (2923/2952) remote: Compressing objects: 100% (2952/2952) remote: Compressing objects: 100% (2952/2952), done.
  6. 9.55 s Receiving objects: 0% (1/87989) Receiving objects: 1% (880/87989) Receiving objects: 2% (1760/87989) Receiving objects: 3% (2640/87989) Receiving objects: 4% (3520/87989) Receiving objects: 5% (4400/87989) Receiving objects: 6% (5280/87989) Receiving objects: 7% (6160/87989) Receiving objects: 8% (7040/87989) Receiving objects: 9% (7920/87989), 11.49 MiB | 22.97 MiB/s Receiving objects: 10% (8799/87989), 11.49 MiB | 22.97 MiB/s Receiving objects: 11% (9679/87989), 11.49 MiB | 22.97 MiB/s Receiving objects: 12% (10559/87989), 11.49 MiB | 22.97 MiB/s Receiving objects: 13% (11439/87989), 11.49 MiB | 22.97 MiB/s Receiving objects: 14% (12319/87989), 11.49 MiB | 22.97 MiB/s Receiving objects: 15% (13199/87989), 11.49 MiB | 22.97 MiB/s Receiving objects: 16% (14079/87989), 11.49 MiB | 22.97 MiB/s Receiving objects: 17% (14959/87989), 11.49 MiB | 22.97 MiB/s Receiving objects: 18% (15839/87989), 11.49 MiB | 22.97 MiB/s Receiving objects: 19% (16718/87989), 11.49 MiB | 22.97 MiB/s Receiving objects: 20% (17598/87989), 11.49 MiB | 22.97 MiB/s Receiving objects: 21% (18478/87989), 11.49 MiB | 22.97 MiB/s Receiving objects: 22% (19358/87989), 11.49 MiB | 22.97 MiB/s Receiving objects: 23% (20238/87989), 11.49 MiB | 22.97 MiB/s Receiving objects: 24% (21118/87989), 11.49 MiB | 22.97 MiB/s Receiving objects: 25% (21998/87989), 11.49 MiB | 22.97 MiB/s Receiving objects: 26% (22878/87989), 11.49 MiB | 22.97 MiB/s Receiving objects: 27% (23758/87989), 11.49 MiB | 22.97 MiB/s Receiving objects: 28% (24637/87989), 11.49 MiB | 22.97 MiB/s Receiving objects: 29% (25517/87989), 11.49 MiB | 22.97 MiB/s Receiving objects: 30% (26397/87989), 11.49 MiB | 22.97 MiB/s Receiving objects: 31% (27277/87989), 11.49 MiB | 22.97 MiB/s Receiving objects: 32% (28157/87989), 11.49 MiB | 22.97 MiB/s Receiving objects: 33% (29037/87989), 11.49 MiB | 22.97 MiB/s Receiving objects: 34% (29917/87989), 11.49 MiB | 22.97 MiB/s Receiving objects: 35% (30797/87989), 11.49 MiB | 22.97 MiB/s Receiving objects: 36% (31677/87989), 11.49 MiB | 22.97 MiB/s Receiving objects: 37% (32556/87989), 11.49 MiB | 22.97 MiB/s Receiving objects: 38% (33436/87989), 11.49 MiB | 22.97 MiB/s Receiving objects: 38% (33571/87989), 31.46 MiB | 31.45 MiB/s Receiving objects: 39% (34316/87989), 31.46 MiB | 31.45 MiB/s Receiving objects: 40% (35196/87989), 31.46 MiB | 31.45 MiB/s Receiving objects: 41% (36076/87989), 31.46 MiB | 31.45 MiB/s Receiving objects: 42% (36956/87989), 31.46 MiB | 31.45 MiB/s Receiving objects: 43% (37836/87989), 31.46 MiB | 31.45 MiB/s Receiving objects: 44% (38716/87989), 31.46 MiB | 31.45 MiB/s Receiving objects: 45% (39596/87989), 44.39 MiB | 29.59 MiB/s Receiving objects: 46% (40475/87989), 44.39 MiB | 29.59 MiB/s Receiving objects: 47% (41355/87989), 44.39 MiB | 29.59 MiB/s Receiving objects: 48% (42235/87989), 44.39 MiB | 29.59 MiB/s Receiving objects: 49% (43115/87989), 44.39 MiB | 29.59 MiB/s Receiving objects: 50% (43995/87989), 44.39 MiB | 29.59 MiB/s Receiving objects: 50% (44581/87989), 44.39 MiB | 29.59 MiB/s Receiving objects: 51% (44875/87989), 53.93 MiB | 26.97 MiB/s Receiving objects: 52% (45755/87989), 53.93 MiB | 26.97 MiB/s Receiving objects: 53% (46635/87989), 53.93 MiB | 26.97 MiB/s Receiving objects: 54% (47515/87989), 53.93 MiB | 26.97 MiB/s Receiving objects: 55% (48394/87989), 53.93 MiB | 26.97 MiB/s Receiving objects: 56% (49274/87989), 53.93 MiB | 26.97 MiB/s Receiving objects: 57% (50154/87989), 53.93 MiB | 26.97 MiB/s Receiving objects: 58% (51034/87989), 70.43 MiB | 28.18 MiB/s Receiving objects: 59% (51914/87989), 70.43 MiB | 28.18 MiB/s Receiving objects: 60% (52794/87989), 70.43 MiB | 28.18 MiB/s Receiving objects: 61% (53674/87989), 70.43 MiB | 28.18 MiB/s Receiving objects: 62% (54554/87989), 70.43 MiB | 28.18 MiB/s Receiving objects: 63% (55434/87989), 70.43 MiB | 28.18 MiB/s Receiving objects: 64% (56313/87989), 70.43 MiB | 28.18 MiB/s Receiving objects: 65% (57193/87989), 70.43 MiB | 28.18 MiB/s Receiving objects: 65% (57359/87989), 88.77 MiB | 29.60 MiB/s Receiving objects: 66% (58073/87989), 104.11 MiB | 29.75 MiB/s Receiving objects: 67% (58953/87989), 104.11 MiB | 29.75 MiB/s Receiving objects: 68% (59833/87989), 104.11 MiB | 29.75 MiB/s Receiving objects: 69% (60713/87989), 104.11 MiB | 29.75 MiB/s Receiving objects: 70% (61593/87989), 104.11 MiB | 29.75 MiB/s Receiving objects: 71% (62473/87989), 104.11 MiB | 29.75 MiB/s Receiving objects: 71% (63231/87989), 119.34 MiB | 29.84 MiB/s Receiving objects: 72% (63353/87989), 119.34 MiB | 29.84 MiB/s Receiving objects: 73% (64232/87989), 119.34 MiB | 29.84 MiB/s Receiving objects: 74% (65112/87989), 119.34 MiB | 29.84 MiB/s Receiving objects: 75% (65992/87989), 119.34 MiB | 29.84 MiB/s Receiving objects: 76% (66872/87989), 119.34 MiB | 29.84 MiB/s Receiving objects: 77% (67752/87989), 119.34 MiB | 29.84 MiB/s Receiving objects: 78% (68632/87989), 119.34 MiB | 29.84 MiB/s Receiving objects: 79% (69512/87989), 119.34 MiB | 29.84 MiB/s Receiving objects: 80% (70392/87989), 119.34 MiB | 29.84 MiB/s Receiving objects: 81% (71272/87989), 136.58 MiB | 30.36 MiB/s Receiving objects: 82% (72151/87989), 136.58 MiB | 30.36 MiB/s Receiving objects: 83% (73031/87989), 136.58 MiB | 30.36 MiB/s Receiving objects: 84% (73911/87989), 136.58 MiB | 30.36 MiB/s Receiving objects: 85% (74791/87989), 136.58 MiB | 30.36 MiB/s Receiving objects: 86% (75671/87989), 136.58 MiB | 30.36 MiB/s Receiving objects: 87% (76551/87989), 136.58 MiB | 30.36 MiB/s Receiving objects: 88% (77431/87989), 136.58 MiB | 30.36 MiB/s Receiving objects: 89% (78311/87989), 136.58 MiB | 30.36 MiB/s Receiving objects: 90% (79191/87989), 136.58 MiB | 30.36 MiB/s Receiving objects: 91% (80070/87989), 136.58 MiB | 30.36 MiB/s Receiving objects: 92% (80950/87989), 136.58 MiB | 30.36 MiB/s Receiving objects: 93% (81830/87989), 136.58 MiB | 30.36 MiB/s Receiving objects: 93% (82200/87989), 136.58 MiB | 30.36 MiB/s Receiving objects: 94% (82710/87989), 152.38 MiB | 31.31 MiB/s Receiving objects: 95% (83590/87989), 152.38 MiB | 31.31 MiB/s Receiving objects: 96% (84470/87989), 152.38 MiB | 31.31 MiB/s Receiving objects: 97% (85350/87989), 152.38 MiB | 31.31 MiB/s Receiving objects: 98% (86230/87989), 152.38 MiB | 31.31 MiB/s Receiving objects: 99% (87110/87989), 168.46 MiB | 30.45 MiB/s remote: Total 87989 (delta 8613), reused 8381 (delta 7579), pack-reused 77432 (from 3)
  7. 9.56 s Receiving objects: 100% (87989/87989), 168.46 MiB | 30.45 MiB/s Receiving objects: 100% (87989/87989), 176.53 MiB | 30.99 MiB/s, done.
  8. 11.79 s Resolving deltas: 0% (0/59508) Resolving deltas: 1% (596/59508) Resolving deltas: 2% (1191/59508) Resolving deltas: 3% (1787/59508) Resolving deltas: 4% (2381/59508) Resolving deltas: 5% (2976/59508) Resolving deltas: 6% (3571/59508) Resolving deltas: 7% (4167/59508) Resolving deltas: 8% (4761/59508) Resolving deltas: 9% (5356/59508) Resolving deltas: 10% (5951/59508) Resolving deltas: 11% (6546/59508) Resolving deltas: 12% (7141/59508) Resolving deltas: 13% (7737/59508) Resolving deltas: 14% (8332/59508) Resolving deltas: 15% (8927/59508) Resolving deltas: 16% (9523/59508) Resolving deltas: 17% (10117/59508) Resolving deltas: 18% (10713/59508) Resolving deltas: 19% (11307/59508) Resolving deltas: 20% (11902/59508) Resolving deltas: 21% (12497/59508) Resolving deltas: 22% (13092/59508) Resolving deltas: 23% (13687/59508) Resolving deltas: 24% (14282/59508) Resolving deltas: 25% (14877/59508) Resolving deltas: 26% (15473/59508) Resolving deltas: 27% (16068/59508) Resolving deltas: 28% (16663/59508) Resolving deltas: 29% (17260/59508) Resolving deltas: 30% (17853/59508) Resolving deltas: 31% (18448/59508) Resolving deltas: 32% (19043/59508) Resolving deltas: 33% (19638/59508) Resolving deltas: 34% (20234/59508) Resolving deltas: 35% (20828/59508) Resolving deltas: 36% (21423/59508) Resolving deltas: 37% (22018/59508) Resolving deltas: 38% (22615/59508) Resolving deltas: 39% (23209/59508) Resolving deltas: 40% (23804/59508) Resolving deltas: 41% (24399/59508) Resolving deltas: 42% (24994/59508) Resolving deltas: 43% (25589/59508) Resolving deltas: 44% (26184/59508) Resolving deltas: 45% (26779/59508) Resolving deltas: 46% (27374/59508) Resolving deltas: 47% (27969/59508) Resolving deltas: 48% (28564/59508) Resolving deltas: 49% (29159/59508) Resolving deltas: 50% (29754/59508) Resolving deltas: 51% (30351/59508) Resolving deltas: 51% (30668/59508) Resolving deltas: 52% (30945/59508) Resolving deltas: 53% (31540/59508) Resolving deltas: 54% (32135/59508) Resolving deltas: 55% (32730/59508) Resolving deltas: 56% (33325/59508) Resolving deltas: 57% (33920/59508) Resolving deltas: 58% (34517/59508) Resolving deltas: 59% (35110/59508) Resolving deltas: 60% (35705/59508) Resolving deltas: 61% (36300/59508) Resolving deltas: 62% (36898/59508) Resolving deltas: 63% (37491/59508) Resolving deltas: 64% (38086/59508) Resolving deltas: 65% (38681/59508) Resolving deltas: 66% (39276/59508) Resolving deltas: 67% (39872/59508) Resolving deltas: 68% (40466/59508) Resolving deltas: 69% (41061/59508) Resolving deltas: 70% (41656/59508) Resolving deltas: 71% (42252/59508) Resolving deltas: 72% (42846/59508) Resolving deltas: 73% (43441/59508) Resolving deltas: 74% (44036/59508) Resolving deltas: 75% (44633/59508) Resolving deltas: 76% (45227/59508) Resolving deltas: 77% (45822/59508) Resolving deltas: 78% (46417/59508) Resolving deltas: 79% (47012/59508) Resolving deltas: 80% (47607/59508) Resolving deltas: 81% (48202/59508) Resolving deltas: 82% (48797/59508) Resolving deltas: 83% (49392/59508) Resolving deltas: 84% (49987/59508) Resolving deltas: 84% (50540/59508) Resolving deltas: 85% (50582/59508) Resolving deltas: 86% (51177/59508) Resolving deltas: 87% (51772/59508) Resolving deltas: 88% (52368/59508) Resolving deltas: 89% (52965/59508) Resolving deltas: 90% (53558/59508) Resolving deltas: 91% (54153/59508) Resolving deltas: 92% (54748/59508) Resolving deltas: 93% (55344/59508) Resolving deltas: 94% (55940/59508) Resolving deltas: 95% (56533/59508) Resolving deltas: 96% (57128/59508) Resolving deltas: 97% (57723/59508) Resolving deltas: 98% (58318/59508) Resolving deltas: 99% (58913/59508) Resolving deltas: 100% (59508/59508) Resolving deltas: 100% (59508/59508), done.
  9. 12.51 s Fetching commit 891dec7c25b5d9026c099da021ec7ae3b757dee9 for codex/docs-before-consolidation-20260914 ...
  10. 12.51 s $ /nix/store/bcnisk3ydfgv26v2gw3zlky24g00yww2-git-2.54.0/bin/git fetch origin 891dec7c25b5d9026c099da021ec7ae3b757dee9
  11. 12.99 s From https://github.com/alphal00p/gammaloop
  12. 12.99 s * branch 891dec7c25b5d9026c099da021ec7ae3b757dee9 -> FETCH_HEAD
  13. 13.02 s $ /nix/store/9ypz3flqsrl5xl495mm8h645gadjsxi1-coreutils-9.11/bin/timeout --kill-after=15s 7200s /nix/store/bcnisk3ydfgv26v2gw3zlky24g00yww2-git-2.54.0/bin/git -c advice.detachedHead=false checkout 891dec7c25b5d9026c099da021ec7ae3b757dee9
  14. 13.48 s HEAD is now at 891dec7c2 change photos
  15. 13.48 s $ /nix/store/9ypz3flqsrl5xl495mm8h645gadjsxi1-coreutils-9.11/bin/timeout --kill-after=15s 7200s /nix/store/23zk8sgzamrbmj1fday15szf7f2279s8-nix-2.34.7/bin/nix --extra-experimental-features nix-command --extra-experimental-features flakes --log-format internal-json run .#packages.x86_64-linux.nix-ci-check-gammaloop-nextest-linnet --print-build-logs
  16. 17.95 s
  17. 22.20 s evaluating derivation 'g copying '/nix/store/bgss evaluating derivation 'g [0/1 built] [1/0/1 built] building ggammaloop-nextest-linnet> Extracting 2 binaries (including 1 non-test binary) to /build/source
  18. 22.25 s gammaloop-nextest-linnet> Extracted 6 files to /build/source in 0.06s
  19. 22.26 s gammaloop-nextest-linnet> ------------
  20. 22.26 s gammaloop-nextest-linnet> Nextest run ID a90e501c-292d-4d17-ae69-cd0d25efe1b5 with nextest profile: ci_gammaloop
  21. 22.26 s gammaloop-nextest-linnet> Starting 24 tests across 1 binary
  22. 22.28 s gammaloop-nextest-linnet> ------------
  23. 22.28 s gammaloop-nextest-linnet> Summary [ 0.017s] 24 tests run: 24 passed, 0 skipped
  24. 22.32 s gammaloop-nextest-linnet>
  25. 22.32 s gammaloop-nextest-linnet> ========== nextest test summary ==========
  26. 22.32 s gammaloop-nextest-linnet> report: target/nextest/ci_gammaloop/junit.xml
  27. 22.32 s gammaloop-nextest-linnet> tests: 24, failures: 0, errors: 0
  28. 22.32 s gammaloop-nextest-linnet> No failing testcases found.
  29. 22.32 s gammaloop-nextest-linnet> =========================================
  30. 22.34 s gammaloop-nextest-linnet> Extracting 2 binaries (including 1 non-test binary) and 1 linked path to /build/source
  31. 22.53 s gammaloop-nextest-linnet> Extracted 9 files to /build/source in 0.19s
  32. 22.54 s gammaloop-nextest-linnet> ------------
  33. 22.54 s gammaloop-nextest-linnet> Nextest run ID c3bc4fd5-a103-4d20-8516-50d4478fa7a8 with nextest profile: ci_gammaloop
  34. 22.54 s gammaloop-nextest-linnet> Starting 183 tests across 1 binary
  35. 22.70 s gammaloop-nextest-linnet> ------------
  36. 22.70 s gammaloop-nextest-linnet> Summary [ 0.159s] 183 tests run: 183 passed, 0 skipped
  37. 22.74 s gammaloop-nextest-linnet>
  38. 22.74 s gammaloop-nextest-linnet> ========== nextest test summary ==========
  39. 22.74 s gammaloop-nextest-linnet> report: target/nextest/ci_gammaloop/junit.xml
  40. 22.74 s gammaloop-nextest-linnet> tests: 183, failures: 0, errors: 0
  41. 22.74 s gammaloop-nextest-linnet> No failing testcases found.
  42. 22.74 s gammaloop-nextest-linnet> =========================================
  43. 22.76 s gammaloop-nextest-linnet> Extracting 4 binaries (including 3 non-test binaries), 1 build script output directory, and 1 linked path to /build/source
  44. 23.11 s gammaloop-nextest-linnet> Extracted 13 files to /build/source in 0.35s
  45. 23.12 s gammaloop-nextest-linnet> ------------
  46. 23.12 s gammaloop-nextest-linnet> Nextest run ID 03de1907-546e-45ce-81a3-925c73a0b384 with nextest profile: ci_gammaloop
  47. 23.12 s gammaloop-nextest-linnet> Starting 0 tests across 1 binary
  48. 23.12 s gammaloop-nextest-linnet> ------------
  49. 23.12 s gammaloop-nextest-linnet> Summary [ 0.000s] 0 tests run: 0 passed, 0 skipped
  50. 23.17 s gammaloop-nextest-linnet>
  51. 23.17 s gammaloop-nextest-linnet> ========== nextest test summary ==========
  52. 23.17 s gammaloop-nextest-linnet> report: target/nextest/ci_gammaloop/junit.xml
  53. 23.17 s gammaloop-nextest-linnet> tests: 0, failures: 0, errors: 0
  54. 23.17 s gammaloop-nextest-linnet> No failing testcases found.
  55. 23.17 s gammaloop-nextest-linnet> =========================================
  56. 23.19 s gammaloop-nextest-linnet> Extracting 2 binaries (including 1 non-test binary) and 1 linked path to /build/source
  57. 23.34 s gammaloop-nextest-linnet> Extracted 9 files to /build/source in 0.16s
  58. 23.38 s gammaloop-nextest-linnet> ------------
  59. 23.38 s gammaloop-nextest-linnet> Nextest run ID f83acb64-c1ab-4342-8c70-ff5d6fdeea72 with nextest profile: ci_gammaloop
  60. 23.38 s gammaloop-nextest-linnet> Starting 128 tests across 1 binary
  61. 23.53 s gammaloop-nextest-linnet> FAIL [ 0.013s] ( 97/128) linnest tests::test_graph_structural_axis_merge_preserves_edge_positions_and_constraints
  62. 23.53 s gammaloop-nextest-linnet> stdout ---
  63. 23.53 s gammaloop-nextest-linnet>
  64. 23.53 s gammaloop-nextest-linnet> running 1 test
  65. 23.53 s gammaloop-nextest-linnet> test tests::test_graph_structural_axis_merge_preserves_edge_positions_and_constraints ... FAILED
  66. 23.53 s gammaloop-nextest-linnet>
  67. 23.53 s gammaloop-nextest-linnet> failures:
  68. 23.53 s gammaloop-nextest-linnet>
  69. 23.53 s gammaloop-nextest-linnet> failures:
  70. 23.53 s gammaloop-nextest-linnet> tests::test_graph_structural_axis_merge_preserves_edge_positions_and_constraints
  71. 23.53 s gammaloop-nextest-linnet>
  72. 23.53 s gammaloop-nextest-linnet> test result: FAILED. 0 passed; 1 failed; 0 ignored; 0 measured; 127 filtered out; finished in 0.00s
  73. 23.53 s gammaloop-nextest-linnet>
  74. 23.53 s gammaloop-nextest-linnet> stderr ---
  75. 23.53 s gammaloop-nextest-linnet>
  76. 23.53 s gammaloop-nextest-linnet> thread 'tests::test_graph_structural_axis_merge_preserves_edge_positions_and_constraints' (913) panicked at crates/linnest/src/tests.rs:1721:32:
  77. 23.53 s gammaloop-nextest-linnet> no entry found for key
  78. 23.53 s gammaloop-nextest-linnet> stack backtrace:
  79. 23.53 s gammaloop-nextest-linnet> 0: __rustc::rust_begin_unwind
  80. 23.53 s gammaloop-nextest-linnet> 1: core::panicking::panic_fmt
  81. 23.53 s gammaloop-nextest-linnet> 2: core::option::expect_failed
  82. 23.53 s gammaloop-nextest-linnet> 3: linnest::tests::test_graph_structural_axis_merge_preserves_edge_positions_and_constraints
  83. 23.53 s gammaloop-nextest-linnet> 4: <linnest::tests::test_graph_structural_axis_merge_preserves_edge_positions_and_constraints::{closure#0} as core::ops::function::FnOnce<()>>::call_once
  84. 23.53 s gammaloop-nextest-linnet> note: Some details are omitted, run with `RUST_BACKTRACE=full` for a verbose backtrace.
  85. 23.53 s gammaloop-nextest-linnet>
  86. 23.61 s gammaloop-nextest-linnet> ------------
  87. 23.61 s gammaloop-nextest-linnet> Summary [ 0.225s] 128 tests run: 127 passed, 1 failed, 0 skipped
  88. 23.61 s gammaloop-nextest-linnet> FAIL [ 0.013s] ( 97/128) linnest tests::test_graph_structural_axis_merge_preserves_edge_positions_and_constraints
  89. 23.61 s gammaloop-nextest-linnet> stdout ---
  90. 23.61 s gammaloop-nextest-linnet>
  91. 23.61 s gammaloop-nextest-linnet> running 1 test
  92. 23.61 s gammaloop-nextest-linnet> test tests::test_graph_structural_axis_merge_preserves_edge_positions_and_constraints ... FAILED
  93. 23.61 s gammaloop-nextest-linnet>
  94. 23.61 s gammaloop-nextest-linnet> failures:
  95. 23.61 s gammaloop-nextest-linnet>
  96. 23.61 s gammaloop-nextest-linnet> failures:
  97. 23.61 s gammaloop-nextest-linnet> tests::test_graph_structural_axis_merge_preserves_edge_positions_and_constraints
  98. 23.61 s gammaloop-nextest-linnet>
  99. 23.61 s gammaloop-nextest-linnet> test result: FAILED. 0 passed; 1 failed; 0 ignored; 0 measured; 127 filtered out; finished in 0.00s
  100. 23.61 s gammaloop-nextest-linnet>
  101. 23.61 s gammaloop-nextest-linnet> stderr ---
  102. 23.61 s gammaloop-nextest-linnet>
  103. 23.61 s gammaloop-nextest-linnet> thread 'tests::test_graph_structural_axis_merge_preserves_edge_positions_and_constraints' (913) panicked at crates/linnest/src/tests.rs:1721:32:
  104. 23.61 s gammaloop-nextest-linnet> no entry found for key
  105. 23.61 s gammaloop-nextest-linnet> stack backtrace:
  106. 23.61 s gammaloop-nextest-linnet> 0: __rustc::rust_begin_unwind
  107. 23.61 s gammaloop-nextest-linnet> 1: core::panicking::panic_fmt
  108. 23.61 s gammaloop-nextest-linnet> 2: core::option::expect_failed
  109. 23.61 s gammaloop-nextest-linnet> 3: linnest::tests::test_graph_structural_axis_merge_preserves_edge_positions_and_constraints
  110. 23.61 s gammaloop-nextest-linnet> 4: <linnest::tests::test_graph_structural_axis_merge_preserves_edge_positions_and_constraints::{closure#0} as core::ops::function::FnOnce<()>>::call_once
  111. 23.61 s gammaloop-nextest-linnet> note: Some details are omitted, run with `RUST_BACKTRACE=full` for a verbose backtrace.
  112. 23.61 s gammaloop-nextest-linnet>
  113. 23.62 s gammaloop-nextest-linnet> error: test run failed
  114. 23.70 s gammaloop-nextest-linnet>
  115. 23.70 s gammaloop-nextest-linnet> ========== nextest test summary ==========
  116. 23.70 s gammaloop-nextest-linnet> report: target/nextest/ci_gammaloop/junit.xml
  117. 23.70 s gammaloop-nextest-linnet> tests: 128, failures: 1, errors: 0
  118. 23.70 s gammaloop-nextest-linnet>
  119. 23.70 s gammaloop-nextest-linnet> 1. linnest::tests::test_graph_structural_axis_merge_preserves_edge_positions_and_constraints
  120. 23.70 s gammaloop-nextest-linnet> failure: test failure with exit code 101
  121. 23.70 s gammaloop-nextest-linnet> thread 'tests::test_graph_structural_axis_merge_preserves_edge_positions_and_constraints' (913) panicked at crates/linnest/src/tests.rs:1721:32:
  122. 23.70 s gammaloop-nextest-linnet> no entry found for key
  123. 23.70 s gammaloop-nextest-linnet> stack backtrace:
  124. 23.70 s gammaloop-nextest-linnet> 0: __rustc::rust_begin_unwind
  125. 23.70 s gammaloop-nextest-linnet> 1: core::panicking::panic_fmt
  126. 23.70 s gammaloop-nextest-linnet> 2: core::option::expect_failed
  127. 23.70 s gammaloop-nextest-linnet> 3: linnest::tests::test_graph_structural_axis_merge_preserves_edge_positions_and_constraints
  128. 23.70 s gammaloop-nextest-linnet> 4: <linnest::tests::test_graph_structural_axis_merge_preserves_edge_positions_and_constraints::{closure#0} as core::ops::function::FnOnce<()>>::call_once
  129. 23.70 s gammaloop-nextest-linnet> note: Some details are omitted, run with `RUST_BACKTRACE=full` for a verbose backtrace.
  130. 23.70 s gammaloop-nextest-linnet> system-out
  131. 23.70 s gammaloop-nextest-linnet> running 1 test
  132. 23.70 s gammaloop-nextest-linnet> test tests::test_graph_structural_axis_merge_preserves_edge_positions_and_constraints ... FAILED
  133. 23.70 s gammaloop-nextest-linnet>
  134. 23.70 s gammaloop-nextest-linnet> failures:
  135. 23.70 s gammaloop-nextest-linnet>
  136. 23.70 s gammaloop-nextest-linnet> failures:
  137. 23.70 s gammaloop-nextest-linnet> tests::test_graph_structural_axis_merge_preserves_edge_positions_and_constraints
  138. 23.70 s gammaloop-nextest-linnet>
  139. 23.70 s gammaloop-nextest-linnet> test result: FAILED. 0 passed; 1 failed; 0 ignored; 0 measured; 127 filtered out; finished in 0.00s
  140. 23.70 s gammaloop-nextest-linnet> system-err
  141. 23.70 s gammaloop-nextest-linnet> thread 'tests::test_graph_structural_axis_merge_preserves_edge_positions_and_constraints' (913) panicked at crates/linnest/src/tests.rs:1721:32:
  142. 23.70 s gammaloop-nextest-linnet> no entry found for key
  143. 23.70 s gammaloop-nextest-linnet> stack backtrace:
  144. 23.70 s gammaloop-nextest-linnet> 0: __rustc::rust_begin_unwind
  145. 23.70 s gammaloop-nextest-linnet> 1: core::panicking::panic_fmt
  146. 23.70 s gammaloop-nextest-linnet> 2: core::option::expect_failed
  147. 23.70 s gammaloop-nextest-linnet> 3: linnest::tests::test_graph_structural_axis_merge_preserves_edge_positions_and_constraints
  148. 23.70 s gammaloop-nextest-linnet> 4: <linnest::tests::test_graph_structural_axis_merge_preserves_edge_positions_and_constraints::{closure#0} as core::ops::function::FnOnce<()>>::call_once
  149. 23.70 s gammaloop-nextest-linnet> note: Some details are omitted, run with `RUST_BACKTRACE=full` for a verbose backtrace.
  150. 23.70 s gammaloop-nextest-linnet> =========================================
  151. 23.89 s error: Cannot build '/nix/store/3a6s86hhbf2g1hgbkmcq3zdrmaha78qr-gammaloop-nextest-linnet.drv'.
  152. 23.89 s Reason: builder failed with exit code 100.
  153. 23.89 s Output paths:
  154. 23.89 s /nix/store/v4cbh6ql60kq7xlziivk5va382nw7f4v-gammaloop-nextest-linnet
  155. 23.89 s Last 134 log lines:
  156. 23.89 s > Extracting 2 binaries (including 1 non-test binary) to /build/source
  157. 23.89 s > Extracted 6 files to /build/source in 0.06s
  158. 23.89 s > ------------
  159. 23.89 s > Nextest run ID a90e501c-292d-4d17-ae69-cd0d25efe1b5 with nextest profile: ci_gammaloop
  160. 23.89 s > Starting 24 tests across 1 binary
  161. 23.89 s > ------------
  162. 23.89 s > Summary [ 0.017s] 24 tests run: 24 passed, 0 skipped
  163. 23.89 s >
  164. 23.89 s > ========== nextest test summary ==========
  165. 23.89 s > report: target/nextest/ci_gammaloop/junit.xml
  166. 23.89 s > tests: 24, failures: 0, errors: 0
  167. 23.89 s > No failing testcases found.
  168. 23.89 s > =========================================
  169. 23.89 s > Extracting 2 binaries (including 1 non-test binary) and 1 linked path to /build/source
  170. 23.89 s > Extracted 9 files to /build/source in 0.19s
  171. 23.89 s > ------------
  172. 23.89 s > Nextest run ID c3bc4fd5-a103-4d20-8516-50d4478fa7a8 with nextest profile: ci_gammaloop
  173. 23.89 s > Starting 183 tests across 1 binary
  174. 23.89 s > ------------
  175. 23.89 s > Summary [ 0.159s] 183 tests run: 183 passed, 0 skipped
  176. 23.89 s >
  177. 23.89 s > ========== nextest test summary ==========
  178. 23.89 s > report: target/nextest/ci_gammaloop/junit.xml
  179. 23.89 s > tests: 183, failures: 0, errors: 0
  180. 23.89 s > No failing testcases found.
  181. 23.89 s > =========================================
  182. 23.89 s > Extracting 4 binaries (including 3 non-test binaries), 1 build script output directory, and 1 linked path to /build/source
  183. 23.89 s > Extracted 13 files to /build/source in 0.35s
  184. 23.89 s > ------------
  185. 23.89 s > Nextest run ID 03de1907-546e-45ce-81a3-925c73a0b384 with nextest profile: ci_gammaloop
  186. 23.89 s > Starting 0 tests across 1 binary
  187. 23.89 s > ------------
  188. 23.89 s > Summary [ 0.000s] 0 tests run: 0 passed, 0 skipped
  189. 23.89 s >
  190. 23.89 s > ========== nextest test summary ==========
  191. 23.89 s > report: target/nextest/ci_gammaloop/junit.xml
  192. 23.89 s > tests: 0, failures: 0, errors: 0
  193. 23.89 s > No failing testcases found.
  194. 23.89 s > =========================================
  195. 23.89 s > Extracting 2 binaries (including 1 non-test binary) and 1 linked path to /build/source
  196. 23.89 s > Extracted 9 files to /build/source in 0.16s
  197. 23.89 s > ------------
  198. 23.89 s > Nextest run ID f83acb64-c1ab-4342-8c70-ff5d6fdeea72 with nextest profile: ci_gammaloop
  199. 23.89 s > Starting 128 tests across 1 binary
  200. 23.89 s > FAIL [ 0.013s] ( 97/128) linnest tests::test_graph_structural_axis_merge_preserves_edge_positions_and_constraints
  201. 23.89 s > stdout ---
  202. 23.89 s >
  203. 23.89 s > running 1 test
  204. 23.89 s > test tests::test_graph_structural_axis_merge_preserves_edge_positions_and_constraints ... FAILED
  205. 23.89 s >
  206. 23.89 s > failures:
  207. 23.89 s >
  208. 23.89 s > failures:
  209. 23.89 s > tests::test_graph_structural_axis_merge_preserves_edge_positions_and_constraints
  210. 23.89 s >
  211. 23.89 s > test result: FAILED. 0 passed; 1 failed; 0 ignored; 0 measured; 127 filtered out; finished in 0.00s
  212. 23.89 s >
  213. 23.89 s > stderr ---
  214. 23.89 s >
  215. 23.89 s > thread 'tests::test_graph_structural_axis_merge_preserves_edge_positions_and_constraints' (913) panicked at crates/linnest/src/tests.rs:1721:32:
  216. 23.89 s > no entry found for key
  217. 23.89 s > stack backtrace:
  218. 23.89 s > 0: __rustc::rust_begin_unwind
  219. 23.89 s > 1: core::panicking::panic_fmt
  220. 23.89 s > 2: core::option::expect_failed
  221. 23.89 s > 3: linnest::tests::test_graph_structural_axis_merge_preserves_edge_positions_and_constraints
  222. 23.89 s > 4: <linnest::tests::test_graph_structural_axis_merge_preserves_edge_positions_and_constraints::{closure#0} as core::ops::function::FnOnce<()>>::call_once
  223. 23.89 s > note: Some details are omitted, run with `RUST_BACKTRACE=full` for a verbose backtrace.
  224. 23.89 s >
  225. 23.89 s > ------------
  226. 23.89 s > Summary [ 0.225s] 128 tests run: 127 passed, 1 failed, 0 skipped
  227. 23.89 s > FAIL [ 0.013s] ( 97/128) linnest tests::test_graph_structural_axis_merge_preserves_edge_positions_and_constraints
  228. 23.89 s > stdout ---
  229. 23.89 s >
  230. 23.89 s > running 1 test
  231. 23.89 s > test tests::test_graph_structural_axis_merge_preserves_edge_positions_and_constraints ... FAILED
  232. 23.89 s >
  233. 23.89 s > failures:
  234. 23.89 s >
  235. 23.89 s > failures:
  236. 23.89 s > tests::test_graph_structural_axis_merge_preserves_edge_positions_and_constraints
  237. 23.89 s >
  238. 23.89 s > test result: FAILED. 0 passed; 1 failed; 0 ignored; 0 measured; 127 filtered out; finished in 0.00s
  239. 23.89 s >
  240. 23.89 s > stderr ---
  241. 23.89 s >
  242. 23.89 s > thread 'tests::test_graph_structural_axis_merge_preserves_edge_positions_and_constraints' (913) panicked at crates/linnest/src/tests.rs:1721:32:
  243. 23.89 s > no entry found for key
  244. 23.89 s > stack backtrace:
  245. 23.89 s > 0: __rustc::rust_begin_unwind
  246. 23.89 s > 1: core::panicking::panic_fmt
  247. 23.89 s > 2: core::option::expect_failed
  248. 23.89 s > 3: linnest::tests::test_graph_structural_axis_merge_preserves_edge_positions_and_constraints
  249. 23.89 s > 4: <linnest::tests::test_graph_structural_axis_merge_preserves_edge_positions_and_constraints::{closure#0} as core::ops::function::FnOnce<()>>::call_once
  250. 23.89 s > note: Some details are omitted, run with `RUST_BACKTRACE=full` for a verbose backtrace.
  251. 23.89 s >
  252. 23.89 s > error: test run failed
  253. 23.89 s >
  254. 23.89 s > ========== nextest test summary ==========
  255. 23.89 s > report: target/nextest/ci_gammaloop/junit.xml
  256. 23.89 s > tests: 128, failures: 1, errors: 0
  257. 23.89 s >
  258. 23.89 s > 1. linnest::tests::test_graph_structural_axis_merge_preserves_edge_positions_and_constraints
  259. 23.89 s > failure: test failure with exit code 101
  260. 23.89 s > thread 'tests::test_graph_structural_axis_merge_preserves_edge_positions_and_constraints' (913) panicked at crates/linnest/src/tests.rs:1721:32:
  261. 23.89 s > no entry found for key
  262. 23.89 s > stack backtrace:
  263. 23.89 s > 0: __rustc::rust_begin_unwind
  264. 23.89 s > 1: core::panicking::panic_fmt
  265. 23.89 s > 2: core::option::expect_failed
  266. 23.89 s > 3: linnest::tests::test_graph_structural_axis_merge_preserves_edge_positions_and_constraints
  267. 23.89 s > 4: <linnest::tests::test_graph_structural_axis_merge_preserves_edge_positions_and_constraints::{closure#0} as core::ops::function::FnOnce<()>>::call_once
  268. 23.89 s > note: Some details are omitted, run with `RUST_BACKTRACE=full` for a verbose backtrace.
  269. 23.89 s > system-out
  270. 23.89 s > running 1 test
  271. 23.89 s > test tests::test_graph_structural_axis_merge_preserves_edge_positions_and_constraints ... FAILED
  272. 23.89 s >
  273. 23.89 s > failures:
  274. 23.89 s >
  275. 23.89 s > failures:
  276. 23.89 s > tests::test_graph_structural_axis_merge_preserves_edge_positions_and_constraints
  277. 23.89 s >
  278. 23.89 s > test result: FAILED. 0 passed; 1 failed; 0 ignored; 0 measured; 127 filtered out; finished in 0.00s
  279. 23.89 s > system-err
  280. 23.89 s > thread 'tests::test_graph_structural_axis_merge_preserves_edge_positions_and_constraints' (913) panicked at crates/linnest/src/tests.rs:1721:32:
  281. 23.89 s > no entry found for key
  282. 23.89 s > stack backtrace:
  283. 23.89 s > 0: __rustc::rust_begin_unwind
  284. 23.89 s > 1: core::panicking::panic_fmt
  285. 23.89 s > 2: core::option::expect_failed
  286. 23.89 s > 3: linnest::tests::test_graph_structural_axis_merge_preserves_edge_positions_and_constraints
  287. 23.89 s > 4: <linnest::tests::test_graph_structural_axis_merge_preserves_edge_positions_and_constraints::{closure#0} as core::ops::function::FnOnce<()>>::call_once
  288. 23.89 s > note: Some details are omitted, run with `RUST_BACKTRACE=full` for a verbose backtrace.
  289. 23.89 s > =========================================
  290. 23.89 s For full logs, run:
  291. 23.89 s nix log /nix/store/3a6s86hhbf2g1hgbkmcq3zdrmaha78qr-gammaloop-nextest-linnet.drv
  292. 24.12 s [0 built (1 failed)]Run failed.