build checks.x86_64-linux.gammaloop-check
0.00 s
$ /nix/store/9ypz3flqsrl5xl495mm8h645gadjsxi1-coreutils-9.11/bin/timeout --kill-after=15s 7200s /nix/store/23zk8sgzamrbmj1fday15szf7f2279s8-nix-2.34.7/bin/nix --extra-experimental-features nix-command --extra-experimental-features flakes --log-format internal-json build --no-link --print-out-paths git+https://github.com/alphal00p/gammaloop?ref=codex%2Fdocs-manuals&rev=fa8ed9a02ca7dff8db2b623fcf9163af3051b0df&shallow=1#checks.x86_64-linux.gammaloop-check --print-build-logs
0.30 s
error (ignored): SQLite database '/var/cache/nix-ci-worker/eval-cache-v6/b8662e2bf247965c4b15522798a3327a911ceb09864110b48cc6d8093ad95d06.sqlite ' is busy
2.58 s
3.40 s
Building /nix/store/yq41fja0qvn1pcayl6m3fb5q6zl3fd3g-gammaloop-workspace-check-0.1.0.drv
3.52 s
[gammaloop-workspace-check] Phase: unpackPhase
3.53 s
[gammaloop-workspace-check] unpacking source archive /nix/store/0llqw1df709zbvslaaqs2ang2jp44rl4-source
3.72 s
[gammaloop-workspace-check] source root is source
3.77 s
[gammaloop-workspace-check] Phase: patchPhase
3.78 s
[gammaloop-workspace-check] Executing configureCargoCommonVars
3.79 s
[gammaloop-workspace-check] decompressing cargo artifacts from /nix/store/wxpx6lf642pgxp2wz1pw1lxksj5p1wb0-gammaloop-workspace-deps-deps-0.1.0/target.tar.zst to target
6.82 s
[gammaloop-workspace-check] Phase: updateAutotoolsGnuConfigScriptsPhase
7.02 s
[gammaloop-workspace-check] Phase: configurePhase
7.04 s
[gammaloop-workspace-check] will append /build/source/.cargo-home/config.toml with contents of /nix/store/8zq9ya5slh345hbylmsibxw827bi98w0-vendor-cargo-deps/config.toml
7.05 s
[gammaloop-workspace-check] default configurePhase, nothing to do
7.06 s
[gammaloop-workspace-check] Phase: buildPhase
7.10 s
[gammaloop-workspace-check] +++ command cargo --version
7.10 s
[gammaloop-workspace-check] cargo 1.97.0 (c980f4866 2026-06-30)
7.15 s
[gammaloop-workspace-check] +++ command cargo check --profile ci-optim --locked --workspace --features gammaloop-tracing-filter/clap,gammaloop-tracing-filter/symbolica,idenso/bincode,idenso/reference-cases,linnet/bincode,linnet/drawing,linnet/rkyv,linnet/serde,linnet/symbolica,spenso-macros/shadowing,spenso/shadowing,symbolica/tracing_max_level_info,three-dimensional-reps/display,three-dimensional-reps/eval,three-dimensional-reps/serde --all-targets
8.15 s
[gammaloop-workspace-check] Checking cfg-if v1.0.4
8.15 s
[gammaloop-workspace-check] Checking memchr v2.8.0
8.15 s
[gammaloop-workspace-check] Checking once_cell v1.21.4
8.15 s
[gammaloop-workspace-check] Checking either v1.15.0
8.16 s
[gammaloop-workspace-check] Checking serde_core v1.0.228
8.16 s
[gammaloop-workspace-check] Checking libc v0.2.186
8.16 s
[gammaloop-workspace-check] Checking libm v0.2.16
8.16 s
[gammaloop-workspace-check] Checking itoa v1.0.18
8.16 s
[gammaloop-workspace-check] Checking log v0.4.29
8.18 s
[gammaloop-workspace-check] Checking regex-syntax v0.8.10
8.19 s
[gammaloop-workspace-check] Checking zerocopy v0.8.48
8.20 s
[gammaloop-workspace-check] Checking crossbeam-utils v0.8.21
8.20 s
[gammaloop-workspace-check] Checking equivalent v1.0.2
8.24 s
[gammaloop-workspace-check] Checking zmij v1.0.21
8.24 s
[gammaloop-workspace-check] Checking lazy_static v1.5.0
8.24 s
[gammaloop-workspace-check] Checking bytemuck v1.25.0
8.25 s
[gammaloop-workspace-check] Compiling target-lexicon v0.13.5
8.30 s
[gammaloop-workspace-check] Checking arrayvec v0.7.6
8.33 s
[gammaloop-workspace-check] Checking powerfmt v0.2.0
8.34 s
[gammaloop-workspace-check] Checking num_threads v0.1.7
8.35 s
[gammaloop-workspace-check] Checking itertools v0.14.0
8.40 s
[gammaloop-workspace-check] Checking pin-project-lite v0.2.17
8.43 s
[gammaloop-workspace-check] Checking num-conv v0.2.1
8.45 s
[gammaloop-workspace-check] Checking time-core v0.1.8
8.50 s
[gammaloop-workspace-check] Checking tracing-core v0.1.36
8.58 s
[gammaloop-workspace-check] Checking deranged v0.5.8
8.60 s
[gammaloop-workspace-check] Checking allocator-api2 v0.2.21
8.65 s
[gammaloop-workspace-check] Checking safe_arch v0.7.4
8.66 s
[gammaloop-workspace-check] Checking foldhash v0.2.0
8.69 s
[gammaloop-workspace-check] Checking const-random v0.1.18
8.81 s
[gammaloop-workspace-check] Checking winnow v1.0.2
8.83 s
[gammaloop-workspace-check] Checking unty v0.0.4
8.85 s
[gammaloop-workspace-check] Checking static_assertions v1.1.0
8.92 s
[gammaloop-workspace-check] Checking nu-ansi-term v0.50.3
8.93 s
[gammaloop-workspace-check] Checking safe_arch v1.0.0
9.17 s
[gammaloop-workspace-check] Checking aho-corasick v1.1.4
9.35 s
[gammaloop-workspace-check] Checking tracing-log v0.2.0
9.49 s
[gammaloop-workspace-check] Checking tracing v0.1.44
9.55 s
[gammaloop-workspace-check] Checking sharded-slab v0.1.7
9.70 s
[gammaloop-workspace-check] Checking wide v0.7.33
9.82 s
[gammaloop-workspace-check] Checking thread_local v1.1.9
9.95 s
[gammaloop-workspace-check] Checking toml_writer v1.1.1+spec-1.1.0
10.06 s
[gammaloop-workspace-check] Checking indenter v0.3.4
10.15 s
[gammaloop-workspace-check] Checking crossbeam-epoch v0.9.18
10.16 s
[gammaloop-workspace-check] Checking az v1.3.0
10.23 s
[gammaloop-workspace-check] Checking num-traits v0.2.19
10.45 s
[gammaloop-workspace-check] Checking wide v1.3.0
10.51 s
[gammaloop-workspace-check] Checking hashbrown v0.16.1
10.81 s
[gammaloop-workspace-check] Checking crossbeam-deque v0.8.6
10.82 s
[gammaloop-workspace-check] Compiling phf_shared v0.11.3
10.92 s
[gammaloop-workspace-check] Checking rayon-core v1.13.0
10.93 s
[gammaloop-workspace-check] Checking approx v0.5.1
10.99 s
[gammaloop-workspace-check] Checking num-integer v0.1.46
11.02 s
[gammaloop-workspace-check] Checking anyhow v1.0.102
11.11 s
[gammaloop-workspace-check] Checking alloc-no-stdlib v2.0.4
11.20 s
[gammaloop-workspace-check] Checking utf8parse v0.2.2
11.21 s
[gammaloop-workspace-check] Checking rawpointer v0.2.1
11.22 s
[gammaloop-workspace-check] Checking dyn-clone v1.0.20
11.23 s
[gammaloop-workspace-check] Checking alloc-stdlib v0.2.2
11.27 s
[gammaloop-workspace-check] Checking matrixmultiply v0.3.10
11.27 s
[gammaloop-workspace-check] Checking anstyle-parse v1.0.0
11.32 s
[gammaloop-workspace-check] Checking colored v3.1.1
11.33 s
[gammaloop-workspace-check] Checking is_terminal_polyfill v1.70.2
11.35 s
[gammaloop-workspace-check] Checking anstyle-query v1.1.5
11.39 s
[gammaloop-workspace-check] Checking anstyle v1.0.14
11.42 s
[gammaloop-workspace-check] Checking colorchoice v1.0.5
11.44 s
[gammaloop-workspace-check] Compiling pyo3-build-config v0.28.3
11.48 s
[gammaloop-workspace-check] Compiling phf_generator v0.11.3
11.53 s
[gammaloop-workspace-check] Checking eyre v0.6.12
11.55 s
[gammaloop-workspace-check] Checking bitflags v1.3.2
11.57 s
[gammaloop-workspace-check] Checking unicode-width v0.2.2
11.59 s
[gammaloop-workspace-check] Compiling phf_codegen v0.11.3
11.60 s
[gammaloop-workspace-check] Checking brotli-decompressor v5.0.0
11.64 s
[gammaloop-workspace-check] Checking rayon v1.12.0
11.78 s
[gammaloop-workspace-check] Checking inventory v0.3.24
11.79 s
[gammaloop-workspace-check] Checking anstream v1.0.0
11.84 s
[gammaloop-workspace-check] Checking serde v1.0.228
11.88 s
[gammaloop-workspace-check] Checking serde_json v1.0.149
11.93 s
[gammaloop-workspace-check] Checking bitflags v2.11.1
12.00 s
[gammaloop-workspace-check] Checking serde_spanned v1.1.1
12.07 s
[gammaloop-workspace-check] Checking toml_datetime v1.1.1+spec-1.1.0
12.11 s
[gammaloop-workspace-check] Checking spec_math v0.1.6
12.16 s
[gammaloop-workspace-check] Checking thiserror v2.0.18
12.20 s
[gammaloop-workspace-check] Compiling getopts v0.2.24
12.22 s
[gammaloop-workspace-check] Checking libloading v0.9.0
12.33 s
[gammaloop-workspace-check] Checking tinyjson v2.5.1
12.34 s
[gammaloop-workspace-check] Checking toml_parser v1.1.2+spec-1.1.0
12.38 s
[gammaloop-workspace-check] Checking bytes v1.11.1
12.41 s
[gammaloop-workspace-check] Checking byteorder v1.5.0
12.45 s
[gammaloop-workspace-check] Checking append-only-vec v0.1.8
12.54 s
[gammaloop-workspace-check] Checking self_cell v1.2.2
12.56 s
[gammaloop-workspace-check] Compiling unicode_names2_generator v1.3.0
12.65 s
[gammaloop-workspace-check] Compiling unic-char-range v0.9.0
12.76 s
[gammaloop-workspace-check] Checking smallvec v1.15.1
12.80 s
[gammaloop-workspace-check] Checking num-complex v0.4.6
13.01 s
[gammaloop-workspace-check] Checking bincode v2.0.1
13.02 s
[gammaloop-workspace-check] Checking tracing-serde v0.2.0
13.09 s
[gammaloop-workspace-check] Checking toml v1.1.2+spec-1.1.0
13.10 s
[gammaloop-workspace-check] Checking brotli v8.0.2
13.15 s
[gammaloop-workspace-check] Checking getrandom v0.3.4
13.21 s
[gammaloop-workspace-check] Checking time v0.3.47
13.38 s
[gammaloop-workspace-check] Checking gmp-mpfr-sys v1.7.1
13.61 s
[gammaloop-workspace-check] Checking simba v0.9.1
13.63 s
[gammaloop-workspace-check] Checking rand_core v0.9.5
13.71 s
[gammaloop-workspace-check] Checking wasmtime-jit-icache-coherence v34.0.2
13.76 s
[gammaloop-workspace-check] Checking hugepage-rs v0.1.1
13.78 s
[gammaloop-workspace-check] Checking region v3.0.2
13.78 s
[gammaloop-workspace-check] Checking smartstring v1.0.1
13.97 s
[gammaloop-workspace-check] Compiling unic-common v0.9.0
14.06 s
[gammaloop-workspace-check] Checking linux-raw-sys v0.12.1
14.11 s
[gammaloop-workspace-check] Compiling unic-ucd-version v0.9.0
14.17 s
[gammaloop-workspace-check] Compiling unic-char-property v0.9.0
14.28 s
[gammaloop-workspace-check] Compiling is-macro v0.3.7
14.32 s
[gammaloop-workspace-check] Compiling rustpython-parser-vendored v0.4.0
14.59 s
[gammaloop-workspace-check] Checking iana-time-zone v0.1.65
14.63 s
[gammaloop-workspace-check] Checking rustix v1.1.4
14.69 s
[gammaloop-workspace-check] Checking chrono v0.4.44
14.74 s
[gammaloop-workspace-check] Compiling rustpython-parser v0.4.0
14.79 s
[gammaloop-workspace-check] Compiling phf v0.11.3
14.87 s
[gammaloop-workspace-check] Checking rustc-hash v2.1.2
14.94 s
[gammaloop-workspace-check] Compiling unic-ucd-ident v0.9.0
14.95 s
[gammaloop-workspace-check] Compiling unic-emoji-char v0.9.0
15.00 s
[gammaloop-workspace-check] Checking ndarray v0.17.2
15.12 s
[gammaloop-workspace-check] Compiling lalrpop-util v0.20.2
15.25 s
[gammaloop-workspace-check] Compiling rustc-hash v1.1.0
15.32 s
[gammaloop-workspace-check] Checking rug v1.30.0
15.36 s
[gammaloop-workspace-check] Compiling symbolica v2.2.0 (https://github.com/alphal00p/symbolica?rev=4d0a833eb8e059d1f95bdae5abed2559830b235f#4d0a833e)
15.52 s
[gammaloop-workspace-check] Checking regex-automata v0.4.14
15.89 s
[gammaloop-workspace-check] Checking unicode-segmentation v1.13.2
15.94 s
[gammaloop-workspace-check] Checking typenum v1.20.0
16.23 s
[gammaloop-workspace-check] Checking getrandom v0.2.17
16.43 s
[gammaloop-workspace-check] Checking scopeguard v1.2.0
16.50 s
[gammaloop-workspace-check] Checking parking_lot_core v0.9.12
16.51 s
[gammaloop-workspace-check] Checking lock_api v0.4.14
16.64 s
[gammaloop-workspace-check] Checking unicode-ident v1.0.24
16.75 s
[gammaloop-workspace-check] Checking hashbrown v0.17.0
16.82 s
[gammaloop-workspace-check] Checking parking_lot v0.12.5
16.88 s
[gammaloop-workspace-check] Checking errno v0.3.14
17.00 s
[gammaloop-workspace-check] Checking unicase v2.9.0
17.09 s
[gammaloop-workspace-check] Checking strsim v0.11.1
17.10 s
[gammaloop-workspace-check] Checking clap_lex v1.1.0
17.15 s
[gammaloop-workspace-check] Checking generic-array v0.14.7
17.26 s
[gammaloop-workspace-check] Checking signal-hook-registry v1.4.8
17.33 s
[gammaloop-workspace-check] Checking vte v0.14.1
17.36 s
[gammaloop-workspace-check] Checking same-file v1.0.6
17.40 s
[gammaloop-workspace-check] Checking indexmap v2.14.0
17.44 s
[gammaloop-workspace-check] Checking signal-hook v0.3.18
17.49 s
[gammaloop-workspace-check] Checking mio v1.2.0
17.50 s
[gammaloop-workspace-check] Checking walkdir v2.5.0
17.60 s
[gammaloop-workspace-check] Checking minimal-lexical v0.2.1
17.82 s
[gammaloop-workspace-check] Checking ciborium-io v0.2.2
17.88 s
[gammaloop-workspace-check] Checking nom v7.1.3
17.89 s
[gammaloop-workspace-check] Checking derive_more v2.1.1
17.94 s
[gammaloop-workspace-check] Checking console v0.16.3
18.02 s
[gammaloop-workspace-check] Checking signal-hook-mio v0.2.5
18.09 s
[gammaloop-workspace-check] Compiling unicode_names2 v1.3.0
18.10 s
[gammaloop-workspace-check] Checking num-bigint v0.4.6
18.21 s
[gammaloop-workspace-check] Checking crypto-common v0.1.7
18.30 s
[gammaloop-workspace-check] Checking block-buffer v0.10.4
18.30 s
[gammaloop-workspace-check] Checking bstr v1.12.1
18.46 s
[gammaloop-workspace-check] Checking digest v0.10.7
18.58 s
[gammaloop-workspace-check] Checking winnow v0.7.15
18.82 s
[gammaloop-workspace-check] Checking cpufeatures v0.2.17
18.86 s
[gammaloop-workspace-check] Checking linux-raw-sys v0.4.15
18.92 s
[gammaloop-workspace-check] Checking ansitok v0.3.0
19.12 s
[gammaloop-workspace-check] Checking ppv-lite86 v0.2.21
19.14 s
[gammaloop-workspace-check] Checking ahash v0.8.12
19.15 s
[gammaloop-workspace-check] Checking xprec v0.2.2
19.48 s
[gammaloop-workspace-check] Checking rand_chacha v0.9.0
19.59 s
[gammaloop-workspace-check] Checking half v2.7.1
19.61 s
[gammaloop-workspace-check] Checking sha2 v0.10.9
19.75 s
[gammaloop-workspace-check] Checking getrandom v0.4.2
19.85 s
[gammaloop-workspace-check] Checking rand v0.9.4
19.91 s
[gammaloop-workspace-check] Checking rand_core v0.6.4
19.93 s
[gammaloop-workspace-check] Checking fnv v1.0.7
19.97 s
[gammaloop-workspace-check] Checking rustix v0.38.44
20.00 s
[gammaloop-workspace-check] Checking fastrand v2.4.1
20.07 s
[gammaloop-workspace-check] Checking plotters-backend v0.3.7
20.20 s
[gammaloop-workspace-check] Checking plotters-svg v0.3.7
20.22 s
[gammaloop-workspace-check] Checking toml_datetime v0.6.11
20.24 s
[gammaloop-workspace-check] Checking serde_spanned v0.6.9
20.30 s
[gammaloop-workspace-check] Checking itertools v0.10.5
20.38 s
[gammaloop-workspace-check] Checking tap v1.0.1
20.39 s
[gammaloop-workspace-check] Checking cast v0.3.0
20.46 s
[gammaloop-workspace-check] Checking toml_write v0.1.2
20.53 s
[gammaloop-workspace-check] Checking wyz v0.5.1
20.67 s
[gammaloop-workspace-check] Checking plotters v0.3.7
20.74 s
[gammaloop-workspace-check] Checking rand_chacha v0.3.1
20.80 s
[gammaloop-workspace-check] Checking ciborium-ll v0.2.2
20.90 s
[gammaloop-workspace-check] Checking terminal_size v0.4.4
20.96 s
[gammaloop-workspace-check] Checking ciborium v0.2.2
21.00 s
[gammaloop-workspace-check] Checking clap_builder v4.6.0
21.01 s
[gammaloop-workspace-check] Checking tempfile v3.27.0
21.11 s
[gammaloop-workspace-check] Checking matchers v0.2.0
21.38 s
[gammaloop-workspace-check] Checking regex v1.12.3
21.40 s
[gammaloop-workspace-check] Checking tracing-subscriber v0.3.23
21.72 s
[gammaloop-workspace-check] Checking globset v0.4.18
21.80 s
[gammaloop-workspace-check] Checking ansi-str v0.9.0
21.80 s
[gammaloop-workspace-check] Checking criterion-plot v0.5.0
21.86 s
[gammaloop-workspace-check] Checking radium v0.7.0
21.96 s
[gammaloop-workspace-check] Checking rust-embed-utils v8.11.0
22.07 s
[gammaloop-workspace-check] Checking typeid v1.0.3
22.08 s
[gammaloop-workspace-check] Compiling pyo3-ffi v0.28.3
22.13 s
[gammaloop-workspace-check] Compiling pyo3-macros-backend v0.28.3
22.20 s
[gammaloop-workspace-check] Compiling pyo3 v0.28.3
22.25 s
[gammaloop-workspace-check] Compiling numpy v0.28.0
22.52 s
[gammaloop-workspace-check] Checking symjit v2.21.0
22.64 s
[gammaloop-workspace-check] Checking tinytemplate v1.2.1
22.65 s
[gammaloop-workspace-check] Checking similar v2.7.0
22.69 s
[gammaloop-workspace-check] Checking is-terminal v0.4.17
22.72 s
[gammaloop-workspace-check] Checking oorandom v11.1.5
22.85 s
[gammaloop-workspace-check] Checking funty v2.0.0
22.95 s
[gammaloop-workspace-check] Checking anes v0.1.6
23.00 s
[gammaloop-workspace-check] Checking bytecount v0.6.9
23.03 s
[gammaloop-workspace-check] Checking ron v0.12.1
23.07 s
[gammaloop-workspace-check] Checking env_filter v1.0.1
23.23 s
[gammaloop-workspace-check] Checking papergrid v0.17.0
23.27 s
[gammaloop-workspace-check] Checking rand v0.8.6
23.29 s
[gammaloop-workspace-check] Checking bitvec v1.0.1
23.39 s
[gammaloop-workspace-check] Checking crossterm v0.28.1
23.52 s
[gammaloop-workspace-check] Checking toml_edit v0.22.27
23.56 s
[gammaloop-workspace-check] Checking testing_table v0.3.0
23.61 s
[gammaloop-workspace-check] Checking clap v4.6.1
23.64 s
[gammaloop-workspace-check] Checking toml_edit v0.25.11+spec-1.1.0
23.66 s
[gammaloop-workspace-check] Checking uncased v0.9.10
23.72 s
[gammaloop-workspace-check] Checking jiff v0.2.24
24.57 s
[gammaloop-workspace-check] Checking ptr_meta v0.1.4
24.61 s
[gammaloop-workspace-check] Checking criterion v0.5.1
24.67 s
[gammaloop-workspace-check] Checking simdutf8 v0.1.5
24.69 s
[gammaloop-workspace-check] Checking ucd-trie v0.1.7
24.82 s
[gammaloop-workspace-check] Checking ahash v0.7.8
24.89 s
[gammaloop-workspace-check] Checking bytecheck v0.6.12
24.99 s
[gammaloop-workspace-check] Checking approx v0.4.0
25.05 s
[gammaloop-workspace-check] Checking pest v2.8.6
25.06 s
[gammaloop-workspace-check] Checking seahash v4.1.0
25.07 s
[gammaloop-workspace-check] Checking hashbrown v0.12.3
25.16 s
[gammaloop-workspace-check] Checking cgmath v0.18.0
25.21 s
[gammaloop-workspace-check] Checking tabled v0.20.0
25.29 s
[gammaloop-workspace-check] Checking num-rational v0.4.2
25.42 s
[gammaloop-workspace-check] Checking num-iter v0.1.45
25.53 s
[gammaloop-workspace-check] Checking rend v0.4.2
25.58 s
[gammaloop-workspace-check] Checking insta v1.47.2
25.66 s
[gammaloop-workspace-check] Checking ref-ops v0.2.5
25.91 s
[gammaloop-workspace-check] Checking rand_xoshiro v0.6.0
26.19 s
[gammaloop-workspace-check] Checking num v0.4.3
26.26 s
[gammaloop-workspace-check] Checking features v0.10.0
26.30 s
[gammaloop-workspace-check] Checking gat-lending-iterator v0.1.8
26.32 s
[gammaloop-workspace-check] Checking constcat v0.5.1
26.37 s
[gammaloop-workspace-check] Checking colored v2.2.0
26.61 s
[gammaloop-workspace-check] Checking arrayref v0.3.9
26.66 s
[gammaloop-workspace-check] Checking constant_time_eq v0.4.2
26.69 s
[gammaloop-workspace-check] Checking cpufeatures v0.3.0
26.77 s
[gammaloop-workspace-check] Checking base64 v0.22.1
26.91 s
[gammaloop-workspace-check] Checking blake3 v1.8.5
26.95 s
[gammaloop-workspace-check] Checking joinery v2.1.0
27.08 s
[gammaloop-workspace-check] Checking siphasher v1.0.2
27.15 s
[gammaloop-workspace-check] Checking titlecase v2.2.1
27.28 s
[gammaloop-workspace-check] Checking subprocess v0.2.15
27.34 s
[gammaloop-workspace-check] Checking toml v0.8.23
27.36 s
[gammaloop-workspace-check] Checking phf_shared v0.13.1
27.45 s
[gammaloop-workspace-check] Checking rust_lisp v0.18.0
27.50 s
[gammaloop-workspace-check] Compiling vakint v0.1.2 (/build/source/crates/vakint)
27.77 s
[gammaloop-workspace-check] Checking version-compare v0.2.1
27.83 s
[gammaloop-workspace-check] Checking xpct v0.5.1
27.99 s
[gammaloop-workspace-check] Checking phf v0.13.1
28.01 s
[gammaloop-workspace-check] Checking string-template-plus v0.4.3
28.11 s
[gammaloop-workspace-check] Checking ryu v1.0.23
28.15 s
[gammaloop-workspace-check] Checking dot-parser v0.5.1
28.18 s
[gammaloop-workspace-check] Checking castaway v0.2.4
28.18 s
[gammaloop-workspace-check] Checking toml_datetime v0.7.5+spec-1.1.0
28.21 s
[gammaloop-workspace-check] Checking figment v0.10.19
28.25 s
[gammaloop-workspace-check] Checking strum v0.27.2
28.35 s
[gammaloop-workspace-check] Checking unicode-truncate v2.0.1
28.44 s
[gammaloop-workspace-check] Checking kasuari v0.4.12
28.48 s
[gammaloop-workspace-check] Checking lru v0.16.4
28.51 s
[gammaloop-workspace-check] Checking vte v0.15.0
28.59 s
[gammaloop-workspace-check] Checking portable-atomic v1.13.1
28.62 s
[gammaloop-workspace-check] Checking vt100 v0.16.2
28.63 s
[gammaloop-workspace-check] Checking toml v0.9.12+spec-1.1.0
28.64 s
[gammaloop-workspace-check] Checking compact_str v0.9.0
28.70 s
[gammaloop-workspace-check] Checking unit-prefix v0.5.2
28.70 s
[gammaloop-workspace-check] Checking rand_distr v0.4.3
28.76 s
[gammaloop-workspace-check] Checking simba v0.6.0
28.79 s
[gammaloop-workspace-check] Checking line-clipping v0.3.7
28.83 s
[gammaloop-workspace-check] Checking adler2 v2.0.1
28.88 s
[gammaloop-workspace-check] Compiling three-dimensional-reps v0.1.0 (/build/source/crates/three-dimensional-reps)
28.93 s
[gammaloop-workspace-check] Checking gimli v0.32.3
29.14 s
[gammaloop-workspace-check] Checking miniz_oxide v0.8.9
29.15 s
[gammaloop-workspace-check] Checking thiserror v1.0.69
29.18 s
[gammaloop-workspace-check] Checking ratatui-core v0.1.0
29.23 s
[gammaloop-workspace-check] Checking derive_builder v0.11.2
29.24 s
[gammaloop-workspace-check] Checking crossterm v0.29.0
29.29 s
[gammaloop-workspace-check] Checking owo-colors v4.3.0
29.32 s
[gammaloop-workspace-check] Checking object v0.37.3
29.34 s
[gammaloop-workspace-check] Checking tracing-error v0.2.1
29.45 s
[gammaloop-workspace-check] Checking typed-index-collections v3.5.0
29.46 s
[gammaloop-workspace-check] Checking serde-big-array v0.5.1
29.49 s
[gammaloop-workspace-check] Checking amd v0.2.2
29.54 s
[gammaloop-workspace-check] Checking itertools v0.11.0
29.65 s
[gammaloop-workspace-check] Compiling gammaloop-tracing-filter-macros v0.1.0 (/build/source/crates/gammaloop-tracing-filter-macros)
29.66 s
[gammaloop-workspace-check] Checking option-ext v0.2.0
29.72 s
[gammaloop-workspace-check] Checking rustc-demangle v0.1.27
29.96 s
[gammaloop-workspace-check] Checking env_logger v0.11.10
29.96 s
[gammaloop-workspace-check] Checking dirs-sys v0.5.0
30.02 s
[gammaloop-workspace-check] Checking ref-cast v1.0.25
30.06 s
[gammaloop-workspace-check] Checking nix v0.31.2
30.10 s
[gammaloop-workspace-check] Checking indicatif v0.18.4
30.10 s
[gammaloop-workspace-check] Checking brotli-decompressor v4.0.3
30.14 s
[gammaloop-workspace-check] Checking integer-sqrt v0.1.5
30.23 s
[gammaloop-workspace-check] Checking crossbeam-channel v0.5.15
30.26 s
[gammaloop-workspace-check] Compiling rustpython-parser-core v0.4.0
30.26 s
[gammaloop-workspace-check] Checking color-spantrace v0.3.0
30.29 s
[gammaloop-workspace-check] Checking itertools v0.12.1
30.45 s
[gammaloop-workspace-check] Compiling rustpython-ast v0.4.0
30.58 s
[gammaloop-workspace-check] Compiling gammalooprs v0.3.4 (/build/source/crates/gammalooprs)
30.59 s
[gammaloop-workspace-check] Checking unsafe-libyaml v0.2.11
30.61 s
[gammaloop-workspace-check] Checking symlink v0.1.0
30.66 s
[gammaloop-workspace-check] Checking tracing-appender v0.2.5
30.72 s
[gammaloop-workspace-check] Checking clarabel v0.11.1
30.84 s
[gammaloop-workspace-check] Checking include_dir v0.7.4
30.90 s
[gammaloop-workspace-check] Checking pathfinding v4.15.0
30.91 s
[gammaloop-workspace-check] Checking tracing-indicatif v0.3.14
30.98 s
[gammaloop-workspace-check] Checking schemars v1.2.1
31.17 s
[gammaloop-workspace-check] Checking ctrlc v3.5.2
31.28 s
[gammaloop-workspace-check] Checking dirs v6.0.0
31.35 s
[gammaloop-workspace-check] Checking slotmap v1.1.1
31.44 s
[gammaloop-workspace-check] Checking json5 v0.4.1
31.50 s
[gammaloop-workspace-check] Checking vectorize v0.2.0
31.59 s
[gammaloop-workspace-check] Checking base62 v2.2.4
31.73 s
[gammaloop-workspace-check] Checking ringbuffer v0.16.0
31.77 s
[gammaloop-workspace-check] Checking ratatui-widgets v0.3.0
31.83 s
[gammaloop-workspace-check] Checking ratatui-crossterm v0.1.0
31.88 s
[gammaloop-workspace-check] Checking brotli v7.0.0
32.03 s
[gammaloop-workspace-check] Checking serde_yaml v0.9.34+deprecated
32.04 s
[gammaloop-workspace-check] Checking rkyv v0.7.46
32.06 s
[gammaloop-workspace-check] Checking clap_complete v4.6.3
32.06 s
[gammaloop-workspace-check] Checking rust-embed v8.11.0
32.09 s
[gammaloop-workspace-check] Checking fd-lock v4.0.4
32.13 s
[gammaloop-workspace-check] Checking strip-ansi-escapes v0.2.1
32.19 s
[gammaloop-workspace-check] Compiling gammaloop-api v0.1.0 (/build/source/crates/gammaloop-api)
32.20 s
[gammaloop-workspace-check] Checking itertools v0.13.0
32.21 s
[gammaloop-workspace-check] Checking strum v0.26.3
32.27 s
[gammaloop-workspace-check] Checking addr2line v0.25.1
32.40 s
[gammaloop-workspace-check] Checking sysinfo v0.33.1
32.43 s
[gammaloop-workspace-check] Checking clap_complete_nushell v4.6.0
32.49 s
[gammaloop-workspace-check] Checking shlex v1.3.0
32.53 s
[gammaloop-workspace-check] Checking futures-core v0.3.32
32.67 s
[gammaloop-workspace-check] Checking futures-task v0.3.32
32.68 s
[gammaloop-workspace-check] Checking slab v0.4.12
32.76 s
[gammaloop-workspace-check] Checking sdd v3.0.10
32.77 s
[gammaloop-workspace-check] Compiling gammaloop-integration-tests v0.1.0 (/build/source/tests)
32.78 s
[gammaloop-workspace-check] Checking futures-util v0.3.32
32.87 s
[gammaloop-workspace-check] Compiling test-log-core v0.2.20
33.11 s
[gammaloop-workspace-check] Checking scc v2.4.0
33.46 s
[gammaloop-workspace-check] Compiling rustc_version v0.4.1
33.52 s
[gammaloop-workspace-check] Checking which v8.0.2
33.67 s
[gammaloop-workspace-check] Checking bincode v1.3.3
34.04 s
[gammaloop-workspace-check] Checking ratatui-macros v0.7.0
34.21 s
[gammaloop-workspace-check] Checking ratatui v0.30.0
34.29 s
[gammaloop-workspace-check] Compiling gungraun-runner v0.18.2
34.66 s
[gammaloop-workspace-check] Compiling gungraun-macros v0.8.0
35.00 s
[gammaloop-workspace-check] Checking proc-macro2 v1.0.106
35.33 s
[gammaloop-workspace-check] Checking reedline v0.42.0
35.47 s
[gammaloop-workspace-check] Checking futures-executor v0.3.32
35.74 s
[gammaloop-workspace-check] Compiling numerica v2.2.0 (https://github.com/alphal00p/symbolica?rev=4d0a833eb8e059d1f95bdae5abed2559830b235f#4d0a833e)
35.84 s
[gammaloop-workspace-check] Checking serial_test v3.4.0
35.93 s
[gammaloop-workspace-check] Checking quote v1.0.45
36.04 s
[gammaloop-workspace-check] Checking maplit v1.0.2
36.09 s
[gammaloop-workspace-check] Checking base64 v0.21.7
36.10 s
[gammaloop-workspace-check] Checking nalgebra v0.29.0
36.15 s
[gammaloop-workspace-check] Compiling iai-callgrind-runner v0.14.2
36.29 s
[gammaloop-workspace-check] Compiling test-log-macros v0.2.20
36.48 s
[gammaloop-workspace-check] Checking wait-timeout v0.2.1
36.50 s
[gammaloop-workspace-check] Checking ron v0.8.1
36.68 s
[gammaloop-workspace-check] Checking kurbo v0.13.0
36.75 s
[gammaloop-workspace-check] Checking quick-error v1.2.3
36.87 s
[gammaloop-workspace-check] Checking bit-vec v0.8.0
37.11 s
[gammaloop-workspace-check] Compiling iai-callgrind v0.14.2
37.13 s
[gammaloop-workspace-check] Checking backtrace v0.3.76
37.22 s
[gammaloop-workspace-check] Checking bit-set v0.8.0
37.38 s
[gammaloop-workspace-check] Checking rusty-fork v0.3.1
37.56 s
[gammaloop-workspace-check] Checking syn v2.0.117
37.57 s
[gammaloop-workspace-check] Compiling iai-callgrind-macros v0.5.1
37.62 s
[gammaloop-workspace-check] Checking color-eyre v0.6.5
37.67 s
[gammaloop-workspace-check] Checking rand_xorshift v0.4.0
37.74 s
[gammaloop-workspace-check] Checking console v0.15.11
37.97 s
[gammaloop-workspace-check] Checking unarray v0.1.4
38.04 s
[gammaloop-workspace-check] Checking pathdiff v0.2.3
38.05 s
[gammaloop-workspace-check] Checking similar-asserts v1.7.0
38.08 s
[gammaloop-workspace-check] Checking proptest v1.11.0
38.12 s
[gammaloop-workspace-check] Checking clinnet v0.1.8 (/build/source/crates/clinnet)
38.95 s
[gammaloop-workspace-check] Checking kurvst v0.1.0 (/build/source/crates/kurvst)
41.23 s
[gammaloop-workspace-check] Checking test-log v0.2.20
43.69 s
[gammaloop-workspace-check] Compiling graphica v2.1.0 (https://github.com/alphal00p/symbolica?rev=4d0a833eb8e059d1f95bdae5abed2559830b235f#4d0a833e)
46.97 s
[gammaloop-workspace-check] Checking statrs v0.16.1
48.32 s
[gammaloop-workspace-check] Checking momtrop v0.3.0
49.31 s
[gammaloop-workspace-check] Compiling pyo3-macros v0.28.3
50.01 s
[gammaloop-workspace-check] Checking gungraun v0.18.2
51.72 s
[gammaloop-workspace-check] Compiling pyo3-stub-gen-derive v0.17.2
57.63 s
[gammaloop-workspace-check] Checking pyo3-stub-gen v0.17.2
65.90 s
[gammaloop-workspace-check] Checking symbolica-utils v0.1.0 (/build/source/crates/symbolica-utils)
65.90 s
[gammaloop-workspace-check] Checking spenso-macros v0.3.2 (/build/source/crates/spenso-macros)
252.00 s
[gammaloop-workspace-check] Compiling gammaloop-workspace-hack v0.1.0 (/build/source/crates/gammaloop-workspace-hack)
252.24 s
[gammaloop-workspace-check] Checking linnet v0.17.0 (/build/source/crates/linnet)
255.53 s
[gammaloop-workspace-check] Checking spenso v0.6.0 (/build/source/crates/spenso)
255.75 s
[gammaloop-workspace-check] Checking linnet-py v0.1.0 (/build/source/crates/linnet-py)
255.75 s
[gammaloop-workspace-check] Checking linnest v0.1.0 (/build/source/crates/linnest)
260.85 s
[gammaloop-workspace-check] Checking idenso v0.3.0 (/build/source/crates/idenso)
260.85 s
[gammaloop-workspace-check] Checking gammaloop-tracing-filter v0.1.0 (/build/source/crates/gammaloop-tracing-filter)
262.87 s
[gammaloop-workspace-check] Checking spenso-hep-lib v0.1.7 (/build/source/crates/spenso-hep-lib)
263.09 s
[gammaloop-workspace-check] Checking spynso3 v0.1.2 (/build/source/crates/spynso3)
290.45 s
[gammaloop-workspace-check] error[E0624] : method `export_uv_forest_graph` is private
290.45 s
[gammaloop-workspace-check] --> tests/tests/uv.rs:3426:33
290.45 s
[gammaloop-workspace-check] |
290.45 s
[gammaloop-workspace-check] 3426 | let soft_export = integrand.export_uv_forest_graph(
290.45 s
[gammaloop-workspace-check] | ^^^^^^^^^^^^^^^^^^^^^^ private method
290.45 s
[gammaloop-workspace-check] |
290.45 s
[gammaloop-workspace-check] ::: crates/gammalooprs/src/uv/export.rs:125:5
290.45 s
[gammaloop-workspace-check] |
290.45 s
[gammaloop-workspace-check] 125 | / pub(crate) fn export_uv_forest_graph(
290.45 s
[gammaloop-workspace-check] 126 | | &self,
290.45 s
[gammaloop-workspace-check] 127 | | graph_id: usize,
290.45 s
[gammaloop-workspace-check] 128 | | orientation: Option<OrientationProjection<'_>>,
290.45 s
[gammaloop-workspace-check] 129 | | generation_settings: &GenerationSettings,
290.45 s
[gammaloop-workspace-check] 130 | | export_settings: &UVForestExportSettings,
290.45 s
[gammaloop-workspace-check] 131 | | ) -> Result<UVForestExport> {
290.45 s
[gammaloop-workspace-check] | |_______________________________- private method defined here
290.45 s
[gammaloop-workspace-check]
290.46 s
[gammaloop-workspace-check] error[E0624] : method `export_uv_forest_graph` is private
290.46 s
[gammaloop-workspace-check] --> tests/tests/uv.rs:3522:38
290.46 s
[gammaloop-workspace-check] |
290.46 s
[gammaloop-workspace-check] 3522 | let uv_export = uv_integrand.export_uv_forest_graph(
290.46 s
[gammaloop-workspace-check] | ^^^^^^^^^^^^^^^^^^^^^^ private method
290.46 s
[gammaloop-workspace-check] |
290.46 s
[gammaloop-workspace-check] ::: crates/gammalooprs/src/uv/export.rs:125:5
290.46 s
[gammaloop-workspace-check] |
290.46 s
[gammaloop-workspace-check] 125 | / pub(crate) fn export_uv_forest_graph(
290.46 s
[gammaloop-workspace-check] 126 | | &self,
290.46 s
[gammaloop-workspace-check] 127 | | graph_id: usize,
290.46 s
[gammaloop-workspace-check] 128 | | orientation: Option<OrientationProjection<'_>>,
290.46 s
[gammaloop-workspace-check] 129 | | generation_settings: &GenerationSettings,
290.46 s
[gammaloop-workspace-check] 130 | | export_settings: &UVForestExportSettings,
290.46 s
[gammaloop-workspace-check] 131 | | ) -> Result<UVForestExport> {
290.46 s
[gammaloop-workspace-check] | |_______________________________- private method defined here
290.46 s
[gammaloop-workspace-check]
290.48 s
[gammaloop-workspace-check] error[E0624] : method `export_uv_forest_graph` is private
290.48 s
[gammaloop-workspace-check] --> tests/tests/uv.rs:3936:44
290.48 s
[gammaloop-workspace-check] |
290.48 s
[gammaloop-workspace-check] 3936 | let export = integrand.export_uv_forest_graph(
290.48 s
[gammaloop-workspace-check] | ^^^^^^^^^^^^^^^^^^^^^^ private method
290.48 s
[gammaloop-workspace-check] |
290.48 s
[gammaloop-workspace-check] ::: crates/gammalooprs/src/uv/export.rs:125:5
290.48 s
[gammaloop-workspace-check] |
290.48 s
[gammaloop-workspace-check] 125 | / pub(crate) fn export_uv_forest_graph(
290.48 s
[gammaloop-workspace-check] 126 | | &self,
290.48 s
[gammaloop-workspace-check] 127 | | graph_id: usize,
290.48 s
[gammaloop-workspace-check] 128 | | orientation: Option<OrientationProjection<'_>>,
290.48 s
[gammaloop-workspace-check] 129 | | generation_settings: &GenerationSettings,
290.48 s
[gammaloop-workspace-check] 130 | | export_settings: &UVForestExportSettings,
290.48 s
[gammaloop-workspace-check] 131 | | ) -> Result<UVForestExport> {
290.48 s
[gammaloop-workspace-check] | |_______________________________- private method defined here
290.48 s
[gammaloop-workspace-check]
290.49 s
[gammaloop-workspace-check] error[E0624] : method `export_uv_forest_graph` is private
290.49 s
[gammaloop-workspace-check] --> tests/tests/uv.rs:4128:36
290.49 s
[gammaloop-workspace-check] |
290.49 s
[gammaloop-workspace-check] 4128 | let export = integrand.export_uv_forest_graph(
290.49 s
[gammaloop-workspace-check] | ^^^^^^^^^^^^^^^^^^^^^^ private method
290.49 s
[gammaloop-workspace-check] |
290.49 s
[gammaloop-workspace-check] ::: crates/gammalooprs/src/uv/export.rs:125:5
290.49 s
[gammaloop-workspace-check] |
290.49 s
[gammaloop-workspace-check] 125 | / pub(crate) fn export_uv_forest_graph(
290.49 s
[gammaloop-workspace-check] 126 | | &self,
290.49 s
[gammaloop-workspace-check] 127 | | graph_id: usize,
290.49 s
[gammaloop-workspace-check] 128 | | orientation: Option<OrientationProjection<'_>>,
290.49 s
[gammaloop-workspace-check] 129 | | generation_settings: &GenerationSettings,
290.49 s
[gammaloop-workspace-check] 130 | | export_settings: &UVForestExportSettings,
290.49 s
[gammaloop-workspace-check] 131 | | ) -> Result<UVForestExport> {
290.49 s
[gammaloop-workspace-check] | |_______________________________- private method defined here
290.49 s
[gammaloop-workspace-check]
290.50 s
[gammaloop-workspace-check] error[E0624] : method `export_uv_forest_graph` is private
290.50 s
[gammaloop-workspace-check] --> tests/tests/uv.rs:4335:36
290.50 s
[gammaloop-workspace-check] |
290.50 s
[gammaloop-workspace-check] 4335 | let export = integrand.export_uv_forest_graph(
290.50 s
[gammaloop-workspace-check] | ^^^^^^^^^^^^^^^^^^^^^^ private method
290.50 s
[gammaloop-workspace-check] |
290.50 s
[gammaloop-workspace-check] ::: crates/gammalooprs/src/uv/export.rs:125:5
290.50 s
[gammaloop-workspace-check] |
290.50 s
[gammaloop-workspace-check] 125 | / pub(crate) fn export_uv_forest_graph(
290.50 s
[gammaloop-workspace-check] 126 | | &self,
290.50 s
[gammaloop-workspace-check] 127 | | graph_id: usize,
290.50 s
[gammaloop-workspace-check] 128 | | orientation: Option<OrientationProjection<'_>>,
290.50 s
[gammaloop-workspace-check] 129 | | generation_settings: &GenerationSettings,
290.50 s
[gammaloop-workspace-check] 130 | | export_settings: &UVForestExportSettings,
290.50 s
[gammaloop-workspace-check] 131 | | ) -> Result<UVForestExport> {
290.50 s
[gammaloop-workspace-check] | |_______________________________- private method defined here
290.50 s
[gammaloop-workspace-check]
290.60 s
[gammaloop-workspace-check] error[E0061] : this method takes 5 arguments but 3 arguments were supplied
290.60 s
[gammaloop-workspace-check] --> tests/tests/uv.rs:4551:26
290.60 s
[gammaloop-workspace-check] |
290.60 s
[gammaloop-workspace-check] 4551 | parent_graph.cff(&parent_tree, &parent_cut, &OrientationPattern::default())?;
290.61 s
[gammaloop-workspace-check] | ^^^ ----------------------------------------------------------- two arguments of type `&three_dimensional_reps::generation::Generate3DExpressionOptions` and `Option<&symbolica::atom::Atom>` are missing
290.61 s
[gammaloop-workspace-check] |
290.61 s
[gammaloop-workspace-check] note : method defined here
290.61 s
[gammaloop-workspace-check] --> crates/gammalooprs/src/cff/mod.rs:755:12
290.61 s
[gammaloop-workspace-check] |
290.61 s
[gammaloop-workspace-check] 755 | pub fn cff<S: SubGraphLike + SubSetLike>(
290.61 s
[gammaloop-workspace-check] | ^^^
290.61 s
[gammaloop-workspace-check] help : provide the arguments
290.61 s
[gammaloop-workspace-check] |
290.61 s
[gammaloop-workspace-check] 4551 | parent_graph.cff(&parent_tree, &parent_cut, &OrientationPattern::default(), /* &three_dimensional_reps::generation::Generate3DExpressionOptions */, /* Option<&symbolica::atom::Atom> */ )?;
290.61 s
[gammaloop-workspace-check] | ++++++++++++++++++++++++++++++++++++++++++++++++++++++++++++++++++++++++++++++++++++++++++++++++++++++++++++++
290.61 s
[gammaloop-workspace-check]
290.61 s
[gammaloop-workspace-check] error[E0616] : field `orientations` of struct `CFFTerm` is private
290.61 s
[gammaloop-workspace-check] --> tests/tests/uv.rs:4555:36
290.61 s
[gammaloop-workspace-check] |
290.61 s
[gammaloop-workspace-check] 4555 | .flat_map(|term| &term.orientations)
290.61 s
[gammaloop-workspace-check] | ^^^^^^^^^^^^ private field
290.61 s
[gammaloop-workspace-check]
290.65 s
[gammaloop-workspace-check] error[E0609] : no field `orientations` on type `&GeneratedThreeDExpression<Esurface, Hsurface>`
290.65 s
[gammaloop-workspace-check] --> tests/tests/uv.rs:4653:18
290.65 s
[gammaloop-workspace-check] |
290.65 s
[gammaloop-workspace-check] 4653 | .orientations
290.65 s
[gammaloop-workspace-check] | ^^^^^^^^^^^^ unknown field
290.65 s
[gammaloop-workspace-check] |
290.65 s
[gammaloop-workspace-check] = note : the full name for the type has been written to '/build/source/target/ci-optim/deps/uv-ae6ff038ef4b6f0a.long-type-12389030920437475506.txt'
290.65 s
[gammaloop-workspace-check] = note : consider using `--verbose` to print the full type name to the console
290.65 s
[gammaloop-workspace-check] help : one of the expressions' fields has a field of the same name
290.65 s
[gammaloop-workspace-check] |
290.65 s
[gammaloop-workspace-check] 4653 | .expression. orientations
290.65 s
[gammaloop-workspace-check] | +++++++++++
290.65 s
[gammaloop-workspace-check]
290.65 s
[gammaloop-workspace-check] error[E0624] : method `export_uv_forest_graph` is private
290.65 s
[gammaloop-workspace-check] --> tests/tests/uv.rs:4673:43
290.65 s
[gammaloop-workspace-check] |
290.65 s
[gammaloop-workspace-check] 4673 | let structural_forest = integrand.export_uv_forest_graph(
290.65 s
[gammaloop-workspace-check] | ^^^^^^^^^^^^^^^^^^^^^^ private method
290.65 s
[gammaloop-workspace-check] |
290.65 s
[gammaloop-workspace-check] ::: crates/gammalooprs/src/uv/export.rs:125:5
290.65 s
[gammaloop-workspace-check] |
290.65 s
[gammaloop-workspace-check] 125 | / pub(crate) fn export_uv_forest_graph(
290.65 s
[gammaloop-workspace-check] 126 | | &self,
290.65 s
[gammaloop-workspace-check] 127 | | graph_id: usize,
290.65 s
[gammaloop-workspace-check] 128 | | orientation: Option<OrientationProjection<'_>>,
290.65 s
[gammaloop-workspace-check] 129 | | generation_settings: &GenerationSettings,
290.65 s
[gammaloop-workspace-check] 130 | | export_settings: &UVForestExportSettings,
290.65 s
[gammaloop-workspace-check] 131 | | ) -> Result<UVForestExport> {
290.65 s
[gammaloop-workspace-check] | |_______________________________- private method defined here
290.65 s
[gammaloop-workspace-check]
290.67 s
[gammaloop-workspace-check] error[E0624] : method `export_uv_forest_graph` is private
290.67 s
[gammaloop-workspace-check] --> tests/tests/uv.rs:4897:43
290.67 s
[gammaloop-workspace-check] |
290.67 s
[gammaloop-workspace-check] 4897 | let structural_forest = integrand.export_uv_forest_graph(
290.67 s
[gammaloop-workspace-check] | ^^^^^^^^^^^^^^^^^^^^^^ private method
290.67 s
[gammaloop-workspace-check] |
290.67 s
[gammaloop-workspace-check] ::: crates/gammalooprs/src/uv/export.rs:125:5
290.67 s
[gammaloop-workspace-check] |
290.67 s
[gammaloop-workspace-check] 125 | / pub(crate) fn export_uv_forest_graph(
290.67 s
[gammaloop-workspace-check] 126 | | &self,
290.67 s
[gammaloop-workspace-check] 127 | | graph_id: usize,
290.67 s
[gammaloop-workspace-check] 128 | | orientation: Option<OrientationProjection<'_>>,
290.67 s
[gammaloop-workspace-check] 129 | | generation_settings: &GenerationSettings,
290.67 s
[gammaloop-workspace-check] 130 | | export_settings: &UVForestExportSettings,
290.67 s
[gammaloop-workspace-check] 131 | | ) -> Result<UVForestExport> {
290.67 s
[gammaloop-workspace-check] | |_______________________________- private method defined here
290.67 s
[gammaloop-workspace-check]
290.69 s
[gammaloop-workspace-check] error[E0624] : method `export_uv_forest_graph` is private
290.69 s
[gammaloop-workspace-check] --> tests/tests/uv.rs:5146:43
290.69 s
[gammaloop-workspace-check] |
290.69 s
[gammaloop-workspace-check] 5146 | let structural_forest = integrand.export_uv_forest_graph(
290.69 s
[gammaloop-workspace-check] | ^^^^^^^^^^^^^^^^^^^^^^ private method
290.69 s
[gammaloop-workspace-check] |
290.69 s
[gammaloop-workspace-check] ::: crates/gammalooprs/src/uv/export.rs:125:5
290.69 s
[gammaloop-workspace-check] |
290.69 s
[gammaloop-workspace-check] 125 | / pub(crate) fn export_uv_forest_graph(
290.69 s
[gammaloop-workspace-check] 126 | | &self,
290.69 s
[gammaloop-workspace-check] 127 | | graph_id: usize,
290.69 s
[gammaloop-workspace-check] 128 | | orientation: Option<OrientationProjection<'_>>,
290.69 s
[gammaloop-workspace-check] 129 | | generation_settings: &GenerationSettings,
290.69 s
[gammaloop-workspace-check] 130 | | export_settings: &UVForestExportSettings,
290.69 s
[gammaloop-workspace-check] 131 | | ) -> Result<UVForestExport> {
290.69 s
[gammaloop-workspace-check] | |_______________________________- private method defined here
290.69 s
[gammaloop-workspace-check]
290.69 s
[gammaloop-workspace-check] error[E0624] : method `export_uv_forest_graph` is private
290.69 s
[gammaloop-workspace-check] --> tests/tests/uv.rs:5161:41
290.69 s
[gammaloop-workspace-check] |
290.69 s
[gammaloop-workspace-check] 5161 | let computed_forest = integrand.export_uv_forest_graph(
290.69 s
[gammaloop-workspace-check] | ^^^^^^^^^^^^^^^^^^^^^^ private method
290.69 s
[gammaloop-workspace-check] |
290.69 s
[gammaloop-workspace-check] ::: crates/gammalooprs/src/uv/export.rs:125:5
290.69 s
[gammaloop-workspace-check] |
290.69 s
[gammaloop-workspace-check] 125 | / pub(crate) fn export_uv_forest_graph(
290.69 s
[gammaloop-workspace-check] 126 | | &self,
290.69 s
[gammaloop-workspace-check] 127 | | graph_id: usize,
290.69 s
[gammaloop-workspace-check] 128 | | orientation: Option<OrientationProjection<'_>>,
290.69 s
[gammaloop-workspace-check] 129 | | generation_settings: &GenerationSettings,
290.69 s
[gammaloop-workspace-check] 130 | | export_settings: &UVForestExportSettings,
290.69 s
[gammaloop-workspace-check] 131 | | ) -> Result<UVForestExport> {
290.69 s
[gammaloop-workspace-check] | |_______________________________- private method defined here
290.69 s
[gammaloop-workspace-check]
290.72 s
[gammaloop-workspace-check] error[E0624] : method `export_uv_forest_graph` is private
290.72 s
[gammaloop-workspace-check] --> tests/tests/uv.rs:5724:51
290.72 s
[gammaloop-workspace-check] |
290.72 s
[gammaloop-workspace-check] 5724 | let structural_forest = integrand.export_uv_forest_graph(
290.72 s
[gammaloop-workspace-check] | ^^^^^^^^^^^^^^^^^^^^^^ private method
290.72 s
[gammaloop-workspace-check] |
290.72 s
[gammaloop-workspace-check] ::: crates/gammalooprs/src/uv/export.rs:125:5
290.72 s
[gammaloop-workspace-check] |
290.72 s
[gammaloop-workspace-check] 125 | / pub(crate) fn export_uv_forest_graph(
290.72 s
[gammaloop-workspace-check] 126 | | &self,
290.72 s
[gammaloop-workspace-check] 127 | | graph_id: usize,
290.72 s
[gammaloop-workspace-check] 128 | | orientation: Option<OrientationProjection<'_>>,
290.72 s
[gammaloop-workspace-check] 129 | | generation_settings: &GenerationSettings,
290.72 s
[gammaloop-workspace-check] 130 | | export_settings: &UVForestExportSettings,
290.72 s
[gammaloop-workspace-check] 131 | | ) -> Result<UVForestExport> {
290.72 s
[gammaloop-workspace-check] | |_______________________________- private method defined here
290.72 s
[gammaloop-workspace-check]
290.88 s
[gammaloop-workspace-check] Some errors have detailed explanations: E0061, E0609, E0616, E0624.
290.88 s
[gammaloop-workspace-check] For more information about an error, try `rustc --explain E0061`.
290.89 s
[gammaloop-workspace-check] error : could not compile `gammaloop-integration-tests` (test "uv") due to 13 previous errors
290.89 s
[gammaloop-workspace-check] warning : build failed, waiting for other jobs to finish...
291.64 s
Progress: 0 of 1 built (1 failed)
291.64 s
Failed to build gammaloop-workspace-check after 4m48s
291.65 s
Cannot build ' /nix/store/yq41fja0qvn1pcayl6m3fb5q6zl3fd3g-gammaloop-workspace-check-0.1.0.drv '.
291.65 s
Reason: builder failed with exit code 101 .
291.65 s
Output paths:
291.65 s
/nix/store/hwdr1153vypfqwdqsimb7pidkhdih6m9-gammaloop-workspace-check-0.1.0
291.65 s
Last 634 log lines:
291.65 s
> Running phase: unpackPhase
291.65 s
> unpacking source archive /nix/store/0llqw1df709zbvslaaqs2ang2jp44rl4-source
291.65 s
> source root is source
291.65 s
> Running phase: patchPhase
291.65 s
> Executing configureCargoCommonVars
291.65 s
> decompressing cargo artifacts from /nix/store/wxpx6lf642pgxp2wz1pw1lxksj5p1wb0-gammaloop-workspace-deps-deps-0.1.0/target.tar.zst to target
291.65 s
> Running phase: updateAutotoolsGnuConfigScriptsPhase
291.65 s
> Running phase: configurePhase
291.65 s
> will append /build/source/.cargo-home/config.toml with contents of /nix/store/8zq9ya5slh345hbylmsibxw827bi98w0-vendor-cargo-deps/config.toml
291.65 s
> default configurePhase, nothing to do
291.65 s
> Running phase: buildPhase
291.65 s
> +++ command cargo --version
291.65 s
> cargo 1.97.0 (c980f4866 2026-06-30)
291.65 s
> +++ command cargo check --profile ci-optim --locked --workspace --features gammaloop-tracing-filter/clap,gammaloop-tracing-filter/symbolica,idenso/bincode,idenso/reference-cases,linnet/bincode,linnet/drawing,linnet/rkyv,linnet/serde,linnet/symbolica,spenso-macros/shadowing,spenso/shadowing,symbolica/tracing_max_level_info,three-dimensional-reps/display,three-dimensional-reps/eval,three-dimensional-reps/serde --all-targets
291.65 s
> Checking cfg-if v1.0.4
291.65 s
> Checking memchr v2.8.0
291.65 s
> Checking once_cell v1.21.4
291.65 s
> Checking either v1.15.0
291.65 s
> Checking serde_core v1.0.228
291.65 s
> Checking libc v0.2.186
291.65 s
> Checking libm v0.2.16
291.65 s
> Checking itoa v1.0.18
291.65 s
> Checking log v0.4.29
291.65 s
> Checking regex-syntax v0.8.10
291.65 s
> Checking zerocopy v0.8.48
291.65 s
> Checking crossbeam-utils v0.8.21
291.65 s
> Checking equivalent v1.0.2
291.65 s
> Checking zmij v1.0.21
291.65 s
> Checking lazy_static v1.5.0
291.65 s
> Checking bytemuck v1.25.0
291.65 s
> Compiling target-lexicon v0.13.5
291.65 s
> Checking arrayvec v0.7.6
291.65 s
> Checking powerfmt v0.2.0
291.65 s
> Checking num_threads v0.1.7
291.65 s
> Checking itertools v0.14.0
291.65 s
> Checking pin-project-lite v0.2.17
291.65 s
> Checking num-conv v0.2.1
291.65 s
> Checking time-core v0.1.8
291.65 s
> Checking tracing-core v0.1.36
291.65 s
> Checking deranged v0.5.8
291.65 s
> Checking allocator-api2 v0.2.21
291.65 s
> Checking safe_arch v0.7.4
291.65 s
> Checking foldhash v0.2.0
291.65 s
> Checking const-random v0.1.18
291.65 s
> Checking winnow v1.0.2
291.65 s
> Checking unty v0.0.4
291.65 s
> Checking static_assertions v1.1.0
291.65 s
> Checking nu-ansi-term v0.50.3
291.65 s
> Checking safe_arch v1.0.0
291.65 s
> Checking aho-corasick v1.1.4
291.65 s
> Checking tracing-log v0.2.0
291.65 s
> Checking tracing v0.1.44
291.65 s
> Checking sharded-slab v0.1.7
291.65 s
> Checking wide v0.7.33
291.65 s
> Checking thread_local v1.1.9
291.65 s
> Checking toml_writer v1.1.1+spec-1.1.0
291.65 s
> Checking indenter v0.3.4
291.65 s
> Checking crossbeam-epoch v0.9.18
291.65 s
> Checking az v1.3.0
291.65 s
> Checking num-traits v0.2.19
291.65 s
> Checking wide v1.3.0
291.65 s
> Checking hashbrown v0.16.1
291.65 s
> Checking crossbeam-deque v0.8.6
291.65 s
> Compiling phf_shared v0.11.3
291.65 s
> Checking rayon-core v1.13.0
291.65 s
> Checking approx v0.5.1
291.65 s
> Checking num-integer v0.1.46
291.65 s
> Checking anyhow v1.0.102
291.65 s
> Checking alloc-no-stdlib v2.0.4
291.65 s
> Checking utf8parse v0.2.2
291.65 s
> Checking rawpointer v0.2.1
291.65 s
> Checking dyn-clone v1.0.20
291.65 s
> Checking alloc-stdlib v0.2.2
291.65 s
> Checking matrixmultiply v0.3.10
291.65 s
> Checking anstyle-parse v1.0.0
291.65 s
> Checking colored v3.1.1
291.65 s
> Checking is_terminal_polyfill v1.70.2
291.65 s
> Checking anstyle-query v1.1.5
291.65 s
> Checking anstyle v1.0.14
291.65 s
> Checking colorchoice v1.0.5
291.65 s
> Compiling pyo3-build-config v0.28.3
291.65 s
> Compiling phf_generator v0.11.3
291.65 s
> Checking eyre v0.6.12
291.65 s
> Checking bitflags v1.3.2
291.65 s
> Checking unicode-width v0.2.2
291.65 s
> Compiling phf_codegen v0.11.3
291.65 s
> Checking brotli-decompressor v5.0.0
291.65 s
> Checking rayon v1.12.0
291.65 s
> Checking inventory v0.3.24
291.65 s
> Checking anstream v1.0.0
291.65 s
> Checking serde v1.0.228
291.65 s
> Checking serde_json v1.0.149
291.65 s
> Checking bitflags v2.11.1
291.65 s
> Checking serde_spanned v1.1.1
291.65 s
> Checking toml_datetime v1.1.1+spec-1.1.0
291.65 s
> Checking spec_math v0.1.6
291.65 s
> Checking thiserror v2.0.18
291.65 s
> Compiling getopts v0.2.24
291.65 s
> Checking libloading v0.9.0
291.65 s
> Checking tinyjson v2.5.1
291.65 s
> Checking toml_parser v1.1.2+spec-1.1.0
291.65 s
> Checking bytes v1.11.1
291.65 s
> Checking byteorder v1.5.0
291.65 s
> Checking append-only-vec v0.1.8
291.65 s
> Checking self_cell v1.2.2
291.65 s
> Compiling unicode_names2_generator v1.3.0
291.65 s
> Compiling unic-char-range v0.9.0
291.65 s
> Checking smallvec v1.15.1
291.65 s
> Checking num-complex v0.4.6
291.65 s
> Checking bincode v2.0.1
291.65 s
> Checking tracing-serde v0.2.0
291.65 s
> Checking toml v1.1.2+spec-1.1.0
291.65 s
> Checking brotli v8.0.2
291.65 s
> Checking getrandom v0.3.4
291.65 s
> Checking time v0.3.47
291.65 s
> Checking gmp-mpfr-sys v1.7.1
291.65 s
> Checking simba v0.9.1
291.65 s
> Checking rand_core v0.9.5
291.65 s
> Checking wasmtime-jit-icache-coherence v34.0.2
291.65 s
> Checking hugepage-rs v0.1.1
291.65 s
> Checking region v3.0.2
291.65 s
> Checking smartstring v1.0.1
291.65 s
> Compiling unic-common v0.9.0
291.65 s
> Checking linux-raw-sys v0.12.1
291.65 s
> Compiling unic-ucd-version v0.9.0
291.65 s
> Compiling unic-char-property v0.9.0
291.65 s
> Compiling is-macro v0.3.7
291.65 s
> Compiling rustpython-parser-vendored v0.4.0
291.65 s
> Checking iana-time-zone v0.1.65
291.65 s
> Checking rustix v1.1.4
291.65 s
> Checking chrono v0.4.44
291.65 s
> Compiling rustpython-parser v0.4.0
291.65 s
> Compiling phf v0.11.3
291.65 s
> Checking rustc-hash v2.1.2
291.65 s
> Compiling unic-ucd-ident v0.9.0
291.65 s
> Compiling unic-emoji-char v0.9.0
291.65 s
> Checking ndarray v0.17.2
291.65 s
> Compiling lalrpop-util v0.20.2
291.65 s
> Compiling rustc-hash v1.1.0
291.65 s
> Checking rug v1.30.0
291.65 s
> Compiling symbolica v2.2.0 (https://github.com/alphal00p/symbolica?rev=4d0a833eb8e059d1f95bdae5abed2559830b235f#4d0a833e)
291.65 s
> Checking regex-automata v0.4.14
291.65 s
> Checking unicode-segmentation v1.13.2
291.65 s
> Checking typenum v1.20.0
291.65 s
> Checking getrandom v0.2.17
291.65 s
> Checking scopeguard v1.2.0
291.65 s
> Checking parking_lot_core v0.9.12
291.65 s
> Checking lock_api v0.4.14
291.65 s
> Checking unicode-ident v1.0.24
291.65 s
> Checking hashbrown v0.17.0
291.65 s
> Checking parking_lot v0.12.5
291.65 s
> Checking errno v0.3.14
291.65 s
> Checking unicase v2.9.0
291.65 s
> Checking strsim v0.11.1
291.65 s
> Checking clap_lex v1.1.0
291.65 s
> Checking generic-array v0.14.7
291.65 s
> Checking signal-hook-registry v1.4.8
291.65 s
> Checking vte v0.14.1
291.65 s
> Checking same-file v1.0.6
291.65 s
> Checking indexmap v2.14.0
291.65 s
> Checking signal-hook v0.3.18
291.65 s
> Checking mio v1.2.0
291.65 s
> Checking walkdir v2.5.0
291.65 s
> Checking minimal-lexical v0.2.1
291.65 s
> Checking ciborium-io v0.2.2
291.65 s
> Checking nom v7.1.3
291.65 s
> Checking derive_more v2.1.1
291.65 s
> Checking console v0.16.3
291.65 s
> Checking signal-hook-mio v0.2.5
291.65 s
> Compiling unicode_names2 v1.3.0
291.65 s
> Checking num-bigint v0.4.6
291.65 s
> Checking crypto-common v0.1.7
291.65 s
> Checking block-buffer v0.10.4
291.65 s
> Checking bstr v1.12.1
291.65 s
> Checking digest v0.10.7
291.65 s
> Checking winnow v0.7.15
291.65 s
> Checking cpufeatures v0.2.17
291.65 s
> Checking linux-raw-sys v0.4.15
291.65 s
> Checking ansitok v0.3.0
291.65 s
> Checking ppv-lite86 v0.2.21
291.65 s
> Checking ahash v0.8.12
291.65 s
> Checking xprec v0.2.2
291.65 s
> Checking rand_chacha v0.9.0
291.65 s
> Checking half v2.7.1
291.65 s
> Checking sha2 v0.10.9
291.65 s
> Checking getrandom v0.4.2
291.65 s
> Checking rand v0.9.4
291.65 s
> Checking rand_core v0.6.4
291.65 s
> Checking fnv v1.0.7
291.65 s
> Checking rustix v0.38.44
291.65 s
> Checking fastrand v2.4.1
291.65 s
> Checking plotters-backend v0.3.7
291.65 s
> Checking plotters-svg v0.3.7
291.65 s
> Checking toml_datetime v0.6.11
291.65 s
> Checking serde_spanned v0.6.9
291.65 s
> Checking itertools v0.10.5
291.65 s
> Checking tap v1.0.1
291.65 s
> Checking cast v0.3.0
291.65 s
> Checking toml_write v0.1.2
291.65 s
> Checking wyz v0.5.1
291.65 s
> Checking plotters v0.3.7
291.65 s
> Checking rand_chacha v0.3.1
291.65 s
> Checking ciborium-ll v0.2.2
291.65 s
> Checking terminal_size v0.4.4
291.65 s
> Checking ciborium v0.2.2
291.65 s
> Checking clap_builder v4.6.0
291.65 s
> Checking tempfile v3.27.0
291.65 s
> Checking matchers v0.2.0
291.65 s
> Checking regex v1.12.3
291.65 s
> Checking tracing-subscriber v0.3.23
291.65 s
> Checking globset v0.4.18
291.65 s
> Checking ansi-str v0.9.0
291.65 s
> Checking criterion-plot v0.5.0
291.65 s
> Checking radium v0.7.0
291.65 s
> Checking rust-embed-utils v8.11.0
291.65 s
> Checking typeid v1.0.3
291.65 s
> Compiling pyo3-ffi v0.28.3
291.65 s
> Compiling pyo3-macros-backend v0.28.3
291.65 s
> Compiling pyo3 v0.28.3
291.65 s
> Compiling numpy v0.28.0
291.65 s
> Checking symjit v2.21.0
291.65 s
> Checking tinytemplate v1.2.1
291.65 s
> Checking similar v2.7.0
291.65 s
> Checking is-terminal v0.4.17
291.65 s
> Checking oorandom v11.1.5
291.65 s
> Checking funty v2.0.0
291.65 s
> Checking anes v0.1.6
291.65 s
> Checking bytecount v0.6.9
291.65 s
> Checking ron v0.12.1
291.65 s
> Checking env_filter v1.0.1
291.65 s
> Checking papergrid v0.17.0
291.65 s
> Checking rand v0.8.6
291.65 s
> Checking bitvec v1.0.1
291.65 s
> Checking crossterm v0.28.1
291.65 s
> Checking toml_edit v0.22.27
291.65 s
> Checking testing_table v0.3.0
291.65 s
> Checking clap v4.6.1
291.65 s
> Checking toml_edit v0.25.11+spec-1.1.0
291.65 s
> Checking uncased v0.9.10
291.65 s
> Checking jiff v0.2.24
291.65 s
> Checking ptr_meta v0.1.4
291.65 s
> Checking criterion v0.5.1
291.65 s
> Checking simdutf8 v0.1.5
291.65 s
> Checking ucd-trie v0.1.7
291.65 s
> Checking ahash v0.7.8
291.65 s
> Checking bytecheck v0.6.12
291.65 s
> Checking approx v0.4.0
291.65 s
> Checking pest v2.8.6
291.65 s
> Checking seahash v4.1.0
291.65 s
> Checking hashbrown v0.12.3
291.65 s
> Checking cgmath v0.18.0
291.65 s
> Checking tabled v0.20.0
291.65 s
> Checking num-rational v0.4.2
291.65 s
> Checking num-iter v0.1.45
291.65 s
> Checking rend v0.4.2
291.65 s
> Checking insta v1.47.2
291.65 s
> Checking ref-ops v0.2.5
291.65 s
> Checking rand_xoshiro v0.6.0
291.65 s
> Checking num v0.4.3
291.65 s
> Checking features v0.10.0
291.65 s
> Checking gat-lending-iterator v0.1.8
291.65 s
> Checking constcat v0.5.1
291.65 s
> Checking colored v2.2.0
291.65 s
> Checking arrayref v0.3.9
291.65 s
> Checking constant_time_eq v0.4.2
291.65 s
> Checking cpufeatures v0.3.0
291.65 s
> Checking base64 v0.22.1
291.65 s
> Checking blake3 v1.8.5
291.65 s
> Checking joinery v2.1.0
291.65 s
> Checking siphasher v1.0.2
291.65 s
> Checking titlecase v2.2.1
291.65 s
> Checking subprocess v0.2.15
291.65 s
> Checking toml v0.8.23
291.65 s
> Checking phf_shared v0.13.1
291.65 s
> Checking rust_lisp v0.18.0
291.65 s
> Compiling vakint v0.1.2 (/build/source/crates/vakint)
291.65 s
> Checking version-compare v0.2.1
291.65 s
> Checking xpct v0.5.1
291.65 s
> Checking phf v0.13.1
291.65 s
> Checking string-template-plus v0.4.3
291.65 s
> Checking ryu v1.0.23
291.65 s
> Checking dot-parser v0.5.1
291.65 s
> Checking castaway v0.2.4
291.65 s
> Checking toml_datetime v0.7.5+spec-1.1.0
291.65 s
> Checking figment v0.10.19
291.65 s
> Checking strum v0.27.2
291.65 s
> Checking unicode-truncate v2.0.1
291.65 s
> Checking kasuari v0.4.12
291.65 s
> Checking lru v0.16.4
291.65 s
> Checking vte v0.15.0
291.65 s
> Checking portable-atomic v1.13.1
291.65 s
> Checking vt100 v0.16.2
291.65 s
> Checking toml v0.9.12+spec-1.1.0
291.65 s
> Checking compact_str v0.9.0
291.65 s
> Checking unit-prefix v0.5.2
291.65 s
> Checking rand_distr v0.4.3
291.65 s
> Checking simba v0.6.0
291.65 s
> Checking line-clipping v0.3.7
291.65 s
> Checking adler2 v2.0.1
291.65 s
> Compiling three-dimensional-reps v0.1.0 (/build/source/crates/three-dimensional-reps)
291.65 s
> Checking gimli v0.32.3
291.65 s
> Checking miniz_oxide v0.8.9
291.65 s
> Checking thiserror v1.0.69
291.65 s
> Checking ratatui-core v0.1.0
291.65 s
> Checking derive_builder v0.11.2
291.65 s
> Checking crossterm v0.29.0
291.65 s
> Checking owo-colors v4.3.0
291.65 s
> Checking object v0.37.3
291.65 s
> Checking tracing-error v0.2.1
291.65 s
> Checking typed-index-collections v3.5.0
291.65 s
> Checking serde-big-array v0.5.1
291.65 s
> Checking amd v0.2.2
291.65 s
> Checking itertools v0.11.0
291.65 s
> Compiling gammaloop-tracing-filter-macros v0.1.0 (/build/source/crates/gammaloop-tracing-filter-macros)
291.65 s
> Checking option-ext v0.2.0
291.65 s
> Checking rustc-demangle v0.1.27
291.65 s
> Checking env_logger v0.11.10
291.65 s
> Checking dirs-sys v0.5.0
291.65 s
> Checking ref-cast v1.0.25
291.65 s
> Checking nix v0.31.2
291.65 s
> Checking indicatif v0.18.4
291.65 s
> Checking brotli-decompressor v4.0.3
291.65 s
> Checking integer-sqrt v0.1.5
291.65 s
> Checking crossbeam-channel v0.5.15
291.65 s
> Compiling rustpython-parser-core v0.4.0
291.65 s
> Checking color-spantrace v0.3.0
291.65 s
> Checking itertools v0.12.1
291.65 s
> Compiling rustpython-ast v0.4.0
291.65 s
> Compiling gammalooprs v0.3.4 (/build/source/crates/gammalooprs)
291.65 s
> Checking unsafe-libyaml v0.2.11
291.65 s
> Checking symlink v0.1.0
291.65 s
> Checking tracing-appender v0.2.5
291.65 s
> Checking clarabel v0.11.1
291.65 s
> Checking include_dir v0.7.4
291.65 s
> Checking pathfinding v4.15.0
291.65 s
> Checking tracing-indicatif v0.3.14
291.65 s
> Checking schemars v1.2.1
291.65 s
> Checking ctrlc v3.5.2
291.65 s
> Checking dirs v6.0.0
291.65 s
> Checking slotmap v1.1.1
291.65 s
> Checking json5 v0.4.1
291.65 s
> Checking vectorize v0.2.0
291.65 s
> Checking base62 v2.2.4
291.65 s
> Checking ringbuffer v0.16.0
291.65 s
> Checking ratatui-widgets v0.3.0
291.65 s
> Checking ratatui-crossterm v0.1.0
291.65 s
> Checking brotli v7.0.0
291.65 s
> Checking serde_yaml v0.9.34+deprecated
291.65 s
> Checking rkyv v0.7.46
291.65 s
> Checking clap_complete v4.6.3
291.65 s
> Checking rust-embed v8.11.0
291.65 s
> Checking fd-lock v4.0.4
291.65 s
> Checking strip-ansi-escapes v0.2.1
291.65 s
> Compiling gammaloop-api v0.1.0 (/build/source/crates/gammaloop-api)
291.65 s
> Checking itertools v0.13.0
291.65 s
> Checking strum v0.26.3
291.65 s
> Checking addr2line v0.25.1
291.65 s
> Checking sysinfo v0.33.1
291.65 s
> Checking clap_complete_nushell v4.6.0
291.65 s
> Checking shlex v1.3.0
291.65 s
> Checking futures-core v0.3.32
291.65 s
> Checking futures-task v0.3.32
291.65 s
> Checking slab v0.4.12
291.65 s
> Checking sdd v3.0.10
291.65 s
> Compiling gammaloop-integration-tests v0.1.0 (/build/source/tests)
291.65 s
> Checking futures-util v0.3.32
291.65 s
> Compiling test-log-core v0.2.20
291.65 s
> Checking scc v2.4.0
291.65 s
> Compiling rustc_version v0.4.1
291.65 s
> Checking which v8.0.2
291.65 s
> Checking bincode v1.3.3
291.65 s
> Checking ratatui-macros v0.7.0
291.65 s
> Checking ratatui v0.30.0
291.65 s
> Compiling gungraun-runner v0.18.2
291.65 s
> Compiling gungraun-macros v0.8.0
291.65 s
> Checking proc-macro2 v1.0.106
291.65 s
> Checking reedline v0.42.0
291.65 s
> Checking futures-executor v0.3.32
291.65 s
> Compiling numerica v2.2.0 (https://github.com/alphal00p/symbolica?rev=4d0a833eb8e059d1f95bdae5abed2559830b235f#4d0a833e)
291.65 s
> Checking serial_test v3.4.0
291.65 s
> Checking quote v1.0.45
291.65 s
> Checking maplit v1.0.2
291.65 s
> Checking base64 v0.21.7
291.65 s
> Checking nalgebra v0.29.0
291.65 s
> Compiling iai-callgrind-runner v0.14.2
291.65 s
> Compiling test-log-macros v0.2.20
291.65 s
> Checking wait-timeout v0.2.1
291.65 s
> Checking ron v0.8.1
291.65 s
> Checking kurbo v0.13.0
291.65 s
> Checking quick-error v1.2.3
291.65 s
> Checking bit-vec v0.8.0
291.65 s
> Compiling iai-callgrind v0.14.2
291.65 s
> Checking backtrace v0.3.76
291.65 s
> Checking bit-set v0.8.0
291.65 s
> Checking rusty-fork v0.3.1
291.65 s
> Checking syn v2.0.117
291.65 s
> Compiling iai-callgrind-macros v0.5.1
291.65 s
> Checking color-eyre v0.6.5
291.65 s
> Checking rand_xorshift v0.4.0
291.65 s
> Checking console v0.15.11
291.65 s
> Checking unarray v0.1.4
291.65 s
> Checking pathdiff v0.2.3
291.65 s
> Checking similar-asserts v1.7.0
291.65 s
> Checking proptest v1.11.0
291.65 s
> Checking clinnet v0.1.8 (/build/source/crates/clinnet)
291.65 s
> Checking kurvst v0.1.0 (/build/source/crates/kurvst)
291.65 s
> Checking test-log v0.2.20
291.65 s
> Compiling graphica v2.1.0 (https://github.com/alphal00p/symbolica?rev=4d0a833eb8e059d1f95bdae5abed2559830b235f#4d0a833e)
291.65 s
> Checking statrs v0.16.1
291.65 s
> Checking momtrop v0.3.0
291.65 s
> Compiling pyo3-macros v0.28.3
291.65 s
> Checking gungraun v0.18.2
291.65 s
> Compiling pyo3-stub-gen-derive v0.17.2
291.65 s
> Checking pyo3-stub-gen v0.17.2
291.65 s
> Checking symbolica-utils v0.1.0 (/build/source/crates/symbolica-utils)
291.65 s
> Checking spenso-macros v0.3.2 (/build/source/crates/spenso-macros)
291.65 s
> Compiling gammaloop-workspace-hack v0.1.0 (/build/source/crates/gammaloop-workspace-hack)
291.65 s
> Checking linnet v0.17.0 (/build/source/crates/linnet)
291.65 s
> Checking spenso v0.6.0 (/build/source/crates/spenso)
291.65 s
> Checking linnet-py v0.1.0 (/build/source/crates/linnet-py)
291.65 s
> Checking linnest v0.1.0 (/build/source/crates/linnest)
291.65 s
> Checking idenso v0.3.0 (/build/source/crates/idenso)
291.65 s
> Checking gammaloop-tracing-filter v0.1.0 (/build/source/crates/gammaloop-tracing-filter)
291.65 s
> Checking spenso-hep-lib v0.1.7 (/build/source/crates/spenso-hep-lib)
291.65 s
> Checking spynso3 v0.1.2 (/build/source/crates/spynso3)
291.65 s
> error[E0624] : method `export_uv_forest_graph` is private
291.65 s
> --> tests/tests/uv.rs:3426:33
291.65 s
> |
291.65 s
> 3426 | let soft_export = integrand.export_uv_forest_graph(
291.65 s
> | ^^^^^^^^^^^^^^^^^^^^^^ private method
291.65 s
> |
291.65 s
> ::: crates/gammalooprs/src/uv/export.rs:125:5
291.65 s
> |
291.65 s
> 125 | / pub(crate) fn export_uv_forest_graph(
291.65 s
> 126 | | &self,
291.65 s
> 127 | | graph_id: usize,
291.65 s
> 128 | | orientation: Option<OrientationProjection<'_>>,
291.65 s
> 129 | | generation_settings: &GenerationSettings,
291.65 s
> 130 | | export_settings: &UVForestExportSettings,
291.65 s
> 131 | | ) -> Result<UVForestExport> {
291.65 s
> | |_______________________________- private method defined here
291.65 s
>
291.65 s
> error[E0624] : method `export_uv_forest_graph` is private
291.65 s
> --> tests/tests/uv.rs:3522:38
291.65 s
> |
291.65 s
> 3522 | let uv_export = uv_integrand.export_uv_forest_graph(
291.65 s
> | ^^^^^^^^^^^^^^^^^^^^^^ private method
291.65 s
> |
291.65 s
> ::: crates/gammalooprs/src/uv/export.rs:125:5
291.65 s
> |
291.65 s
> 125 | / pub(crate) fn export_uv_forest_graph(
291.65 s
> 126 | | &self,
291.65 s
> 127 | | graph_id: usize,
291.65 s
> 128 | | orientation: Option<OrientationProjection<'_>>,
291.65 s
> 129 | | generation_settings: &GenerationSettings,
291.65 s
> 130 | | export_settings: &UVForestExportSettings,
291.65 s
> 131 | | ) -> Result<UVForestExport> {
291.65 s
> | |_______________________________- private method defined here
291.65 s
>
291.65 s
> error[E0624] : method `export_uv_forest_graph` is private
291.65 s
> --> tests/tests/uv.rs:3936:44
291.65 s
> |
291.65 s
> 3936 | let export = integrand.export_uv_forest_graph(
291.65 s
> | ^^^^^^^^^^^^^^^^^^^^^^ private method
291.65 s
> |
291.65 s
> ::: crates/gammalooprs/src/uv/export.rs:125:5
291.65 s
> |
291.65 s
> 125 | / pub(crate) fn export_uv_forest_graph(
291.65 s
> 126 | | &self,
291.65 s
> 127 | | graph_id: usize,
291.65 s
> 128 | | orientation: Option<OrientationProjection<'_>>,
291.65 s
> 129 | | generation_settings: &GenerationSettings,
291.65 s
> 130 | | export_settings: &UVForestExportSettings,
291.65 s
> 131 | | ) -> Result<UVForestExport> {
291.65 s
> | |_______________________________- private method defined here
291.65 s
>
291.65 s
> error[E0624] : method `export_uv_forest_graph` is private
291.65 s
> --> tests/tests/uv.rs:4128:36
291.65 s
> |
291.65 s
> 4128 | let export = integrand.export_uv_forest_graph(
291.65 s
> | ^^^^^^^^^^^^^^^^^^^^^^ private method
291.65 s
> |
291.65 s
> ::: crates/gammalooprs/src/uv/export.rs:125:5
291.65 s
> |
291.65 s
> 125 | / pub(crate) fn export_uv_forest_graph(
291.65 s
> 126 | | &self,
291.65 s
> 127 | | graph_id: usize,
291.65 s
> 128 | | orientation: Option<OrientationProjection<'_>>,
291.65 s
> 129 | | generation_settings: &GenerationSettings,
291.65 s
> 130 | | export_settings: &UVForestExportSettings,
291.65 s
> 131 | | ) -> Result<UVForestExport> {
291.65 s
> | |_______________________________- private method defined here
291.65 s
>
291.65 s
> error[E0624] : method `export_uv_forest_graph` is private
291.65 s
> --> tests/tests/uv.rs:4335:36
291.65 s
> |
291.65 s
> 4335 | let export = integrand.export_uv_forest_graph(
291.65 s
> | ^^^^^^^^^^^^^^^^^^^^^^ private method
291.65 s
> |
291.65 s
> ::: crates/gammalooprs/src/uv/export.rs:125:5
291.65 s
> |
291.65 s
> 125 | / pub(crate) fn export_uv_forest_graph(
291.65 s
> 126 | | &self,
291.65 s
> 127 | | graph_id: usize,
291.65 s
> 128 | | orientation: Option<OrientationProjection<'_>>,
291.65 s
> 129 | | generation_settings: &GenerationSettings,
291.65 s
> 130 | | export_settings: &UVForestExportSettings,
291.65 s
> 131 | | ) -> Result<UVForestExport> {
291.65 s
> | |_______________________________- private method defined here
291.65 s
>
291.65 s
> error[E0061] : this method takes 5 arguments but 3 arguments were supplied
291.65 s
> --> tests/tests/uv.rs:4551:26
291.65 s
> |
291.65 s
> 4551 | parent_graph.cff(&parent_tree, &parent_cut, &OrientationPattern::default())?;
291.65 s
> | ^^^ ----------------------------------------------------------- two arguments of type `&three_dimensional_reps::generation::Generate3DExpressionOptions` and `Option<&symbolica::atom::Atom>` are missing
291.65 s
> |
291.65 s
> note : method defined here
291.65 s
> --> crates/gammalooprs/src/cff/mod.rs:755:12
291.65 s
> |
291.65 s
> 755 | pub fn cff<S: SubGraphLike + SubSetLike>(
291.65 s
> | ^^^
291.65 s
> help : provide the arguments
291.65 s
> |
291.65 s
> 4551 | parent_graph.cff(&parent_tree, &parent_cut, &OrientationPattern::default(), /* &three_dimensional_reps::generation::Generate3DExpressionOptions */, /* Option<&symbolica::atom::Atom> */ )?;
291.65 s
> | ++++++++++++++++++++++++++++++++++++++++++++++++++++++++++++++++++++++++++++++++++++++++++++++++++++++++++++++
291.65 s
>
291.65 s
> error[E0616] : field `orientations` of struct `CFFTerm` is private
291.65 s
> --> tests/tests/uv.rs:4555:36
291.65 s
> |
291.65 s
> 4555 | .flat_map(|term| &term.orientations)
291.65 s
> | ^^^^^^^^^^^^ private field
291.65 s
>
291.65 s
> error[E0609] : no field `orientations` on type `&GeneratedThreeDExpression<Esurface, Hsurface>`
291.65 s
> --> tests/tests/uv.rs:4653:18
291.65 s
> |
291.65 s
> 4653 | .orientations
291.65 s
> | ^^^^^^^^^^^^ unknown field
291.65 s
> |
291.65 s
> = note : the full name for the type has been written to '/build/source/target/ci-optim/deps/uv-ae6ff038ef4b6f0a.long-type-12389030920437475506.txt'
291.65 s
> = note : consider using `--verbose` to print the full type name to the console
291.65 s
> help : one of the expressions' fields has a field of the same name
291.65 s
> |
291.65 s
> 4653 | .expression. orientations
291.65 s
> | +++++++++++
291.65 s
>
291.65 s
> error[E0624] : method `export_uv_forest_graph` is private
291.65 s
> --> tests/tests/uv.rs:4673:43
291.65 s
> |
291.65 s
> 4673 | let structural_forest = integrand.export_uv_forest_graph(
291.65 s
> | ^^^^^^^^^^^^^^^^^^^^^^ private method
291.65 s
> |
291.65 s
> ::: crates/gammalooprs/src/uv/export.rs:125:5
291.65 s
> |
291.65 s
> 125 | / pub(crate) fn export_uv_forest_graph(
291.65 s
> 126 | | &self,
291.65 s
> 127 | | graph_id: usize,
291.65 s
> 128 | | orientation: Option<OrientationProjection<'_>>,
291.65 s
> 129 | | generation_settings: &GenerationSettings,
291.65 s
> 130 | | export_settings: &UVForestExportSettings,
291.65 s
> 131 | | ) -> Result<UVForestExport> {
291.65 s
> | |_______________________________- private method defined here
291.65 s
>
291.65 s
> error[E0624] : method `export_uv_forest_graph` is private
291.65 s
> --> tests/tests/uv.rs:4897:43
291.65 s
> |
291.65 s
> 4897 | let structural_forest = integrand.export_uv_forest_graph(
291.65 s
> | ^^^^^^^^^^^^^^^^^^^^^^ private method
291.65 s
> |
291.65 s
> ::: crates/gammalooprs/src/uv/export.rs:125:5
291.65 s
> |
291.65 s
> 125 | / pub(crate) fn export_uv_forest_graph(
291.65 s
> 126 | | &self,
291.65 s
> 127 | | graph_id: usize,
291.65 s
> 128 | | orientation: Option<OrientationProjection<'_>>,
291.65 s
> 129 | | generation_settings: &GenerationSettings,
291.65 s
> 130 | | export_settings: &UVForestExportSettings,
291.65 s
> 131 | | ) -> Result<UVForestExport> {
291.65 s
> | |_______________________________- private method defined here
291.65 s
>
291.65 s
> error[E0624] : method `export_uv_forest_graph` is private
291.65 s
> --> tests/tests/uv.rs:5146:43
291.65 s
> |
291.65 s
> 5146 | let structural_forest = integrand.export_uv_forest_graph(
291.65 s
> | ^^^^^^^^^^^^^^^^^^^^^^ private method
291.65 s
> |
291.65 s
> ::: crates/gammalooprs/src/uv/export.rs:125:5
291.65 s
> |
291.65 s
> 125 | / pub(crate) fn export_uv_forest_graph(
291.65 s
> 126 | | &self,
291.65 s
> 127 | | graph_id: usize,
291.65 s
> 128 | | orientation: Option<OrientationProjection<'_>>,
291.65 s
> 129 | | generation_settings: &GenerationSettings,
291.65 s
> 130 | | export_settings: &UVForestExportSettings,
291.65 s
> 131 | | ) -> Result<UVForestExport> {
291.65 s
> | |_______________________________- private method defined here
291.65 s
>
291.65 s
> error[E0624] : method `export_uv_forest_graph` is private
291.65 s
> --> tests/tests/uv.rs:5161:41
291.65 s
> |
291.65 s
> 5161 | let computed_forest = integrand.export_uv_forest_graph(
291.65 s
> | ^^^^^^^^^^^^^^^^^^^^^^ private method
291.65 s
> |
291.65 s
> ::: crates/gammalooprs/src/uv/export.rs:125:5
291.65 s
> |
291.65 s
> 125 | / pub(crate) fn export_uv_forest_graph(
291.65 s
> 126 | | &self,
291.65 s
> 127 | | graph_id: usize,
291.65 s
> 128 | | orientation: Option<OrientationProjection<'_>>,
291.65 s
> 129 | | generation_settings: &GenerationSettings,
291.65 s
> 130 | | export_settings: &UVForestExportSettings,
291.65 s
> 131 | | ) -> Result<UVForestExport> {
291.65 s
> | |_______________________________- private method defined here
291.65 s
>
291.65 s
> error[E0624] : method `export_uv_forest_graph` is private
291.65 s
> --> tests/tests/uv.rs:5724:51
291.65 s
> |
291.65 s
> 5724 | let structural_forest = integrand.export_uv_forest_graph(
291.65 s
> | ^^^^^^^^^^^^^^^^^^^^^^ private method
291.65 s
> |
291.65 s
> ::: crates/gammalooprs/src/uv/export.rs:125:5
291.65 s
> |
291.65 s
> 125 | / pub(crate) fn export_uv_forest_graph(
291.65 s
> 126 | | &self,
291.65 s
> 127 | | graph_id: usize,
291.65 s
> 128 | | orientation: Option<OrientationProjection<'_>>,
291.65 s
> 129 | | generation_settings: &GenerationSettings,
291.65 s
> 130 | | export_settings: &UVForestExportSettings,
291.65 s
> 131 | | ) -> Result<UVForestExport> {
291.65 s
> | |_______________________________- private method defined here
291.65 s
>
291.65 s
> Some errors have detailed explanations: E0061, E0609, E0616, E0624.
291.65 s
> For more information about an error, try `rustc --explain E0061`.
291.65 s
> error : could not compile `gammaloop-integration-tests` (test "uv") due to 13 previous errors
291.65 s
> warning : build failed, waiting for other jobs to finish...
291.65 s
For full logs, run:
291.65 s
nix log /nix/store/yq41fja0qvn1pcayl6m3fb5q6zl3fd3g-gammaloop-workspace-check-0.1.0.drv
291.68 s
Build failed.