1. 0.00 s $ /nix/store/9ypz3flqsrl5xl495mm8h645gadjsxi1-coreutils-9.11/bin/timeout --kill-after=15s 7200s /nix/store/23zk8sgzamrbmj1fday15szf7f2279s8-nix-2.34.7/bin/nix --extra-experimental-features nix-command --extra-experimental-features flakes --log-format internal-json build --no-link --print-out-paths git+https://github.com/alphal00p/gammaloop?ref=codex%2Fdocs-manuals&rev=fa8ed9a02ca7dff8db2b623fcf9163af3051b0df&shallow=1#checks.x86_64-linux.gammaloop-check --print-build-logs
  2. 0.30 s error (ignored): SQLite database '/var/cache/nix-ci-worker/eval-cache-v6/b8662e2bf247965c4b15522798a3327a911ceb09864110b48cc6d8093ad95d06.sqlite' is busy
  3. 2.58 s
  4. 3.40 s Building /nix/store/yq41fja0qvn1pcayl6m3fb5q6zl3fd3g-gammaloop-workspace-check-0.1.0.drv
  5. 3.52 s [gammaloop-workspace-check] Phase: unpackPhase
  6. 3.53 s [gammaloop-workspace-check] unpacking source archive /nix/store/0llqw1df709zbvslaaqs2ang2jp44rl4-source
  7. 3.72 s [gammaloop-workspace-check] source root is source
  8. 3.77 s [gammaloop-workspace-check] Phase: patchPhase
  9. 3.78 s [gammaloop-workspace-check] Executing configureCargoCommonVars
  10. 3.79 s [gammaloop-workspace-check] decompressing cargo artifacts from /nix/store/wxpx6lf642pgxp2wz1pw1lxksj5p1wb0-gammaloop-workspace-deps-deps-0.1.0/target.tar.zst to target
  11. 6.82 s [gammaloop-workspace-check] Phase: updateAutotoolsGnuConfigScriptsPhase
  12. 7.02 s [gammaloop-workspace-check] Phase: configurePhase
  13. 7.04 s [gammaloop-workspace-check] will append /build/source/.cargo-home/config.toml with contents of /nix/store/8zq9ya5slh345hbylmsibxw827bi98w0-vendor-cargo-deps/config.toml
  14. 7.05 s [gammaloop-workspace-check] default configurePhase, nothing to do
  15. 7.06 s [gammaloop-workspace-check] Phase: buildPhase
  16. 7.10 s [gammaloop-workspace-check] +++ command cargo --version
  17. 7.10 s [gammaloop-workspace-check] cargo 1.97.0 (c980f4866 2026-06-30)
  18. 7.15 s [gammaloop-workspace-check] +++ command cargo check --profile ci-optim --locked --workspace --features gammaloop-tracing-filter/clap,gammaloop-tracing-filter/symbolica,idenso/bincode,idenso/reference-cases,linnet/bincode,linnet/drawing,linnet/rkyv,linnet/serde,linnet/symbolica,spenso-macros/shadowing,spenso/shadowing,symbolica/tracing_max_level_info,three-dimensional-reps/display,three-dimensional-reps/eval,three-dimensional-reps/serde --all-targets
  19. 8.15 s [gammaloop-workspace-check] Checking cfg-if v1.0.4
  20. 8.15 s [gammaloop-workspace-check] Checking memchr v2.8.0
  21. 8.15 s [gammaloop-workspace-check] Checking once_cell v1.21.4
  22. 8.15 s [gammaloop-workspace-check] Checking either v1.15.0
  23. 8.16 s [gammaloop-workspace-check] Checking serde_core v1.0.228
  24. 8.16 s [gammaloop-workspace-check] Checking libc v0.2.186
  25. 8.16 s [gammaloop-workspace-check] Checking libm v0.2.16
  26. 8.16 s [gammaloop-workspace-check] Checking itoa v1.0.18
  27. 8.16 s [gammaloop-workspace-check] Checking log v0.4.29
  28. 8.18 s [gammaloop-workspace-check] Checking regex-syntax v0.8.10
  29. 8.19 s [gammaloop-workspace-check] Checking zerocopy v0.8.48
  30. 8.20 s [gammaloop-workspace-check] Checking crossbeam-utils v0.8.21
  31. 8.20 s [gammaloop-workspace-check] Checking equivalent v1.0.2
  32. 8.24 s [gammaloop-workspace-check] Checking zmij v1.0.21
  33. 8.24 s [gammaloop-workspace-check] Checking lazy_static v1.5.0
  34. 8.24 s [gammaloop-workspace-check] Checking bytemuck v1.25.0
  35. 8.25 s [gammaloop-workspace-check] Compiling target-lexicon v0.13.5
  36. 8.30 s [gammaloop-workspace-check] Checking arrayvec v0.7.6
  37. 8.33 s [gammaloop-workspace-check] Checking powerfmt v0.2.0
  38. 8.34 s [gammaloop-workspace-check] Checking num_threads v0.1.7
  39. 8.35 s [gammaloop-workspace-check] Checking itertools v0.14.0
  40. 8.40 s [gammaloop-workspace-check] Checking pin-project-lite v0.2.17
  41. 8.43 s [gammaloop-workspace-check] Checking num-conv v0.2.1
  42. 8.45 s [gammaloop-workspace-check] Checking time-core v0.1.8
  43. 8.50 s [gammaloop-workspace-check] Checking tracing-core v0.1.36
  44. 8.58 s [gammaloop-workspace-check] Checking deranged v0.5.8
  45. 8.60 s [gammaloop-workspace-check] Checking allocator-api2 v0.2.21
  46. 8.65 s [gammaloop-workspace-check] Checking safe_arch v0.7.4
  47. 8.66 s [gammaloop-workspace-check] Checking foldhash v0.2.0
  48. 8.69 s [gammaloop-workspace-check] Checking const-random v0.1.18
  49. 8.81 s [gammaloop-workspace-check] Checking winnow v1.0.2
  50. 8.83 s [gammaloop-workspace-check] Checking unty v0.0.4
  51. 8.85 s [gammaloop-workspace-check] Checking static_assertions v1.1.0
  52. 8.92 s [gammaloop-workspace-check] Checking nu-ansi-term v0.50.3
  53. 8.93 s [gammaloop-workspace-check] Checking safe_arch v1.0.0
  54. 9.17 s [gammaloop-workspace-check] Checking aho-corasick v1.1.4
  55. 9.35 s [gammaloop-workspace-check] Checking tracing-log v0.2.0
  56. 9.49 s [gammaloop-workspace-check] Checking tracing v0.1.44
  57. 9.55 s [gammaloop-workspace-check] Checking sharded-slab v0.1.7
  58. 9.70 s [gammaloop-workspace-check] Checking wide v0.7.33
  59. 9.82 s [gammaloop-workspace-check] Checking thread_local v1.1.9
  60. 9.95 s [gammaloop-workspace-check] Checking toml_writer v1.1.1+spec-1.1.0
  61. 10.06 s [gammaloop-workspace-check] Checking indenter v0.3.4
  62. 10.15 s [gammaloop-workspace-check] Checking crossbeam-epoch v0.9.18
  63. 10.16 s [gammaloop-workspace-check] Checking az v1.3.0
  64. 10.23 s [gammaloop-workspace-check] Checking num-traits v0.2.19
  65. 10.45 s [gammaloop-workspace-check] Checking wide v1.3.0
  66. 10.51 s [gammaloop-workspace-check] Checking hashbrown v0.16.1
  67. 10.81 s [gammaloop-workspace-check] Checking crossbeam-deque v0.8.6
  68. 10.82 s [gammaloop-workspace-check] Compiling phf_shared v0.11.3
  69. 10.92 s [gammaloop-workspace-check] Checking rayon-core v1.13.0
  70. 10.93 s [gammaloop-workspace-check] Checking approx v0.5.1
  71. 10.99 s [gammaloop-workspace-check] Checking num-integer v0.1.46
  72. 11.02 s [gammaloop-workspace-check] Checking anyhow v1.0.102
  73. 11.11 s [gammaloop-workspace-check] Checking alloc-no-stdlib v2.0.4
  74. 11.20 s [gammaloop-workspace-check] Checking utf8parse v0.2.2
  75. 11.21 s [gammaloop-workspace-check] Checking rawpointer v0.2.1
  76. 11.22 s [gammaloop-workspace-check] Checking dyn-clone v1.0.20
  77. 11.23 s [gammaloop-workspace-check] Checking alloc-stdlib v0.2.2
  78. 11.27 s [gammaloop-workspace-check] Checking matrixmultiply v0.3.10
  79. 11.27 s [gammaloop-workspace-check] Checking anstyle-parse v1.0.0
  80. 11.32 s [gammaloop-workspace-check] Checking colored v3.1.1
  81. 11.33 s [gammaloop-workspace-check] Checking is_terminal_polyfill v1.70.2
  82. 11.35 s [gammaloop-workspace-check] Checking anstyle-query v1.1.5
  83. 11.39 s [gammaloop-workspace-check] Checking anstyle v1.0.14
  84. 11.42 s [gammaloop-workspace-check] Checking colorchoice v1.0.5
  85. 11.44 s [gammaloop-workspace-check] Compiling pyo3-build-config v0.28.3
  86. 11.48 s [gammaloop-workspace-check] Compiling phf_generator v0.11.3
  87. 11.53 s [gammaloop-workspace-check] Checking eyre v0.6.12
  88. 11.55 s [gammaloop-workspace-check] Checking bitflags v1.3.2
  89. 11.57 s [gammaloop-workspace-check] Checking unicode-width v0.2.2
  90. 11.59 s [gammaloop-workspace-check] Compiling phf_codegen v0.11.3
  91. 11.60 s [gammaloop-workspace-check] Checking brotli-decompressor v5.0.0
  92. 11.64 s [gammaloop-workspace-check] Checking rayon v1.12.0
  93. 11.78 s [gammaloop-workspace-check] Checking inventory v0.3.24
  94. 11.79 s [gammaloop-workspace-check] Checking anstream v1.0.0
  95. 11.84 s [gammaloop-workspace-check] Checking serde v1.0.228
  96. 11.88 s [gammaloop-workspace-check] Checking serde_json v1.0.149
  97. 11.93 s [gammaloop-workspace-check] Checking bitflags v2.11.1
  98. 12.00 s [gammaloop-workspace-check] Checking serde_spanned v1.1.1
  99. 12.07 s [gammaloop-workspace-check] Checking toml_datetime v1.1.1+spec-1.1.0
  100. 12.11 s [gammaloop-workspace-check] Checking spec_math v0.1.6
  101. 12.16 s [gammaloop-workspace-check] Checking thiserror v2.0.18
  102. 12.20 s [gammaloop-workspace-check] Compiling getopts v0.2.24
  103. 12.22 s [gammaloop-workspace-check] Checking libloading v0.9.0
  104. 12.33 s [gammaloop-workspace-check] Checking tinyjson v2.5.1
  105. 12.34 s [gammaloop-workspace-check] Checking toml_parser v1.1.2+spec-1.1.0
  106. 12.38 s [gammaloop-workspace-check] Checking bytes v1.11.1
  107. 12.41 s [gammaloop-workspace-check] Checking byteorder v1.5.0
  108. 12.45 s [gammaloop-workspace-check] Checking append-only-vec v0.1.8
  109. 12.54 s [gammaloop-workspace-check] Checking self_cell v1.2.2
  110. 12.56 s [gammaloop-workspace-check] Compiling unicode_names2_generator v1.3.0
  111. 12.65 s [gammaloop-workspace-check] Compiling unic-char-range v0.9.0
  112. 12.76 s [gammaloop-workspace-check] Checking smallvec v1.15.1
  113. 12.80 s [gammaloop-workspace-check] Checking num-complex v0.4.6
  114. 13.01 s [gammaloop-workspace-check] Checking bincode v2.0.1
  115. 13.02 s [gammaloop-workspace-check] Checking tracing-serde v0.2.0
  116. 13.09 s [gammaloop-workspace-check] Checking toml v1.1.2+spec-1.1.0
  117. 13.10 s [gammaloop-workspace-check] Checking brotli v8.0.2
  118. 13.15 s [gammaloop-workspace-check] Checking getrandom v0.3.4
  119. 13.21 s [gammaloop-workspace-check] Checking time v0.3.47
  120. 13.38 s [gammaloop-workspace-check] Checking gmp-mpfr-sys v1.7.1
  121. 13.61 s [gammaloop-workspace-check] Checking simba v0.9.1
  122. 13.63 s [gammaloop-workspace-check] Checking rand_core v0.9.5
  123. 13.71 s [gammaloop-workspace-check] Checking wasmtime-jit-icache-coherence v34.0.2
  124. 13.76 s [gammaloop-workspace-check] Checking hugepage-rs v0.1.1
  125. 13.78 s [gammaloop-workspace-check] Checking region v3.0.2
  126. 13.78 s [gammaloop-workspace-check] Checking smartstring v1.0.1
  127. 13.97 s [gammaloop-workspace-check] Compiling unic-common v0.9.0
  128. 14.06 s [gammaloop-workspace-check] Checking linux-raw-sys v0.12.1
  129. 14.11 s [gammaloop-workspace-check] Compiling unic-ucd-version v0.9.0
  130. 14.17 s [gammaloop-workspace-check] Compiling unic-char-property v0.9.0
  131. 14.28 s [gammaloop-workspace-check] Compiling is-macro v0.3.7
  132. 14.32 s [gammaloop-workspace-check] Compiling rustpython-parser-vendored v0.4.0
  133. 14.59 s [gammaloop-workspace-check] Checking iana-time-zone v0.1.65
  134. 14.63 s [gammaloop-workspace-check] Checking rustix v1.1.4
  135. 14.69 s [gammaloop-workspace-check] Checking chrono v0.4.44
  136. 14.74 s [gammaloop-workspace-check] Compiling rustpython-parser v0.4.0
  137. 14.79 s [gammaloop-workspace-check] Compiling phf v0.11.3
  138. 14.87 s [gammaloop-workspace-check] Checking rustc-hash v2.1.2
  139. 14.94 s [gammaloop-workspace-check] Compiling unic-ucd-ident v0.9.0
  140. 14.95 s [gammaloop-workspace-check] Compiling unic-emoji-char v0.9.0
  141. 15.00 s [gammaloop-workspace-check] Checking ndarray v0.17.2
  142. 15.12 s [gammaloop-workspace-check] Compiling lalrpop-util v0.20.2
  143. 15.25 s [gammaloop-workspace-check] Compiling rustc-hash v1.1.0
  144. 15.32 s [gammaloop-workspace-check] Checking rug v1.30.0
  145. 15.36 s [gammaloop-workspace-check] Compiling symbolica v2.2.0 (https://github.com/alphal00p/symbolica?rev=4d0a833eb8e059d1f95bdae5abed2559830b235f#4d0a833e)
  146. 15.52 s [gammaloop-workspace-check] Checking regex-automata v0.4.14
  147. 15.89 s [gammaloop-workspace-check] Checking unicode-segmentation v1.13.2
  148. 15.94 s [gammaloop-workspace-check] Checking typenum v1.20.0
  149. 16.23 s [gammaloop-workspace-check] Checking getrandom v0.2.17
  150. 16.43 s [gammaloop-workspace-check] Checking scopeguard v1.2.0
  151. 16.50 s [gammaloop-workspace-check] Checking parking_lot_core v0.9.12
  152. 16.51 s [gammaloop-workspace-check] Checking lock_api v0.4.14
  153. 16.64 s [gammaloop-workspace-check] Checking unicode-ident v1.0.24
  154. 16.75 s [gammaloop-workspace-check] Checking hashbrown v0.17.0
  155. 16.82 s [gammaloop-workspace-check] Checking parking_lot v0.12.5
  156. 16.88 s [gammaloop-workspace-check] Checking errno v0.3.14
  157. 17.00 s [gammaloop-workspace-check] Checking unicase v2.9.0
  158. 17.09 s [gammaloop-workspace-check] Checking strsim v0.11.1
  159. 17.10 s [gammaloop-workspace-check] Checking clap_lex v1.1.0
  160. 17.15 s [gammaloop-workspace-check] Checking generic-array v0.14.7
  161. 17.26 s [gammaloop-workspace-check] Checking signal-hook-registry v1.4.8
  162. 17.33 s [gammaloop-workspace-check] Checking vte v0.14.1
  163. 17.36 s [gammaloop-workspace-check] Checking same-file v1.0.6
  164. 17.40 s [gammaloop-workspace-check] Checking indexmap v2.14.0
  165. 17.44 s [gammaloop-workspace-check] Checking signal-hook v0.3.18
  166. 17.49 s [gammaloop-workspace-check] Checking mio v1.2.0
  167. 17.50 s [gammaloop-workspace-check] Checking walkdir v2.5.0
  168. 17.60 s [gammaloop-workspace-check] Checking minimal-lexical v0.2.1
  169. 17.82 s [gammaloop-workspace-check] Checking ciborium-io v0.2.2
  170. 17.88 s [gammaloop-workspace-check] Checking nom v7.1.3
  171. 17.89 s [gammaloop-workspace-check] Checking derive_more v2.1.1
  172. 17.94 s [gammaloop-workspace-check] Checking console v0.16.3
  173. 18.02 s [gammaloop-workspace-check] Checking signal-hook-mio v0.2.5
  174. 18.09 s [gammaloop-workspace-check] Compiling unicode_names2 v1.3.0
  175. 18.10 s [gammaloop-workspace-check] Checking num-bigint v0.4.6
  176. 18.21 s [gammaloop-workspace-check] Checking crypto-common v0.1.7
  177. 18.30 s [gammaloop-workspace-check] Checking block-buffer v0.10.4
  178. 18.30 s [gammaloop-workspace-check] Checking bstr v1.12.1
  179. 18.46 s [gammaloop-workspace-check] Checking digest v0.10.7
  180. 18.58 s [gammaloop-workspace-check] Checking winnow v0.7.15
  181. 18.82 s [gammaloop-workspace-check] Checking cpufeatures v0.2.17
  182. 18.86 s [gammaloop-workspace-check] Checking linux-raw-sys v0.4.15
  183. 18.92 s [gammaloop-workspace-check] Checking ansitok v0.3.0
  184. 19.12 s [gammaloop-workspace-check] Checking ppv-lite86 v0.2.21
  185. 19.14 s [gammaloop-workspace-check] Checking ahash v0.8.12
  186. 19.15 s [gammaloop-workspace-check] Checking xprec v0.2.2
  187. 19.48 s [gammaloop-workspace-check] Checking rand_chacha v0.9.0
  188. 19.59 s [gammaloop-workspace-check] Checking half v2.7.1
  189. 19.61 s [gammaloop-workspace-check] Checking sha2 v0.10.9
  190. 19.75 s [gammaloop-workspace-check] Checking getrandom v0.4.2
  191. 19.85 s [gammaloop-workspace-check] Checking rand v0.9.4
  192. 19.91 s [gammaloop-workspace-check] Checking rand_core v0.6.4
  193. 19.93 s [gammaloop-workspace-check] Checking fnv v1.0.7
  194. 19.97 s [gammaloop-workspace-check] Checking rustix v0.38.44
  195. 20.00 s [gammaloop-workspace-check] Checking fastrand v2.4.1
  196. 20.07 s [gammaloop-workspace-check] Checking plotters-backend v0.3.7
  197. 20.20 s [gammaloop-workspace-check] Checking plotters-svg v0.3.7
  198. 20.22 s [gammaloop-workspace-check] Checking toml_datetime v0.6.11
  199. 20.24 s [gammaloop-workspace-check] Checking serde_spanned v0.6.9
  200. 20.30 s [gammaloop-workspace-check] Checking itertools v0.10.5
  201. 20.38 s [gammaloop-workspace-check] Checking tap v1.0.1
  202. 20.39 s [gammaloop-workspace-check] Checking cast v0.3.0
  203. 20.46 s [gammaloop-workspace-check] Checking toml_write v0.1.2
  204. 20.53 s [gammaloop-workspace-check] Checking wyz v0.5.1
  205. 20.67 s [gammaloop-workspace-check] Checking plotters v0.3.7
  206. 20.74 s [gammaloop-workspace-check] Checking rand_chacha v0.3.1
  207. 20.80 s [gammaloop-workspace-check] Checking ciborium-ll v0.2.2
  208. 20.90 s [gammaloop-workspace-check] Checking terminal_size v0.4.4
  209. 20.96 s [gammaloop-workspace-check] Checking ciborium v0.2.2
  210. 21.00 s [gammaloop-workspace-check] Checking clap_builder v4.6.0
  211. 21.01 s [gammaloop-workspace-check] Checking tempfile v3.27.0
  212. 21.11 s [gammaloop-workspace-check] Checking matchers v0.2.0
  213. 21.38 s [gammaloop-workspace-check] Checking regex v1.12.3
  214. 21.40 s [gammaloop-workspace-check] Checking tracing-subscriber v0.3.23
  215. 21.72 s [gammaloop-workspace-check] Checking globset v0.4.18
  216. 21.80 s [gammaloop-workspace-check] Checking ansi-str v0.9.0
  217. 21.80 s [gammaloop-workspace-check] Checking criterion-plot v0.5.0
  218. 21.86 s [gammaloop-workspace-check] Checking radium v0.7.0
  219. 21.96 s [gammaloop-workspace-check] Checking rust-embed-utils v8.11.0
  220. 22.07 s [gammaloop-workspace-check] Checking typeid v1.0.3
  221. 22.08 s [gammaloop-workspace-check] Compiling pyo3-ffi v0.28.3
  222. 22.13 s [gammaloop-workspace-check] Compiling pyo3-macros-backend v0.28.3
  223. 22.20 s [gammaloop-workspace-check] Compiling pyo3 v0.28.3
  224. 22.25 s [gammaloop-workspace-check] Compiling numpy v0.28.0
  225. 22.52 s [gammaloop-workspace-check] Checking symjit v2.21.0
  226. 22.64 s [gammaloop-workspace-check] Checking tinytemplate v1.2.1
  227. 22.65 s [gammaloop-workspace-check] Checking similar v2.7.0
  228. 22.69 s [gammaloop-workspace-check] Checking is-terminal v0.4.17
  229. 22.72 s [gammaloop-workspace-check] Checking oorandom v11.1.5
  230. 22.85 s [gammaloop-workspace-check] Checking funty v2.0.0
  231. 22.95 s [gammaloop-workspace-check] Checking anes v0.1.6
  232. 23.00 s [gammaloop-workspace-check] Checking bytecount v0.6.9
  233. 23.03 s [gammaloop-workspace-check] Checking ron v0.12.1
  234. 23.07 s [gammaloop-workspace-check] Checking env_filter v1.0.1
  235. 23.23 s [gammaloop-workspace-check] Checking papergrid v0.17.0
  236. 23.27 s [gammaloop-workspace-check] Checking rand v0.8.6
  237. 23.29 s [gammaloop-workspace-check] Checking bitvec v1.0.1
  238. 23.39 s [gammaloop-workspace-check] Checking crossterm v0.28.1
  239. 23.52 s [gammaloop-workspace-check] Checking toml_edit v0.22.27
  240. 23.56 s [gammaloop-workspace-check] Checking testing_table v0.3.0
  241. 23.61 s [gammaloop-workspace-check] Checking clap v4.6.1
  242. 23.64 s [gammaloop-workspace-check] Checking toml_edit v0.25.11+spec-1.1.0
  243. 23.66 s [gammaloop-workspace-check] Checking uncased v0.9.10
  244. 23.72 s [gammaloop-workspace-check] Checking jiff v0.2.24
  245. 24.57 s [gammaloop-workspace-check] Checking ptr_meta v0.1.4
  246. 24.61 s [gammaloop-workspace-check] Checking criterion v0.5.1
  247. 24.67 s [gammaloop-workspace-check] Checking simdutf8 v0.1.5
  248. 24.69 s [gammaloop-workspace-check] Checking ucd-trie v0.1.7
  249. 24.82 s [gammaloop-workspace-check] Checking ahash v0.7.8
  250. 24.89 s [gammaloop-workspace-check] Checking bytecheck v0.6.12
  251. 24.99 s [gammaloop-workspace-check] Checking approx v0.4.0
  252. 25.05 s [gammaloop-workspace-check] Checking pest v2.8.6
  253. 25.06 s [gammaloop-workspace-check] Checking seahash v4.1.0
  254. 25.07 s [gammaloop-workspace-check] Checking hashbrown v0.12.3
  255. 25.16 s [gammaloop-workspace-check] Checking cgmath v0.18.0
  256. 25.21 s [gammaloop-workspace-check] Checking tabled v0.20.0
  257. 25.29 s [gammaloop-workspace-check] Checking num-rational v0.4.2
  258. 25.42 s [gammaloop-workspace-check] Checking num-iter v0.1.45
  259. 25.53 s [gammaloop-workspace-check] Checking rend v0.4.2
  260. 25.58 s [gammaloop-workspace-check] Checking insta v1.47.2
  261. 25.66 s [gammaloop-workspace-check] Checking ref-ops v0.2.5
  262. 25.91 s [gammaloop-workspace-check] Checking rand_xoshiro v0.6.0
  263. 26.19 s [gammaloop-workspace-check] Checking num v0.4.3
  264. 26.26 s [gammaloop-workspace-check] Checking features v0.10.0
  265. 26.30 s [gammaloop-workspace-check] Checking gat-lending-iterator v0.1.8
  266. 26.32 s [gammaloop-workspace-check] Checking constcat v0.5.1
  267. 26.37 s [gammaloop-workspace-check] Checking colored v2.2.0
  268. 26.61 s [gammaloop-workspace-check] Checking arrayref v0.3.9
  269. 26.66 s [gammaloop-workspace-check] Checking constant_time_eq v0.4.2
  270. 26.69 s [gammaloop-workspace-check] Checking cpufeatures v0.3.0
  271. 26.77 s [gammaloop-workspace-check] Checking base64 v0.22.1
  272. 26.91 s [gammaloop-workspace-check] Checking blake3 v1.8.5
  273. 26.95 s [gammaloop-workspace-check] Checking joinery v2.1.0
  274. 27.08 s [gammaloop-workspace-check] Checking siphasher v1.0.2
  275. 27.15 s [gammaloop-workspace-check] Checking titlecase v2.2.1
  276. 27.28 s [gammaloop-workspace-check] Checking subprocess v0.2.15
  277. 27.34 s [gammaloop-workspace-check] Checking toml v0.8.23
  278. 27.36 s [gammaloop-workspace-check] Checking phf_shared v0.13.1
  279. 27.45 s [gammaloop-workspace-check] Checking rust_lisp v0.18.0
  280. 27.50 s [gammaloop-workspace-check] Compiling vakint v0.1.2 (/build/source/crates/vakint)
  281. 27.77 s [gammaloop-workspace-check] Checking version-compare v0.2.1
  282. 27.83 s [gammaloop-workspace-check] Checking xpct v0.5.1
  283. 27.99 s [gammaloop-workspace-check] Checking phf v0.13.1
  284. 28.01 s [gammaloop-workspace-check] Checking string-template-plus v0.4.3
  285. 28.11 s [gammaloop-workspace-check] Checking ryu v1.0.23
  286. 28.15 s [gammaloop-workspace-check] Checking dot-parser v0.5.1
  287. 28.18 s [gammaloop-workspace-check] Checking castaway v0.2.4
  288. 28.18 s [gammaloop-workspace-check] Checking toml_datetime v0.7.5+spec-1.1.0
  289. 28.21 s [gammaloop-workspace-check] Checking figment v0.10.19
  290. 28.25 s [gammaloop-workspace-check] Checking strum v0.27.2
  291. 28.35 s [gammaloop-workspace-check] Checking unicode-truncate v2.0.1
  292. 28.44 s [gammaloop-workspace-check] Checking kasuari v0.4.12
  293. 28.48 s [gammaloop-workspace-check] Checking lru v0.16.4
  294. 28.51 s [gammaloop-workspace-check] Checking vte v0.15.0
  295. 28.59 s [gammaloop-workspace-check] Checking portable-atomic v1.13.1
  296. 28.62 s [gammaloop-workspace-check] Checking vt100 v0.16.2
  297. 28.63 s [gammaloop-workspace-check] Checking toml v0.9.12+spec-1.1.0
  298. 28.64 s [gammaloop-workspace-check] Checking compact_str v0.9.0
  299. 28.70 s [gammaloop-workspace-check] Checking unit-prefix v0.5.2
  300. 28.70 s [gammaloop-workspace-check] Checking rand_distr v0.4.3
  301. 28.76 s [gammaloop-workspace-check] Checking simba v0.6.0
  302. 28.79 s [gammaloop-workspace-check] Checking line-clipping v0.3.7
  303. 28.83 s [gammaloop-workspace-check] Checking adler2 v2.0.1
  304. 28.88 s [gammaloop-workspace-check] Compiling three-dimensional-reps v0.1.0 (/build/source/crates/three-dimensional-reps)
  305. 28.93 s [gammaloop-workspace-check] Checking gimli v0.32.3
  306. 29.14 s [gammaloop-workspace-check] Checking miniz_oxide v0.8.9
  307. 29.15 s [gammaloop-workspace-check] Checking thiserror v1.0.69
  308. 29.18 s [gammaloop-workspace-check] Checking ratatui-core v0.1.0
  309. 29.23 s [gammaloop-workspace-check] Checking derive_builder v0.11.2
  310. 29.24 s [gammaloop-workspace-check] Checking crossterm v0.29.0
  311. 29.29 s [gammaloop-workspace-check] Checking owo-colors v4.3.0
  312. 29.32 s [gammaloop-workspace-check] Checking object v0.37.3
  313. 29.34 s [gammaloop-workspace-check] Checking tracing-error v0.2.1
  314. 29.45 s [gammaloop-workspace-check] Checking typed-index-collections v3.5.0
  315. 29.46 s [gammaloop-workspace-check] Checking serde-big-array v0.5.1
  316. 29.49 s [gammaloop-workspace-check] Checking amd v0.2.2
  317. 29.54 s [gammaloop-workspace-check] Checking itertools v0.11.0
  318. 29.65 s [gammaloop-workspace-check] Compiling gammaloop-tracing-filter-macros v0.1.0 (/build/source/crates/gammaloop-tracing-filter-macros)
  319. 29.66 s [gammaloop-workspace-check] Checking option-ext v0.2.0
  320. 29.72 s [gammaloop-workspace-check] Checking rustc-demangle v0.1.27
  321. 29.96 s [gammaloop-workspace-check] Checking env_logger v0.11.10
  322. 29.96 s [gammaloop-workspace-check] Checking dirs-sys v0.5.0
  323. 30.02 s [gammaloop-workspace-check] Checking ref-cast v1.0.25
  324. 30.06 s [gammaloop-workspace-check] Checking nix v0.31.2
  325. 30.10 s [gammaloop-workspace-check] Checking indicatif v0.18.4
  326. 30.10 s [gammaloop-workspace-check] Checking brotli-decompressor v4.0.3
  327. 30.14 s [gammaloop-workspace-check] Checking integer-sqrt v0.1.5
  328. 30.23 s [gammaloop-workspace-check] Checking crossbeam-channel v0.5.15
  329. 30.26 s [gammaloop-workspace-check] Compiling rustpython-parser-core v0.4.0
  330. 30.26 s [gammaloop-workspace-check] Checking color-spantrace v0.3.0
  331. 30.29 s [gammaloop-workspace-check] Checking itertools v0.12.1
  332. 30.45 s [gammaloop-workspace-check] Compiling rustpython-ast v0.4.0
  333. 30.58 s [gammaloop-workspace-check] Compiling gammalooprs v0.3.4 (/build/source/crates/gammalooprs)
  334. 30.59 s [gammaloop-workspace-check] Checking unsafe-libyaml v0.2.11
  335. 30.61 s [gammaloop-workspace-check] Checking symlink v0.1.0
  336. 30.66 s [gammaloop-workspace-check] Checking tracing-appender v0.2.5
  337. 30.72 s [gammaloop-workspace-check] Checking clarabel v0.11.1
  338. 30.84 s [gammaloop-workspace-check] Checking include_dir v0.7.4
  339. 30.90 s [gammaloop-workspace-check] Checking pathfinding v4.15.0
  340. 30.91 s [gammaloop-workspace-check] Checking tracing-indicatif v0.3.14
  341. 30.98 s [gammaloop-workspace-check] Checking schemars v1.2.1
  342. 31.17 s [gammaloop-workspace-check] Checking ctrlc v3.5.2
  343. 31.28 s [gammaloop-workspace-check] Checking dirs v6.0.0
  344. 31.35 s [gammaloop-workspace-check] Checking slotmap v1.1.1
  345. 31.44 s [gammaloop-workspace-check] Checking json5 v0.4.1
  346. 31.50 s [gammaloop-workspace-check] Checking vectorize v0.2.0
  347. 31.59 s [gammaloop-workspace-check] Checking base62 v2.2.4
  348. 31.73 s [gammaloop-workspace-check] Checking ringbuffer v0.16.0
  349. 31.77 s [gammaloop-workspace-check] Checking ratatui-widgets v0.3.0
  350. 31.83 s [gammaloop-workspace-check] Checking ratatui-crossterm v0.1.0
  351. 31.88 s [gammaloop-workspace-check] Checking brotli v7.0.0
  352. 32.03 s [gammaloop-workspace-check] Checking serde_yaml v0.9.34+deprecated
  353. 32.04 s [gammaloop-workspace-check] Checking rkyv v0.7.46
  354. 32.06 s [gammaloop-workspace-check] Checking clap_complete v4.6.3
  355. 32.06 s [gammaloop-workspace-check] Checking rust-embed v8.11.0
  356. 32.09 s [gammaloop-workspace-check] Checking fd-lock v4.0.4
  357. 32.13 s [gammaloop-workspace-check] Checking strip-ansi-escapes v0.2.1
  358. 32.19 s [gammaloop-workspace-check] Compiling gammaloop-api v0.1.0 (/build/source/crates/gammaloop-api)
  359. 32.20 s [gammaloop-workspace-check] Checking itertools v0.13.0
  360. 32.21 s [gammaloop-workspace-check] Checking strum v0.26.3
  361. 32.27 s [gammaloop-workspace-check] Checking addr2line v0.25.1
  362. 32.40 s [gammaloop-workspace-check] Checking sysinfo v0.33.1
  363. 32.43 s [gammaloop-workspace-check] Checking clap_complete_nushell v4.6.0
  364. 32.49 s [gammaloop-workspace-check] Checking shlex v1.3.0
  365. 32.53 s [gammaloop-workspace-check] Checking futures-core v0.3.32
  366. 32.67 s [gammaloop-workspace-check] Checking futures-task v0.3.32
  367. 32.68 s [gammaloop-workspace-check] Checking slab v0.4.12
  368. 32.76 s [gammaloop-workspace-check] Checking sdd v3.0.10
  369. 32.77 s [gammaloop-workspace-check] Compiling gammaloop-integration-tests v0.1.0 (/build/source/tests)
  370. 32.78 s [gammaloop-workspace-check] Checking futures-util v0.3.32
  371. 32.87 s [gammaloop-workspace-check] Compiling test-log-core v0.2.20
  372. 33.11 s [gammaloop-workspace-check] Checking scc v2.4.0
  373. 33.46 s [gammaloop-workspace-check] Compiling rustc_version v0.4.1
  374. 33.52 s [gammaloop-workspace-check] Checking which v8.0.2
  375. 33.67 s [gammaloop-workspace-check] Checking bincode v1.3.3
  376. 34.04 s [gammaloop-workspace-check] Checking ratatui-macros v0.7.0
  377. 34.21 s [gammaloop-workspace-check] Checking ratatui v0.30.0
  378. 34.29 s [gammaloop-workspace-check] Compiling gungraun-runner v0.18.2
  379. 34.66 s [gammaloop-workspace-check] Compiling gungraun-macros v0.8.0
  380. 35.00 s [gammaloop-workspace-check] Checking proc-macro2 v1.0.106
  381. 35.33 s [gammaloop-workspace-check] Checking reedline v0.42.0
  382. 35.47 s [gammaloop-workspace-check] Checking futures-executor v0.3.32
  383. 35.74 s [gammaloop-workspace-check] Compiling numerica v2.2.0 (https://github.com/alphal00p/symbolica?rev=4d0a833eb8e059d1f95bdae5abed2559830b235f#4d0a833e)
  384. 35.84 s [gammaloop-workspace-check] Checking serial_test v3.4.0
  385. 35.93 s [gammaloop-workspace-check] Checking quote v1.0.45
  386. 36.04 s [gammaloop-workspace-check] Checking maplit v1.0.2
  387. 36.09 s [gammaloop-workspace-check] Checking base64 v0.21.7
  388. 36.10 s [gammaloop-workspace-check] Checking nalgebra v0.29.0
  389. 36.15 s [gammaloop-workspace-check] Compiling iai-callgrind-runner v0.14.2
  390. 36.29 s [gammaloop-workspace-check] Compiling test-log-macros v0.2.20
  391. 36.48 s [gammaloop-workspace-check] Checking wait-timeout v0.2.1
  392. 36.50 s [gammaloop-workspace-check] Checking ron v0.8.1
  393. 36.68 s [gammaloop-workspace-check] Checking kurbo v0.13.0
  394. 36.75 s [gammaloop-workspace-check] Checking quick-error v1.2.3
  395. 36.87 s [gammaloop-workspace-check] Checking bit-vec v0.8.0
  396. 37.11 s [gammaloop-workspace-check] Compiling iai-callgrind v0.14.2
  397. 37.13 s [gammaloop-workspace-check] Checking backtrace v0.3.76
  398. 37.22 s [gammaloop-workspace-check] Checking bit-set v0.8.0
  399. 37.38 s [gammaloop-workspace-check] Checking rusty-fork v0.3.1
  400. 37.56 s [gammaloop-workspace-check] Checking syn v2.0.117
  401. 37.57 s [gammaloop-workspace-check] Compiling iai-callgrind-macros v0.5.1
  402. 37.62 s [gammaloop-workspace-check] Checking color-eyre v0.6.5
  403. 37.67 s [gammaloop-workspace-check] Checking rand_xorshift v0.4.0
  404. 37.74 s [gammaloop-workspace-check] Checking console v0.15.11
  405. 37.97 s [gammaloop-workspace-check] Checking unarray v0.1.4
  406. 38.04 s [gammaloop-workspace-check] Checking pathdiff v0.2.3
  407. 38.05 s [gammaloop-workspace-check] Checking similar-asserts v1.7.0
  408. 38.08 s [gammaloop-workspace-check] Checking proptest v1.11.0
  409. 38.12 s [gammaloop-workspace-check] Checking clinnet v0.1.8 (/build/source/crates/clinnet)
  410. 38.95 s [gammaloop-workspace-check] Checking kurvst v0.1.0 (/build/source/crates/kurvst)
  411. 41.23 s [gammaloop-workspace-check] Checking test-log v0.2.20
  412. 43.69 s [gammaloop-workspace-check] Compiling graphica v2.1.0 (https://github.com/alphal00p/symbolica?rev=4d0a833eb8e059d1f95bdae5abed2559830b235f#4d0a833e)
  413. 46.97 s [gammaloop-workspace-check] Checking statrs v0.16.1
  414. 48.32 s [gammaloop-workspace-check] Checking momtrop v0.3.0
  415. 49.31 s [gammaloop-workspace-check] Compiling pyo3-macros v0.28.3
  416. 50.01 s [gammaloop-workspace-check] Checking gungraun v0.18.2
  417. 51.72 s [gammaloop-workspace-check] Compiling pyo3-stub-gen-derive v0.17.2
  418. 57.63 s [gammaloop-workspace-check] Checking pyo3-stub-gen v0.17.2
  419. 65.90 s [gammaloop-workspace-check] Checking symbolica-utils v0.1.0 (/build/source/crates/symbolica-utils)
  420. 65.90 s [gammaloop-workspace-check] Checking spenso-macros v0.3.2 (/build/source/crates/spenso-macros)
  421. 252.00 s [gammaloop-workspace-check] Compiling gammaloop-workspace-hack v0.1.0 (/build/source/crates/gammaloop-workspace-hack)
  422. 252.24 s [gammaloop-workspace-check] Checking linnet v0.17.0 (/build/source/crates/linnet)
  423. 255.53 s [gammaloop-workspace-check] Checking spenso v0.6.0 (/build/source/crates/spenso)
  424. 255.75 s [gammaloop-workspace-check] Checking linnet-py v0.1.0 (/build/source/crates/linnet-py)
  425. 255.75 s [gammaloop-workspace-check] Checking linnest v0.1.0 (/build/source/crates/linnest)
  426. 260.85 s [gammaloop-workspace-check] Checking idenso v0.3.0 (/build/source/crates/idenso)
  427. 260.85 s [gammaloop-workspace-check] Checking gammaloop-tracing-filter v0.1.0 (/build/source/crates/gammaloop-tracing-filter)
  428. 262.87 s [gammaloop-workspace-check] Checking spenso-hep-lib v0.1.7 (/build/source/crates/spenso-hep-lib)
  429. 263.09 s [gammaloop-workspace-check] Checking spynso3 v0.1.2 (/build/source/crates/spynso3)
  430. 290.45 s [gammaloop-workspace-check] error[E0624]: method `export_uv_forest_graph` is private
  431. 290.45 s [gammaloop-workspace-check] --> tests/tests/uv.rs:3426:33
  432. 290.45 s [gammaloop-workspace-check] |
  433. 290.45 s [gammaloop-workspace-check] 3426 | let soft_export = integrand.export_uv_forest_graph(
  434. 290.45 s [gammaloop-workspace-check] | ^^^^^^^^^^^^^^^^^^^^^^ private method
  435. 290.45 s [gammaloop-workspace-check] |
  436. 290.45 s [gammaloop-workspace-check] ::: crates/gammalooprs/src/uv/export.rs:125:5
  437. 290.45 s [gammaloop-workspace-check] |
  438. 290.45 s [gammaloop-workspace-check] 125 | / pub(crate) fn export_uv_forest_graph(
  439. 290.45 s [gammaloop-workspace-check] 126 | | &self,
  440. 290.45 s [gammaloop-workspace-check] 127 | | graph_id: usize,
  441. 290.45 s [gammaloop-workspace-check] 128 | | orientation: Option<OrientationProjection<'_>>,
  442. 290.45 s [gammaloop-workspace-check] 129 | | generation_settings: &GenerationSettings,
  443. 290.45 s [gammaloop-workspace-check] 130 | | export_settings: &UVForestExportSettings,
  444. 290.45 s [gammaloop-workspace-check] 131 | | ) -> Result<UVForestExport> {
  445. 290.45 s [gammaloop-workspace-check] | |_______________________________- private method defined here
  446. 290.45 s [gammaloop-workspace-check]
  447. 290.46 s [gammaloop-workspace-check] error[E0624]: method `export_uv_forest_graph` is private
  448. 290.46 s [gammaloop-workspace-check] --> tests/tests/uv.rs:3522:38
  449. 290.46 s [gammaloop-workspace-check] |
  450. 290.46 s [gammaloop-workspace-check] 3522 | let uv_export = uv_integrand.export_uv_forest_graph(
  451. 290.46 s [gammaloop-workspace-check] | ^^^^^^^^^^^^^^^^^^^^^^ private method
  452. 290.46 s [gammaloop-workspace-check] |
  453. 290.46 s [gammaloop-workspace-check] ::: crates/gammalooprs/src/uv/export.rs:125:5
  454. 290.46 s [gammaloop-workspace-check] |
  455. 290.46 s [gammaloop-workspace-check] 125 | / pub(crate) fn export_uv_forest_graph(
  456. 290.46 s [gammaloop-workspace-check] 126 | | &self,
  457. 290.46 s [gammaloop-workspace-check] 127 | | graph_id: usize,
  458. 290.46 s [gammaloop-workspace-check] 128 | | orientation: Option<OrientationProjection<'_>>,
  459. 290.46 s [gammaloop-workspace-check] 129 | | generation_settings: &GenerationSettings,
  460. 290.46 s [gammaloop-workspace-check] 130 | | export_settings: &UVForestExportSettings,
  461. 290.46 s [gammaloop-workspace-check] 131 | | ) -> Result<UVForestExport> {
  462. 290.46 s [gammaloop-workspace-check] | |_______________________________- private method defined here
  463. 290.46 s [gammaloop-workspace-check]
  464. 290.48 s [gammaloop-workspace-check] error[E0624]: method `export_uv_forest_graph` is private
  465. 290.48 s [gammaloop-workspace-check] --> tests/tests/uv.rs:3936:44
  466. 290.48 s [gammaloop-workspace-check] |
  467. 290.48 s [gammaloop-workspace-check] 3936 | let export = integrand.export_uv_forest_graph(
  468. 290.48 s [gammaloop-workspace-check] | ^^^^^^^^^^^^^^^^^^^^^^ private method
  469. 290.48 s [gammaloop-workspace-check] |
  470. 290.48 s [gammaloop-workspace-check] ::: crates/gammalooprs/src/uv/export.rs:125:5
  471. 290.48 s [gammaloop-workspace-check] |
  472. 290.48 s [gammaloop-workspace-check] 125 | / pub(crate) fn export_uv_forest_graph(
  473. 290.48 s [gammaloop-workspace-check] 126 | | &self,
  474. 290.48 s [gammaloop-workspace-check] 127 | | graph_id: usize,
  475. 290.48 s [gammaloop-workspace-check] 128 | | orientation: Option<OrientationProjection<'_>>,
  476. 290.48 s [gammaloop-workspace-check] 129 | | generation_settings: &GenerationSettings,
  477. 290.48 s [gammaloop-workspace-check] 130 | | export_settings: &UVForestExportSettings,
  478. 290.48 s [gammaloop-workspace-check] 131 | | ) -> Result<UVForestExport> {
  479. 290.48 s [gammaloop-workspace-check] | |_______________________________- private method defined here
  480. 290.48 s [gammaloop-workspace-check]
  481. 290.49 s [gammaloop-workspace-check] error[E0624]: method `export_uv_forest_graph` is private
  482. 290.49 s [gammaloop-workspace-check] --> tests/tests/uv.rs:4128:36
  483. 290.49 s [gammaloop-workspace-check] |
  484. 290.49 s [gammaloop-workspace-check] 4128 | let export = integrand.export_uv_forest_graph(
  485. 290.49 s [gammaloop-workspace-check] | ^^^^^^^^^^^^^^^^^^^^^^ private method
  486. 290.49 s [gammaloop-workspace-check] |
  487. 290.49 s [gammaloop-workspace-check] ::: crates/gammalooprs/src/uv/export.rs:125:5
  488. 290.49 s [gammaloop-workspace-check] |
  489. 290.49 s [gammaloop-workspace-check] 125 | / pub(crate) fn export_uv_forest_graph(
  490. 290.49 s [gammaloop-workspace-check] 126 | | &self,
  491. 290.49 s [gammaloop-workspace-check] 127 | | graph_id: usize,
  492. 290.49 s [gammaloop-workspace-check] 128 | | orientation: Option<OrientationProjection<'_>>,
  493. 290.49 s [gammaloop-workspace-check] 129 | | generation_settings: &GenerationSettings,
  494. 290.49 s [gammaloop-workspace-check] 130 | | export_settings: &UVForestExportSettings,
  495. 290.49 s [gammaloop-workspace-check] 131 | | ) -> Result<UVForestExport> {
  496. 290.49 s [gammaloop-workspace-check] | |_______________________________- private method defined here
  497. 290.49 s [gammaloop-workspace-check]
  498. 290.50 s [gammaloop-workspace-check] error[E0624]: method `export_uv_forest_graph` is private
  499. 290.50 s [gammaloop-workspace-check] --> tests/tests/uv.rs:4335:36
  500. 290.50 s [gammaloop-workspace-check] |
  501. 290.50 s [gammaloop-workspace-check] 4335 | let export = integrand.export_uv_forest_graph(
  502. 290.50 s [gammaloop-workspace-check] | ^^^^^^^^^^^^^^^^^^^^^^ private method
  503. 290.50 s [gammaloop-workspace-check] |
  504. 290.50 s [gammaloop-workspace-check] ::: crates/gammalooprs/src/uv/export.rs:125:5
  505. 290.50 s [gammaloop-workspace-check] |
  506. 290.50 s [gammaloop-workspace-check] 125 | / pub(crate) fn export_uv_forest_graph(
  507. 290.50 s [gammaloop-workspace-check] 126 | | &self,
  508. 290.50 s [gammaloop-workspace-check] 127 | | graph_id: usize,
  509. 290.50 s [gammaloop-workspace-check] 128 | | orientation: Option<OrientationProjection<'_>>,
  510. 290.50 s [gammaloop-workspace-check] 129 | | generation_settings: &GenerationSettings,
  511. 290.50 s [gammaloop-workspace-check] 130 | | export_settings: &UVForestExportSettings,
  512. 290.50 s [gammaloop-workspace-check] 131 | | ) -> Result<UVForestExport> {
  513. 290.50 s [gammaloop-workspace-check] | |_______________________________- private method defined here
  514. 290.50 s [gammaloop-workspace-check]
  515. 290.60 s [gammaloop-workspace-check] error[E0061]: this method takes 5 arguments but 3 arguments were supplied
  516. 290.60 s [gammaloop-workspace-check] --> tests/tests/uv.rs:4551:26
  517. 290.60 s [gammaloop-workspace-check] |
  518. 290.60 s [gammaloop-workspace-check] 4551 | parent_graph.cff(&parent_tree, &parent_cut, &OrientationPattern::default())?;
  519. 290.61 s [gammaloop-workspace-check] | ^^^----------------------------------------------------------- two arguments of type `&three_dimensional_reps::generation::Generate3DExpressionOptions` and `Option<&symbolica::atom::Atom>` are missing
  520. 290.61 s [gammaloop-workspace-check] |
  521. 290.61 s [gammaloop-workspace-check] note: method defined here
  522. 290.61 s [gammaloop-workspace-check] --> crates/gammalooprs/src/cff/mod.rs:755:12
  523. 290.61 s [gammaloop-workspace-check] |
  524. 290.61 s [gammaloop-workspace-check] 755 | pub fn cff<S: SubGraphLike + SubSetLike>(
  525. 290.61 s [gammaloop-workspace-check] | ^^^
  526. 290.61 s [gammaloop-workspace-check] help: provide the arguments
  527. 290.61 s [gammaloop-workspace-check] |
  528. 290.61 s [gammaloop-workspace-check] 4551 | parent_graph.cff(&parent_tree, &parent_cut, &OrientationPattern::default(), /* &three_dimensional_reps::generation::Generate3DExpressionOptions */, /* Option<&symbolica::atom::Atom> */)?;
  529. 290.61 s [gammaloop-workspace-check] | ++++++++++++++++++++++++++++++++++++++++++++++++++++++++++++++++++++++++++++++++++++++++++++++++++++++++++++++
  530. 290.61 s [gammaloop-workspace-check]
  531. 290.61 s [gammaloop-workspace-check] error[E0616]: field `orientations` of struct `CFFTerm` is private
  532. 290.61 s [gammaloop-workspace-check] --> tests/tests/uv.rs:4555:36
  533. 290.61 s [gammaloop-workspace-check] |
  534. 290.61 s [gammaloop-workspace-check] 4555 | .flat_map(|term| &term.orientations)
  535. 290.61 s [gammaloop-workspace-check] | ^^^^^^^^^^^^ private field
  536. 290.61 s [gammaloop-workspace-check]
  537. 290.65 s [gammaloop-workspace-check] error[E0609]: no field `orientations` on type `&GeneratedThreeDExpression<Esurface, Hsurface>`
  538. 290.65 s [gammaloop-workspace-check] --> tests/tests/uv.rs:4653:18
  539. 290.65 s [gammaloop-workspace-check] |
  540. 290.65 s [gammaloop-workspace-check] 4653 | .orientations
  541. 290.65 s [gammaloop-workspace-check] | ^^^^^^^^^^^^ unknown field
  542. 290.65 s [gammaloop-workspace-check] |
  543. 290.65 s [gammaloop-workspace-check] = note: the full name for the type has been written to '/build/source/target/ci-optim/deps/uv-ae6ff038ef4b6f0a.long-type-12389030920437475506.txt'
  544. 290.65 s [gammaloop-workspace-check] = note: consider using `--verbose` to print the full type name to the console
  545. 290.65 s [gammaloop-workspace-check] help: one of the expressions' fields has a field of the same name
  546. 290.65 s [gammaloop-workspace-check] |
  547. 290.65 s [gammaloop-workspace-check] 4653 | .expression.orientations
  548. 290.65 s [gammaloop-workspace-check] | +++++++++++
  549. 290.65 s [gammaloop-workspace-check]
  550. 290.65 s [gammaloop-workspace-check] error[E0624]: method `export_uv_forest_graph` is private
  551. 290.65 s [gammaloop-workspace-check] --> tests/tests/uv.rs:4673:43
  552. 290.65 s [gammaloop-workspace-check] |
  553. 290.65 s [gammaloop-workspace-check] 4673 | let structural_forest = integrand.export_uv_forest_graph(
  554. 290.65 s [gammaloop-workspace-check] | ^^^^^^^^^^^^^^^^^^^^^^ private method
  555. 290.65 s [gammaloop-workspace-check] |
  556. 290.65 s [gammaloop-workspace-check] ::: crates/gammalooprs/src/uv/export.rs:125:5
  557. 290.65 s [gammaloop-workspace-check] |
  558. 290.65 s [gammaloop-workspace-check] 125 | / pub(crate) fn export_uv_forest_graph(
  559. 290.65 s [gammaloop-workspace-check] 126 | | &self,
  560. 290.65 s [gammaloop-workspace-check] 127 | | graph_id: usize,
  561. 290.65 s [gammaloop-workspace-check] 128 | | orientation: Option<OrientationProjection<'_>>,
  562. 290.65 s [gammaloop-workspace-check] 129 | | generation_settings: &GenerationSettings,
  563. 290.65 s [gammaloop-workspace-check] 130 | | export_settings: &UVForestExportSettings,
  564. 290.65 s [gammaloop-workspace-check] 131 | | ) -> Result<UVForestExport> {
  565. 290.65 s [gammaloop-workspace-check] | |_______________________________- private method defined here
  566. 290.65 s [gammaloop-workspace-check]
  567. 290.67 s [gammaloop-workspace-check] error[E0624]: method `export_uv_forest_graph` is private
  568. 290.67 s [gammaloop-workspace-check] --> tests/tests/uv.rs:4897:43
  569. 290.67 s [gammaloop-workspace-check] |
  570. 290.67 s [gammaloop-workspace-check] 4897 | let structural_forest = integrand.export_uv_forest_graph(
  571. 290.67 s [gammaloop-workspace-check] | ^^^^^^^^^^^^^^^^^^^^^^ private method
  572. 290.67 s [gammaloop-workspace-check] |
  573. 290.67 s [gammaloop-workspace-check] ::: crates/gammalooprs/src/uv/export.rs:125:5
  574. 290.67 s [gammaloop-workspace-check] |
  575. 290.67 s [gammaloop-workspace-check] 125 | / pub(crate) fn export_uv_forest_graph(
  576. 290.67 s [gammaloop-workspace-check] 126 | | &self,
  577. 290.67 s [gammaloop-workspace-check] 127 | | graph_id: usize,
  578. 290.67 s [gammaloop-workspace-check] 128 | | orientation: Option<OrientationProjection<'_>>,
  579. 290.67 s [gammaloop-workspace-check] 129 | | generation_settings: &GenerationSettings,
  580. 290.67 s [gammaloop-workspace-check] 130 | | export_settings: &UVForestExportSettings,
  581. 290.67 s [gammaloop-workspace-check] 131 | | ) -> Result<UVForestExport> {
  582. 290.67 s [gammaloop-workspace-check] | |_______________________________- private method defined here
  583. 290.67 s [gammaloop-workspace-check]
  584. 290.69 s [gammaloop-workspace-check] error[E0624]: method `export_uv_forest_graph` is private
  585. 290.69 s [gammaloop-workspace-check] --> tests/tests/uv.rs:5146:43
  586. 290.69 s [gammaloop-workspace-check] |
  587. 290.69 s [gammaloop-workspace-check] 5146 | let structural_forest = integrand.export_uv_forest_graph(
  588. 290.69 s [gammaloop-workspace-check] | ^^^^^^^^^^^^^^^^^^^^^^ private method
  589. 290.69 s [gammaloop-workspace-check] |
  590. 290.69 s [gammaloop-workspace-check] ::: crates/gammalooprs/src/uv/export.rs:125:5
  591. 290.69 s [gammaloop-workspace-check] |
  592. 290.69 s [gammaloop-workspace-check] 125 | / pub(crate) fn export_uv_forest_graph(
  593. 290.69 s [gammaloop-workspace-check] 126 | | &self,
  594. 290.69 s [gammaloop-workspace-check] 127 | | graph_id: usize,
  595. 290.69 s [gammaloop-workspace-check] 128 | | orientation: Option<OrientationProjection<'_>>,
  596. 290.69 s [gammaloop-workspace-check] 129 | | generation_settings: &GenerationSettings,
  597. 290.69 s [gammaloop-workspace-check] 130 | | export_settings: &UVForestExportSettings,
  598. 290.69 s [gammaloop-workspace-check] 131 | | ) -> Result<UVForestExport> {
  599. 290.69 s [gammaloop-workspace-check] | |_______________________________- private method defined here
  600. 290.69 s [gammaloop-workspace-check]
  601. 290.69 s [gammaloop-workspace-check] error[E0624]: method `export_uv_forest_graph` is private
  602. 290.69 s [gammaloop-workspace-check] --> tests/tests/uv.rs:5161:41
  603. 290.69 s [gammaloop-workspace-check] |
  604. 290.69 s [gammaloop-workspace-check] 5161 | let computed_forest = integrand.export_uv_forest_graph(
  605. 290.69 s [gammaloop-workspace-check] | ^^^^^^^^^^^^^^^^^^^^^^ private method
  606. 290.69 s [gammaloop-workspace-check] |
  607. 290.69 s [gammaloop-workspace-check] ::: crates/gammalooprs/src/uv/export.rs:125:5
  608. 290.69 s [gammaloop-workspace-check] |
  609. 290.69 s [gammaloop-workspace-check] 125 | / pub(crate) fn export_uv_forest_graph(
  610. 290.69 s [gammaloop-workspace-check] 126 | | &self,
  611. 290.69 s [gammaloop-workspace-check] 127 | | graph_id: usize,
  612. 290.69 s [gammaloop-workspace-check] 128 | | orientation: Option<OrientationProjection<'_>>,
  613. 290.69 s [gammaloop-workspace-check] 129 | | generation_settings: &GenerationSettings,
  614. 290.69 s [gammaloop-workspace-check] 130 | | export_settings: &UVForestExportSettings,
  615. 290.69 s [gammaloop-workspace-check] 131 | | ) -> Result<UVForestExport> {
  616. 290.69 s [gammaloop-workspace-check] | |_______________________________- private method defined here
  617. 290.69 s [gammaloop-workspace-check]
  618. 290.72 s [gammaloop-workspace-check] error[E0624]: method `export_uv_forest_graph` is private
  619. 290.72 s [gammaloop-workspace-check] --> tests/tests/uv.rs:5724:51
  620. 290.72 s [gammaloop-workspace-check] |
  621. 290.72 s [gammaloop-workspace-check] 5724 | let structural_forest = integrand.export_uv_forest_graph(
  622. 290.72 s [gammaloop-workspace-check] | ^^^^^^^^^^^^^^^^^^^^^^ private method
  623. 290.72 s [gammaloop-workspace-check] |
  624. 290.72 s [gammaloop-workspace-check] ::: crates/gammalooprs/src/uv/export.rs:125:5
  625. 290.72 s [gammaloop-workspace-check] |
  626. 290.72 s [gammaloop-workspace-check] 125 | / pub(crate) fn export_uv_forest_graph(
  627. 290.72 s [gammaloop-workspace-check] 126 | | &self,
  628. 290.72 s [gammaloop-workspace-check] 127 | | graph_id: usize,
  629. 290.72 s [gammaloop-workspace-check] 128 | | orientation: Option<OrientationProjection<'_>>,
  630. 290.72 s [gammaloop-workspace-check] 129 | | generation_settings: &GenerationSettings,
  631. 290.72 s [gammaloop-workspace-check] 130 | | export_settings: &UVForestExportSettings,
  632. 290.72 s [gammaloop-workspace-check] 131 | | ) -> Result<UVForestExport> {
  633. 290.72 s [gammaloop-workspace-check] | |_______________________________- private method defined here
  634. 290.72 s [gammaloop-workspace-check]
  635. 290.88 s [gammaloop-workspace-check] Some errors have detailed explanations: E0061, E0609, E0616, E0624.
  636. 290.88 s [gammaloop-workspace-check] For more information about an error, try `rustc --explain E0061`.
  637. 290.89 s [gammaloop-workspace-check] error: could not compile `gammaloop-integration-tests` (test "uv") due to 13 previous errors
  638. 290.89 s [gammaloop-workspace-check] warning: build failed, waiting for other jobs to finish...
  639. 291.64 s Progress: 0 of 1 built (1 failed)
  640. 291.64 s Failed to build gammaloop-workspace-check after 4m48s
  641. 291.65 s Cannot build '/nix/store/yq41fja0qvn1pcayl6m3fb5q6zl3fd3g-gammaloop-workspace-check-0.1.0.drv'.
  642. 291.65 s Reason: builder failed with exit code 101.
  643. 291.65 s Output paths:
  644. 291.65 s /nix/store/hwdr1153vypfqwdqsimb7pidkhdih6m9-gammaloop-workspace-check-0.1.0
  645. 291.65 s Last 634 log lines:
  646. 291.65 s > Running phase: unpackPhase
  647. 291.65 s > unpacking source archive /nix/store/0llqw1df709zbvslaaqs2ang2jp44rl4-source
  648. 291.65 s > source root is source
  649. 291.65 s > Running phase: patchPhase
  650. 291.65 s > Executing configureCargoCommonVars
  651. 291.65 s > decompressing cargo artifacts from /nix/store/wxpx6lf642pgxp2wz1pw1lxksj5p1wb0-gammaloop-workspace-deps-deps-0.1.0/target.tar.zst to target
  652. 291.65 s > Running phase: updateAutotoolsGnuConfigScriptsPhase
  653. 291.65 s > Running phase: configurePhase
  654. 291.65 s > will append /build/source/.cargo-home/config.toml with contents of /nix/store/8zq9ya5slh345hbylmsibxw827bi98w0-vendor-cargo-deps/config.toml
  655. 291.65 s > default configurePhase, nothing to do
  656. 291.65 s > Running phase: buildPhase
  657. 291.65 s > +++ command cargo --version
  658. 291.65 s > cargo 1.97.0 (c980f4866 2026-06-30)
  659. 291.65 s > +++ command cargo check --profile ci-optim --locked --workspace --features gammaloop-tracing-filter/clap,gammaloop-tracing-filter/symbolica,idenso/bincode,idenso/reference-cases,linnet/bincode,linnet/drawing,linnet/rkyv,linnet/serde,linnet/symbolica,spenso-macros/shadowing,spenso/shadowing,symbolica/tracing_max_level_info,three-dimensional-reps/display,three-dimensional-reps/eval,three-dimensional-reps/serde --all-targets
  660. 291.65 s > Checking cfg-if v1.0.4
  661. 291.65 s > Checking memchr v2.8.0
  662. 291.65 s > Checking once_cell v1.21.4
  663. 291.65 s > Checking either v1.15.0
  664. 291.65 s > Checking serde_core v1.0.228
  665. 291.65 s > Checking libc v0.2.186
  666. 291.65 s > Checking libm v0.2.16
  667. 291.65 s > Checking itoa v1.0.18
  668. 291.65 s > Checking log v0.4.29
  669. 291.65 s > Checking regex-syntax v0.8.10
  670. 291.65 s > Checking zerocopy v0.8.48
  671. 291.65 s > Checking crossbeam-utils v0.8.21
  672. 291.65 s > Checking equivalent v1.0.2
  673. 291.65 s > Checking zmij v1.0.21
  674. 291.65 s > Checking lazy_static v1.5.0
  675. 291.65 s > Checking bytemuck v1.25.0
  676. 291.65 s > Compiling target-lexicon v0.13.5
  677. 291.65 s > Checking arrayvec v0.7.6
  678. 291.65 s > Checking powerfmt v0.2.0
  679. 291.65 s > Checking num_threads v0.1.7
  680. 291.65 s > Checking itertools v0.14.0
  681. 291.65 s > Checking pin-project-lite v0.2.17
  682. 291.65 s > Checking num-conv v0.2.1
  683. 291.65 s > Checking time-core v0.1.8
  684. 291.65 s > Checking tracing-core v0.1.36
  685. 291.65 s > Checking deranged v0.5.8
  686. 291.65 s > Checking allocator-api2 v0.2.21
  687. 291.65 s > Checking safe_arch v0.7.4
  688. 291.65 s > Checking foldhash v0.2.0
  689. 291.65 s > Checking const-random v0.1.18
  690. 291.65 s > Checking winnow v1.0.2
  691. 291.65 s > Checking unty v0.0.4
  692. 291.65 s > Checking static_assertions v1.1.0
  693. 291.65 s > Checking nu-ansi-term v0.50.3
  694. 291.65 s > Checking safe_arch v1.0.0
  695. 291.65 s > Checking aho-corasick v1.1.4
  696. 291.65 s > Checking tracing-log v0.2.0
  697. 291.65 s > Checking tracing v0.1.44
  698. 291.65 s > Checking sharded-slab v0.1.7
  699. 291.65 s > Checking wide v0.7.33
  700. 291.65 s > Checking thread_local v1.1.9
  701. 291.65 s > Checking toml_writer v1.1.1+spec-1.1.0
  702. 291.65 s > Checking indenter v0.3.4
  703. 291.65 s > Checking crossbeam-epoch v0.9.18
  704. 291.65 s > Checking az v1.3.0
  705. 291.65 s > Checking num-traits v0.2.19
  706. 291.65 s > Checking wide v1.3.0
  707. 291.65 s > Checking hashbrown v0.16.1
  708. 291.65 s > Checking crossbeam-deque v0.8.6
  709. 291.65 s > Compiling phf_shared v0.11.3
  710. 291.65 s > Checking rayon-core v1.13.0
  711. 291.65 s > Checking approx v0.5.1
  712. 291.65 s > Checking num-integer v0.1.46
  713. 291.65 s > Checking anyhow v1.0.102
  714. 291.65 s > Checking alloc-no-stdlib v2.0.4
  715. 291.65 s > Checking utf8parse v0.2.2
  716. 291.65 s > Checking rawpointer v0.2.1
  717. 291.65 s > Checking dyn-clone v1.0.20
  718. 291.65 s > Checking alloc-stdlib v0.2.2
  719. 291.65 s > Checking matrixmultiply v0.3.10
  720. 291.65 s > Checking anstyle-parse v1.0.0
  721. 291.65 s > Checking colored v3.1.1
  722. 291.65 s > Checking is_terminal_polyfill v1.70.2
  723. 291.65 s > Checking anstyle-query v1.1.5
  724. 291.65 s > Checking anstyle v1.0.14
  725. 291.65 s > Checking colorchoice v1.0.5
  726. 291.65 s > Compiling pyo3-build-config v0.28.3
  727. 291.65 s > Compiling phf_generator v0.11.3
  728. 291.65 s > Checking eyre v0.6.12
  729. 291.65 s > Checking bitflags v1.3.2
  730. 291.65 s > Checking unicode-width v0.2.2
  731. 291.65 s > Compiling phf_codegen v0.11.3
  732. 291.65 s > Checking brotli-decompressor v5.0.0
  733. 291.65 s > Checking rayon v1.12.0
  734. 291.65 s > Checking inventory v0.3.24
  735. 291.65 s > Checking anstream v1.0.0
  736. 291.65 s > Checking serde v1.0.228
  737. 291.65 s > Checking serde_json v1.0.149
  738. 291.65 s > Checking bitflags v2.11.1
  739. 291.65 s > Checking serde_spanned v1.1.1
  740. 291.65 s > Checking toml_datetime v1.1.1+spec-1.1.0
  741. 291.65 s > Checking spec_math v0.1.6
  742. 291.65 s > Checking thiserror v2.0.18
  743. 291.65 s > Compiling getopts v0.2.24
  744. 291.65 s > Checking libloading v0.9.0
  745. 291.65 s > Checking tinyjson v2.5.1
  746. 291.65 s > Checking toml_parser v1.1.2+spec-1.1.0
  747. 291.65 s > Checking bytes v1.11.1
  748. 291.65 s > Checking byteorder v1.5.0
  749. 291.65 s > Checking append-only-vec v0.1.8
  750. 291.65 s > Checking self_cell v1.2.2
  751. 291.65 s > Compiling unicode_names2_generator v1.3.0
  752. 291.65 s > Compiling unic-char-range v0.9.0
  753. 291.65 s > Checking smallvec v1.15.1
  754. 291.65 s > Checking num-complex v0.4.6
  755. 291.65 s > Checking bincode v2.0.1
  756. 291.65 s > Checking tracing-serde v0.2.0
  757. 291.65 s > Checking toml v1.1.2+spec-1.1.0
  758. 291.65 s > Checking brotli v8.0.2
  759. 291.65 s > Checking getrandom v0.3.4
  760. 291.65 s > Checking time v0.3.47
  761. 291.65 s > Checking gmp-mpfr-sys v1.7.1
  762. 291.65 s > Checking simba v0.9.1
  763. 291.65 s > Checking rand_core v0.9.5
  764. 291.65 s > Checking wasmtime-jit-icache-coherence v34.0.2
  765. 291.65 s > Checking hugepage-rs v0.1.1
  766. 291.65 s > Checking region v3.0.2
  767. 291.65 s > Checking smartstring v1.0.1
  768. 291.65 s > Compiling unic-common v0.9.0
  769. 291.65 s > Checking linux-raw-sys v0.12.1
  770. 291.65 s > Compiling unic-ucd-version v0.9.0
  771. 291.65 s > Compiling unic-char-property v0.9.0
  772. 291.65 s > Compiling is-macro v0.3.7
  773. 291.65 s > Compiling rustpython-parser-vendored v0.4.0
  774. 291.65 s > Checking iana-time-zone v0.1.65
  775. 291.65 s > Checking rustix v1.1.4
  776. 291.65 s > Checking chrono v0.4.44
  777. 291.65 s > Compiling rustpython-parser v0.4.0
  778. 291.65 s > Compiling phf v0.11.3
  779. 291.65 s > Checking rustc-hash v2.1.2
  780. 291.65 s > Compiling unic-ucd-ident v0.9.0
  781. 291.65 s > Compiling unic-emoji-char v0.9.0
  782. 291.65 s > Checking ndarray v0.17.2
  783. 291.65 s > Compiling lalrpop-util v0.20.2
  784. 291.65 s > Compiling rustc-hash v1.1.0
  785. 291.65 s > Checking rug v1.30.0
  786. 291.65 s > Compiling symbolica v2.2.0 (https://github.com/alphal00p/symbolica?rev=4d0a833eb8e059d1f95bdae5abed2559830b235f#4d0a833e)
  787. 291.65 s > Checking regex-automata v0.4.14
  788. 291.65 s > Checking unicode-segmentation v1.13.2
  789. 291.65 s > Checking typenum v1.20.0
  790. 291.65 s > Checking getrandom v0.2.17
  791. 291.65 s > Checking scopeguard v1.2.0
  792. 291.65 s > Checking parking_lot_core v0.9.12
  793. 291.65 s > Checking lock_api v0.4.14
  794. 291.65 s > Checking unicode-ident v1.0.24
  795. 291.65 s > Checking hashbrown v0.17.0
  796. 291.65 s > Checking parking_lot v0.12.5
  797. 291.65 s > Checking errno v0.3.14
  798. 291.65 s > Checking unicase v2.9.0
  799. 291.65 s > Checking strsim v0.11.1
  800. 291.65 s > Checking clap_lex v1.1.0
  801. 291.65 s > Checking generic-array v0.14.7
  802. 291.65 s > Checking signal-hook-registry v1.4.8
  803. 291.65 s > Checking vte v0.14.1
  804. 291.65 s > Checking same-file v1.0.6
  805. 291.65 s > Checking indexmap v2.14.0
  806. 291.65 s > Checking signal-hook v0.3.18
  807. 291.65 s > Checking mio v1.2.0
  808. 291.65 s > Checking walkdir v2.5.0
  809. 291.65 s > Checking minimal-lexical v0.2.1
  810. 291.65 s > Checking ciborium-io v0.2.2
  811. 291.65 s > Checking nom v7.1.3
  812. 291.65 s > Checking derive_more v2.1.1
  813. 291.65 s > Checking console v0.16.3
  814. 291.65 s > Checking signal-hook-mio v0.2.5
  815. 291.65 s > Compiling unicode_names2 v1.3.0
  816. 291.65 s > Checking num-bigint v0.4.6
  817. 291.65 s > Checking crypto-common v0.1.7
  818. 291.65 s > Checking block-buffer v0.10.4
  819. 291.65 s > Checking bstr v1.12.1
  820. 291.65 s > Checking digest v0.10.7
  821. 291.65 s > Checking winnow v0.7.15
  822. 291.65 s > Checking cpufeatures v0.2.17
  823. 291.65 s > Checking linux-raw-sys v0.4.15
  824. 291.65 s > Checking ansitok v0.3.0
  825. 291.65 s > Checking ppv-lite86 v0.2.21
  826. 291.65 s > Checking ahash v0.8.12
  827. 291.65 s > Checking xprec v0.2.2
  828. 291.65 s > Checking rand_chacha v0.9.0
  829. 291.65 s > Checking half v2.7.1
  830. 291.65 s > Checking sha2 v0.10.9
  831. 291.65 s > Checking getrandom v0.4.2
  832. 291.65 s > Checking rand v0.9.4
  833. 291.65 s > Checking rand_core v0.6.4
  834. 291.65 s > Checking fnv v1.0.7
  835. 291.65 s > Checking rustix v0.38.44
  836. 291.65 s > Checking fastrand v2.4.1
  837. 291.65 s > Checking plotters-backend v0.3.7
  838. 291.65 s > Checking plotters-svg v0.3.7
  839. 291.65 s > Checking toml_datetime v0.6.11
  840. 291.65 s > Checking serde_spanned v0.6.9
  841. 291.65 s > Checking itertools v0.10.5
  842. 291.65 s > Checking tap v1.0.1
  843. 291.65 s > Checking cast v0.3.0
  844. 291.65 s > Checking toml_write v0.1.2
  845. 291.65 s > Checking wyz v0.5.1
  846. 291.65 s > Checking plotters v0.3.7
  847. 291.65 s > Checking rand_chacha v0.3.1
  848. 291.65 s > Checking ciborium-ll v0.2.2
  849. 291.65 s > Checking terminal_size v0.4.4
  850. 291.65 s > Checking ciborium v0.2.2
  851. 291.65 s > Checking clap_builder v4.6.0
  852. 291.65 s > Checking tempfile v3.27.0
  853. 291.65 s > Checking matchers v0.2.0
  854. 291.65 s > Checking regex v1.12.3
  855. 291.65 s > Checking tracing-subscriber v0.3.23
  856. 291.65 s > Checking globset v0.4.18
  857. 291.65 s > Checking ansi-str v0.9.0
  858. 291.65 s > Checking criterion-plot v0.5.0
  859. 291.65 s > Checking radium v0.7.0
  860. 291.65 s > Checking rust-embed-utils v8.11.0
  861. 291.65 s > Checking typeid v1.0.3
  862. 291.65 s > Compiling pyo3-ffi v0.28.3
  863. 291.65 s > Compiling pyo3-macros-backend v0.28.3
  864. 291.65 s > Compiling pyo3 v0.28.3
  865. 291.65 s > Compiling numpy v0.28.0
  866. 291.65 s > Checking symjit v2.21.0
  867. 291.65 s > Checking tinytemplate v1.2.1
  868. 291.65 s > Checking similar v2.7.0
  869. 291.65 s > Checking is-terminal v0.4.17
  870. 291.65 s > Checking oorandom v11.1.5
  871. 291.65 s > Checking funty v2.0.0
  872. 291.65 s > Checking anes v0.1.6
  873. 291.65 s > Checking bytecount v0.6.9
  874. 291.65 s > Checking ron v0.12.1
  875. 291.65 s > Checking env_filter v1.0.1
  876. 291.65 s > Checking papergrid v0.17.0
  877. 291.65 s > Checking rand v0.8.6
  878. 291.65 s > Checking bitvec v1.0.1
  879. 291.65 s > Checking crossterm v0.28.1
  880. 291.65 s > Checking toml_edit v0.22.27
  881. 291.65 s > Checking testing_table v0.3.0
  882. 291.65 s > Checking clap v4.6.1
  883. 291.65 s > Checking toml_edit v0.25.11+spec-1.1.0
  884. 291.65 s > Checking uncased v0.9.10
  885. 291.65 s > Checking jiff v0.2.24
  886. 291.65 s > Checking ptr_meta v0.1.4
  887. 291.65 s > Checking criterion v0.5.1
  888. 291.65 s > Checking simdutf8 v0.1.5
  889. 291.65 s > Checking ucd-trie v0.1.7
  890. 291.65 s > Checking ahash v0.7.8
  891. 291.65 s > Checking bytecheck v0.6.12
  892. 291.65 s > Checking approx v0.4.0
  893. 291.65 s > Checking pest v2.8.6
  894. 291.65 s > Checking seahash v4.1.0
  895. 291.65 s > Checking hashbrown v0.12.3
  896. 291.65 s > Checking cgmath v0.18.0
  897. 291.65 s > Checking tabled v0.20.0
  898. 291.65 s > Checking num-rational v0.4.2
  899. 291.65 s > Checking num-iter v0.1.45
  900. 291.65 s > Checking rend v0.4.2
  901. 291.65 s > Checking insta v1.47.2
  902. 291.65 s > Checking ref-ops v0.2.5
  903. 291.65 s > Checking rand_xoshiro v0.6.0
  904. 291.65 s > Checking num v0.4.3
  905. 291.65 s > Checking features v0.10.0
  906. 291.65 s > Checking gat-lending-iterator v0.1.8
  907. 291.65 s > Checking constcat v0.5.1
  908. 291.65 s > Checking colored v2.2.0
  909. 291.65 s > Checking arrayref v0.3.9
  910. 291.65 s > Checking constant_time_eq v0.4.2
  911. 291.65 s > Checking cpufeatures v0.3.0
  912. 291.65 s > Checking base64 v0.22.1
  913. 291.65 s > Checking blake3 v1.8.5
  914. 291.65 s > Checking joinery v2.1.0
  915. 291.65 s > Checking siphasher v1.0.2
  916. 291.65 s > Checking titlecase v2.2.1
  917. 291.65 s > Checking subprocess v0.2.15
  918. 291.65 s > Checking toml v0.8.23
  919. 291.65 s > Checking phf_shared v0.13.1
  920. 291.65 s > Checking rust_lisp v0.18.0
  921. 291.65 s > Compiling vakint v0.1.2 (/build/source/crates/vakint)
  922. 291.65 s > Checking version-compare v0.2.1
  923. 291.65 s > Checking xpct v0.5.1
  924. 291.65 s > Checking phf v0.13.1
  925. 291.65 s > Checking string-template-plus v0.4.3
  926. 291.65 s > Checking ryu v1.0.23
  927. 291.65 s > Checking dot-parser v0.5.1
  928. 291.65 s > Checking castaway v0.2.4
  929. 291.65 s > Checking toml_datetime v0.7.5+spec-1.1.0
  930. 291.65 s > Checking figment v0.10.19
  931. 291.65 s > Checking strum v0.27.2
  932. 291.65 s > Checking unicode-truncate v2.0.1
  933. 291.65 s > Checking kasuari v0.4.12
  934. 291.65 s > Checking lru v0.16.4
  935. 291.65 s > Checking vte v0.15.0
  936. 291.65 s > Checking portable-atomic v1.13.1
  937. 291.65 s > Checking vt100 v0.16.2
  938. 291.65 s > Checking toml v0.9.12+spec-1.1.0
  939. 291.65 s > Checking compact_str v0.9.0
  940. 291.65 s > Checking unit-prefix v0.5.2
  941. 291.65 s > Checking rand_distr v0.4.3
  942. 291.65 s > Checking simba v0.6.0
  943. 291.65 s > Checking line-clipping v0.3.7
  944. 291.65 s > Checking adler2 v2.0.1
  945. 291.65 s > Compiling three-dimensional-reps v0.1.0 (/build/source/crates/three-dimensional-reps)
  946. 291.65 s > Checking gimli v0.32.3
  947. 291.65 s > Checking miniz_oxide v0.8.9
  948. 291.65 s > Checking thiserror v1.0.69
  949. 291.65 s > Checking ratatui-core v0.1.0
  950. 291.65 s > Checking derive_builder v0.11.2
  951. 291.65 s > Checking crossterm v0.29.0
  952. 291.65 s > Checking owo-colors v4.3.0
  953. 291.65 s > Checking object v0.37.3
  954. 291.65 s > Checking tracing-error v0.2.1
  955. 291.65 s > Checking typed-index-collections v3.5.0
  956. 291.65 s > Checking serde-big-array v0.5.1
  957. 291.65 s > Checking amd v0.2.2
  958. 291.65 s > Checking itertools v0.11.0
  959. 291.65 s > Compiling gammaloop-tracing-filter-macros v0.1.0 (/build/source/crates/gammaloop-tracing-filter-macros)
  960. 291.65 s > Checking option-ext v0.2.0
  961. 291.65 s > Checking rustc-demangle v0.1.27
  962. 291.65 s > Checking env_logger v0.11.10
  963. 291.65 s > Checking dirs-sys v0.5.0
  964. 291.65 s > Checking ref-cast v1.0.25
  965. 291.65 s > Checking nix v0.31.2
  966. 291.65 s > Checking indicatif v0.18.4
  967. 291.65 s > Checking brotli-decompressor v4.0.3
  968. 291.65 s > Checking integer-sqrt v0.1.5
  969. 291.65 s > Checking crossbeam-channel v0.5.15
  970. 291.65 s > Compiling rustpython-parser-core v0.4.0
  971. 291.65 s > Checking color-spantrace v0.3.0
  972. 291.65 s > Checking itertools v0.12.1
  973. 291.65 s > Compiling rustpython-ast v0.4.0
  974. 291.65 s > Compiling gammalooprs v0.3.4 (/build/source/crates/gammalooprs)
  975. 291.65 s > Checking unsafe-libyaml v0.2.11
  976. 291.65 s > Checking symlink v0.1.0
  977. 291.65 s > Checking tracing-appender v0.2.5
  978. 291.65 s > Checking clarabel v0.11.1
  979. 291.65 s > Checking include_dir v0.7.4
  980. 291.65 s > Checking pathfinding v4.15.0
  981. 291.65 s > Checking tracing-indicatif v0.3.14
  982. 291.65 s > Checking schemars v1.2.1
  983. 291.65 s > Checking ctrlc v3.5.2
  984. 291.65 s > Checking dirs v6.0.0
  985. 291.65 s > Checking slotmap v1.1.1
  986. 291.65 s > Checking json5 v0.4.1
  987. 291.65 s > Checking vectorize v0.2.0
  988. 291.65 s > Checking base62 v2.2.4
  989. 291.65 s > Checking ringbuffer v0.16.0
  990. 291.65 s > Checking ratatui-widgets v0.3.0
  991. 291.65 s > Checking ratatui-crossterm v0.1.0
  992. 291.65 s > Checking brotli v7.0.0
  993. 291.65 s > Checking serde_yaml v0.9.34+deprecated
  994. 291.65 s > Checking rkyv v0.7.46
  995. 291.65 s > Checking clap_complete v4.6.3
  996. 291.65 s > Checking rust-embed v8.11.0
  997. 291.65 s > Checking fd-lock v4.0.4
  998. 291.65 s > Checking strip-ansi-escapes v0.2.1
  999. 291.65 s > Compiling gammaloop-api v0.1.0 (/build/source/crates/gammaloop-api)
  1000. 291.65 s > Checking itertools v0.13.0
  1001. 291.65 s > Checking strum v0.26.3
  1002. 291.65 s > Checking addr2line v0.25.1
  1003. 291.65 s > Checking sysinfo v0.33.1
  1004. 291.65 s > Checking clap_complete_nushell v4.6.0
  1005. 291.65 s > Checking shlex v1.3.0
  1006. 291.65 s > Checking futures-core v0.3.32
  1007. 291.65 s > Checking futures-task v0.3.32
  1008. 291.65 s > Checking slab v0.4.12
  1009. 291.65 s > Checking sdd v3.0.10
  1010. 291.65 s > Compiling gammaloop-integration-tests v0.1.0 (/build/source/tests)
  1011. 291.65 s > Checking futures-util v0.3.32
  1012. 291.65 s > Compiling test-log-core v0.2.20
  1013. 291.65 s > Checking scc v2.4.0
  1014. 291.65 s > Compiling rustc_version v0.4.1
  1015. 291.65 s > Checking which v8.0.2
  1016. 291.65 s > Checking bincode v1.3.3
  1017. 291.65 s > Checking ratatui-macros v0.7.0
  1018. 291.65 s > Checking ratatui v0.30.0
  1019. 291.65 s > Compiling gungraun-runner v0.18.2
  1020. 291.65 s > Compiling gungraun-macros v0.8.0
  1021. 291.65 s > Checking proc-macro2 v1.0.106
  1022. 291.65 s > Checking reedline v0.42.0
  1023. 291.65 s > Checking futures-executor v0.3.32
  1024. 291.65 s > Compiling numerica v2.2.0 (https://github.com/alphal00p/symbolica?rev=4d0a833eb8e059d1f95bdae5abed2559830b235f#4d0a833e)
  1025. 291.65 s > Checking serial_test v3.4.0
  1026. 291.65 s > Checking quote v1.0.45
  1027. 291.65 s > Checking maplit v1.0.2
  1028. 291.65 s > Checking base64 v0.21.7
  1029. 291.65 s > Checking nalgebra v0.29.0
  1030. 291.65 s > Compiling iai-callgrind-runner v0.14.2
  1031. 291.65 s > Compiling test-log-macros v0.2.20
  1032. 291.65 s > Checking wait-timeout v0.2.1
  1033. 291.65 s > Checking ron v0.8.1
  1034. 291.65 s > Checking kurbo v0.13.0
  1035. 291.65 s > Checking quick-error v1.2.3
  1036. 291.65 s > Checking bit-vec v0.8.0
  1037. 291.65 s > Compiling iai-callgrind v0.14.2
  1038. 291.65 s > Checking backtrace v0.3.76
  1039. 291.65 s > Checking bit-set v0.8.0
  1040. 291.65 s > Checking rusty-fork v0.3.1
  1041. 291.65 s > Checking syn v2.0.117
  1042. 291.65 s > Compiling iai-callgrind-macros v0.5.1
  1043. 291.65 s > Checking color-eyre v0.6.5
  1044. 291.65 s > Checking rand_xorshift v0.4.0
  1045. 291.65 s > Checking console v0.15.11
  1046. 291.65 s > Checking unarray v0.1.4
  1047. 291.65 s > Checking pathdiff v0.2.3
  1048. 291.65 s > Checking similar-asserts v1.7.0
  1049. 291.65 s > Checking proptest v1.11.0
  1050. 291.65 s > Checking clinnet v0.1.8 (/build/source/crates/clinnet)
  1051. 291.65 s > Checking kurvst v0.1.0 (/build/source/crates/kurvst)
  1052. 291.65 s > Checking test-log v0.2.20
  1053. 291.65 s > Compiling graphica v2.1.0 (https://github.com/alphal00p/symbolica?rev=4d0a833eb8e059d1f95bdae5abed2559830b235f#4d0a833e)
  1054. 291.65 s > Checking statrs v0.16.1
  1055. 291.65 s > Checking momtrop v0.3.0
  1056. 291.65 s > Compiling pyo3-macros v0.28.3
  1057. 291.65 s > Checking gungraun v0.18.2
  1058. 291.65 s > Compiling pyo3-stub-gen-derive v0.17.2
  1059. 291.65 s > Checking pyo3-stub-gen v0.17.2
  1060. 291.65 s > Checking symbolica-utils v0.1.0 (/build/source/crates/symbolica-utils)
  1061. 291.65 s > Checking spenso-macros v0.3.2 (/build/source/crates/spenso-macros)
  1062. 291.65 s > Compiling gammaloop-workspace-hack v0.1.0 (/build/source/crates/gammaloop-workspace-hack)
  1063. 291.65 s > Checking linnet v0.17.0 (/build/source/crates/linnet)
  1064. 291.65 s > Checking spenso v0.6.0 (/build/source/crates/spenso)
  1065. 291.65 s > Checking linnet-py v0.1.0 (/build/source/crates/linnet-py)
  1066. 291.65 s > Checking linnest v0.1.0 (/build/source/crates/linnest)
  1067. 291.65 s > Checking idenso v0.3.0 (/build/source/crates/idenso)
  1068. 291.65 s > Checking gammaloop-tracing-filter v0.1.0 (/build/source/crates/gammaloop-tracing-filter)
  1069. 291.65 s > Checking spenso-hep-lib v0.1.7 (/build/source/crates/spenso-hep-lib)
  1070. 291.65 s > Checking spynso3 v0.1.2 (/build/source/crates/spynso3)
  1071. 291.65 s > error[E0624]: method `export_uv_forest_graph` is private
  1072. 291.65 s > --> tests/tests/uv.rs:3426:33
  1073. 291.65 s > |
  1074. 291.65 s > 3426 | let soft_export = integrand.export_uv_forest_graph(
  1075. 291.65 s > | ^^^^^^^^^^^^^^^^^^^^^^ private method
  1076. 291.65 s > |
  1077. 291.65 s > ::: crates/gammalooprs/src/uv/export.rs:125:5
  1078. 291.65 s > |
  1079. 291.65 s > 125 | / pub(crate) fn export_uv_forest_graph(
  1080. 291.65 s > 126 | | &self,
  1081. 291.65 s > 127 | | graph_id: usize,
  1082. 291.65 s > 128 | | orientation: Option<OrientationProjection<'_>>,
  1083. 291.65 s > 129 | | generation_settings: &GenerationSettings,
  1084. 291.65 s > 130 | | export_settings: &UVForestExportSettings,
  1085. 291.65 s > 131 | | ) -> Result<UVForestExport> {
  1086. 291.65 s > | |_______________________________- private method defined here
  1087. 291.65 s >
  1088. 291.65 s > error[E0624]: method `export_uv_forest_graph` is private
  1089. 291.65 s > --> tests/tests/uv.rs:3522:38
  1090. 291.65 s > |
  1091. 291.65 s > 3522 | let uv_export = uv_integrand.export_uv_forest_graph(
  1092. 291.65 s > | ^^^^^^^^^^^^^^^^^^^^^^ private method
  1093. 291.65 s > |
  1094. 291.65 s > ::: crates/gammalooprs/src/uv/export.rs:125:5
  1095. 291.65 s > |
  1096. 291.65 s > 125 | / pub(crate) fn export_uv_forest_graph(
  1097. 291.65 s > 126 | | &self,
  1098. 291.65 s > 127 | | graph_id: usize,
  1099. 291.65 s > 128 | | orientation: Option<OrientationProjection<'_>>,
  1100. 291.65 s > 129 | | generation_settings: &GenerationSettings,
  1101. 291.65 s > 130 | | export_settings: &UVForestExportSettings,
  1102. 291.65 s > 131 | | ) -> Result<UVForestExport> {
  1103. 291.65 s > | |_______________________________- private method defined here
  1104. 291.65 s >
  1105. 291.65 s > error[E0624]: method `export_uv_forest_graph` is private
  1106. 291.65 s > --> tests/tests/uv.rs:3936:44
  1107. 291.65 s > |
  1108. 291.65 s > 3936 | let export = integrand.export_uv_forest_graph(
  1109. 291.65 s > | ^^^^^^^^^^^^^^^^^^^^^^ private method
  1110. 291.65 s > |
  1111. 291.65 s > ::: crates/gammalooprs/src/uv/export.rs:125:5
  1112. 291.65 s > |
  1113. 291.65 s > 125 | / pub(crate) fn export_uv_forest_graph(
  1114. 291.65 s > 126 | | &self,
  1115. 291.65 s > 127 | | graph_id: usize,
  1116. 291.65 s > 128 | | orientation: Option<OrientationProjection<'_>>,
  1117. 291.65 s > 129 | | generation_settings: &GenerationSettings,
  1118. 291.65 s > 130 | | export_settings: &UVForestExportSettings,
  1119. 291.65 s > 131 | | ) -> Result<UVForestExport> {
  1120. 291.65 s > | |_______________________________- private method defined here
  1121. 291.65 s >
  1122. 291.65 s > error[E0624]: method `export_uv_forest_graph` is private
  1123. 291.65 s > --> tests/tests/uv.rs:4128:36
  1124. 291.65 s > |
  1125. 291.65 s > 4128 | let export = integrand.export_uv_forest_graph(
  1126. 291.65 s > | ^^^^^^^^^^^^^^^^^^^^^^ private method
  1127. 291.65 s > |
  1128. 291.65 s > ::: crates/gammalooprs/src/uv/export.rs:125:5
  1129. 291.65 s > |
  1130. 291.65 s > 125 | / pub(crate) fn export_uv_forest_graph(
  1131. 291.65 s > 126 | | &self,
  1132. 291.65 s > 127 | | graph_id: usize,
  1133. 291.65 s > 128 | | orientation: Option<OrientationProjection<'_>>,
  1134. 291.65 s > 129 | | generation_settings: &GenerationSettings,
  1135. 291.65 s > 130 | | export_settings: &UVForestExportSettings,
  1136. 291.65 s > 131 | | ) -> Result<UVForestExport> {
  1137. 291.65 s > | |_______________________________- private method defined here
  1138. 291.65 s >
  1139. 291.65 s > error[E0624]: method `export_uv_forest_graph` is private
  1140. 291.65 s > --> tests/tests/uv.rs:4335:36
  1141. 291.65 s > |
  1142. 291.65 s > 4335 | let export = integrand.export_uv_forest_graph(
  1143. 291.65 s > | ^^^^^^^^^^^^^^^^^^^^^^ private method
  1144. 291.65 s > |
  1145. 291.65 s > ::: crates/gammalooprs/src/uv/export.rs:125:5
  1146. 291.65 s > |
  1147. 291.65 s > 125 | / pub(crate) fn export_uv_forest_graph(
  1148. 291.65 s > 126 | | &self,
  1149. 291.65 s > 127 | | graph_id: usize,
  1150. 291.65 s > 128 | | orientation: Option<OrientationProjection<'_>>,
  1151. 291.65 s > 129 | | generation_settings: &GenerationSettings,
  1152. 291.65 s > 130 | | export_settings: &UVForestExportSettings,
  1153. 291.65 s > 131 | | ) -> Result<UVForestExport> {
  1154. 291.65 s > | |_______________________________- private method defined here
  1155. 291.65 s >
  1156. 291.65 s > error[E0061]: this method takes 5 arguments but 3 arguments were supplied
  1157. 291.65 s > --> tests/tests/uv.rs:4551:26
  1158. 291.65 s > |
  1159. 291.65 s > 4551 | parent_graph.cff(&parent_tree, &parent_cut, &OrientationPattern::default())?;
  1160. 291.65 s > | ^^^----------------------------------------------------------- two arguments of type `&three_dimensional_reps::generation::Generate3DExpressionOptions` and `Option<&symbolica::atom::Atom>` are missing
  1161. 291.65 s > |
  1162. 291.65 s > note: method defined here
  1163. 291.65 s > --> crates/gammalooprs/src/cff/mod.rs:755:12
  1164. 291.65 s > |
  1165. 291.65 s > 755 | pub fn cff<S: SubGraphLike + SubSetLike>(
  1166. 291.65 s > | ^^^
  1167. 291.65 s > help: provide the arguments
  1168. 291.65 s > |
  1169. 291.65 s > 4551 | parent_graph.cff(&parent_tree, &parent_cut, &OrientationPattern::default(), /* &three_dimensional_reps::generation::Generate3DExpressionOptions */, /* Option<&symbolica::atom::Atom> */)?;
  1170. 291.65 s > | ++++++++++++++++++++++++++++++++++++++++++++++++++++++++++++++++++++++++++++++++++++++++++++++++++++++++++++++
  1171. 291.65 s >
  1172. 291.65 s > error[E0616]: field `orientations` of struct `CFFTerm` is private
  1173. 291.65 s > --> tests/tests/uv.rs:4555:36
  1174. 291.65 s > |
  1175. 291.65 s > 4555 | .flat_map(|term| &term.orientations)
  1176. 291.65 s > | ^^^^^^^^^^^^ private field
  1177. 291.65 s >
  1178. 291.65 s > error[E0609]: no field `orientations` on type `&GeneratedThreeDExpression<Esurface, Hsurface>`
  1179. 291.65 s > --> tests/tests/uv.rs:4653:18
  1180. 291.65 s > |
  1181. 291.65 s > 4653 | .orientations
  1182. 291.65 s > | ^^^^^^^^^^^^ unknown field
  1183. 291.65 s > |
  1184. 291.65 s > = note: the full name for the type has been written to '/build/source/target/ci-optim/deps/uv-ae6ff038ef4b6f0a.long-type-12389030920437475506.txt'
  1185. 291.65 s > = note: consider using `--verbose` to print the full type name to the console
  1186. 291.65 s > help: one of the expressions' fields has a field of the same name
  1187. 291.65 s > |
  1188. 291.65 s > 4653 | .expression.orientations
  1189. 291.65 s > | +++++++++++
  1190. 291.65 s >
  1191. 291.65 s > error[E0624]: method `export_uv_forest_graph` is private
  1192. 291.65 s > --> tests/tests/uv.rs:4673:43
  1193. 291.65 s > |
  1194. 291.65 s > 4673 | let structural_forest = integrand.export_uv_forest_graph(
  1195. 291.65 s > | ^^^^^^^^^^^^^^^^^^^^^^ private method
  1196. 291.65 s > |
  1197. 291.65 s > ::: crates/gammalooprs/src/uv/export.rs:125:5
  1198. 291.65 s > |
  1199. 291.65 s > 125 | / pub(crate) fn export_uv_forest_graph(
  1200. 291.65 s > 126 | | &self,
  1201. 291.65 s > 127 | | graph_id: usize,
  1202. 291.65 s > 128 | | orientation: Option<OrientationProjection<'_>>,
  1203. 291.65 s > 129 | | generation_settings: &GenerationSettings,
  1204. 291.65 s > 130 | | export_settings: &UVForestExportSettings,
  1205. 291.65 s > 131 | | ) -> Result<UVForestExport> {
  1206. 291.65 s > | |_______________________________- private method defined here
  1207. 291.65 s >
  1208. 291.65 s > error[E0624]: method `export_uv_forest_graph` is private
  1209. 291.65 s > --> tests/tests/uv.rs:4897:43
  1210. 291.65 s > |
  1211. 291.65 s > 4897 | let structural_forest = integrand.export_uv_forest_graph(
  1212. 291.65 s > | ^^^^^^^^^^^^^^^^^^^^^^ private method
  1213. 291.65 s > |
  1214. 291.65 s > ::: crates/gammalooprs/src/uv/export.rs:125:5
  1215. 291.65 s > |
  1216. 291.65 s > 125 | / pub(crate) fn export_uv_forest_graph(
  1217. 291.65 s > 126 | | &self,
  1218. 291.65 s > 127 | | graph_id: usize,
  1219. 291.65 s > 128 | | orientation: Option<OrientationProjection<'_>>,
  1220. 291.65 s > 129 | | generation_settings: &GenerationSettings,
  1221. 291.65 s > 130 | | export_settings: &UVForestExportSettings,
  1222. 291.65 s > 131 | | ) -> Result<UVForestExport> {
  1223. 291.65 s > | |_______________________________- private method defined here
  1224. 291.65 s >
  1225. 291.65 s > error[E0624]: method `export_uv_forest_graph` is private
  1226. 291.65 s > --> tests/tests/uv.rs:5146:43
  1227. 291.65 s > |
  1228. 291.65 s > 5146 | let structural_forest = integrand.export_uv_forest_graph(
  1229. 291.65 s > | ^^^^^^^^^^^^^^^^^^^^^^ private method
  1230. 291.65 s > |
  1231. 291.65 s > ::: crates/gammalooprs/src/uv/export.rs:125:5
  1232. 291.65 s > |
  1233. 291.65 s > 125 | / pub(crate) fn export_uv_forest_graph(
  1234. 291.65 s > 126 | | &self,
  1235. 291.65 s > 127 | | graph_id: usize,
  1236. 291.65 s > 128 | | orientation: Option<OrientationProjection<'_>>,
  1237. 291.65 s > 129 | | generation_settings: &GenerationSettings,
  1238. 291.65 s > 130 | | export_settings: &UVForestExportSettings,
  1239. 291.65 s > 131 | | ) -> Result<UVForestExport> {
  1240. 291.65 s > | |_______________________________- private method defined here
  1241. 291.65 s >
  1242. 291.65 s > error[E0624]: method `export_uv_forest_graph` is private
  1243. 291.65 s > --> tests/tests/uv.rs:5161:41
  1244. 291.65 s > |
  1245. 291.65 s > 5161 | let computed_forest = integrand.export_uv_forest_graph(
  1246. 291.65 s > | ^^^^^^^^^^^^^^^^^^^^^^ private method
  1247. 291.65 s > |
  1248. 291.65 s > ::: crates/gammalooprs/src/uv/export.rs:125:5
  1249. 291.65 s > |
  1250. 291.65 s > 125 | / pub(crate) fn export_uv_forest_graph(
  1251. 291.65 s > 126 | | &self,
  1252. 291.65 s > 127 | | graph_id: usize,
  1253. 291.65 s > 128 | | orientation: Option<OrientationProjection<'_>>,
  1254. 291.65 s > 129 | | generation_settings: &GenerationSettings,
  1255. 291.65 s > 130 | | export_settings: &UVForestExportSettings,
  1256. 291.65 s > 131 | | ) -> Result<UVForestExport> {
  1257. 291.65 s > | |_______________________________- private method defined here
  1258. 291.65 s >
  1259. 291.65 s > error[E0624]: method `export_uv_forest_graph` is private
  1260. 291.65 s > --> tests/tests/uv.rs:5724:51
  1261. 291.65 s > |
  1262. 291.65 s > 5724 | let structural_forest = integrand.export_uv_forest_graph(
  1263. 291.65 s > | ^^^^^^^^^^^^^^^^^^^^^^ private method
  1264. 291.65 s > |
  1265. 291.65 s > ::: crates/gammalooprs/src/uv/export.rs:125:5
  1266. 291.65 s > |
  1267. 291.65 s > 125 | / pub(crate) fn export_uv_forest_graph(
  1268. 291.65 s > 126 | | &self,
  1269. 291.65 s > 127 | | graph_id: usize,
  1270. 291.65 s > 128 | | orientation: Option<OrientationProjection<'_>>,
  1271. 291.65 s > 129 | | generation_settings: &GenerationSettings,
  1272. 291.65 s > 130 | | export_settings: &UVForestExportSettings,
  1273. 291.65 s > 131 | | ) -> Result<UVForestExport> {
  1274. 291.65 s > | |_______________________________- private method defined here
  1275. 291.65 s >
  1276. 291.65 s > Some errors have detailed explanations: E0061, E0609, E0616, E0624.
  1277. 291.65 s > For more information about an error, try `rustc --explain E0061`.
  1278. 291.65 s > error: could not compile `gammaloop-integration-tests` (test "uv") due to 13 previous errors
  1279. 291.65 s > warning: build failed, waiting for other jobs to finish...
  1280. 291.65 s For full logs, run:
  1281. 291.65 s nix log /nix/store/yq41fja0qvn1pcayl6m3fb5q6zl3fd3g-gammaloop-workspace-check-0.1.0.drv
  1282. 291.68 s Build failed.