0.00 s
$ /nix/store/9ypz3flqsrl5xl495mm8h645gadjsxi1-coreutils-9.11/bin/timeout --kill-after=15s 7200s /nix/store/23zk8sgzamrbmj1fday15szf7f2279s8-nix-2.34.7/bin/nix --extra-experimental-features nix-command --extra-experimental-features flakes --log-format internal-json build --no-link --print-out-paths git+https://github.com/alphal00p/gammaloop?ref=codex%2Fdocs-manuals&rev=fa8ed9a02ca7dff8db2b623fcf9163af3051b0df&shallow=1#packages.x86_64-linux.crate-test-binaries-gammaloop-integration-tests --print-build-logs
4.46 s
6.26 s
Building /nix/store/7bvilb8f8jk96pxj7jzk23i0qicj2vy5-gammaloop-ci-test-binary-dependencies-b8cda0d438c96d4f-gammaloop-integration-tests-dev-dependency.toml.drv
6.75 s
Building /nix/store/ksam0pl7wd6c3vkhbr7kj8y42kw86gms-gammaloop-crate-test-binaries-gammaloop-integration-tests-b8cda0d438c96d4f-inputs.drv
6.82 s
[gammaloop-ci-test-binary-dependencies-b8cda0d438c96d4f-gammaloop-integration-tests-dev-dependency.toml:post-build] Uploading to the NixCI cache: /nix/store/2lfqmlw92swx4z82ikq7m59s1qqd8l2d-gammaloop-ci-test-binary-dependencies-b8cda0d438c96d4f-gammaloop-integration-tests-dev-dependency.toml
7.13 s
[gammaloop-ci-test-binary-dependencies-b8cda0d438c96d4f-gammaloop-integration-tests-dev-dependency.toml:post-build] warning: 'warn-short-path-literals' is deprecated, use 'lint-short-path-literals = ignore' instead
7.83 s
[gammaloop-ci-test-binary-dependencies-b8cda0d438c96d4f-gammaloop-integration-tests-dev-dependency.toml:post-build] copying 0 paths...
8.16 s
[gammaloop-ci-test-binary-dependencies-b8cda0d438c96d4f-gammaloop-integration-tests-dev-dependency.toml:post-build] warning: 'warn-short-path-literals' is deprecated, use 'lint-short-path-literals = ignore' instead
8.45 s
[gammaloop-ci-test-binary-dependencies-b8cda0d438c96d4f-gammaloop-integration-tests-dev-dependency.toml:post-build] copying 0 paths...
8.63 s
Uploaded gammaloop-ci-test-binary-dependencies-b8cda0d438c96d4f-gammaloop-integration-tests-dev-dependency.toml in 1.8s
8.63 s
Progress: 1 of 5 built (1 building)
8.63 s
Built gammaloop-ci-test-binary-dependencies-b8cda0d438c96d4f-gammaloop-integration-tests-dev-dependency.toml in 2.3s
20.32 s
[gammaloop-crate-test-binaries-gammaloop-integration-tests-b8cda0d438c96d4f-inputs:post-build] Uploading to the NixCI cache: /nix/store/3jv2y5in0rr1jv0hdb45595kih4n826m-gammaloop-crate-test-binaries-gammaloop-integration-tests-b8cda0d438c96d4f-inputs
20.69 s
[gammaloop-crate-test-binaries-gammaloop-integration-tests-b8cda0d438c96d4f-inputs:post-build] warning: 'warn-short-path-literals' is deprecated, use 'lint-short-path-literals = ignore' instead
20.78 s
[gammaloop-crate-test-binaries-gammaloop-integration-tests-b8cda0d438c96d4f-inputs:post-build] copying 1 paths...
20.78 s
[gammaloop-crate-test-binaries-gammaloop-integration-tests-b8cda0d438c96d4f-inputs:post-build] copying path '/nix/store/3jv2y5in0rr1jv0hdb45595kih4n826m-gammaloop-crate-test-binaries-gammaloop-integration-tests-b8cda0d438c96d4f-inputs' to 'https://cache.nix-ci.com'...
387.46 s
[gammaloop-crate-test-binaries-gammaloop-integration-tests-b8cda0d438c96d4f-inputs:post-build] warning: 'warn-short-path-literals' is deprecated, use 'lint-short-path-literals = ignore' instead
387.72 s
[gammaloop-crate-test-binaries-gammaloop-integration-tests-b8cda0d438c96d4f-inputs:post-build] copying 1 paths...
387.72 s
[gammaloop-crate-test-binaries-gammaloop-integration-tests-b8cda0d438c96d4f-inputs:post-build] copying path '/nix/store/ksam0pl7wd6c3vkhbr7kj8y42kw86gms-gammaloop-crate-test-binaries-gammaloop-integration-tests-b8cda0d438c96d4f-inputs.drv' to 'https://cache.nix-ci.com'...
387.87 s
Uploaded gammaloop-crate-test-binaries-gammaloop-integration-tests-b8cda0d438c96d4f-inputs in 6m07s
387.87 s
Progress: 2 of 5 built
387.87 s
Built gammaloop-crate-test-binaries-gammaloop-integration-tests-b8cda0d438c96d4f-inputs in 6m21s
387.95 s
Building /nix/store/jmdxlfvakb7hqqx0dbiq8qybml3didbp-gammaloop-crate-test-binaries-gammaloop-integration-tests-b8cda0d438c96d4f-deps-0.1.0.drv
388.02 s
[gammaloop-crate-test-binaries-gammaloop-integration-tests-b8cda0d438c96d4f-deps] Phase: unpackPhase
388.02 s
[gammaloop-crate-test-binaries-gammaloop-integration-tests-b8cda0d438c96d4f-deps] unpacking source archive /nix/store/s8h804zbj5xpi2ifcc945rxxavmvwxir-source
388.08 s
[gammaloop-crate-test-binaries-gammaloop-integration-tests-b8cda0d438c96d4f-deps] source root is source
388.10 s
[gammaloop-crate-test-binaries-gammaloop-integration-tests-b8cda0d438c96d4f-deps] Phase: patchPhase
388.18 s
[gammaloop-crate-test-binaries-gammaloop-integration-tests-b8cda0d438c96d4f-deps] Executing configureCargoCommonVars
388.18 s
[gammaloop-crate-test-binaries-gammaloop-integration-tests-b8cda0d438c96d4f-deps] copying cargo artifacts from /nix/store/3jv2y5in0rr1jv0hdb45595kih4n826m-gammaloop-crate-test-binaries-gammaloop-integration-tests-b8cda0d438c96d4f-inputs/target to target
388.18 s
[gammaloop-crate-test-binaries-gammaloop-integration-tests-b8cda0d438c96d4f-deps] will deep copy artifacts (instead of symlinking) as requested
389.53 s
[gammaloop-crate-test-binaries-gammaloop-integration-tests-b8cda0d438c96d4f-deps] Phase: updateAutotoolsGnuConfigScriptsPhase
389.56 s
[gammaloop-crate-test-binaries-gammaloop-integration-tests-b8cda0d438c96d4f-deps] Phase: configurePhase
389.57 s
[gammaloop-crate-test-binaries-gammaloop-integration-tests-b8cda0d438c96d4f-deps] will append /build/source/.cargo-home/config.toml with contents of /nix/store/8zq9ya5slh345hbylmsibxw827bi98w0-vendor-cargo-deps/config.toml
389.57 s
[gammaloop-crate-test-binaries-gammaloop-integration-tests-b8cda0d438c96d4f-deps] default configurePhase, nothing to do
389.57 s
[gammaloop-crate-test-binaries-gammaloop-integration-tests-b8cda0d438c96d4f-deps] Phase: buildPhase
389.58 s
[gammaloop-crate-test-binaries-gammaloop-integration-tests-b8cda0d438c96d4f-deps] +++ command cargo --version
389.58 s
[gammaloop-crate-test-binaries-gammaloop-integration-tests-b8cda0d438c96d4f-deps] cargo 1.97.0 (c980f4866 2026-06-30)
389.58 s
[gammaloop-crate-test-binaries-gammaloop-integration-tests-b8cda0d438c96d4f-deps] +++ command cargo test --profile ci-optim --no-run --offline -p gammaloop-integration-tests
390.00 s
[gammaloop-crate-test-binaries-gammaloop-integration-tests-b8cda0d438c96d4f-deps] Compiling gammaloop-integration-tests v0.1.0 (/build/source/tests)
390.51 s
[gammaloop-crate-test-binaries-gammaloop-integration-tests-b8cda0d438c96d4f-deps] error[E0624] : method `export_uv_forest_graph` is private
390.51 s
[gammaloop-crate-test-binaries-gammaloop-integration-tests-b8cda0d438c96d4f-deps] --> tests/tests/uv.rs:3426:33
390.51 s
[gammaloop-crate-test-binaries-gammaloop-integration-tests-b8cda0d438c96d4f-deps] |
390.51 s
[gammaloop-crate-test-binaries-gammaloop-integration-tests-b8cda0d438c96d4f-deps] 3426 | let soft_export = integrand.export_uv_forest_graph(
390.51 s
[gammaloop-crate-test-binaries-gammaloop-integration-tests-b8cda0d438c96d4f-deps] | ^^^^^^^^^^^^^^^^^^^^^^ private method
390.51 s
[gammaloop-crate-test-binaries-gammaloop-integration-tests-b8cda0d438c96d4f-deps] |
390.51 s
[gammaloop-crate-test-binaries-gammaloop-integration-tests-b8cda0d438c96d4f-deps] ::: crates/gammalooprs/src/uv/export.rs:125:5
390.51 s
[gammaloop-crate-test-binaries-gammaloop-integration-tests-b8cda0d438c96d4f-deps] |
390.51 s
[gammaloop-crate-test-binaries-gammaloop-integration-tests-b8cda0d438c96d4f-deps] 125 | / pub(crate) fn export_uv_forest_graph(
390.51 s
[gammaloop-crate-test-binaries-gammaloop-integration-tests-b8cda0d438c96d4f-deps] 126 | | &self,
390.51 s
[gammaloop-crate-test-binaries-gammaloop-integration-tests-b8cda0d438c96d4f-deps] 127 | | graph_id: usize,
390.51 s
[gammaloop-crate-test-binaries-gammaloop-integration-tests-b8cda0d438c96d4f-deps] 128 | | orientation: Option<OrientationProjection<'_>>,
390.51 s
[gammaloop-crate-test-binaries-gammaloop-integration-tests-b8cda0d438c96d4f-deps] 129 | | generation_settings: &GenerationSettings,
390.51 s
[gammaloop-crate-test-binaries-gammaloop-integration-tests-b8cda0d438c96d4f-deps] 130 | | export_settings: &UVForestExportSettings,
390.51 s
[gammaloop-crate-test-binaries-gammaloop-integration-tests-b8cda0d438c96d4f-deps] 131 | | ) -> Result<UVForestExport> {
390.51 s
[gammaloop-crate-test-binaries-gammaloop-integration-tests-b8cda0d438c96d4f-deps] | |_______________________________- private method defined here
390.51 s
[gammaloop-crate-test-binaries-gammaloop-integration-tests-b8cda0d438c96d4f-deps]
390.51 s
[gammaloop-crate-test-binaries-gammaloop-integration-tests-b8cda0d438c96d4f-deps] error[E0624] : method `export_uv_forest_graph` is private
390.51 s
[gammaloop-crate-test-binaries-gammaloop-integration-tests-b8cda0d438c96d4f-deps] --> tests/tests/uv.rs:3522:38
390.51 s
[gammaloop-crate-test-binaries-gammaloop-integration-tests-b8cda0d438c96d4f-deps] |
390.51 s
[gammaloop-crate-test-binaries-gammaloop-integration-tests-b8cda0d438c96d4f-deps] 3522 | let uv_export = uv_integrand.export_uv_forest_graph(
390.51 s
[gammaloop-crate-test-binaries-gammaloop-integration-tests-b8cda0d438c96d4f-deps] | ^^^^^^^^^^^^^^^^^^^^^^ private method
390.51 s
[gammaloop-crate-test-binaries-gammaloop-integration-tests-b8cda0d438c96d4f-deps] |
390.51 s
[gammaloop-crate-test-binaries-gammaloop-integration-tests-b8cda0d438c96d4f-deps] ::: crates/gammalooprs/src/uv/export.rs:125:5
390.51 s
[gammaloop-crate-test-binaries-gammaloop-integration-tests-b8cda0d438c96d4f-deps] |
390.51 s
[gammaloop-crate-test-binaries-gammaloop-integration-tests-b8cda0d438c96d4f-deps] 125 | / pub(crate) fn export_uv_forest_graph(
390.51 s
[gammaloop-crate-test-binaries-gammaloop-integration-tests-b8cda0d438c96d4f-deps] 126 | | &self,
390.51 s
[gammaloop-crate-test-binaries-gammaloop-integration-tests-b8cda0d438c96d4f-deps] 127 | | graph_id: usize,
390.51 s
[gammaloop-crate-test-binaries-gammaloop-integration-tests-b8cda0d438c96d4f-deps] 128 | | orientation: Option<OrientationProjection<'_>>,
390.51 s
[gammaloop-crate-test-binaries-gammaloop-integration-tests-b8cda0d438c96d4f-deps] 129 | | generation_settings: &GenerationSettings,
390.51 s
[gammaloop-crate-test-binaries-gammaloop-integration-tests-b8cda0d438c96d4f-deps] 130 | | export_settings: &UVForestExportSettings,
390.51 s
[gammaloop-crate-test-binaries-gammaloop-integration-tests-b8cda0d438c96d4f-deps] 131 | | ) -> Result<UVForestExport> {
390.51 s
[gammaloop-crate-test-binaries-gammaloop-integration-tests-b8cda0d438c96d4f-deps] | |_______________________________- private method defined here
390.51 s
[gammaloop-crate-test-binaries-gammaloop-integration-tests-b8cda0d438c96d4f-deps]
390.54 s
[gammaloop-crate-test-binaries-gammaloop-integration-tests-b8cda0d438c96d4f-deps] error[E0624] : method `export_uv_forest_graph` is private
390.54 s
[gammaloop-crate-test-binaries-gammaloop-integration-tests-b8cda0d438c96d4f-deps] --> tests/tests/uv.rs:3936:44
390.54 s
[gammaloop-crate-test-binaries-gammaloop-integration-tests-b8cda0d438c96d4f-deps] |
390.54 s
[gammaloop-crate-test-binaries-gammaloop-integration-tests-b8cda0d438c96d4f-deps] 3936 | let export = integrand.export_uv_forest_graph(
390.54 s
[gammaloop-crate-test-binaries-gammaloop-integration-tests-b8cda0d438c96d4f-deps] | ^^^^^^^^^^^^^^^^^^^^^^ private method
390.54 s
[gammaloop-crate-test-binaries-gammaloop-integration-tests-b8cda0d438c96d4f-deps] |
390.54 s
[gammaloop-crate-test-binaries-gammaloop-integration-tests-b8cda0d438c96d4f-deps] ::: crates/gammalooprs/src/uv/export.rs:125:5
390.54 s
[gammaloop-crate-test-binaries-gammaloop-integration-tests-b8cda0d438c96d4f-deps] |
390.54 s
[gammaloop-crate-test-binaries-gammaloop-integration-tests-b8cda0d438c96d4f-deps] 125 | / pub(crate) fn export_uv_forest_graph(
390.54 s
[gammaloop-crate-test-binaries-gammaloop-integration-tests-b8cda0d438c96d4f-deps] 126 | | &self,
390.54 s
[gammaloop-crate-test-binaries-gammaloop-integration-tests-b8cda0d438c96d4f-deps] 127 | | graph_id: usize,
390.54 s
[gammaloop-crate-test-binaries-gammaloop-integration-tests-b8cda0d438c96d4f-deps] 128 | | orientation: Option<OrientationProjection<'_>>,
390.54 s
[gammaloop-crate-test-binaries-gammaloop-integration-tests-b8cda0d438c96d4f-deps] 129 | | generation_settings: &GenerationSettings,
390.54 s
[gammaloop-crate-test-binaries-gammaloop-integration-tests-b8cda0d438c96d4f-deps] 130 | | export_settings: &UVForestExportSettings,
390.54 s
[gammaloop-crate-test-binaries-gammaloop-integration-tests-b8cda0d438c96d4f-deps] 131 | | ) -> Result<UVForestExport> {
390.54 s
[gammaloop-crate-test-binaries-gammaloop-integration-tests-b8cda0d438c96d4f-deps] | |_______________________________- private method defined here
390.54 s
[gammaloop-crate-test-binaries-gammaloop-integration-tests-b8cda0d438c96d4f-deps]
390.55 s
[gammaloop-crate-test-binaries-gammaloop-integration-tests-b8cda0d438c96d4f-deps] error[E0624] : method `export_uv_forest_graph` is private
390.55 s
[gammaloop-crate-test-binaries-gammaloop-integration-tests-b8cda0d438c96d4f-deps] --> tests/tests/uv.rs:4128:36
390.55 s
[gammaloop-crate-test-binaries-gammaloop-integration-tests-b8cda0d438c96d4f-deps] |
390.55 s
[gammaloop-crate-test-binaries-gammaloop-integration-tests-b8cda0d438c96d4f-deps] 4128 | let export = integrand.export_uv_forest_graph(
390.55 s
[gammaloop-crate-test-binaries-gammaloop-integration-tests-b8cda0d438c96d4f-deps] | ^^^^^^^^^^^^^^^^^^^^^^ private method
390.55 s
[gammaloop-crate-test-binaries-gammaloop-integration-tests-b8cda0d438c96d4f-deps] |
390.55 s
[gammaloop-crate-test-binaries-gammaloop-integration-tests-b8cda0d438c96d4f-deps] ::: crates/gammalooprs/src/uv/export.rs:125:5
390.55 s
[gammaloop-crate-test-binaries-gammaloop-integration-tests-b8cda0d438c96d4f-deps] |
390.55 s
[gammaloop-crate-test-binaries-gammaloop-integration-tests-b8cda0d438c96d4f-deps] 125 | / pub(crate) fn export_uv_forest_graph(
390.55 s
[gammaloop-crate-test-binaries-gammaloop-integration-tests-b8cda0d438c96d4f-deps] 126 | | &self,
390.55 s
[gammaloop-crate-test-binaries-gammaloop-integration-tests-b8cda0d438c96d4f-deps] 127 | | graph_id: usize,
390.55 s
[gammaloop-crate-test-binaries-gammaloop-integration-tests-b8cda0d438c96d4f-deps] 128 | | orientation: Option<OrientationProjection<'_>>,
390.55 s
[gammaloop-crate-test-binaries-gammaloop-integration-tests-b8cda0d438c96d4f-deps] 129 | | generation_settings: &GenerationSettings,
390.55 s
[gammaloop-crate-test-binaries-gammaloop-integration-tests-b8cda0d438c96d4f-deps] 130 | | export_settings: &UVForestExportSettings,
390.55 s
[gammaloop-crate-test-binaries-gammaloop-integration-tests-b8cda0d438c96d4f-deps] 131 | | ) -> Result<UVForestExport> {
390.55 s
[gammaloop-crate-test-binaries-gammaloop-integration-tests-b8cda0d438c96d4f-deps] | |_______________________________- private method defined here
390.55 s
[gammaloop-crate-test-binaries-gammaloop-integration-tests-b8cda0d438c96d4f-deps]
390.57 s
[gammaloop-crate-test-binaries-gammaloop-integration-tests-b8cda0d438c96d4f-deps] error[E0624] : method `export_uv_forest_graph` is private
390.57 s
[gammaloop-crate-test-binaries-gammaloop-integration-tests-b8cda0d438c96d4f-deps] --> tests/tests/uv.rs:4335:36
390.57 s
[gammaloop-crate-test-binaries-gammaloop-integration-tests-b8cda0d438c96d4f-deps] |
390.57 s
[gammaloop-crate-test-binaries-gammaloop-integration-tests-b8cda0d438c96d4f-deps] 4335 | let export = integrand.export_uv_forest_graph(
390.57 s
[gammaloop-crate-test-binaries-gammaloop-integration-tests-b8cda0d438c96d4f-deps] | ^^^^^^^^^^^^^^^^^^^^^^ private method
390.57 s
[gammaloop-crate-test-binaries-gammaloop-integration-tests-b8cda0d438c96d4f-deps] |
390.57 s
[gammaloop-crate-test-binaries-gammaloop-integration-tests-b8cda0d438c96d4f-deps] ::: crates/gammalooprs/src/uv/export.rs:125:5
390.57 s
[gammaloop-crate-test-binaries-gammaloop-integration-tests-b8cda0d438c96d4f-deps] |
390.57 s
[gammaloop-crate-test-binaries-gammaloop-integration-tests-b8cda0d438c96d4f-deps] 125 | / pub(crate) fn export_uv_forest_graph(
390.57 s
[gammaloop-crate-test-binaries-gammaloop-integration-tests-b8cda0d438c96d4f-deps] 126 | | &self,
390.57 s
[gammaloop-crate-test-binaries-gammaloop-integration-tests-b8cda0d438c96d4f-deps] 127 | | graph_id: usize,
390.57 s
[gammaloop-crate-test-binaries-gammaloop-integration-tests-b8cda0d438c96d4f-deps] 128 | | orientation: Option<OrientationProjection<'_>>,
390.57 s
[gammaloop-crate-test-binaries-gammaloop-integration-tests-b8cda0d438c96d4f-deps] 129 | | generation_settings: &GenerationSettings,
390.57 s
[gammaloop-crate-test-binaries-gammaloop-integration-tests-b8cda0d438c96d4f-deps] 130 | | export_settings: &UVForestExportSettings,
390.57 s
[gammaloop-crate-test-binaries-gammaloop-integration-tests-b8cda0d438c96d4f-deps] 131 | | ) -> Result<UVForestExport> {
390.57 s
[gammaloop-crate-test-binaries-gammaloop-integration-tests-b8cda0d438c96d4f-deps] | |_______________________________- private method defined here
390.57 s
[gammaloop-crate-test-binaries-gammaloop-integration-tests-b8cda0d438c96d4f-deps]
390.69 s
[gammaloop-crate-test-binaries-gammaloop-integration-tests-b8cda0d438c96d4f-deps] error[E0061] : this method takes 5 arguments but 3 arguments were supplied
390.69 s
[gammaloop-crate-test-binaries-gammaloop-integration-tests-b8cda0d438c96d4f-deps] --> tests/tests/uv.rs:4551:26
390.69 s
[gammaloop-crate-test-binaries-gammaloop-integration-tests-b8cda0d438c96d4f-deps] |
390.69 s
[gammaloop-crate-test-binaries-gammaloop-integration-tests-b8cda0d438c96d4f-deps] 4551 | parent_graph.cff(&parent_tree, &parent_cut, &OrientationPattern::default())?;
390.69 s
[gammaloop-crate-test-binaries-gammaloop-integration-tests-b8cda0d438c96d4f-deps] | ^^^ ----------------------------------------------------------- two arguments of type `&three_dimensional_reps::generation::Generate3DExpressionOptions` and `Option<&symbolica::atom::Atom>` are missing
390.69 s
[gammaloop-crate-test-binaries-gammaloop-integration-tests-b8cda0d438c96d4f-deps] |
390.69 s
[gammaloop-crate-test-binaries-gammaloop-integration-tests-b8cda0d438c96d4f-deps] note : method defined here
390.69 s
[gammaloop-crate-test-binaries-gammaloop-integration-tests-b8cda0d438c96d4f-deps] --> crates/gammalooprs/src/cff/mod.rs:755:12
390.69 s
[gammaloop-crate-test-binaries-gammaloop-integration-tests-b8cda0d438c96d4f-deps] |
390.69 s
[gammaloop-crate-test-binaries-gammaloop-integration-tests-b8cda0d438c96d4f-deps] 755 | pub fn cff<S: SubGraphLike + SubSetLike>(
390.69 s
[gammaloop-crate-test-binaries-gammaloop-integration-tests-b8cda0d438c96d4f-deps] | ^^^
390.69 s
[gammaloop-crate-test-binaries-gammaloop-integration-tests-b8cda0d438c96d4f-deps] help : provide the arguments
390.69 s
[gammaloop-crate-test-binaries-gammaloop-integration-tests-b8cda0d438c96d4f-deps] |
390.69 s
[gammaloop-crate-test-binaries-gammaloop-integration-tests-b8cda0d438c96d4f-deps] 4551 | parent_graph.cff(&parent_tree, &parent_cut, &OrientationPattern::default(), /* &three_dimensional_reps::generation::Generate3DExpressionOptions */, /* Option<&symbolica::atom::Atom> */ )?;
390.69 s
[gammaloop-crate-test-binaries-gammaloop-integration-tests-b8cda0d438c96d4f-deps] | ++++++++++++++++++++++++++++++++++++++++++++++++++++++++++++++++++++++++++++++++++++++++++++++++++++++++++++++
390.69 s
[gammaloop-crate-test-binaries-gammaloop-integration-tests-b8cda0d438c96d4f-deps]
390.69 s
[gammaloop-crate-test-binaries-gammaloop-integration-tests-b8cda0d438c96d4f-deps] error[E0616] : field `orientations` of struct `CFFTerm` is private
390.70 s
[gammaloop-crate-test-binaries-gammaloop-integration-tests-b8cda0d438c96d4f-deps] --> tests/tests/uv.rs:4555:36
390.70 s
[gammaloop-crate-test-binaries-gammaloop-integration-tests-b8cda0d438c96d4f-deps] |
390.70 s
[gammaloop-crate-test-binaries-gammaloop-integration-tests-b8cda0d438c96d4f-deps] 4555 | .flat_map(|term| &term.orientations)
390.70 s
[gammaloop-crate-test-binaries-gammaloop-integration-tests-b8cda0d438c96d4f-deps] | ^^^^^^^^^^^^ private field
390.70 s
[gammaloop-crate-test-binaries-gammaloop-integration-tests-b8cda0d438c96d4f-deps]
390.75 s
[gammaloop-crate-test-binaries-gammaloop-integration-tests-b8cda0d438c96d4f-deps] error[E0609] : no field `orientations` on type `&GeneratedThreeDExpression<Esurface, Hsurface>`
390.75 s
[gammaloop-crate-test-binaries-gammaloop-integration-tests-b8cda0d438c96d4f-deps] --> tests/tests/uv.rs:4653:18
390.75 s
[gammaloop-crate-test-binaries-gammaloop-integration-tests-b8cda0d438c96d4f-deps] |
390.75 s
[gammaloop-crate-test-binaries-gammaloop-integration-tests-b8cda0d438c96d4f-deps] 4653 | .orientations
390.75 s
[gammaloop-crate-test-binaries-gammaloop-integration-tests-b8cda0d438c96d4f-deps] | ^^^^^^^^^^^^ unknown field
390.75 s
[gammaloop-crate-test-binaries-gammaloop-integration-tests-b8cda0d438c96d4f-deps] |
390.75 s
[gammaloop-crate-test-binaries-gammaloop-integration-tests-b8cda0d438c96d4f-deps] = note : the full name for the type has been written to '/build/source/target/ci-optim/deps/uv-ce4ce797f04de65a.long-type-18114926718083020756.txt'
390.75 s
[gammaloop-crate-test-binaries-gammaloop-integration-tests-b8cda0d438c96d4f-deps] = note : consider using `--verbose` to print the full type name to the console
390.75 s
[gammaloop-crate-test-binaries-gammaloop-integration-tests-b8cda0d438c96d4f-deps] help : one of the expressions' fields has a field of the same name
390.75 s
[gammaloop-crate-test-binaries-gammaloop-integration-tests-b8cda0d438c96d4f-deps] |
390.75 s
[gammaloop-crate-test-binaries-gammaloop-integration-tests-b8cda0d438c96d4f-deps] 4653 | .expression. orientations
390.75 s
[gammaloop-crate-test-binaries-gammaloop-integration-tests-b8cda0d438c96d4f-deps] | +++++++++++
390.75 s
[gammaloop-crate-test-binaries-gammaloop-integration-tests-b8cda0d438c96d4f-deps]
390.75 s
[gammaloop-crate-test-binaries-gammaloop-integration-tests-b8cda0d438c96d4f-deps] error[E0624] : method `export_uv_forest_graph` is private
390.75 s
[gammaloop-crate-test-binaries-gammaloop-integration-tests-b8cda0d438c96d4f-deps] --> tests/tests/uv.rs:4673:43
390.75 s
[gammaloop-crate-test-binaries-gammaloop-integration-tests-b8cda0d438c96d4f-deps] |
390.75 s
[gammaloop-crate-test-binaries-gammaloop-integration-tests-b8cda0d438c96d4f-deps] 4673 | let structural_forest = integrand.export_uv_forest_graph(
390.75 s
[gammaloop-crate-test-binaries-gammaloop-integration-tests-b8cda0d438c96d4f-deps] | ^^^^^^^^^^^^^^^^^^^^^^ private method
390.75 s
[gammaloop-crate-test-binaries-gammaloop-integration-tests-b8cda0d438c96d4f-deps] |
390.75 s
[gammaloop-crate-test-binaries-gammaloop-integration-tests-b8cda0d438c96d4f-deps] ::: crates/gammalooprs/src/uv/export.rs:125:5
390.75 s
[gammaloop-crate-test-binaries-gammaloop-integration-tests-b8cda0d438c96d4f-deps] |
390.75 s
[gammaloop-crate-test-binaries-gammaloop-integration-tests-b8cda0d438c96d4f-deps] 125 | / pub(crate) fn export_uv_forest_graph(
390.75 s
[gammaloop-crate-test-binaries-gammaloop-integration-tests-b8cda0d438c96d4f-deps] 126 | | &self,
390.75 s
[gammaloop-crate-test-binaries-gammaloop-integration-tests-b8cda0d438c96d4f-deps] 127 | | graph_id: usize,
390.75 s
[gammaloop-crate-test-binaries-gammaloop-integration-tests-b8cda0d438c96d4f-deps] 128 | | orientation: Option<OrientationProjection<'_>>,
390.75 s
[gammaloop-crate-test-binaries-gammaloop-integration-tests-b8cda0d438c96d4f-deps] 129 | | generation_settings: &GenerationSettings,
390.75 s
[gammaloop-crate-test-binaries-gammaloop-integration-tests-b8cda0d438c96d4f-deps] 130 | | export_settings: &UVForestExportSettings,
390.75 s
[gammaloop-crate-test-binaries-gammaloop-integration-tests-b8cda0d438c96d4f-deps] 131 | | ) -> Result<UVForestExport> {
390.75 s
[gammaloop-crate-test-binaries-gammaloop-integration-tests-b8cda0d438c96d4f-deps] | |_______________________________- private method defined here
390.75 s
[gammaloop-crate-test-binaries-gammaloop-integration-tests-b8cda0d438c96d4f-deps]
390.77 s
[gammaloop-crate-test-binaries-gammaloop-integration-tests-b8cda0d438c96d4f-deps] error[E0624] : method `export_uv_forest_graph` is private
390.77 s
[gammaloop-crate-test-binaries-gammaloop-integration-tests-b8cda0d438c96d4f-deps] --> tests/tests/uv.rs:4897:43
390.77 s
[gammaloop-crate-test-binaries-gammaloop-integration-tests-b8cda0d438c96d4f-deps] |
390.77 s
[gammaloop-crate-test-binaries-gammaloop-integration-tests-b8cda0d438c96d4f-deps] 4897 | let structural_forest = integrand.export_uv_forest_graph(
390.77 s
[gammaloop-crate-test-binaries-gammaloop-integration-tests-b8cda0d438c96d4f-deps] | ^^^^^^^^^^^^^^^^^^^^^^ private method
390.77 s
[gammaloop-crate-test-binaries-gammaloop-integration-tests-b8cda0d438c96d4f-deps] |
390.77 s
[gammaloop-crate-test-binaries-gammaloop-integration-tests-b8cda0d438c96d4f-deps] ::: crates/gammalooprs/src/uv/export.rs:125:5
390.77 s
[gammaloop-crate-test-binaries-gammaloop-integration-tests-b8cda0d438c96d4f-deps] |
390.77 s
[gammaloop-crate-test-binaries-gammaloop-integration-tests-b8cda0d438c96d4f-deps] 125 | / pub(crate) fn export_uv_forest_graph(
390.77 s
[gammaloop-crate-test-binaries-gammaloop-integration-tests-b8cda0d438c96d4f-deps] 126 | | &self,
390.77 s
[gammaloop-crate-test-binaries-gammaloop-integration-tests-b8cda0d438c96d4f-deps] 127 | | graph_id: usize,
390.77 s
[gammaloop-crate-test-binaries-gammaloop-integration-tests-b8cda0d438c96d4f-deps] 128 | | orientation: Option<OrientationProjection<'_>>,
390.77 s
[gammaloop-crate-test-binaries-gammaloop-integration-tests-b8cda0d438c96d4f-deps] 129 | | generation_settings: &GenerationSettings,
390.77 s
[gammaloop-crate-test-binaries-gammaloop-integration-tests-b8cda0d438c96d4f-deps] 130 | | export_settings: &UVForestExportSettings,
390.77 s
[gammaloop-crate-test-binaries-gammaloop-integration-tests-b8cda0d438c96d4f-deps] 131 | | ) -> Result<UVForestExport> {
390.77 s
[gammaloop-crate-test-binaries-gammaloop-integration-tests-b8cda0d438c96d4f-deps] | |_______________________________- private method defined here
390.77 s
[gammaloop-crate-test-binaries-gammaloop-integration-tests-b8cda0d438c96d4f-deps]
390.80 s
[gammaloop-crate-test-binaries-gammaloop-integration-tests-b8cda0d438c96d4f-deps] error[E0624] : method `export_uv_forest_graph` is private
390.80 s
[gammaloop-crate-test-binaries-gammaloop-integration-tests-b8cda0d438c96d4f-deps] --> tests/tests/uv.rs:5146:43
390.80 s
[gammaloop-crate-test-binaries-gammaloop-integration-tests-b8cda0d438c96d4f-deps] |
390.80 s
[gammaloop-crate-test-binaries-gammaloop-integration-tests-b8cda0d438c96d4f-deps] 5146 | let structural_forest = integrand.export_uv_forest_graph(
390.80 s
[gammaloop-crate-test-binaries-gammaloop-integration-tests-b8cda0d438c96d4f-deps] | ^^^^^^^^^^^^^^^^^^^^^^ private method
390.80 s
[gammaloop-crate-test-binaries-gammaloop-integration-tests-b8cda0d438c96d4f-deps] |
390.80 s
[gammaloop-crate-test-binaries-gammaloop-integration-tests-b8cda0d438c96d4f-deps] ::: crates/gammalooprs/src/uv/export.rs:125:5
390.80 s
[gammaloop-crate-test-binaries-gammaloop-integration-tests-b8cda0d438c96d4f-deps] |
390.80 s
[gammaloop-crate-test-binaries-gammaloop-integration-tests-b8cda0d438c96d4f-deps] 125 | / pub(crate) fn export_uv_forest_graph(
390.80 s
[gammaloop-crate-test-binaries-gammaloop-integration-tests-b8cda0d438c96d4f-deps] 126 | | &self,
390.80 s
[gammaloop-crate-test-binaries-gammaloop-integration-tests-b8cda0d438c96d4f-deps] 127 | | graph_id: usize,
390.80 s
[gammaloop-crate-test-binaries-gammaloop-integration-tests-b8cda0d438c96d4f-deps] 128 | | orientation: Option<OrientationProjection<'_>>,
390.80 s
[gammaloop-crate-test-binaries-gammaloop-integration-tests-b8cda0d438c96d4f-deps] 129 | | generation_settings: &GenerationSettings,
390.80 s
[gammaloop-crate-test-binaries-gammaloop-integration-tests-b8cda0d438c96d4f-deps] 130 | | export_settings: &UVForestExportSettings,
390.80 s
[gammaloop-crate-test-binaries-gammaloop-integration-tests-b8cda0d438c96d4f-deps] 131 | | ) -> Result<UVForestExport> {
390.80 s
[gammaloop-crate-test-binaries-gammaloop-integration-tests-b8cda0d438c96d4f-deps] | |_______________________________- private method defined here
390.80 s
[gammaloop-crate-test-binaries-gammaloop-integration-tests-b8cda0d438c96d4f-deps]
390.80 s
[gammaloop-crate-test-binaries-gammaloop-integration-tests-b8cda0d438c96d4f-deps] error[E0624] : method `export_uv_forest_graph` is private
390.80 s
[gammaloop-crate-test-binaries-gammaloop-integration-tests-b8cda0d438c96d4f-deps] --> tests/tests/uv.rs:5161:41
390.80 s
[gammaloop-crate-test-binaries-gammaloop-integration-tests-b8cda0d438c96d4f-deps] |
390.80 s
[gammaloop-crate-test-binaries-gammaloop-integration-tests-b8cda0d438c96d4f-deps] 5161 | let computed_forest = integrand.export_uv_forest_graph(
390.80 s
[gammaloop-crate-test-binaries-gammaloop-integration-tests-b8cda0d438c96d4f-deps] | ^^^^^^^^^^^^^^^^^^^^^^ private method
390.80 s
[gammaloop-crate-test-binaries-gammaloop-integration-tests-b8cda0d438c96d4f-deps] |
390.80 s
[gammaloop-crate-test-binaries-gammaloop-integration-tests-b8cda0d438c96d4f-deps] ::: crates/gammalooprs/src/uv/export.rs:125:5
390.80 s
[gammaloop-crate-test-binaries-gammaloop-integration-tests-b8cda0d438c96d4f-deps] |
390.80 s
[gammaloop-crate-test-binaries-gammaloop-integration-tests-b8cda0d438c96d4f-deps] 125 | / pub(crate) fn export_uv_forest_graph(
390.80 s
[gammaloop-crate-test-binaries-gammaloop-integration-tests-b8cda0d438c96d4f-deps] 126 | | &self,
390.80 s
[gammaloop-crate-test-binaries-gammaloop-integration-tests-b8cda0d438c96d4f-deps] 127 | | graph_id: usize,
390.80 s
[gammaloop-crate-test-binaries-gammaloop-integration-tests-b8cda0d438c96d4f-deps] 128 | | orientation: Option<OrientationProjection<'_>>,
390.80 s
[gammaloop-crate-test-binaries-gammaloop-integration-tests-b8cda0d438c96d4f-deps] 129 | | generation_settings: &GenerationSettings,
390.80 s
[gammaloop-crate-test-binaries-gammaloop-integration-tests-b8cda0d438c96d4f-deps] 130 | | export_settings: &UVForestExportSettings,
390.80 s
[gammaloop-crate-test-binaries-gammaloop-integration-tests-b8cda0d438c96d4f-deps] 131 | | ) -> Result<UVForestExport> {
390.80 s
[gammaloop-crate-test-binaries-gammaloop-integration-tests-b8cda0d438c96d4f-deps] | |_______________________________- private method defined here
390.80 s
[gammaloop-crate-test-binaries-gammaloop-integration-tests-b8cda0d438c96d4f-deps]
390.93 s
[gammaloop-crate-test-binaries-gammaloop-integration-tests-b8cda0d438c96d4f-deps] error[E0624] : method `export_uv_forest_graph` is private
390.93 s
[gammaloop-crate-test-binaries-gammaloop-integration-tests-b8cda0d438c96d4f-deps] --> tests/tests/uv.rs:5724:51
390.93 s
[gammaloop-crate-test-binaries-gammaloop-integration-tests-b8cda0d438c96d4f-deps] |
390.93 s
[gammaloop-crate-test-binaries-gammaloop-integration-tests-b8cda0d438c96d4f-deps] 5724 | let structural_forest = integrand.export_uv_forest_graph(
390.93 s
[gammaloop-crate-test-binaries-gammaloop-integration-tests-b8cda0d438c96d4f-deps] | ^^^^^^^^^^^^^^^^^^^^^^ private method
390.93 s
[gammaloop-crate-test-binaries-gammaloop-integration-tests-b8cda0d438c96d4f-deps] |
390.93 s
[gammaloop-crate-test-binaries-gammaloop-integration-tests-b8cda0d438c96d4f-deps] ::: crates/gammalooprs/src/uv/export.rs:125:5
390.93 s
[gammaloop-crate-test-binaries-gammaloop-integration-tests-b8cda0d438c96d4f-deps] |
390.93 s
[gammaloop-crate-test-binaries-gammaloop-integration-tests-b8cda0d438c96d4f-deps] 125 | / pub(crate) fn export_uv_forest_graph(
390.93 s
[gammaloop-crate-test-binaries-gammaloop-integration-tests-b8cda0d438c96d4f-deps] 126 | | &self,
390.93 s
[gammaloop-crate-test-binaries-gammaloop-integration-tests-b8cda0d438c96d4f-deps] 127 | | graph_id: usize,
390.93 s
[gammaloop-crate-test-binaries-gammaloop-integration-tests-b8cda0d438c96d4f-deps] 128 | | orientation: Option<OrientationProjection<'_>>,
390.93 s
[gammaloop-crate-test-binaries-gammaloop-integration-tests-b8cda0d438c96d4f-deps] 129 | | generation_settings: &GenerationSettings,
390.93 s
[gammaloop-crate-test-binaries-gammaloop-integration-tests-b8cda0d438c96d4f-deps] 130 | | export_settings: &UVForestExportSettings,
390.93 s
[gammaloop-crate-test-binaries-gammaloop-integration-tests-b8cda0d438c96d4f-deps] 131 | | ) -> Result<UVForestExport> {
390.93 s
[gammaloop-crate-test-binaries-gammaloop-integration-tests-b8cda0d438c96d4f-deps] | |_______________________________- private method defined here
390.93 s
[gammaloop-crate-test-binaries-gammaloop-integration-tests-b8cda0d438c96d4f-deps]
391.21 s
[gammaloop-crate-test-binaries-gammaloop-integration-tests-b8cda0d438c96d4f-deps] Some errors have detailed explanations: E0061, E0609, E0616, E0624.
391.21 s
[gammaloop-crate-test-binaries-gammaloop-integration-tests-b8cda0d438c96d4f-deps] For more information about an error, try `rustc --explain E0061`.
391.23 s
[gammaloop-crate-test-binaries-gammaloop-integration-tests-b8cda0d438c96d4f-deps] error : could not compile `gammaloop-integration-tests` (test "uv") due to 13 previous errors
391.23 s
[gammaloop-crate-test-binaries-gammaloop-integration-tests-b8cda0d438c96d4f-deps] warning : build failed, waiting for other jobs to finish...
497.87 s
Progress: 2 of 4 built (1 failed)
497.87 s
Failed to build gammaloop-crate-test-binaries-gammaloop-integration-tests-b8cda0d438c96d4f-deps after 1m49s
497.88 s
error: Cannot build '/nix/store/jmdxlfvakb7hqqx0dbiq8qybml3didbp-gammaloop-crate-test-binaries-gammaloop-integration-tests-b8cda0d438c96d4f-deps-0.1.0.drv '.
497.88 s
Reason: builder failed with exit code 101 .
497.88 s
Output paths:
497.88 s
/nix/store/z7fnxfqj0k797i8c7vpay5bxg9nbn8zm-gammaloop-crate-test-binaries-gammaloop-integration-tests-b8cda0d438c96d4f-deps-0.1.0
497.88 s
Last 225 log lines:
497.88 s
> Running phase: unpackPhase
497.88 s
> unpacking source archive /nix/store/s8h804zbj5xpi2ifcc945rxxavmvwxir-source
497.88 s
> source root is source
497.88 s
> Running phase: patchPhase
497.88 s
> Executing configureCargoCommonVars
497.88 s
> copying cargo artifacts from /nix/store/3jv2y5in0rr1jv0hdb45595kih4n826m-gammaloop-crate-test-binaries-gammaloop-integration-tests-b8cda0d438c96d4f-inputs/target to target
497.88 s
> will deep copy artifacts (instead of symlinking) as requested
497.88 s
> Running phase: updateAutotoolsGnuConfigScriptsPhase
497.88 s
> Running phase: configurePhase
497.88 s
> will append /build/source/.cargo-home/config.toml with contents of /nix/store/8zq9ya5slh345hbylmsibxw827bi98w0-vendor-cargo-deps/config.toml
497.88 s
> default configurePhase, nothing to do
497.88 s
> Running phase: buildPhase
497.88 s
> +++ command cargo --version
497.88 s
> cargo 1.97.0 (c980f4866 2026-06-30)
497.88 s
> +++ command cargo test --profile ci-optim --no-run --offline -p gammaloop-integration-tests
497.88 s
> Compiling gammaloop-integration-tests v0.1.0 (/build/source/tests)
497.88 s
> error[E0624] : method `export_uv_forest_graph` is private
497.88 s
> --> tests/tests/uv.rs:3426:33
497.88 s
> |
497.88 s
> 3426 | let soft_export = integrand.export_uv_forest_graph(
497.88 s
> | ^^^^^^^^^^^^^^^^^^^^^^ private method
497.88 s
> |
497.88 s
> ::: crates/gammalooprs/src/uv/export.rs:125:5
497.88 s
> |
497.88 s
> 125 | / pub(crate) fn export_uv_forest_graph(
497.88 s
> 126 | | &self,
497.88 s
> 127 | | graph_id: usize,
497.88 s
> 128 | | orientation: Option<OrientationProjection<'_>>,
497.88 s
> 129 | | generation_settings: &GenerationSettings,
497.88 s
> 130 | | export_settings: &UVForestExportSettings,
497.88 s
> 131 | | ) -> Result<UVForestExport> {
497.88 s
> | |_______________________________- private method defined here
497.88 s
>
497.88 s
> error[E0624] : method `export_uv_forest_graph` is private
497.88 s
> --> tests/tests/uv.rs:3522:38
497.88 s
> |
497.88 s
> 3522 | let uv_export = uv_integrand.export_uv_forest_graph(
497.88 s
> | ^^^^^^^^^^^^^^^^^^^^^^ private method
497.88 s
> |
497.88 s
> ::: crates/gammalooprs/src/uv/export.rs:125:5
497.88 s
> |
497.88 s
> 125 | / pub(crate) fn export_uv_forest_graph(
497.88 s
> 126 | | &self,
497.88 s
> 127 | | graph_id: usize,
497.88 s
> 128 | | orientation: Option<OrientationProjection<'_>>,
497.88 s
> 129 | | generation_settings: &GenerationSettings,
497.88 s
> 130 | | export_settings: &UVForestExportSettings,
497.88 s
> 131 | | ) -> Result<UVForestExport> {
497.88 s
> | |_______________________________- private method defined here
497.88 s
>
497.88 s
> error[E0624] : method `export_uv_forest_graph` is private
497.88 s
> --> tests/tests/uv.rs:3936:44
497.88 s
> |
497.88 s
> 3936 | let export = integrand.export_uv_forest_graph(
497.88 s
> | ^^^^^^^^^^^^^^^^^^^^^^ private method
497.88 s
> |
497.88 s
> ::: crates/gammalooprs/src/uv/export.rs:125:5
497.88 s
> |
497.88 s
> 125 | / pub(crate) fn export_uv_forest_graph(
497.88 s
> 126 | | &self,
497.88 s
> 127 | | graph_id: usize,
497.88 s
> 128 | | orientation: Option<OrientationProjection<'_>>,
497.88 s
> 129 | | generation_settings: &GenerationSettings,
497.88 s
> 130 | | export_settings: &UVForestExportSettings,
497.88 s
> 131 | | ) -> Result<UVForestExport> {
497.88 s
> | |_______________________________- private method defined here
497.88 s
>
497.88 s
> error[E0624] : method `export_uv_forest_graph` is private
497.88 s
> --> tests/tests/uv.rs:4128:36
497.88 s
> |
497.88 s
> 4128 | let export = integrand.export_uv_forest_graph(
497.88 s
> | ^^^^^^^^^^^^^^^^^^^^^^ private method
497.88 s
> |
497.88 s
> ::: crates/gammalooprs/src/uv/export.rs:125:5
497.88 s
> |
497.88 s
> 125 | / pub(crate) fn export_uv_forest_graph(
497.88 s
> 126 | | &self,
497.88 s
> 127 | | graph_id: usize,
497.88 s
> 128 | | orientation: Option<OrientationProjection<'_>>,
497.88 s
> 129 | | generation_settings: &GenerationSettings,
497.88 s
> 130 | | export_settings: &UVForestExportSettings,
497.88 s
> 131 | | ) -> Result<UVForestExport> {
497.88 s
> | |_______________________________- private method defined here
497.88 s
>
497.88 s
> error[E0624] : method `export_uv_forest_graph` is private
497.88 s
> --> tests/tests/uv.rs:4335:36
497.88 s
> |
497.88 s
> 4335 | let export = integrand.export_uv_forest_graph(
497.88 s
> | ^^^^^^^^^^^^^^^^^^^^^^ private method
497.88 s
> |
497.88 s
> ::: crates/gammalooprs/src/uv/export.rs:125:5
497.88 s
> |
497.88 s
> 125 | / pub(crate) fn export_uv_forest_graph(
497.88 s
> 126 | | &self,
497.88 s
> 127 | | graph_id: usize,
497.88 s
> 128 | | orientation: Option<OrientationProjection<'_>>,
497.88 s
> 129 | | generation_settings: &GenerationSettings,
497.88 s
> 130 | | export_settings: &UVForestExportSettings,
497.88 s
> 131 | | ) -> Result<UVForestExport> {
497.88 s
> | |_______________________________- private method defined here
497.88 s
>
497.88 s
> error[E0061] : this method takes 5 arguments but 3 arguments were supplied
497.88 s
> --> tests/tests/uv.rs:4551:26
497.88 s
> |
497.88 s
> 4551 | parent_graph.cff(&parent_tree, &parent_cut, &OrientationPattern::default())?;
497.88 s
> | ^^^ ----------------------------------------------------------- two arguments of type `&three_dimensional_reps::generation::Generate3DExpressionOptions` and `Option<&symbolica::atom::Atom>` are missing
497.88 s
> |
497.88 s
> note : method defined here
497.88 s
> --> crates/gammalooprs/src/cff/mod.rs:755:12
497.88 s
> |
497.88 s
> 755 | pub fn cff<S: SubGraphLike + SubSetLike>(
497.88 s
> | ^^^
497.88 s
> help : provide the arguments
497.88 s
> |
497.88 s
> 4551 | parent_graph.cff(&parent_tree, &parent_cut, &OrientationPattern::default(), /* &three_dimensional_reps::generation::Generate3DExpressionOptions */, /* Option<&symbolica::atom::Atom> */ )?;
497.88 s
> | ++++++++++++++++++++++++++++++++++++++++++++++++++++++++++++++++++++++++++++++++++++++++++++++++++++++++++++++
497.88 s
>
497.88 s
> error[E0616] : field `orientations` of struct `CFFTerm` is private
497.88 s
> --> tests/tests/uv.rs:4555:36
497.88 s
> |
497.88 s
> 4555 | .flat_map(|term| &term.orientations)
497.88 s
> | ^^^^^^^^^^^^ private field
497.88 s
>
497.88 s
> error[E0609] : no field `orientations` on type `&GeneratedThreeDExpression<Esurface, Hsurface>`
497.88 s
> --> tests/tests/uv.rs:4653:18
497.88 s
> |
497.88 s
> 4653 | .orientations
497.88 s
> | ^^^^^^^^^^^^ unknown field
497.88 s
> |
497.88 s
> = note : the full name for the type has been written to '/build/source/target/ci-optim/deps/uv-ce4ce797f04de65a.long-type-18114926718083020756.txt'
497.88 s
> = note : consider using `--verbose` to print the full type name to the console
497.88 s
> help : one of the expressions' fields has a field of the same name
497.88 s
> |
497.88 s
> 4653 | .expression. orientations
497.88 s
> | +++++++++++
497.88 s
>
497.88 s
> error[E0624] : method `export_uv_forest_graph` is private
497.88 s
> --> tests/tests/uv.rs:4673:43
497.88 s
> |
497.88 s
> 4673 | let structural_forest = integrand.export_uv_forest_graph(
497.88 s
> | ^^^^^^^^^^^^^^^^^^^^^^ private method
497.88 s
> |
497.88 s
> ::: crates/gammalooprs/src/uv/export.rs:125:5
497.88 s
> |
497.88 s
> 125 | / pub(crate) fn export_uv_forest_graph(
497.88 s
> 126 | | &self,
497.88 s
> 127 | | graph_id: usize,
497.88 s
> 128 | | orientation: Option<OrientationProjection<'_>>,
497.88 s
> 129 | | generation_settings: &GenerationSettings,
497.88 s
> 130 | | export_settings: &UVForestExportSettings,
497.88 s
> 131 | | ) -> Result<UVForestExport> {
497.88 s
> | |_______________________________- private method defined here
497.88 s
>
497.88 s
> error[E0624] : method `export_uv_forest_graph` is private
497.88 s
> --> tests/tests/uv.rs:4897:43
497.88 s
> |
497.88 s
> 4897 | let structural_forest = integrand.export_uv_forest_graph(
497.88 s
> | ^^^^^^^^^^^^^^^^^^^^^^ private method
497.88 s
> |
497.88 s
> ::: crates/gammalooprs/src/uv/export.rs:125:5
497.88 s
> |
497.88 s
> 125 | / pub(crate) fn export_uv_forest_graph(
497.88 s
> 126 | | &self,
497.88 s
> 127 | | graph_id: usize,
497.88 s
> 128 | | orientation: Option<OrientationProjection<'_>>,
497.88 s
> 129 | | generation_settings: &GenerationSettings,
497.88 s
> 130 | | export_settings: &UVForestExportSettings,
497.88 s
> 131 | | ) -> Result<UVForestExport> {
497.88 s
> | |_______________________________- private method defined here
497.88 s
>
497.88 s
> error[E0624] : method `export_uv_forest_graph` is private
497.88 s
> --> tests/tests/uv.rs:5146:43
497.88 s
> |
497.88 s
> 5146 | let structural_forest = integrand.export_uv_forest_graph(
497.88 s
> | ^^^^^^^^^^^^^^^^^^^^^^ private method
497.88 s
> |
497.88 s
> ::: crates/gammalooprs/src/uv/export.rs:125:5
497.88 s
> |
497.88 s
> 125 | / pub(crate) fn export_uv_forest_graph(
497.88 s
> 126 | | &self,
497.88 s
> 127 | | graph_id: usize,
497.88 s
> 128 | | orientation: Option<OrientationProjection<'_>>,
497.88 s
> 129 | | generation_settings: &GenerationSettings,
497.88 s
> 130 | | export_settings: &UVForestExportSettings,
497.88 s
> 131 | | ) -> Result<UVForestExport> {
497.88 s
> | |_______________________________- private method defined here
497.88 s
>
497.88 s
> error[E0624] : method `export_uv_forest_graph` is private
497.88 s
> --> tests/tests/uv.rs:5161:41
497.88 s
> |
497.88 s
> 5161 | let computed_forest = integrand.export_uv_forest_graph(
497.88 s
> | ^^^^^^^^^^^^^^^^^^^^^^ private method
497.88 s
> |
497.88 s
> ::: crates/gammalooprs/src/uv/export.rs:125:5
497.88 s
> |
497.88 s
> 125 | / pub(crate) fn export_uv_forest_graph(
497.88 s
> 126 | | &self,
497.88 s
> 127 | | graph_id: usize,
497.88 s
> 128 | | orientation: Option<OrientationProjection<'_>>,
497.88 s
> 129 | | generation_settings: &GenerationSettings,
497.88 s
> 130 | | export_settings: &UVForestExportSettings,
497.88 s
> 131 | | ) -> Result<UVForestExport> {
497.88 s
> | |_______________________________- private method defined here
497.88 s
>
497.88 s
> error[E0624] : method `export_uv_forest_graph` is private
497.88 s
> --> tests/tests/uv.rs:5724:51
497.88 s
> |
497.88 s
> 5724 | let structural_forest = integrand.export_uv_forest_graph(
497.88 s
> | ^^^^^^^^^^^^^^^^^^^^^^ private method
497.88 s
> |
497.88 s
> ::: crates/gammalooprs/src/uv/export.rs:125:5
497.88 s
> |
497.88 s
> 125 | / pub(crate) fn export_uv_forest_graph(
497.88 s
> 126 | | &self,
497.88 s
> 127 | | graph_id: usize,
497.88 s
> 128 | | orientation: Option<OrientationProjection<'_>>,
497.88 s
> 129 | | generation_settings: &GenerationSettings,
497.88 s
> 130 | | export_settings: &UVForestExportSettings,
497.88 s
> 131 | | ) -> Result<UVForestExport> {
497.88 s
> | |_______________________________- private method defined here
497.88 s
>
497.88 s
> Some errors have detailed explanations: E0061, E0609, E0616, E0624.
497.88 s
> For more information about an error, try `rustc --explain E0061`.
497.88 s
> error : could not compile `gammaloop-integration-tests` (test "uv") due to 13 previous errors
497.88 s
> warning : build failed, waiting for other jobs to finish...
497.88 s
For full logs, run:
497.88 s
nix log /nix/store/jmdxlfvakb7hqqx0dbiq8qybml3didbp-gammaloop-crate-test-binaries-gammaloop-integration-tests-b8cda0d438c96d4f-deps-0.1.0.drv
497.88 s
error: Cannot build '/nix/store/iv6mkn8q4k8zm0nv65sm048v1mk2abq1-nix-ci-artifact-barrier-crate-test-binaries-gammaloop-integration-tests.drv '.
497.88 s
Reason: 1 dependency failed .
497.88 s
Output paths:
497.88 s
/nix/store/alqj26s1binb75rfk04kcvmmvic0a5vh-nix-ci-artifact-barrier-crate-test-binaries-gammaloop-integration-tests
497.88 s
Build failed due to failed dependency
497.93 s
Build failed.