build packages.x86_64-linux.crate-test-binaries-gammaloop-integration-tests

Reproduce this run
Retry Run
  1. 0.00 s $ /nix/store/9ypz3flqsrl5xl495mm8h645gadjsxi1-coreutils-9.11/bin/timeout --kill-after=15s 7200s /nix/store/23zk8sgzamrbmj1fday15szf7f2279s8-nix-2.34.7/bin/nix --extra-experimental-features nix-command --extra-experimental-features flakes --log-format internal-json build --no-link --print-out-paths git+https://github.com/alphal00p/gammaloop?ref=codex%2Fdocs-manuals&rev=fa8ed9a02ca7dff8db2b623fcf9163af3051b0df&shallow=1#packages.x86_64-linux.crate-test-binaries-gammaloop-integration-tests --print-build-logs
  2. 4.46 s
  3. 6.26 s Building /nix/store/7bvilb8f8jk96pxj7jzk23i0qicj2vy5-gammaloop-ci-test-binary-dependencies-b8cda0d438c96d4f-gammaloop-integration-tests-dev-dependency.toml.drv
  4. 6.75 s Building /nix/store/ksam0pl7wd6c3vkhbr7kj8y42kw86gms-gammaloop-crate-test-binaries-gammaloop-integration-tests-b8cda0d438c96d4f-inputs.drv
  5. 6.82 s [gammaloop-ci-test-binary-dependencies-b8cda0d438c96d4f-gammaloop-integration-tests-dev-dependency.toml:post-build] Uploading to the NixCI cache: /nix/store/2lfqmlw92swx4z82ikq7m59s1qqd8l2d-gammaloop-ci-test-binary-dependencies-b8cda0d438c96d4f-gammaloop-integration-tests-dev-dependency.toml
  6. 7.13 s [gammaloop-ci-test-binary-dependencies-b8cda0d438c96d4f-gammaloop-integration-tests-dev-dependency.toml:post-build] warning: 'warn-short-path-literals' is deprecated, use 'lint-short-path-literals = ignore' instead
  7. 7.83 s [gammaloop-ci-test-binary-dependencies-b8cda0d438c96d4f-gammaloop-integration-tests-dev-dependency.toml:post-build] copying 0 paths...
  8. 8.16 s [gammaloop-ci-test-binary-dependencies-b8cda0d438c96d4f-gammaloop-integration-tests-dev-dependency.toml:post-build] warning: 'warn-short-path-literals' is deprecated, use 'lint-short-path-literals = ignore' instead
  9. 8.45 s [gammaloop-ci-test-binary-dependencies-b8cda0d438c96d4f-gammaloop-integration-tests-dev-dependency.toml:post-build] copying 0 paths...
  10. 8.63 s Uploaded gammaloop-ci-test-binary-dependencies-b8cda0d438c96d4f-gammaloop-integration-tests-dev-dependency.toml in 1.8s
  11. 8.63 s Progress: 1 of 5 built (1 building)
  12. 8.63 s Built gammaloop-ci-test-binary-dependencies-b8cda0d438c96d4f-gammaloop-integration-tests-dev-dependency.toml in 2.3s
  13. 20.32 s [gammaloop-crate-test-binaries-gammaloop-integration-tests-b8cda0d438c96d4f-inputs:post-build] Uploading to the NixCI cache: /nix/store/3jv2y5in0rr1jv0hdb45595kih4n826m-gammaloop-crate-test-binaries-gammaloop-integration-tests-b8cda0d438c96d4f-inputs
  14. 20.69 s [gammaloop-crate-test-binaries-gammaloop-integration-tests-b8cda0d438c96d4f-inputs:post-build] warning: 'warn-short-path-literals' is deprecated, use 'lint-short-path-literals = ignore' instead
  15. 20.78 s [gammaloop-crate-test-binaries-gammaloop-integration-tests-b8cda0d438c96d4f-inputs:post-build] copying 1 paths...
  16. 20.78 s [gammaloop-crate-test-binaries-gammaloop-integration-tests-b8cda0d438c96d4f-inputs:post-build] copying path '/nix/store/3jv2y5in0rr1jv0hdb45595kih4n826m-gammaloop-crate-test-binaries-gammaloop-integration-tests-b8cda0d438c96d4f-inputs' to 'https://cache.nix-ci.com'...
  17. 387.46 s [gammaloop-crate-test-binaries-gammaloop-integration-tests-b8cda0d438c96d4f-inputs:post-build] warning: 'warn-short-path-literals' is deprecated, use 'lint-short-path-literals = ignore' instead
  18. 387.72 s [gammaloop-crate-test-binaries-gammaloop-integration-tests-b8cda0d438c96d4f-inputs:post-build] copying 1 paths...
  19. 387.72 s [gammaloop-crate-test-binaries-gammaloop-integration-tests-b8cda0d438c96d4f-inputs:post-build] copying path '/nix/store/ksam0pl7wd6c3vkhbr7kj8y42kw86gms-gammaloop-crate-test-binaries-gammaloop-integration-tests-b8cda0d438c96d4f-inputs.drv' to 'https://cache.nix-ci.com'...
  20. 387.87 s Uploaded gammaloop-crate-test-binaries-gammaloop-integration-tests-b8cda0d438c96d4f-inputs in 6m07s
  21. 387.87 s Progress: 2 of 5 built
  22. 387.87 s Built gammaloop-crate-test-binaries-gammaloop-integration-tests-b8cda0d438c96d4f-inputs in 6m21s
  23. 387.95 s Building /nix/store/jmdxlfvakb7hqqx0dbiq8qybml3didbp-gammaloop-crate-test-binaries-gammaloop-integration-tests-b8cda0d438c96d4f-deps-0.1.0.drv
  24. 388.02 s [gammaloop-crate-test-binaries-gammaloop-integration-tests-b8cda0d438c96d4f-deps] Phase: unpackPhase
  25. 388.02 s [gammaloop-crate-test-binaries-gammaloop-integration-tests-b8cda0d438c96d4f-deps] unpacking source archive /nix/store/s8h804zbj5xpi2ifcc945rxxavmvwxir-source
  26. 388.08 s [gammaloop-crate-test-binaries-gammaloop-integration-tests-b8cda0d438c96d4f-deps] source root is source
  27. 388.10 s [gammaloop-crate-test-binaries-gammaloop-integration-tests-b8cda0d438c96d4f-deps] Phase: patchPhase
  28. 388.18 s [gammaloop-crate-test-binaries-gammaloop-integration-tests-b8cda0d438c96d4f-deps] Executing configureCargoCommonVars
  29. 388.18 s [gammaloop-crate-test-binaries-gammaloop-integration-tests-b8cda0d438c96d4f-deps] copying cargo artifacts from /nix/store/3jv2y5in0rr1jv0hdb45595kih4n826m-gammaloop-crate-test-binaries-gammaloop-integration-tests-b8cda0d438c96d4f-inputs/target to target
  30. 388.18 s [gammaloop-crate-test-binaries-gammaloop-integration-tests-b8cda0d438c96d4f-deps] will deep copy artifacts (instead of symlinking) as requested
  31. 389.53 s [gammaloop-crate-test-binaries-gammaloop-integration-tests-b8cda0d438c96d4f-deps] Phase: updateAutotoolsGnuConfigScriptsPhase
  32. 389.56 s [gammaloop-crate-test-binaries-gammaloop-integration-tests-b8cda0d438c96d4f-deps] Phase: configurePhase
  33. 389.57 s [gammaloop-crate-test-binaries-gammaloop-integration-tests-b8cda0d438c96d4f-deps] will append /build/source/.cargo-home/config.toml with contents of /nix/store/8zq9ya5slh345hbylmsibxw827bi98w0-vendor-cargo-deps/config.toml
  34. 389.57 s [gammaloop-crate-test-binaries-gammaloop-integration-tests-b8cda0d438c96d4f-deps] default configurePhase, nothing to do
  35. 389.57 s [gammaloop-crate-test-binaries-gammaloop-integration-tests-b8cda0d438c96d4f-deps] Phase: buildPhase
  36. 389.58 s [gammaloop-crate-test-binaries-gammaloop-integration-tests-b8cda0d438c96d4f-deps] +++ command cargo --version
  37. 389.58 s [gammaloop-crate-test-binaries-gammaloop-integration-tests-b8cda0d438c96d4f-deps] cargo 1.97.0 (c980f4866 2026-06-30)
  38. 389.58 s [gammaloop-crate-test-binaries-gammaloop-integration-tests-b8cda0d438c96d4f-deps] +++ command cargo test --profile ci-optim --no-run --offline -p gammaloop-integration-tests
  39. 390.00 s [gammaloop-crate-test-binaries-gammaloop-integration-tests-b8cda0d438c96d4f-deps] Compiling gammaloop-integration-tests v0.1.0 (/build/source/tests)
  40. 390.51 s [gammaloop-crate-test-binaries-gammaloop-integration-tests-b8cda0d438c96d4f-deps] error[E0624]: method `export_uv_forest_graph` is private
  41. 390.51 s [gammaloop-crate-test-binaries-gammaloop-integration-tests-b8cda0d438c96d4f-deps] --> tests/tests/uv.rs:3426:33
  42. 390.51 s [gammaloop-crate-test-binaries-gammaloop-integration-tests-b8cda0d438c96d4f-deps] |
  43. 390.51 s [gammaloop-crate-test-binaries-gammaloop-integration-tests-b8cda0d438c96d4f-deps] 3426 | let soft_export = integrand.export_uv_forest_graph(
  44. 390.51 s [gammaloop-crate-test-binaries-gammaloop-integration-tests-b8cda0d438c96d4f-deps] | ^^^^^^^^^^^^^^^^^^^^^^ private method
  45. 390.51 s [gammaloop-crate-test-binaries-gammaloop-integration-tests-b8cda0d438c96d4f-deps] |
  46. 390.51 s [gammaloop-crate-test-binaries-gammaloop-integration-tests-b8cda0d438c96d4f-deps] ::: crates/gammalooprs/src/uv/export.rs:125:5
  47. 390.51 s [gammaloop-crate-test-binaries-gammaloop-integration-tests-b8cda0d438c96d4f-deps] |
  48. 390.51 s [gammaloop-crate-test-binaries-gammaloop-integration-tests-b8cda0d438c96d4f-deps] 125 | / pub(crate) fn export_uv_forest_graph(
  49. 390.51 s [gammaloop-crate-test-binaries-gammaloop-integration-tests-b8cda0d438c96d4f-deps] 126 | | &self,
  50. 390.51 s [gammaloop-crate-test-binaries-gammaloop-integration-tests-b8cda0d438c96d4f-deps] 127 | | graph_id: usize,
  51. 390.51 s [gammaloop-crate-test-binaries-gammaloop-integration-tests-b8cda0d438c96d4f-deps] 128 | | orientation: Option<OrientationProjection<'_>>,
  52. 390.51 s [gammaloop-crate-test-binaries-gammaloop-integration-tests-b8cda0d438c96d4f-deps] 129 | | generation_settings: &GenerationSettings,
  53. 390.51 s [gammaloop-crate-test-binaries-gammaloop-integration-tests-b8cda0d438c96d4f-deps] 130 | | export_settings: &UVForestExportSettings,
  54. 390.51 s [gammaloop-crate-test-binaries-gammaloop-integration-tests-b8cda0d438c96d4f-deps] 131 | | ) -> Result<UVForestExport> {
  55. 390.51 s [gammaloop-crate-test-binaries-gammaloop-integration-tests-b8cda0d438c96d4f-deps] | |_______________________________- private method defined here
  56. 390.51 s [gammaloop-crate-test-binaries-gammaloop-integration-tests-b8cda0d438c96d4f-deps]
  57. 390.51 s [gammaloop-crate-test-binaries-gammaloop-integration-tests-b8cda0d438c96d4f-deps] error[E0624]: method `export_uv_forest_graph` is private
  58. 390.51 s [gammaloop-crate-test-binaries-gammaloop-integration-tests-b8cda0d438c96d4f-deps] --> tests/tests/uv.rs:3522:38
  59. 390.51 s [gammaloop-crate-test-binaries-gammaloop-integration-tests-b8cda0d438c96d4f-deps] |
  60. 390.51 s [gammaloop-crate-test-binaries-gammaloop-integration-tests-b8cda0d438c96d4f-deps] 3522 | let uv_export = uv_integrand.export_uv_forest_graph(
  61. 390.51 s [gammaloop-crate-test-binaries-gammaloop-integration-tests-b8cda0d438c96d4f-deps] | ^^^^^^^^^^^^^^^^^^^^^^ private method
  62. 390.51 s [gammaloop-crate-test-binaries-gammaloop-integration-tests-b8cda0d438c96d4f-deps] |
  63. 390.51 s [gammaloop-crate-test-binaries-gammaloop-integration-tests-b8cda0d438c96d4f-deps] ::: crates/gammalooprs/src/uv/export.rs:125:5
  64. 390.51 s [gammaloop-crate-test-binaries-gammaloop-integration-tests-b8cda0d438c96d4f-deps] |
  65. 390.51 s [gammaloop-crate-test-binaries-gammaloop-integration-tests-b8cda0d438c96d4f-deps] 125 | / pub(crate) fn export_uv_forest_graph(
  66. 390.51 s [gammaloop-crate-test-binaries-gammaloop-integration-tests-b8cda0d438c96d4f-deps] 126 | | &self,
  67. 390.51 s [gammaloop-crate-test-binaries-gammaloop-integration-tests-b8cda0d438c96d4f-deps] 127 | | graph_id: usize,
  68. 390.51 s [gammaloop-crate-test-binaries-gammaloop-integration-tests-b8cda0d438c96d4f-deps] 128 | | orientation: Option<OrientationProjection<'_>>,
  69. 390.51 s [gammaloop-crate-test-binaries-gammaloop-integration-tests-b8cda0d438c96d4f-deps] 129 | | generation_settings: &GenerationSettings,
  70. 390.51 s [gammaloop-crate-test-binaries-gammaloop-integration-tests-b8cda0d438c96d4f-deps] 130 | | export_settings: &UVForestExportSettings,
  71. 390.51 s [gammaloop-crate-test-binaries-gammaloop-integration-tests-b8cda0d438c96d4f-deps] 131 | | ) -> Result<UVForestExport> {
  72. 390.51 s [gammaloop-crate-test-binaries-gammaloop-integration-tests-b8cda0d438c96d4f-deps] | |_______________________________- private method defined here
  73. 390.51 s [gammaloop-crate-test-binaries-gammaloop-integration-tests-b8cda0d438c96d4f-deps]
  74. 390.54 s [gammaloop-crate-test-binaries-gammaloop-integration-tests-b8cda0d438c96d4f-deps] error[E0624]: method `export_uv_forest_graph` is private
  75. 390.54 s [gammaloop-crate-test-binaries-gammaloop-integration-tests-b8cda0d438c96d4f-deps] --> tests/tests/uv.rs:3936:44
  76. 390.54 s [gammaloop-crate-test-binaries-gammaloop-integration-tests-b8cda0d438c96d4f-deps] |
  77. 390.54 s [gammaloop-crate-test-binaries-gammaloop-integration-tests-b8cda0d438c96d4f-deps] 3936 | let export = integrand.export_uv_forest_graph(
  78. 390.54 s [gammaloop-crate-test-binaries-gammaloop-integration-tests-b8cda0d438c96d4f-deps] | ^^^^^^^^^^^^^^^^^^^^^^ private method
  79. 390.54 s [gammaloop-crate-test-binaries-gammaloop-integration-tests-b8cda0d438c96d4f-deps] |
  80. 390.54 s [gammaloop-crate-test-binaries-gammaloop-integration-tests-b8cda0d438c96d4f-deps] ::: crates/gammalooprs/src/uv/export.rs:125:5
  81. 390.54 s [gammaloop-crate-test-binaries-gammaloop-integration-tests-b8cda0d438c96d4f-deps] |
  82. 390.54 s [gammaloop-crate-test-binaries-gammaloop-integration-tests-b8cda0d438c96d4f-deps] 125 | / pub(crate) fn export_uv_forest_graph(
  83. 390.54 s [gammaloop-crate-test-binaries-gammaloop-integration-tests-b8cda0d438c96d4f-deps] 126 | | &self,
  84. 390.54 s [gammaloop-crate-test-binaries-gammaloop-integration-tests-b8cda0d438c96d4f-deps] 127 | | graph_id: usize,
  85. 390.54 s [gammaloop-crate-test-binaries-gammaloop-integration-tests-b8cda0d438c96d4f-deps] 128 | | orientation: Option<OrientationProjection<'_>>,
  86. 390.54 s [gammaloop-crate-test-binaries-gammaloop-integration-tests-b8cda0d438c96d4f-deps] 129 | | generation_settings: &GenerationSettings,
  87. 390.54 s [gammaloop-crate-test-binaries-gammaloop-integration-tests-b8cda0d438c96d4f-deps] 130 | | export_settings: &UVForestExportSettings,
  88. 390.54 s [gammaloop-crate-test-binaries-gammaloop-integration-tests-b8cda0d438c96d4f-deps] 131 | | ) -> Result<UVForestExport> {
  89. 390.54 s [gammaloop-crate-test-binaries-gammaloop-integration-tests-b8cda0d438c96d4f-deps] | |_______________________________- private method defined here
  90. 390.54 s [gammaloop-crate-test-binaries-gammaloop-integration-tests-b8cda0d438c96d4f-deps]
  91. 390.55 s [gammaloop-crate-test-binaries-gammaloop-integration-tests-b8cda0d438c96d4f-deps] error[E0624]: method `export_uv_forest_graph` is private
  92. 390.55 s [gammaloop-crate-test-binaries-gammaloop-integration-tests-b8cda0d438c96d4f-deps] --> tests/tests/uv.rs:4128:36
  93. 390.55 s [gammaloop-crate-test-binaries-gammaloop-integration-tests-b8cda0d438c96d4f-deps] |
  94. 390.55 s [gammaloop-crate-test-binaries-gammaloop-integration-tests-b8cda0d438c96d4f-deps] 4128 | let export = integrand.export_uv_forest_graph(
  95. 390.55 s [gammaloop-crate-test-binaries-gammaloop-integration-tests-b8cda0d438c96d4f-deps] | ^^^^^^^^^^^^^^^^^^^^^^ private method
  96. 390.55 s [gammaloop-crate-test-binaries-gammaloop-integration-tests-b8cda0d438c96d4f-deps] |
  97. 390.55 s [gammaloop-crate-test-binaries-gammaloop-integration-tests-b8cda0d438c96d4f-deps] ::: crates/gammalooprs/src/uv/export.rs:125:5
  98. 390.55 s [gammaloop-crate-test-binaries-gammaloop-integration-tests-b8cda0d438c96d4f-deps] |
  99. 390.55 s [gammaloop-crate-test-binaries-gammaloop-integration-tests-b8cda0d438c96d4f-deps] 125 | / pub(crate) fn export_uv_forest_graph(
  100. 390.55 s [gammaloop-crate-test-binaries-gammaloop-integration-tests-b8cda0d438c96d4f-deps] 126 | | &self,
  101. 390.55 s [gammaloop-crate-test-binaries-gammaloop-integration-tests-b8cda0d438c96d4f-deps] 127 | | graph_id: usize,
  102. 390.55 s [gammaloop-crate-test-binaries-gammaloop-integration-tests-b8cda0d438c96d4f-deps] 128 | | orientation: Option<OrientationProjection<'_>>,
  103. 390.55 s [gammaloop-crate-test-binaries-gammaloop-integration-tests-b8cda0d438c96d4f-deps] 129 | | generation_settings: &GenerationSettings,
  104. 390.55 s [gammaloop-crate-test-binaries-gammaloop-integration-tests-b8cda0d438c96d4f-deps] 130 | | export_settings: &UVForestExportSettings,
  105. 390.55 s [gammaloop-crate-test-binaries-gammaloop-integration-tests-b8cda0d438c96d4f-deps] 131 | | ) -> Result<UVForestExport> {
  106. 390.55 s [gammaloop-crate-test-binaries-gammaloop-integration-tests-b8cda0d438c96d4f-deps] | |_______________________________- private method defined here
  107. 390.55 s [gammaloop-crate-test-binaries-gammaloop-integration-tests-b8cda0d438c96d4f-deps]
  108. 390.57 s [gammaloop-crate-test-binaries-gammaloop-integration-tests-b8cda0d438c96d4f-deps] error[E0624]: method `export_uv_forest_graph` is private
  109. 390.57 s [gammaloop-crate-test-binaries-gammaloop-integration-tests-b8cda0d438c96d4f-deps] --> tests/tests/uv.rs:4335:36
  110. 390.57 s [gammaloop-crate-test-binaries-gammaloop-integration-tests-b8cda0d438c96d4f-deps] |
  111. 390.57 s [gammaloop-crate-test-binaries-gammaloop-integration-tests-b8cda0d438c96d4f-deps] 4335 | let export = integrand.export_uv_forest_graph(
  112. 390.57 s [gammaloop-crate-test-binaries-gammaloop-integration-tests-b8cda0d438c96d4f-deps] | ^^^^^^^^^^^^^^^^^^^^^^ private method
  113. 390.57 s [gammaloop-crate-test-binaries-gammaloop-integration-tests-b8cda0d438c96d4f-deps] |
  114. 390.57 s [gammaloop-crate-test-binaries-gammaloop-integration-tests-b8cda0d438c96d4f-deps] ::: crates/gammalooprs/src/uv/export.rs:125:5
  115. 390.57 s [gammaloop-crate-test-binaries-gammaloop-integration-tests-b8cda0d438c96d4f-deps] |
  116. 390.57 s [gammaloop-crate-test-binaries-gammaloop-integration-tests-b8cda0d438c96d4f-deps] 125 | / pub(crate) fn export_uv_forest_graph(
  117. 390.57 s [gammaloop-crate-test-binaries-gammaloop-integration-tests-b8cda0d438c96d4f-deps] 126 | | &self,
  118. 390.57 s [gammaloop-crate-test-binaries-gammaloop-integration-tests-b8cda0d438c96d4f-deps] 127 | | graph_id: usize,
  119. 390.57 s [gammaloop-crate-test-binaries-gammaloop-integration-tests-b8cda0d438c96d4f-deps] 128 | | orientation: Option<OrientationProjection<'_>>,
  120. 390.57 s [gammaloop-crate-test-binaries-gammaloop-integration-tests-b8cda0d438c96d4f-deps] 129 | | generation_settings: &GenerationSettings,
  121. 390.57 s [gammaloop-crate-test-binaries-gammaloop-integration-tests-b8cda0d438c96d4f-deps] 130 | | export_settings: &UVForestExportSettings,
  122. 390.57 s [gammaloop-crate-test-binaries-gammaloop-integration-tests-b8cda0d438c96d4f-deps] 131 | | ) -> Result<UVForestExport> {
  123. 390.57 s [gammaloop-crate-test-binaries-gammaloop-integration-tests-b8cda0d438c96d4f-deps] | |_______________________________- private method defined here
  124. 390.57 s [gammaloop-crate-test-binaries-gammaloop-integration-tests-b8cda0d438c96d4f-deps]
  125. 390.69 s [gammaloop-crate-test-binaries-gammaloop-integration-tests-b8cda0d438c96d4f-deps] error[E0061]: this method takes 5 arguments but 3 arguments were supplied
  126. 390.69 s [gammaloop-crate-test-binaries-gammaloop-integration-tests-b8cda0d438c96d4f-deps] --> tests/tests/uv.rs:4551:26
  127. 390.69 s [gammaloop-crate-test-binaries-gammaloop-integration-tests-b8cda0d438c96d4f-deps] |
  128. 390.69 s [gammaloop-crate-test-binaries-gammaloop-integration-tests-b8cda0d438c96d4f-deps] 4551 | parent_graph.cff(&parent_tree, &parent_cut, &OrientationPattern::default())?;
  129. 390.69 s [gammaloop-crate-test-binaries-gammaloop-integration-tests-b8cda0d438c96d4f-deps] | ^^^----------------------------------------------------------- two arguments of type `&three_dimensional_reps::generation::Generate3DExpressionOptions` and `Option<&symbolica::atom::Atom>` are missing
  130. 390.69 s [gammaloop-crate-test-binaries-gammaloop-integration-tests-b8cda0d438c96d4f-deps] |
  131. 390.69 s [gammaloop-crate-test-binaries-gammaloop-integration-tests-b8cda0d438c96d4f-deps] note: method defined here
  132. 390.69 s [gammaloop-crate-test-binaries-gammaloop-integration-tests-b8cda0d438c96d4f-deps] --> crates/gammalooprs/src/cff/mod.rs:755:12
  133. 390.69 s [gammaloop-crate-test-binaries-gammaloop-integration-tests-b8cda0d438c96d4f-deps] |
  134. 390.69 s [gammaloop-crate-test-binaries-gammaloop-integration-tests-b8cda0d438c96d4f-deps] 755 | pub fn cff<S: SubGraphLike + SubSetLike>(
  135. 390.69 s [gammaloop-crate-test-binaries-gammaloop-integration-tests-b8cda0d438c96d4f-deps] | ^^^
  136. 390.69 s [gammaloop-crate-test-binaries-gammaloop-integration-tests-b8cda0d438c96d4f-deps] help: provide the arguments
  137. 390.69 s [gammaloop-crate-test-binaries-gammaloop-integration-tests-b8cda0d438c96d4f-deps] |
  138. 390.69 s [gammaloop-crate-test-binaries-gammaloop-integration-tests-b8cda0d438c96d4f-deps] 4551 | parent_graph.cff(&parent_tree, &parent_cut, &OrientationPattern::default(), /* &three_dimensional_reps::generation::Generate3DExpressionOptions */, /* Option<&symbolica::atom::Atom> */)?;
  139. 390.69 s [gammaloop-crate-test-binaries-gammaloop-integration-tests-b8cda0d438c96d4f-deps] | ++++++++++++++++++++++++++++++++++++++++++++++++++++++++++++++++++++++++++++++++++++++++++++++++++++++++++++++
  140. 390.69 s [gammaloop-crate-test-binaries-gammaloop-integration-tests-b8cda0d438c96d4f-deps]
  141. 390.69 s [gammaloop-crate-test-binaries-gammaloop-integration-tests-b8cda0d438c96d4f-deps] error[E0616]: field `orientations` of struct `CFFTerm` is private
  142. 390.70 s [gammaloop-crate-test-binaries-gammaloop-integration-tests-b8cda0d438c96d4f-deps] --> tests/tests/uv.rs:4555:36
  143. 390.70 s [gammaloop-crate-test-binaries-gammaloop-integration-tests-b8cda0d438c96d4f-deps] |
  144. 390.70 s [gammaloop-crate-test-binaries-gammaloop-integration-tests-b8cda0d438c96d4f-deps] 4555 | .flat_map(|term| &term.orientations)
  145. 390.70 s [gammaloop-crate-test-binaries-gammaloop-integration-tests-b8cda0d438c96d4f-deps] | ^^^^^^^^^^^^ private field
  146. 390.70 s [gammaloop-crate-test-binaries-gammaloop-integration-tests-b8cda0d438c96d4f-deps]
  147. 390.75 s [gammaloop-crate-test-binaries-gammaloop-integration-tests-b8cda0d438c96d4f-deps] error[E0609]: no field `orientations` on type `&GeneratedThreeDExpression<Esurface, Hsurface>`
  148. 390.75 s [gammaloop-crate-test-binaries-gammaloop-integration-tests-b8cda0d438c96d4f-deps] --> tests/tests/uv.rs:4653:18
  149. 390.75 s [gammaloop-crate-test-binaries-gammaloop-integration-tests-b8cda0d438c96d4f-deps] |
  150. 390.75 s [gammaloop-crate-test-binaries-gammaloop-integration-tests-b8cda0d438c96d4f-deps] 4653 | .orientations
  151. 390.75 s [gammaloop-crate-test-binaries-gammaloop-integration-tests-b8cda0d438c96d4f-deps] | ^^^^^^^^^^^^ unknown field
  152. 390.75 s [gammaloop-crate-test-binaries-gammaloop-integration-tests-b8cda0d438c96d4f-deps] |
  153. 390.75 s [gammaloop-crate-test-binaries-gammaloop-integration-tests-b8cda0d438c96d4f-deps] = note: the full name for the type has been written to '/build/source/target/ci-optim/deps/uv-ce4ce797f04de65a.long-type-18114926718083020756.txt'
  154. 390.75 s [gammaloop-crate-test-binaries-gammaloop-integration-tests-b8cda0d438c96d4f-deps] = note: consider using `--verbose` to print the full type name to the console
  155. 390.75 s [gammaloop-crate-test-binaries-gammaloop-integration-tests-b8cda0d438c96d4f-deps] help: one of the expressions' fields has a field of the same name
  156. 390.75 s [gammaloop-crate-test-binaries-gammaloop-integration-tests-b8cda0d438c96d4f-deps] |
  157. 390.75 s [gammaloop-crate-test-binaries-gammaloop-integration-tests-b8cda0d438c96d4f-deps] 4653 | .expression.orientations
  158. 390.75 s [gammaloop-crate-test-binaries-gammaloop-integration-tests-b8cda0d438c96d4f-deps] | +++++++++++
  159. 390.75 s [gammaloop-crate-test-binaries-gammaloop-integration-tests-b8cda0d438c96d4f-deps]
  160. 390.75 s [gammaloop-crate-test-binaries-gammaloop-integration-tests-b8cda0d438c96d4f-deps] error[E0624]: method `export_uv_forest_graph` is private
  161. 390.75 s [gammaloop-crate-test-binaries-gammaloop-integration-tests-b8cda0d438c96d4f-deps] --> tests/tests/uv.rs:4673:43
  162. 390.75 s [gammaloop-crate-test-binaries-gammaloop-integration-tests-b8cda0d438c96d4f-deps] |
  163. 390.75 s [gammaloop-crate-test-binaries-gammaloop-integration-tests-b8cda0d438c96d4f-deps] 4673 | let structural_forest = integrand.export_uv_forest_graph(
  164. 390.75 s [gammaloop-crate-test-binaries-gammaloop-integration-tests-b8cda0d438c96d4f-deps] | ^^^^^^^^^^^^^^^^^^^^^^ private method
  165. 390.75 s [gammaloop-crate-test-binaries-gammaloop-integration-tests-b8cda0d438c96d4f-deps] |
  166. 390.75 s [gammaloop-crate-test-binaries-gammaloop-integration-tests-b8cda0d438c96d4f-deps] ::: crates/gammalooprs/src/uv/export.rs:125:5
  167. 390.75 s [gammaloop-crate-test-binaries-gammaloop-integration-tests-b8cda0d438c96d4f-deps] |
  168. 390.75 s [gammaloop-crate-test-binaries-gammaloop-integration-tests-b8cda0d438c96d4f-deps] 125 | / pub(crate) fn export_uv_forest_graph(
  169. 390.75 s [gammaloop-crate-test-binaries-gammaloop-integration-tests-b8cda0d438c96d4f-deps] 126 | | &self,
  170. 390.75 s [gammaloop-crate-test-binaries-gammaloop-integration-tests-b8cda0d438c96d4f-deps] 127 | | graph_id: usize,
  171. 390.75 s [gammaloop-crate-test-binaries-gammaloop-integration-tests-b8cda0d438c96d4f-deps] 128 | | orientation: Option<OrientationProjection<'_>>,
  172. 390.75 s [gammaloop-crate-test-binaries-gammaloop-integration-tests-b8cda0d438c96d4f-deps] 129 | | generation_settings: &GenerationSettings,
  173. 390.75 s [gammaloop-crate-test-binaries-gammaloop-integration-tests-b8cda0d438c96d4f-deps] 130 | | export_settings: &UVForestExportSettings,
  174. 390.75 s [gammaloop-crate-test-binaries-gammaloop-integration-tests-b8cda0d438c96d4f-deps] 131 | | ) -> Result<UVForestExport> {
  175. 390.75 s [gammaloop-crate-test-binaries-gammaloop-integration-tests-b8cda0d438c96d4f-deps] | |_______________________________- private method defined here
  176. 390.75 s [gammaloop-crate-test-binaries-gammaloop-integration-tests-b8cda0d438c96d4f-deps]
  177. 390.77 s [gammaloop-crate-test-binaries-gammaloop-integration-tests-b8cda0d438c96d4f-deps] error[E0624]: method `export_uv_forest_graph` is private
  178. 390.77 s [gammaloop-crate-test-binaries-gammaloop-integration-tests-b8cda0d438c96d4f-deps] --> tests/tests/uv.rs:4897:43
  179. 390.77 s [gammaloop-crate-test-binaries-gammaloop-integration-tests-b8cda0d438c96d4f-deps] |
  180. 390.77 s [gammaloop-crate-test-binaries-gammaloop-integration-tests-b8cda0d438c96d4f-deps] 4897 | let structural_forest = integrand.export_uv_forest_graph(
  181. 390.77 s [gammaloop-crate-test-binaries-gammaloop-integration-tests-b8cda0d438c96d4f-deps] | ^^^^^^^^^^^^^^^^^^^^^^ private method
  182. 390.77 s [gammaloop-crate-test-binaries-gammaloop-integration-tests-b8cda0d438c96d4f-deps] |
  183. 390.77 s [gammaloop-crate-test-binaries-gammaloop-integration-tests-b8cda0d438c96d4f-deps] ::: crates/gammalooprs/src/uv/export.rs:125:5
  184. 390.77 s [gammaloop-crate-test-binaries-gammaloop-integration-tests-b8cda0d438c96d4f-deps] |
  185. 390.77 s [gammaloop-crate-test-binaries-gammaloop-integration-tests-b8cda0d438c96d4f-deps] 125 | / pub(crate) fn export_uv_forest_graph(
  186. 390.77 s [gammaloop-crate-test-binaries-gammaloop-integration-tests-b8cda0d438c96d4f-deps] 126 | | &self,
  187. 390.77 s [gammaloop-crate-test-binaries-gammaloop-integration-tests-b8cda0d438c96d4f-deps] 127 | | graph_id: usize,
  188. 390.77 s [gammaloop-crate-test-binaries-gammaloop-integration-tests-b8cda0d438c96d4f-deps] 128 | | orientation: Option<OrientationProjection<'_>>,
  189. 390.77 s [gammaloop-crate-test-binaries-gammaloop-integration-tests-b8cda0d438c96d4f-deps] 129 | | generation_settings: &GenerationSettings,
  190. 390.77 s [gammaloop-crate-test-binaries-gammaloop-integration-tests-b8cda0d438c96d4f-deps] 130 | | export_settings: &UVForestExportSettings,
  191. 390.77 s [gammaloop-crate-test-binaries-gammaloop-integration-tests-b8cda0d438c96d4f-deps] 131 | | ) -> Result<UVForestExport> {
  192. 390.77 s [gammaloop-crate-test-binaries-gammaloop-integration-tests-b8cda0d438c96d4f-deps] | |_______________________________- private method defined here
  193. 390.77 s [gammaloop-crate-test-binaries-gammaloop-integration-tests-b8cda0d438c96d4f-deps]
  194. 390.80 s [gammaloop-crate-test-binaries-gammaloop-integration-tests-b8cda0d438c96d4f-deps] error[E0624]: method `export_uv_forest_graph` is private
  195. 390.80 s [gammaloop-crate-test-binaries-gammaloop-integration-tests-b8cda0d438c96d4f-deps] --> tests/tests/uv.rs:5146:43
  196. 390.80 s [gammaloop-crate-test-binaries-gammaloop-integration-tests-b8cda0d438c96d4f-deps] |
  197. 390.80 s [gammaloop-crate-test-binaries-gammaloop-integration-tests-b8cda0d438c96d4f-deps] 5146 | let structural_forest = integrand.export_uv_forest_graph(
  198. 390.80 s [gammaloop-crate-test-binaries-gammaloop-integration-tests-b8cda0d438c96d4f-deps] | ^^^^^^^^^^^^^^^^^^^^^^ private method
  199. 390.80 s [gammaloop-crate-test-binaries-gammaloop-integration-tests-b8cda0d438c96d4f-deps] |
  200. 390.80 s [gammaloop-crate-test-binaries-gammaloop-integration-tests-b8cda0d438c96d4f-deps] ::: crates/gammalooprs/src/uv/export.rs:125:5
  201. 390.80 s [gammaloop-crate-test-binaries-gammaloop-integration-tests-b8cda0d438c96d4f-deps] |
  202. 390.80 s [gammaloop-crate-test-binaries-gammaloop-integration-tests-b8cda0d438c96d4f-deps] 125 | / pub(crate) fn export_uv_forest_graph(
  203. 390.80 s [gammaloop-crate-test-binaries-gammaloop-integration-tests-b8cda0d438c96d4f-deps] 126 | | &self,
  204. 390.80 s [gammaloop-crate-test-binaries-gammaloop-integration-tests-b8cda0d438c96d4f-deps] 127 | | graph_id: usize,
  205. 390.80 s [gammaloop-crate-test-binaries-gammaloop-integration-tests-b8cda0d438c96d4f-deps] 128 | | orientation: Option<OrientationProjection<'_>>,
  206. 390.80 s [gammaloop-crate-test-binaries-gammaloop-integration-tests-b8cda0d438c96d4f-deps] 129 | | generation_settings: &GenerationSettings,
  207. 390.80 s [gammaloop-crate-test-binaries-gammaloop-integration-tests-b8cda0d438c96d4f-deps] 130 | | export_settings: &UVForestExportSettings,
  208. 390.80 s [gammaloop-crate-test-binaries-gammaloop-integration-tests-b8cda0d438c96d4f-deps] 131 | | ) -> Result<UVForestExport> {
  209. 390.80 s [gammaloop-crate-test-binaries-gammaloop-integration-tests-b8cda0d438c96d4f-deps] | |_______________________________- private method defined here
  210. 390.80 s [gammaloop-crate-test-binaries-gammaloop-integration-tests-b8cda0d438c96d4f-deps]
  211. 390.80 s [gammaloop-crate-test-binaries-gammaloop-integration-tests-b8cda0d438c96d4f-deps] error[E0624]: method `export_uv_forest_graph` is private
  212. 390.80 s [gammaloop-crate-test-binaries-gammaloop-integration-tests-b8cda0d438c96d4f-deps] --> tests/tests/uv.rs:5161:41
  213. 390.80 s [gammaloop-crate-test-binaries-gammaloop-integration-tests-b8cda0d438c96d4f-deps] |
  214. 390.80 s [gammaloop-crate-test-binaries-gammaloop-integration-tests-b8cda0d438c96d4f-deps] 5161 | let computed_forest = integrand.export_uv_forest_graph(
  215. 390.80 s [gammaloop-crate-test-binaries-gammaloop-integration-tests-b8cda0d438c96d4f-deps] | ^^^^^^^^^^^^^^^^^^^^^^ private method
  216. 390.80 s [gammaloop-crate-test-binaries-gammaloop-integration-tests-b8cda0d438c96d4f-deps] |
  217. 390.80 s [gammaloop-crate-test-binaries-gammaloop-integration-tests-b8cda0d438c96d4f-deps] ::: crates/gammalooprs/src/uv/export.rs:125:5
  218. 390.80 s [gammaloop-crate-test-binaries-gammaloop-integration-tests-b8cda0d438c96d4f-deps] |
  219. 390.80 s [gammaloop-crate-test-binaries-gammaloop-integration-tests-b8cda0d438c96d4f-deps] 125 | / pub(crate) fn export_uv_forest_graph(
  220. 390.80 s [gammaloop-crate-test-binaries-gammaloop-integration-tests-b8cda0d438c96d4f-deps] 126 | | &self,
  221. 390.80 s [gammaloop-crate-test-binaries-gammaloop-integration-tests-b8cda0d438c96d4f-deps] 127 | | graph_id: usize,
  222. 390.80 s [gammaloop-crate-test-binaries-gammaloop-integration-tests-b8cda0d438c96d4f-deps] 128 | | orientation: Option<OrientationProjection<'_>>,
  223. 390.80 s [gammaloop-crate-test-binaries-gammaloop-integration-tests-b8cda0d438c96d4f-deps] 129 | | generation_settings: &GenerationSettings,
  224. 390.80 s [gammaloop-crate-test-binaries-gammaloop-integration-tests-b8cda0d438c96d4f-deps] 130 | | export_settings: &UVForestExportSettings,
  225. 390.80 s [gammaloop-crate-test-binaries-gammaloop-integration-tests-b8cda0d438c96d4f-deps] 131 | | ) -> Result<UVForestExport> {
  226. 390.80 s [gammaloop-crate-test-binaries-gammaloop-integration-tests-b8cda0d438c96d4f-deps] | |_______________________________- private method defined here
  227. 390.80 s [gammaloop-crate-test-binaries-gammaloop-integration-tests-b8cda0d438c96d4f-deps]
  228. 390.93 s [gammaloop-crate-test-binaries-gammaloop-integration-tests-b8cda0d438c96d4f-deps] error[E0624]: method `export_uv_forest_graph` is private
  229. 390.93 s [gammaloop-crate-test-binaries-gammaloop-integration-tests-b8cda0d438c96d4f-deps] --> tests/tests/uv.rs:5724:51
  230. 390.93 s [gammaloop-crate-test-binaries-gammaloop-integration-tests-b8cda0d438c96d4f-deps] |
  231. 390.93 s [gammaloop-crate-test-binaries-gammaloop-integration-tests-b8cda0d438c96d4f-deps] 5724 | let structural_forest = integrand.export_uv_forest_graph(
  232. 390.93 s [gammaloop-crate-test-binaries-gammaloop-integration-tests-b8cda0d438c96d4f-deps] | ^^^^^^^^^^^^^^^^^^^^^^ private method
  233. 390.93 s [gammaloop-crate-test-binaries-gammaloop-integration-tests-b8cda0d438c96d4f-deps] |
  234. 390.93 s [gammaloop-crate-test-binaries-gammaloop-integration-tests-b8cda0d438c96d4f-deps] ::: crates/gammalooprs/src/uv/export.rs:125:5
  235. 390.93 s [gammaloop-crate-test-binaries-gammaloop-integration-tests-b8cda0d438c96d4f-deps] |
  236. 390.93 s [gammaloop-crate-test-binaries-gammaloop-integration-tests-b8cda0d438c96d4f-deps] 125 | / pub(crate) fn export_uv_forest_graph(
  237. 390.93 s [gammaloop-crate-test-binaries-gammaloop-integration-tests-b8cda0d438c96d4f-deps] 126 | | &self,
  238. 390.93 s [gammaloop-crate-test-binaries-gammaloop-integration-tests-b8cda0d438c96d4f-deps] 127 | | graph_id: usize,
  239. 390.93 s [gammaloop-crate-test-binaries-gammaloop-integration-tests-b8cda0d438c96d4f-deps] 128 | | orientation: Option<OrientationProjection<'_>>,
  240. 390.93 s [gammaloop-crate-test-binaries-gammaloop-integration-tests-b8cda0d438c96d4f-deps] 129 | | generation_settings: &GenerationSettings,
  241. 390.93 s [gammaloop-crate-test-binaries-gammaloop-integration-tests-b8cda0d438c96d4f-deps] 130 | | export_settings: &UVForestExportSettings,
  242. 390.93 s [gammaloop-crate-test-binaries-gammaloop-integration-tests-b8cda0d438c96d4f-deps] 131 | | ) -> Result<UVForestExport> {
  243. 390.93 s [gammaloop-crate-test-binaries-gammaloop-integration-tests-b8cda0d438c96d4f-deps] | |_______________________________- private method defined here
  244. 390.93 s [gammaloop-crate-test-binaries-gammaloop-integration-tests-b8cda0d438c96d4f-deps]
  245. 391.21 s [gammaloop-crate-test-binaries-gammaloop-integration-tests-b8cda0d438c96d4f-deps] Some errors have detailed explanations: E0061, E0609, E0616, E0624.
  246. 391.21 s [gammaloop-crate-test-binaries-gammaloop-integration-tests-b8cda0d438c96d4f-deps] For more information about an error, try `rustc --explain E0061`.
  247. 391.23 s [gammaloop-crate-test-binaries-gammaloop-integration-tests-b8cda0d438c96d4f-deps] error: could not compile `gammaloop-integration-tests` (test "uv") due to 13 previous errors
  248. 391.23 s [gammaloop-crate-test-binaries-gammaloop-integration-tests-b8cda0d438c96d4f-deps] warning: build failed, waiting for other jobs to finish...
  249. 497.87 s Progress: 2 of 4 built (1 failed)
  250. 497.87 s Failed to build gammaloop-crate-test-binaries-gammaloop-integration-tests-b8cda0d438c96d4f-deps after 1m49s
  251. 497.88 s error: Cannot build '/nix/store/jmdxlfvakb7hqqx0dbiq8qybml3didbp-gammaloop-crate-test-binaries-gammaloop-integration-tests-b8cda0d438c96d4f-deps-0.1.0.drv'.
  252. 497.88 s Reason: builder failed with exit code 101.
  253. 497.88 s Output paths:
  254. 497.88 s /nix/store/z7fnxfqj0k797i8c7vpay5bxg9nbn8zm-gammaloop-crate-test-binaries-gammaloop-integration-tests-b8cda0d438c96d4f-deps-0.1.0
  255. 497.88 s Last 225 log lines:
  256. 497.88 s > Running phase: unpackPhase
  257. 497.88 s > unpacking source archive /nix/store/s8h804zbj5xpi2ifcc945rxxavmvwxir-source
  258. 497.88 s > source root is source
  259. 497.88 s > Running phase: patchPhase
  260. 497.88 s > Executing configureCargoCommonVars
  261. 497.88 s > copying cargo artifacts from /nix/store/3jv2y5in0rr1jv0hdb45595kih4n826m-gammaloop-crate-test-binaries-gammaloop-integration-tests-b8cda0d438c96d4f-inputs/target to target
  262. 497.88 s > will deep copy artifacts (instead of symlinking) as requested
  263. 497.88 s > Running phase: updateAutotoolsGnuConfigScriptsPhase
  264. 497.88 s > Running phase: configurePhase
  265. 497.88 s > will append /build/source/.cargo-home/config.toml with contents of /nix/store/8zq9ya5slh345hbylmsibxw827bi98w0-vendor-cargo-deps/config.toml
  266. 497.88 s > default configurePhase, nothing to do
  267. 497.88 s > Running phase: buildPhase
  268. 497.88 s > +++ command cargo --version
  269. 497.88 s > cargo 1.97.0 (c980f4866 2026-06-30)
  270. 497.88 s > +++ command cargo test --profile ci-optim --no-run --offline -p gammaloop-integration-tests
  271. 497.88 s > Compiling gammaloop-integration-tests v0.1.0 (/build/source/tests)
  272. 497.88 s > error[E0624]: method `export_uv_forest_graph` is private
  273. 497.88 s > --> tests/tests/uv.rs:3426:33
  274. 497.88 s > |
  275. 497.88 s > 3426 | let soft_export = integrand.export_uv_forest_graph(
  276. 497.88 s > | ^^^^^^^^^^^^^^^^^^^^^^ private method
  277. 497.88 s > |
  278. 497.88 s > ::: crates/gammalooprs/src/uv/export.rs:125:5
  279. 497.88 s > |
  280. 497.88 s > 125 | / pub(crate) fn export_uv_forest_graph(
  281. 497.88 s > 126 | | &self,
  282. 497.88 s > 127 | | graph_id: usize,
  283. 497.88 s > 128 | | orientation: Option<OrientationProjection<'_>>,
  284. 497.88 s > 129 | | generation_settings: &GenerationSettings,
  285. 497.88 s > 130 | | export_settings: &UVForestExportSettings,
  286. 497.88 s > 131 | | ) -> Result<UVForestExport> {
  287. 497.88 s > | |_______________________________- private method defined here
  288. 497.88 s >
  289. 497.88 s > error[E0624]: method `export_uv_forest_graph` is private
  290. 497.88 s > --> tests/tests/uv.rs:3522:38
  291. 497.88 s > |
  292. 497.88 s > 3522 | let uv_export = uv_integrand.export_uv_forest_graph(
  293. 497.88 s > | ^^^^^^^^^^^^^^^^^^^^^^ private method
  294. 497.88 s > |
  295. 497.88 s > ::: crates/gammalooprs/src/uv/export.rs:125:5
  296. 497.88 s > |
  297. 497.88 s > 125 | / pub(crate) fn export_uv_forest_graph(
  298. 497.88 s > 126 | | &self,
  299. 497.88 s > 127 | | graph_id: usize,
  300. 497.88 s > 128 | | orientation: Option<OrientationProjection<'_>>,
  301. 497.88 s > 129 | | generation_settings: &GenerationSettings,
  302. 497.88 s > 130 | | export_settings: &UVForestExportSettings,
  303. 497.88 s > 131 | | ) -> Result<UVForestExport> {
  304. 497.88 s > | |_______________________________- private method defined here
  305. 497.88 s >
  306. 497.88 s > error[E0624]: method `export_uv_forest_graph` is private
  307. 497.88 s > --> tests/tests/uv.rs:3936:44
  308. 497.88 s > |
  309. 497.88 s > 3936 | let export = integrand.export_uv_forest_graph(
  310. 497.88 s > | ^^^^^^^^^^^^^^^^^^^^^^ private method
  311. 497.88 s > |
  312. 497.88 s > ::: crates/gammalooprs/src/uv/export.rs:125:5
  313. 497.88 s > |
  314. 497.88 s > 125 | / pub(crate) fn export_uv_forest_graph(
  315. 497.88 s > 126 | | &self,
  316. 497.88 s > 127 | | graph_id: usize,
  317. 497.88 s > 128 | | orientation: Option<OrientationProjection<'_>>,
  318. 497.88 s > 129 | | generation_settings: &GenerationSettings,
  319. 497.88 s > 130 | | export_settings: &UVForestExportSettings,
  320. 497.88 s > 131 | | ) -> Result<UVForestExport> {
  321. 497.88 s > | |_______________________________- private method defined here
  322. 497.88 s >
  323. 497.88 s > error[E0624]: method `export_uv_forest_graph` is private
  324. 497.88 s > --> tests/tests/uv.rs:4128:36
  325. 497.88 s > |
  326. 497.88 s > 4128 | let export = integrand.export_uv_forest_graph(
  327. 497.88 s > | ^^^^^^^^^^^^^^^^^^^^^^ private method
  328. 497.88 s > |
  329. 497.88 s > ::: crates/gammalooprs/src/uv/export.rs:125:5
  330. 497.88 s > |
  331. 497.88 s > 125 | / pub(crate) fn export_uv_forest_graph(
  332. 497.88 s > 126 | | &self,
  333. 497.88 s > 127 | | graph_id: usize,
  334. 497.88 s > 128 | | orientation: Option<OrientationProjection<'_>>,
  335. 497.88 s > 129 | | generation_settings: &GenerationSettings,
  336. 497.88 s > 130 | | export_settings: &UVForestExportSettings,
  337. 497.88 s > 131 | | ) -> Result<UVForestExport> {
  338. 497.88 s > | |_______________________________- private method defined here
  339. 497.88 s >
  340. 497.88 s > error[E0624]: method `export_uv_forest_graph` is private
  341. 497.88 s > --> tests/tests/uv.rs:4335:36
  342. 497.88 s > |
  343. 497.88 s > 4335 | let export = integrand.export_uv_forest_graph(
  344. 497.88 s > | ^^^^^^^^^^^^^^^^^^^^^^ private method
  345. 497.88 s > |
  346. 497.88 s > ::: crates/gammalooprs/src/uv/export.rs:125:5
  347. 497.88 s > |
  348. 497.88 s > 125 | / pub(crate) fn export_uv_forest_graph(
  349. 497.88 s > 126 | | &self,
  350. 497.88 s > 127 | | graph_id: usize,
  351. 497.88 s > 128 | | orientation: Option<OrientationProjection<'_>>,
  352. 497.88 s > 129 | | generation_settings: &GenerationSettings,
  353. 497.88 s > 130 | | export_settings: &UVForestExportSettings,
  354. 497.88 s > 131 | | ) -> Result<UVForestExport> {
  355. 497.88 s > | |_______________________________- private method defined here
  356. 497.88 s >
  357. 497.88 s > error[E0061]: this method takes 5 arguments but 3 arguments were supplied
  358. 497.88 s > --> tests/tests/uv.rs:4551:26
  359. 497.88 s > |
  360. 497.88 s > 4551 | parent_graph.cff(&parent_tree, &parent_cut, &OrientationPattern::default())?;
  361. 497.88 s > | ^^^----------------------------------------------------------- two arguments of type `&three_dimensional_reps::generation::Generate3DExpressionOptions` and `Option<&symbolica::atom::Atom>` are missing
  362. 497.88 s > |
  363. 497.88 s > note: method defined here
  364. 497.88 s > --> crates/gammalooprs/src/cff/mod.rs:755:12
  365. 497.88 s > |
  366. 497.88 s > 755 | pub fn cff<S: SubGraphLike + SubSetLike>(
  367. 497.88 s > | ^^^
  368. 497.88 s > help: provide the arguments
  369. 497.88 s > |
  370. 497.88 s > 4551 | parent_graph.cff(&parent_tree, &parent_cut, &OrientationPattern::default(), /* &three_dimensional_reps::generation::Generate3DExpressionOptions */, /* Option<&symbolica::atom::Atom> */)?;
  371. 497.88 s > | ++++++++++++++++++++++++++++++++++++++++++++++++++++++++++++++++++++++++++++++++++++++++++++++++++++++++++++++
  372. 497.88 s >
  373. 497.88 s > error[E0616]: field `orientations` of struct `CFFTerm` is private
  374. 497.88 s > --> tests/tests/uv.rs:4555:36
  375. 497.88 s > |
  376. 497.88 s > 4555 | .flat_map(|term| &term.orientations)
  377. 497.88 s > | ^^^^^^^^^^^^ private field
  378. 497.88 s >
  379. 497.88 s > error[E0609]: no field `orientations` on type `&GeneratedThreeDExpression<Esurface, Hsurface>`
  380. 497.88 s > --> tests/tests/uv.rs:4653:18
  381. 497.88 s > |
  382. 497.88 s > 4653 | .orientations
  383. 497.88 s > | ^^^^^^^^^^^^ unknown field
  384. 497.88 s > |
  385. 497.88 s > = note: the full name for the type has been written to '/build/source/target/ci-optim/deps/uv-ce4ce797f04de65a.long-type-18114926718083020756.txt'
  386. 497.88 s > = note: consider using `--verbose` to print the full type name to the console
  387. 497.88 s > help: one of the expressions' fields has a field of the same name
  388. 497.88 s > |
  389. 497.88 s > 4653 | .expression.orientations
  390. 497.88 s > | +++++++++++
  391. 497.88 s >
  392. 497.88 s > error[E0624]: method `export_uv_forest_graph` is private
  393. 497.88 s > --> tests/tests/uv.rs:4673:43
  394. 497.88 s > |
  395. 497.88 s > 4673 | let structural_forest = integrand.export_uv_forest_graph(
  396. 497.88 s > | ^^^^^^^^^^^^^^^^^^^^^^ private method
  397. 497.88 s > |
  398. 497.88 s > ::: crates/gammalooprs/src/uv/export.rs:125:5
  399. 497.88 s > |
  400. 497.88 s > 125 | / pub(crate) fn export_uv_forest_graph(
  401. 497.88 s > 126 | | &self,
  402. 497.88 s > 127 | | graph_id: usize,
  403. 497.88 s > 128 | | orientation: Option<OrientationProjection<'_>>,
  404. 497.88 s > 129 | | generation_settings: &GenerationSettings,
  405. 497.88 s > 130 | | export_settings: &UVForestExportSettings,
  406. 497.88 s > 131 | | ) -> Result<UVForestExport> {
  407. 497.88 s > | |_______________________________- private method defined here
  408. 497.88 s >
  409. 497.88 s > error[E0624]: method `export_uv_forest_graph` is private
  410. 497.88 s > --> tests/tests/uv.rs:4897:43
  411. 497.88 s > |
  412. 497.88 s > 4897 | let structural_forest = integrand.export_uv_forest_graph(
  413. 497.88 s > | ^^^^^^^^^^^^^^^^^^^^^^ private method
  414. 497.88 s > |
  415. 497.88 s > ::: crates/gammalooprs/src/uv/export.rs:125:5
  416. 497.88 s > |
  417. 497.88 s > 125 | / pub(crate) fn export_uv_forest_graph(
  418. 497.88 s > 126 | | &self,
  419. 497.88 s > 127 | | graph_id: usize,
  420. 497.88 s > 128 | | orientation: Option<OrientationProjection<'_>>,
  421. 497.88 s > 129 | | generation_settings: &GenerationSettings,
  422. 497.88 s > 130 | | export_settings: &UVForestExportSettings,
  423. 497.88 s > 131 | | ) -> Result<UVForestExport> {
  424. 497.88 s > | |_______________________________- private method defined here
  425. 497.88 s >
  426. 497.88 s > error[E0624]: method `export_uv_forest_graph` is private
  427. 497.88 s > --> tests/tests/uv.rs:5146:43
  428. 497.88 s > |
  429. 497.88 s > 5146 | let structural_forest = integrand.export_uv_forest_graph(
  430. 497.88 s > | ^^^^^^^^^^^^^^^^^^^^^^ private method
  431. 497.88 s > |
  432. 497.88 s > ::: crates/gammalooprs/src/uv/export.rs:125:5
  433. 497.88 s > |
  434. 497.88 s > 125 | / pub(crate) fn export_uv_forest_graph(
  435. 497.88 s > 126 | | &self,
  436. 497.88 s > 127 | | graph_id: usize,
  437. 497.88 s > 128 | | orientation: Option<OrientationProjection<'_>>,
  438. 497.88 s > 129 | | generation_settings: &GenerationSettings,
  439. 497.88 s > 130 | | export_settings: &UVForestExportSettings,
  440. 497.88 s > 131 | | ) -> Result<UVForestExport> {
  441. 497.88 s > | |_______________________________- private method defined here
  442. 497.88 s >
  443. 497.88 s > error[E0624]: method `export_uv_forest_graph` is private
  444. 497.88 s > --> tests/tests/uv.rs:5161:41
  445. 497.88 s > |
  446. 497.88 s > 5161 | let computed_forest = integrand.export_uv_forest_graph(
  447. 497.88 s > | ^^^^^^^^^^^^^^^^^^^^^^ private method
  448. 497.88 s > |
  449. 497.88 s > ::: crates/gammalooprs/src/uv/export.rs:125:5
  450. 497.88 s > |
  451. 497.88 s > 125 | / pub(crate) fn export_uv_forest_graph(
  452. 497.88 s > 126 | | &self,
  453. 497.88 s > 127 | | graph_id: usize,
  454. 497.88 s > 128 | | orientation: Option<OrientationProjection<'_>>,
  455. 497.88 s > 129 | | generation_settings: &GenerationSettings,
  456. 497.88 s > 130 | | export_settings: &UVForestExportSettings,
  457. 497.88 s > 131 | | ) -> Result<UVForestExport> {
  458. 497.88 s > | |_______________________________- private method defined here
  459. 497.88 s >
  460. 497.88 s > error[E0624]: method `export_uv_forest_graph` is private
  461. 497.88 s > --> tests/tests/uv.rs:5724:51
  462. 497.88 s > |
  463. 497.88 s > 5724 | let structural_forest = integrand.export_uv_forest_graph(
  464. 497.88 s > | ^^^^^^^^^^^^^^^^^^^^^^ private method
  465. 497.88 s > |
  466. 497.88 s > ::: crates/gammalooprs/src/uv/export.rs:125:5
  467. 497.88 s > |
  468. 497.88 s > 125 | / pub(crate) fn export_uv_forest_graph(
  469. 497.88 s > 126 | | &self,
  470. 497.88 s > 127 | | graph_id: usize,
  471. 497.88 s > 128 | | orientation: Option<OrientationProjection<'_>>,
  472. 497.88 s > 129 | | generation_settings: &GenerationSettings,
  473. 497.88 s > 130 | | export_settings: &UVForestExportSettings,
  474. 497.88 s > 131 | | ) -> Result<UVForestExport> {
  475. 497.88 s > | |_______________________________- private method defined here
  476. 497.88 s >
  477. 497.88 s > Some errors have detailed explanations: E0061, E0609, E0616, E0624.
  478. 497.88 s > For more information about an error, try `rustc --explain E0061`.
  479. 497.88 s > error: could not compile `gammaloop-integration-tests` (test "uv") due to 13 previous errors
  480. 497.88 s > warning: build failed, waiting for other jobs to finish...
  481. 497.88 s For full logs, run:
  482. 497.88 s nix log /nix/store/jmdxlfvakb7hqqx0dbiq8qybml3didbp-gammaloop-crate-test-binaries-gammaloop-integration-tests-b8cda0d438c96d4f-deps-0.1.0.drv
  483. 497.88 s error: Cannot build '/nix/store/iv6mkn8q4k8zm0nv65sm048v1mk2abq1-nix-ci-artifact-barrier-crate-test-binaries-gammaloop-integration-tests.drv'.
  484. 497.88 s Reason: 1 dependency failed.
  485. 497.88 s Output paths:
  486. 497.88 s /nix/store/alqj26s1binb75rfk04kcvmmvic0a5vh-nix-ci-artifact-barrier-crate-test-binaries-gammaloop-integration-tests
  487. 497.88 s Build failed due to failed dependency
  488. 497.93 s Build failed.