build packages.x86_64-linux.crate-test-binaries-gammaloop-integration-tests
0.00 s
$ /nix/store/9ypz3flqsrl5xl495mm8h645gadjsxi1-coreutils-9.11/bin/timeout --kill-after=15s 7200s /nix/store/23zk8sgzamrbmj1fday15szf7f2279s8-nix-2.34.7/bin/nix --extra-experimental-features nix-command --extra-experimental-features flakes --log-format internal-json build --no-link --print-out-paths git+https://github.com/alphal00p/gammaloop?ref=codex%2Fdocs-manuals&rev=fa8ed9a02ca7dff8db2b623fcf9163af3051b0df&shallow=1#packages.x86_64-linux.crate-test-binaries-gammaloop-integration-tests --print-build-logs
0.12 s
0.38 s
Building /nix/store/jmdxlfvakb7hqqx0dbiq8qybml3didbp-gammaloop-crate-test-binaries-gammaloop-integration-tests-b8cda0d438c96d4f-deps-0.1.0.drv
0.45 s
[gammaloop-crate-test-binaries-gammaloop-integration-tests-b8cda0d438c96d4f-deps] Phase: unpackPhase
0.45 s
[gammaloop-crate-test-binaries-gammaloop-integration-tests-b8cda0d438c96d4f-deps] unpacking source archive /nix/store/s8h804zbj5xpi2ifcc945rxxavmvwxir-source
0.58 s
[gammaloop-crate-test-binaries-gammaloop-integration-tests-b8cda0d438c96d4f-deps] source root is source
0.60 s
[gammaloop-crate-test-binaries-gammaloop-integration-tests-b8cda0d438c96d4f-deps] Phase: patchPhase
0.68 s
[gammaloop-crate-test-binaries-gammaloop-integration-tests-b8cda0d438c96d4f-deps] Executing configureCargoCommonVars
0.68 s
[gammaloop-crate-test-binaries-gammaloop-integration-tests-b8cda0d438c96d4f-deps] copying cargo artifacts from /nix/store/3jv2y5in0rr1jv0hdb45595kih4n826m-gammaloop-crate-test-binaries-gammaloop-integration-tests-b8cda0d438c96d4f-inputs/target to target
0.68 s
[gammaloop-crate-test-binaries-gammaloop-integration-tests-b8cda0d438c96d4f-deps] will deep copy artifacts (instead of symlinking) as requested
2.34 s
[gammaloop-crate-test-binaries-gammaloop-integration-tests-b8cda0d438c96d4f-deps] Phase: updateAutotoolsGnuConfigScriptsPhase
2.37 s
[gammaloop-crate-test-binaries-gammaloop-integration-tests-b8cda0d438c96d4f-deps] Phase: configurePhase
2.38 s
[gammaloop-crate-test-binaries-gammaloop-integration-tests-b8cda0d438c96d4f-deps] will append /build/source/.cargo-home/config.toml with contents of /nix/store/8zq9ya5slh345hbylmsibxw827bi98w0-vendor-cargo-deps/config.toml
2.38 s
[gammaloop-crate-test-binaries-gammaloop-integration-tests-b8cda0d438c96d4f-deps] default configurePhase, nothing to do
2.38 s
[gammaloop-crate-test-binaries-gammaloop-integration-tests-b8cda0d438c96d4f-deps] Phase: buildPhase
2.39 s
[gammaloop-crate-test-binaries-gammaloop-integration-tests-b8cda0d438c96d4f-deps] +++ command cargo --version
2.39 s
[gammaloop-crate-test-binaries-gammaloop-integration-tests-b8cda0d438c96d4f-deps] cargo 1.97.0 (c980f4866 2026-06-30)
2.39 s
[gammaloop-crate-test-binaries-gammaloop-integration-tests-b8cda0d438c96d4f-deps] +++ command cargo test --profile ci-optim --no-run --offline -p gammaloop-integration-tests
2.80 s
[gammaloop-crate-test-binaries-gammaloop-integration-tests-b8cda0d438c96d4f-deps] Compiling gammaloop-integration-tests v0.1.0 (/build/source/tests)
3.32 s
[gammaloop-crate-test-binaries-gammaloop-integration-tests-b8cda0d438c96d4f-deps] error[E0624] : method `export_uv_forest_graph` is private
3.32 s
[gammaloop-crate-test-binaries-gammaloop-integration-tests-b8cda0d438c96d4f-deps] --> tests/tests/uv.rs:3426:33
3.32 s
[gammaloop-crate-test-binaries-gammaloop-integration-tests-b8cda0d438c96d4f-deps] |
3.32 s
[gammaloop-crate-test-binaries-gammaloop-integration-tests-b8cda0d438c96d4f-deps] 3426 | let soft_export = integrand.export_uv_forest_graph(
3.32 s
[gammaloop-crate-test-binaries-gammaloop-integration-tests-b8cda0d438c96d4f-deps] | ^^^^^^^^^^^^^^^^^^^^^^ private method
3.32 s
[gammaloop-crate-test-binaries-gammaloop-integration-tests-b8cda0d438c96d4f-deps] |
3.32 s
[gammaloop-crate-test-binaries-gammaloop-integration-tests-b8cda0d438c96d4f-deps] ::: crates/gammalooprs/src/uv/export.rs:125:5
3.32 s
[gammaloop-crate-test-binaries-gammaloop-integration-tests-b8cda0d438c96d4f-deps] |
3.32 s
[gammaloop-crate-test-binaries-gammaloop-integration-tests-b8cda0d438c96d4f-deps] 125 | / pub(crate) fn export_uv_forest_graph(
3.32 s
[gammaloop-crate-test-binaries-gammaloop-integration-tests-b8cda0d438c96d4f-deps] 126 | | &self,
3.32 s
[gammaloop-crate-test-binaries-gammaloop-integration-tests-b8cda0d438c96d4f-deps] 127 | | graph_id: usize,
3.32 s
[gammaloop-crate-test-binaries-gammaloop-integration-tests-b8cda0d438c96d4f-deps] 128 | | orientation: Option<OrientationProjection<'_>>,
3.32 s
[gammaloop-crate-test-binaries-gammaloop-integration-tests-b8cda0d438c96d4f-deps] 129 | | generation_settings: &GenerationSettings,
3.32 s
[gammaloop-crate-test-binaries-gammaloop-integration-tests-b8cda0d438c96d4f-deps] 130 | | export_settings: &UVForestExportSettings,
3.32 s
[gammaloop-crate-test-binaries-gammaloop-integration-tests-b8cda0d438c96d4f-deps] 131 | | ) -> Result<UVForestExport> {
3.32 s
[gammaloop-crate-test-binaries-gammaloop-integration-tests-b8cda0d438c96d4f-deps] | |_______________________________- private method defined here
3.32 s
[gammaloop-crate-test-binaries-gammaloop-integration-tests-b8cda0d438c96d4f-deps]
3.32 s
[gammaloop-crate-test-binaries-gammaloop-integration-tests-b8cda0d438c96d4f-deps] error[E0624] : method `export_uv_forest_graph` is private
3.32 s
[gammaloop-crate-test-binaries-gammaloop-integration-tests-b8cda0d438c96d4f-deps] --> tests/tests/uv.rs:3522:38
3.32 s
[gammaloop-crate-test-binaries-gammaloop-integration-tests-b8cda0d438c96d4f-deps] |
3.32 s
[gammaloop-crate-test-binaries-gammaloop-integration-tests-b8cda0d438c96d4f-deps] 3522 | let uv_export = uv_integrand.export_uv_forest_graph(
3.32 s
[gammaloop-crate-test-binaries-gammaloop-integration-tests-b8cda0d438c96d4f-deps] | ^^^^^^^^^^^^^^^^^^^^^^ private method
3.32 s
[gammaloop-crate-test-binaries-gammaloop-integration-tests-b8cda0d438c96d4f-deps] |
3.32 s
[gammaloop-crate-test-binaries-gammaloop-integration-tests-b8cda0d438c96d4f-deps] ::: crates/gammalooprs/src/uv/export.rs:125:5
3.32 s
[gammaloop-crate-test-binaries-gammaloop-integration-tests-b8cda0d438c96d4f-deps] |
3.32 s
[gammaloop-crate-test-binaries-gammaloop-integration-tests-b8cda0d438c96d4f-deps] 125 | / pub(crate) fn export_uv_forest_graph(
3.32 s
[gammaloop-crate-test-binaries-gammaloop-integration-tests-b8cda0d438c96d4f-deps] 126 | | &self,
3.32 s
[gammaloop-crate-test-binaries-gammaloop-integration-tests-b8cda0d438c96d4f-deps] 127 | | graph_id: usize,
3.32 s
[gammaloop-crate-test-binaries-gammaloop-integration-tests-b8cda0d438c96d4f-deps] 128 | | orientation: Option<OrientationProjection<'_>>,
3.32 s
[gammaloop-crate-test-binaries-gammaloop-integration-tests-b8cda0d438c96d4f-deps] 129 | | generation_settings: &GenerationSettings,
3.32 s
[gammaloop-crate-test-binaries-gammaloop-integration-tests-b8cda0d438c96d4f-deps] 130 | | export_settings: &UVForestExportSettings,
3.32 s
[gammaloop-crate-test-binaries-gammaloop-integration-tests-b8cda0d438c96d4f-deps] 131 | | ) -> Result<UVForestExport> {
3.32 s
[gammaloop-crate-test-binaries-gammaloop-integration-tests-b8cda0d438c96d4f-deps] | |_______________________________- private method defined here
3.32 s
[gammaloop-crate-test-binaries-gammaloop-integration-tests-b8cda0d438c96d4f-deps]
3.35 s
[gammaloop-crate-test-binaries-gammaloop-integration-tests-b8cda0d438c96d4f-deps] error[E0624] : method `export_uv_forest_graph` is private
3.35 s
[gammaloop-crate-test-binaries-gammaloop-integration-tests-b8cda0d438c96d4f-deps] --> tests/tests/uv.rs:3936:44
3.35 s
[gammaloop-crate-test-binaries-gammaloop-integration-tests-b8cda0d438c96d4f-deps] |
3.35 s
[gammaloop-crate-test-binaries-gammaloop-integration-tests-b8cda0d438c96d4f-deps] 3936 | let export = integrand.export_uv_forest_graph(
3.35 s
[gammaloop-crate-test-binaries-gammaloop-integration-tests-b8cda0d438c96d4f-deps] | ^^^^^^^^^^^^^^^^^^^^^^ private method
3.35 s
[gammaloop-crate-test-binaries-gammaloop-integration-tests-b8cda0d438c96d4f-deps] |
3.35 s
[gammaloop-crate-test-binaries-gammaloop-integration-tests-b8cda0d438c96d4f-deps] ::: crates/gammalooprs/src/uv/export.rs:125:5
3.35 s
[gammaloop-crate-test-binaries-gammaloop-integration-tests-b8cda0d438c96d4f-deps] |
3.35 s
[gammaloop-crate-test-binaries-gammaloop-integration-tests-b8cda0d438c96d4f-deps] 125 | / pub(crate) fn export_uv_forest_graph(
3.35 s
[gammaloop-crate-test-binaries-gammaloop-integration-tests-b8cda0d438c96d4f-deps] 126 | | &self,
3.35 s
[gammaloop-crate-test-binaries-gammaloop-integration-tests-b8cda0d438c96d4f-deps] 127 | | graph_id: usize,
3.35 s
[gammaloop-crate-test-binaries-gammaloop-integration-tests-b8cda0d438c96d4f-deps] 128 | | orientation: Option<OrientationProjection<'_>>,
3.35 s
[gammaloop-crate-test-binaries-gammaloop-integration-tests-b8cda0d438c96d4f-deps] 129 | | generation_settings: &GenerationSettings,
3.35 s
[gammaloop-crate-test-binaries-gammaloop-integration-tests-b8cda0d438c96d4f-deps] 130 | | export_settings: &UVForestExportSettings,
3.35 s
[gammaloop-crate-test-binaries-gammaloop-integration-tests-b8cda0d438c96d4f-deps] 131 | | ) -> Result<UVForestExport> {
3.35 s
[gammaloop-crate-test-binaries-gammaloop-integration-tests-b8cda0d438c96d4f-deps] | |_______________________________- private method defined here
3.35 s
[gammaloop-crate-test-binaries-gammaloop-integration-tests-b8cda0d438c96d4f-deps]
3.37 s
[gammaloop-crate-test-binaries-gammaloop-integration-tests-b8cda0d438c96d4f-deps] error[E0624] : method `export_uv_forest_graph` is private
3.37 s
[gammaloop-crate-test-binaries-gammaloop-integration-tests-b8cda0d438c96d4f-deps] --> tests/tests/uv.rs:4128:36
3.37 s
[gammaloop-crate-test-binaries-gammaloop-integration-tests-b8cda0d438c96d4f-deps] |
3.37 s
[gammaloop-crate-test-binaries-gammaloop-integration-tests-b8cda0d438c96d4f-deps] 4128 | let export = integrand.export_uv_forest_graph(
3.37 s
[gammaloop-crate-test-binaries-gammaloop-integration-tests-b8cda0d438c96d4f-deps] | ^^^^^^^^^^^^^^^^^^^^^^ private method
3.37 s
[gammaloop-crate-test-binaries-gammaloop-integration-tests-b8cda0d438c96d4f-deps] |
3.37 s
[gammaloop-crate-test-binaries-gammaloop-integration-tests-b8cda0d438c96d4f-deps] ::: crates/gammalooprs/src/uv/export.rs:125:5
3.37 s
[gammaloop-crate-test-binaries-gammaloop-integration-tests-b8cda0d438c96d4f-deps] |
3.37 s
[gammaloop-crate-test-binaries-gammaloop-integration-tests-b8cda0d438c96d4f-deps] 125 | / pub(crate) fn export_uv_forest_graph(
3.37 s
[gammaloop-crate-test-binaries-gammaloop-integration-tests-b8cda0d438c96d4f-deps] 126 | | &self,
3.37 s
[gammaloop-crate-test-binaries-gammaloop-integration-tests-b8cda0d438c96d4f-deps] 127 | | graph_id: usize,
3.37 s
[gammaloop-crate-test-binaries-gammaloop-integration-tests-b8cda0d438c96d4f-deps] 128 | | orientation: Option<OrientationProjection<'_>>,
3.37 s
[gammaloop-crate-test-binaries-gammaloop-integration-tests-b8cda0d438c96d4f-deps] 129 | | generation_settings: &GenerationSettings,
3.37 s
[gammaloop-crate-test-binaries-gammaloop-integration-tests-b8cda0d438c96d4f-deps] 130 | | export_settings: &UVForestExportSettings,
3.37 s
[gammaloop-crate-test-binaries-gammaloop-integration-tests-b8cda0d438c96d4f-deps] 131 | | ) -> Result<UVForestExport> {
3.37 s
[gammaloop-crate-test-binaries-gammaloop-integration-tests-b8cda0d438c96d4f-deps] | |_______________________________- private method defined here
3.37 s
[gammaloop-crate-test-binaries-gammaloop-integration-tests-b8cda0d438c96d4f-deps]
3.38 s
[gammaloop-crate-test-binaries-gammaloop-integration-tests-b8cda0d438c96d4f-deps] error[E0624] : method `export_uv_forest_graph` is private
3.38 s
[gammaloop-crate-test-binaries-gammaloop-integration-tests-b8cda0d438c96d4f-deps] --> tests/tests/uv.rs:4335:36
3.38 s
[gammaloop-crate-test-binaries-gammaloop-integration-tests-b8cda0d438c96d4f-deps] |
3.38 s
[gammaloop-crate-test-binaries-gammaloop-integration-tests-b8cda0d438c96d4f-deps] 4335 | let export = integrand.export_uv_forest_graph(
3.38 s
[gammaloop-crate-test-binaries-gammaloop-integration-tests-b8cda0d438c96d4f-deps] | ^^^^^^^^^^^^^^^^^^^^^^ private method
3.38 s
[gammaloop-crate-test-binaries-gammaloop-integration-tests-b8cda0d438c96d4f-deps] |
3.38 s
[gammaloop-crate-test-binaries-gammaloop-integration-tests-b8cda0d438c96d4f-deps] ::: crates/gammalooprs/src/uv/export.rs:125:5
3.38 s
[gammaloop-crate-test-binaries-gammaloop-integration-tests-b8cda0d438c96d4f-deps] |
3.38 s
[gammaloop-crate-test-binaries-gammaloop-integration-tests-b8cda0d438c96d4f-deps] 125 | / pub(crate) fn export_uv_forest_graph(
3.38 s
[gammaloop-crate-test-binaries-gammaloop-integration-tests-b8cda0d438c96d4f-deps] 126 | | &self,
3.38 s
[gammaloop-crate-test-binaries-gammaloop-integration-tests-b8cda0d438c96d4f-deps] 127 | | graph_id: usize,
3.38 s
[gammaloop-crate-test-binaries-gammaloop-integration-tests-b8cda0d438c96d4f-deps] 128 | | orientation: Option<OrientationProjection<'_>>,
3.38 s
[gammaloop-crate-test-binaries-gammaloop-integration-tests-b8cda0d438c96d4f-deps] 129 | | generation_settings: &GenerationSettings,
3.38 s
[gammaloop-crate-test-binaries-gammaloop-integration-tests-b8cda0d438c96d4f-deps] 130 | | export_settings: &UVForestExportSettings,
3.38 s
[gammaloop-crate-test-binaries-gammaloop-integration-tests-b8cda0d438c96d4f-deps] 131 | | ) -> Result<UVForestExport> {
3.38 s
[gammaloop-crate-test-binaries-gammaloop-integration-tests-b8cda0d438c96d4f-deps] | |_______________________________- private method defined here
3.38 s
[gammaloop-crate-test-binaries-gammaloop-integration-tests-b8cda0d438c96d4f-deps]
3.51 s
[gammaloop-crate-test-binaries-gammaloop-integration-tests-b8cda0d438c96d4f-deps] error[E0061] : this method takes 5 arguments but 3 arguments were supplied
3.51 s
[gammaloop-crate-test-binaries-gammaloop-integration-tests-b8cda0d438c96d4f-deps] --> tests/tests/uv.rs:4551:26
3.51 s
[gammaloop-crate-test-binaries-gammaloop-integration-tests-b8cda0d438c96d4f-deps] |
3.51 s
[gammaloop-crate-test-binaries-gammaloop-integration-tests-b8cda0d438c96d4f-deps] 4551 | parent_graph.cff(&parent_tree, &parent_cut, &OrientationPattern::default())?;
3.51 s
[gammaloop-crate-test-binaries-gammaloop-integration-tests-b8cda0d438c96d4f-deps] | ^^^ ----------------------------------------------------------- two arguments of type `&three_dimensional_reps::generation::Generate3DExpressionOptions` and `Option<&symbolica::atom::Atom>` are missing
3.51 s
[gammaloop-crate-test-binaries-gammaloop-integration-tests-b8cda0d438c96d4f-deps] |
3.51 s
[gammaloop-crate-test-binaries-gammaloop-integration-tests-b8cda0d438c96d4f-deps] note : method defined here
3.51 s
[gammaloop-crate-test-binaries-gammaloop-integration-tests-b8cda0d438c96d4f-deps] --> crates/gammalooprs/src/cff/mod.rs:755:12
3.51 s
[gammaloop-crate-test-binaries-gammaloop-integration-tests-b8cda0d438c96d4f-deps] |
3.51 s
[gammaloop-crate-test-binaries-gammaloop-integration-tests-b8cda0d438c96d4f-deps] 755 | pub fn cff<S: SubGraphLike + SubSetLike>(
3.51 s
[gammaloop-crate-test-binaries-gammaloop-integration-tests-b8cda0d438c96d4f-deps] | ^^^
3.51 s
[gammaloop-crate-test-binaries-gammaloop-integration-tests-b8cda0d438c96d4f-deps] help : provide the arguments
3.51 s
[gammaloop-crate-test-binaries-gammaloop-integration-tests-b8cda0d438c96d4f-deps] |
3.51 s
[gammaloop-crate-test-binaries-gammaloop-integration-tests-b8cda0d438c96d4f-deps] 4551 | parent_graph.cff(&parent_tree, &parent_cut, &OrientationPattern::default(), /* &three_dimensional_reps::generation::Generate3DExpressionOptions */, /* Option<&symbolica::atom::Atom> */ )?;
3.51 s
[gammaloop-crate-test-binaries-gammaloop-integration-tests-b8cda0d438c96d4f-deps] | ++++++++++++++++++++++++++++++++++++++++++++++++++++++++++++++++++++++++++++++++++++++++++++++++++++++++++++++
3.51 s
[gammaloop-crate-test-binaries-gammaloop-integration-tests-b8cda0d438c96d4f-deps]
3.51 s
[gammaloop-crate-test-binaries-gammaloop-integration-tests-b8cda0d438c96d4f-deps] error[E0616] : field `orientations` of struct `CFFTerm` is private
3.51 s
[gammaloop-crate-test-binaries-gammaloop-integration-tests-b8cda0d438c96d4f-deps] --> tests/tests/uv.rs:4555:36
3.51 s
[gammaloop-crate-test-binaries-gammaloop-integration-tests-b8cda0d438c96d4f-deps] |
3.51 s
[gammaloop-crate-test-binaries-gammaloop-integration-tests-b8cda0d438c96d4f-deps] 4555 | .flat_map(|term| &term.orientations)
3.51 s
[gammaloop-crate-test-binaries-gammaloop-integration-tests-b8cda0d438c96d4f-deps] | ^^^^^^^^^^^^ private field
3.51 s
[gammaloop-crate-test-binaries-gammaloop-integration-tests-b8cda0d438c96d4f-deps]
3.57 s
[gammaloop-crate-test-binaries-gammaloop-integration-tests-b8cda0d438c96d4f-deps] error[E0609] : no field `orientations` on type `&GeneratedThreeDExpression<Esurface, Hsurface>`
3.57 s
[gammaloop-crate-test-binaries-gammaloop-integration-tests-b8cda0d438c96d4f-deps] --> tests/tests/uv.rs:4653:18
3.57 s
[gammaloop-crate-test-binaries-gammaloop-integration-tests-b8cda0d438c96d4f-deps] |
3.57 s
[gammaloop-crate-test-binaries-gammaloop-integration-tests-b8cda0d438c96d4f-deps] 4653 | .orientations
3.57 s
[gammaloop-crate-test-binaries-gammaloop-integration-tests-b8cda0d438c96d4f-deps] | ^^^^^^^^^^^^ unknown field
3.57 s
[gammaloop-crate-test-binaries-gammaloop-integration-tests-b8cda0d438c96d4f-deps] |
3.57 s
[gammaloop-crate-test-binaries-gammaloop-integration-tests-b8cda0d438c96d4f-deps] = note : the full name for the type has been written to '/build/source/target/ci-optim/deps/uv-ce4ce797f04de65a.long-type-18114926718083020756.txt'
3.57 s
[gammaloop-crate-test-binaries-gammaloop-integration-tests-b8cda0d438c96d4f-deps] = note : consider using `--verbose` to print the full type name to the console
3.57 s
[gammaloop-crate-test-binaries-gammaloop-integration-tests-b8cda0d438c96d4f-deps] help : one of the expressions' fields has a field of the same name
3.57 s
[gammaloop-crate-test-binaries-gammaloop-integration-tests-b8cda0d438c96d4f-deps] |
3.57 s
[gammaloop-crate-test-binaries-gammaloop-integration-tests-b8cda0d438c96d4f-deps] 4653 | .expression. orientations
3.57 s
[gammaloop-crate-test-binaries-gammaloop-integration-tests-b8cda0d438c96d4f-deps] | +++++++++++
3.57 s
[gammaloop-crate-test-binaries-gammaloop-integration-tests-b8cda0d438c96d4f-deps]
3.58 s
[gammaloop-crate-test-binaries-gammaloop-integration-tests-b8cda0d438c96d4f-deps] error[E0624] : method `export_uv_forest_graph` is private
3.58 s
[gammaloop-crate-test-binaries-gammaloop-integration-tests-b8cda0d438c96d4f-deps] --> tests/tests/uv.rs:4673:43
3.58 s
[gammaloop-crate-test-binaries-gammaloop-integration-tests-b8cda0d438c96d4f-deps] |
3.58 s
[gammaloop-crate-test-binaries-gammaloop-integration-tests-b8cda0d438c96d4f-deps] 4673 | let structural_forest = integrand.export_uv_forest_graph(
3.58 s
[gammaloop-crate-test-binaries-gammaloop-integration-tests-b8cda0d438c96d4f-deps] | ^^^^^^^^^^^^^^^^^^^^^^ private method
3.58 s
[gammaloop-crate-test-binaries-gammaloop-integration-tests-b8cda0d438c96d4f-deps] |
3.58 s
[gammaloop-crate-test-binaries-gammaloop-integration-tests-b8cda0d438c96d4f-deps] ::: crates/gammalooprs/src/uv/export.rs:125:5
3.58 s
[gammaloop-crate-test-binaries-gammaloop-integration-tests-b8cda0d438c96d4f-deps] |
3.58 s
[gammaloop-crate-test-binaries-gammaloop-integration-tests-b8cda0d438c96d4f-deps] 125 | / pub(crate) fn export_uv_forest_graph(
3.58 s
[gammaloop-crate-test-binaries-gammaloop-integration-tests-b8cda0d438c96d4f-deps] 126 | | &self,
3.58 s
[gammaloop-crate-test-binaries-gammaloop-integration-tests-b8cda0d438c96d4f-deps] 127 | | graph_id: usize,
3.58 s
[gammaloop-crate-test-binaries-gammaloop-integration-tests-b8cda0d438c96d4f-deps] 128 | | orientation: Option<OrientationProjection<'_>>,
3.58 s
[gammaloop-crate-test-binaries-gammaloop-integration-tests-b8cda0d438c96d4f-deps] 129 | | generation_settings: &GenerationSettings,
3.58 s
[gammaloop-crate-test-binaries-gammaloop-integration-tests-b8cda0d438c96d4f-deps] 130 | | export_settings: &UVForestExportSettings,
3.58 s
[gammaloop-crate-test-binaries-gammaloop-integration-tests-b8cda0d438c96d4f-deps] 131 | | ) -> Result<UVForestExport> {
3.58 s
[gammaloop-crate-test-binaries-gammaloop-integration-tests-b8cda0d438c96d4f-deps] | |_______________________________- private method defined here
3.58 s
[gammaloop-crate-test-binaries-gammaloop-integration-tests-b8cda0d438c96d4f-deps]
3.60 s
[gammaloop-crate-test-binaries-gammaloop-integration-tests-b8cda0d438c96d4f-deps] error[E0624] : method `export_uv_forest_graph` is private
3.60 s
[gammaloop-crate-test-binaries-gammaloop-integration-tests-b8cda0d438c96d4f-deps] --> tests/tests/uv.rs:4897:43
3.60 s
[gammaloop-crate-test-binaries-gammaloop-integration-tests-b8cda0d438c96d4f-deps] |
3.60 s
[gammaloop-crate-test-binaries-gammaloop-integration-tests-b8cda0d438c96d4f-deps] 4897 | let structural_forest = integrand.export_uv_forest_graph(
3.60 s
[gammaloop-crate-test-binaries-gammaloop-integration-tests-b8cda0d438c96d4f-deps] | ^^^^^^^^^^^^^^^^^^^^^^ private method
3.60 s
[gammaloop-crate-test-binaries-gammaloop-integration-tests-b8cda0d438c96d4f-deps] |
3.60 s
[gammaloop-crate-test-binaries-gammaloop-integration-tests-b8cda0d438c96d4f-deps] ::: crates/gammalooprs/src/uv/export.rs:125:5
3.60 s
[gammaloop-crate-test-binaries-gammaloop-integration-tests-b8cda0d438c96d4f-deps] |
3.60 s
[gammaloop-crate-test-binaries-gammaloop-integration-tests-b8cda0d438c96d4f-deps] 125 | / pub(crate) fn export_uv_forest_graph(
3.60 s
[gammaloop-crate-test-binaries-gammaloop-integration-tests-b8cda0d438c96d4f-deps] 126 | | &self,
3.60 s
[gammaloop-crate-test-binaries-gammaloop-integration-tests-b8cda0d438c96d4f-deps] 127 | | graph_id: usize,
3.60 s
[gammaloop-crate-test-binaries-gammaloop-integration-tests-b8cda0d438c96d4f-deps] 128 | | orientation: Option<OrientationProjection<'_>>,
3.60 s
[gammaloop-crate-test-binaries-gammaloop-integration-tests-b8cda0d438c96d4f-deps] 129 | | generation_settings: &GenerationSettings,
3.60 s
[gammaloop-crate-test-binaries-gammaloop-integration-tests-b8cda0d438c96d4f-deps] 130 | | export_settings: &UVForestExportSettings,
3.60 s
[gammaloop-crate-test-binaries-gammaloop-integration-tests-b8cda0d438c96d4f-deps] 131 | | ) -> Result<UVForestExport> {
3.60 s
[gammaloop-crate-test-binaries-gammaloop-integration-tests-b8cda0d438c96d4f-deps] | |_______________________________- private method defined here
3.60 s
[gammaloop-crate-test-binaries-gammaloop-integration-tests-b8cda0d438c96d4f-deps]
3.62 s
[gammaloop-crate-test-binaries-gammaloop-integration-tests-b8cda0d438c96d4f-deps] error[E0624] : method `export_uv_forest_graph` is private
3.62 s
[gammaloop-crate-test-binaries-gammaloop-integration-tests-b8cda0d438c96d4f-deps] --> tests/tests/uv.rs:5146:43
3.62 s
[gammaloop-crate-test-binaries-gammaloop-integration-tests-b8cda0d438c96d4f-deps] |
3.62 s
[gammaloop-crate-test-binaries-gammaloop-integration-tests-b8cda0d438c96d4f-deps] 5146 | let structural_forest = integrand.export_uv_forest_graph(
3.62 s
[gammaloop-crate-test-binaries-gammaloop-integration-tests-b8cda0d438c96d4f-deps] | ^^^^^^^^^^^^^^^^^^^^^^ private method
3.62 s
[gammaloop-crate-test-binaries-gammaloop-integration-tests-b8cda0d438c96d4f-deps] |
3.62 s
[gammaloop-crate-test-binaries-gammaloop-integration-tests-b8cda0d438c96d4f-deps] ::: crates/gammalooprs/src/uv/export.rs:125:5
3.62 s
[gammaloop-crate-test-binaries-gammaloop-integration-tests-b8cda0d438c96d4f-deps] |
3.62 s
[gammaloop-crate-test-binaries-gammaloop-integration-tests-b8cda0d438c96d4f-deps] 125 | / pub(crate) fn export_uv_forest_graph(
3.62 s
[gammaloop-crate-test-binaries-gammaloop-integration-tests-b8cda0d438c96d4f-deps] 126 | | &self,
3.62 s
[gammaloop-crate-test-binaries-gammaloop-integration-tests-b8cda0d438c96d4f-deps] 127 | | graph_id: usize,
3.62 s
[gammaloop-crate-test-binaries-gammaloop-integration-tests-b8cda0d438c96d4f-deps] 128 | | orientation: Option<OrientationProjection<'_>>,
3.62 s
[gammaloop-crate-test-binaries-gammaloop-integration-tests-b8cda0d438c96d4f-deps] 129 | | generation_settings: &GenerationSettings,
3.62 s
[gammaloop-crate-test-binaries-gammaloop-integration-tests-b8cda0d438c96d4f-deps] 130 | | export_settings: &UVForestExportSettings,
3.62 s
[gammaloop-crate-test-binaries-gammaloop-integration-tests-b8cda0d438c96d4f-deps] 131 | | ) -> Result<UVForestExport> {
3.62 s
[gammaloop-crate-test-binaries-gammaloop-integration-tests-b8cda0d438c96d4f-deps] | |_______________________________- private method defined here
3.62 s
[gammaloop-crate-test-binaries-gammaloop-integration-tests-b8cda0d438c96d4f-deps]
3.62 s
[gammaloop-crate-test-binaries-gammaloop-integration-tests-b8cda0d438c96d4f-deps] error[E0624] : method `export_uv_forest_graph` is private
3.62 s
[gammaloop-crate-test-binaries-gammaloop-integration-tests-b8cda0d438c96d4f-deps] --> tests/tests/uv.rs:5161:41
3.62 s
[gammaloop-crate-test-binaries-gammaloop-integration-tests-b8cda0d438c96d4f-deps] |
3.62 s
[gammaloop-crate-test-binaries-gammaloop-integration-tests-b8cda0d438c96d4f-deps] 5161 | let computed_forest = integrand.export_uv_forest_graph(
3.62 s
[gammaloop-crate-test-binaries-gammaloop-integration-tests-b8cda0d438c96d4f-deps] | ^^^^^^^^^^^^^^^^^^^^^^ private method
3.62 s
[gammaloop-crate-test-binaries-gammaloop-integration-tests-b8cda0d438c96d4f-deps] |
3.62 s
[gammaloop-crate-test-binaries-gammaloop-integration-tests-b8cda0d438c96d4f-deps] ::: crates/gammalooprs/src/uv/export.rs:125:5
3.62 s
[gammaloop-crate-test-binaries-gammaloop-integration-tests-b8cda0d438c96d4f-deps] |
3.62 s
[gammaloop-crate-test-binaries-gammaloop-integration-tests-b8cda0d438c96d4f-deps] 125 | / pub(crate) fn export_uv_forest_graph(
3.62 s
[gammaloop-crate-test-binaries-gammaloop-integration-tests-b8cda0d438c96d4f-deps] 126 | | &self,
3.62 s
[gammaloop-crate-test-binaries-gammaloop-integration-tests-b8cda0d438c96d4f-deps] 127 | | graph_id: usize,
3.62 s
[gammaloop-crate-test-binaries-gammaloop-integration-tests-b8cda0d438c96d4f-deps] 128 | | orientation: Option<OrientationProjection<'_>>,
3.63 s
[gammaloop-crate-test-binaries-gammaloop-integration-tests-b8cda0d438c96d4f-deps] 129 | | generation_settings: &GenerationSettings,
3.63 s
[gammaloop-crate-test-binaries-gammaloop-integration-tests-b8cda0d438c96d4f-deps] 130 | | export_settings: &UVForestExportSettings,
3.63 s
[gammaloop-crate-test-binaries-gammaloop-integration-tests-b8cda0d438c96d4f-deps] 131 | | ) -> Result<UVForestExport> {
3.63 s
[gammaloop-crate-test-binaries-gammaloop-integration-tests-b8cda0d438c96d4f-deps] | |_______________________________- private method defined here
3.63 s
[gammaloop-crate-test-binaries-gammaloop-integration-tests-b8cda0d438c96d4f-deps]
3.66 s
[gammaloop-crate-test-binaries-gammaloop-integration-tests-b8cda0d438c96d4f-deps] error[E0624] : method `export_uv_forest_graph` is private
3.66 s
[gammaloop-crate-test-binaries-gammaloop-integration-tests-b8cda0d438c96d4f-deps] --> tests/tests/uv.rs:5724:51
3.66 s
[gammaloop-crate-test-binaries-gammaloop-integration-tests-b8cda0d438c96d4f-deps] |
3.66 s
[gammaloop-crate-test-binaries-gammaloop-integration-tests-b8cda0d438c96d4f-deps] 5724 | let structural_forest = integrand.export_uv_forest_graph(
3.66 s
[gammaloop-crate-test-binaries-gammaloop-integration-tests-b8cda0d438c96d4f-deps] | ^^^^^^^^^^^^^^^^^^^^^^ private method
3.66 s
[gammaloop-crate-test-binaries-gammaloop-integration-tests-b8cda0d438c96d4f-deps] |
3.66 s
[gammaloop-crate-test-binaries-gammaloop-integration-tests-b8cda0d438c96d4f-deps] ::: crates/gammalooprs/src/uv/export.rs:125:5
3.66 s
[gammaloop-crate-test-binaries-gammaloop-integration-tests-b8cda0d438c96d4f-deps] |
3.66 s
[gammaloop-crate-test-binaries-gammaloop-integration-tests-b8cda0d438c96d4f-deps] 125 | / pub(crate) fn export_uv_forest_graph(
3.66 s
[gammaloop-crate-test-binaries-gammaloop-integration-tests-b8cda0d438c96d4f-deps] 126 | | &self,
3.66 s
[gammaloop-crate-test-binaries-gammaloop-integration-tests-b8cda0d438c96d4f-deps] 127 | | graph_id: usize,
3.66 s
[gammaloop-crate-test-binaries-gammaloop-integration-tests-b8cda0d438c96d4f-deps] 128 | | orientation: Option<OrientationProjection<'_>>,
3.66 s
[gammaloop-crate-test-binaries-gammaloop-integration-tests-b8cda0d438c96d4f-deps] 129 | | generation_settings: &GenerationSettings,
3.66 s
[gammaloop-crate-test-binaries-gammaloop-integration-tests-b8cda0d438c96d4f-deps] 130 | | export_settings: &UVForestExportSettings,
3.66 s
[gammaloop-crate-test-binaries-gammaloop-integration-tests-b8cda0d438c96d4f-deps] 131 | | ) -> Result<UVForestExport> {
3.66 s
[gammaloop-crate-test-binaries-gammaloop-integration-tests-b8cda0d438c96d4f-deps] | |_______________________________- private method defined here
3.66 s
[gammaloop-crate-test-binaries-gammaloop-integration-tests-b8cda0d438c96d4f-deps]
3.95 s
[gammaloop-crate-test-binaries-gammaloop-integration-tests-b8cda0d438c96d4f-deps] Some errors have detailed explanations: E0061, E0609, E0616, E0624.
3.95 s
[gammaloop-crate-test-binaries-gammaloop-integration-tests-b8cda0d438c96d4f-deps] For more information about an error, try `rustc --explain E0061`.
4.00 s
[gammaloop-crate-test-binaries-gammaloop-integration-tests-b8cda0d438c96d4f-deps] error : could not compile `gammaloop-integration-tests` (test "uv") due to 13 previous errors
4.00 s
[gammaloop-crate-test-binaries-gammaloop-integration-tests-b8cda0d438c96d4f-deps] warning : build failed, waiting for other jobs to finish...
88.23 s
Progress: 0 of 2 built (1 failed)
88.23 s
Failed to build gammaloop-crate-test-binaries-gammaloop-integration-tests-b8cda0d438c96d4f-deps after 1m27s
88.23 s
error: Cannot build '/nix/store/jmdxlfvakb7hqqx0dbiq8qybml3didbp-gammaloop-crate-test-binaries-gammaloop-integration-tests-b8cda0d438c96d4f-deps-0.1.0.drv '.
88.23 s
Reason: builder failed with exit code 101 .
88.23 s
Output paths:
88.23 s
/nix/store/z7fnxfqj0k797i8c7vpay5bxg9nbn8zm-gammaloop-crate-test-binaries-gammaloop-integration-tests-b8cda0d438c96d4f-deps-0.1.0
88.23 s
Last 225 log lines:
88.23 s
> Running phase: unpackPhase
88.23 s
> unpacking source archive /nix/store/s8h804zbj5xpi2ifcc945rxxavmvwxir-source
88.23 s
> source root is source
88.23 s
> Running phase: patchPhase
88.23 s
> Executing configureCargoCommonVars
88.23 s
> copying cargo artifacts from /nix/store/3jv2y5in0rr1jv0hdb45595kih4n826m-gammaloop-crate-test-binaries-gammaloop-integration-tests-b8cda0d438c96d4f-inputs/target to target
88.23 s
> will deep copy artifacts (instead of symlinking) as requested
88.23 s
> Running phase: updateAutotoolsGnuConfigScriptsPhase
88.23 s
> Running phase: configurePhase
88.23 s
> will append /build/source/.cargo-home/config.toml with contents of /nix/store/8zq9ya5slh345hbylmsibxw827bi98w0-vendor-cargo-deps/config.toml
88.23 s
> default configurePhase, nothing to do
88.23 s
> Running phase: buildPhase
88.23 s
> +++ command cargo --version
88.23 s
> cargo 1.97.0 (c980f4866 2026-06-30)
88.23 s
> +++ command cargo test --profile ci-optim --no-run --offline -p gammaloop-integration-tests
88.23 s
> Compiling gammaloop-integration-tests v0.1.0 (/build/source/tests)
88.23 s
> error[E0624] : method `export_uv_forest_graph` is private
88.23 s
> --> tests/tests/uv.rs:3426:33
88.23 s
> |
88.23 s
> 3426 | let soft_export = integrand.export_uv_forest_graph(
88.23 s
> | ^^^^^^^^^^^^^^^^^^^^^^ private method
88.23 s
> |
88.23 s
> ::: crates/gammalooprs/src/uv/export.rs:125:5
88.23 s
> |
88.23 s
> 125 | / pub(crate) fn export_uv_forest_graph(
88.23 s
> 126 | | &self,
88.23 s
> 127 | | graph_id: usize,
88.23 s
> 128 | | orientation: Option<OrientationProjection<'_>>,
88.23 s
> 129 | | generation_settings: &GenerationSettings,
88.23 s
> 130 | | export_settings: &UVForestExportSettings,
88.23 s
> 131 | | ) -> Result<UVForestExport> {
88.23 s
> | |_______________________________- private method defined here
88.23 s
>
88.23 s
> error[E0624] : method `export_uv_forest_graph` is private
88.23 s
> --> tests/tests/uv.rs:3522:38
88.23 s
> |
88.23 s
> 3522 | let uv_export = uv_integrand.export_uv_forest_graph(
88.23 s
> | ^^^^^^^^^^^^^^^^^^^^^^ private method
88.23 s
> |
88.23 s
> ::: crates/gammalooprs/src/uv/export.rs:125:5
88.23 s
> |
88.23 s
> 125 | / pub(crate) fn export_uv_forest_graph(
88.23 s
> 126 | | &self,
88.23 s
> 127 | | graph_id: usize,
88.23 s
> 128 | | orientation: Option<OrientationProjection<'_>>,
88.23 s
> 129 | | generation_settings: &GenerationSettings,
88.23 s
> 130 | | export_settings: &UVForestExportSettings,
88.23 s
> 131 | | ) -> Result<UVForestExport> {
88.23 s
> | |_______________________________- private method defined here
88.23 s
>
88.23 s
> error[E0624] : method `export_uv_forest_graph` is private
88.23 s
> --> tests/tests/uv.rs:3936:44
88.23 s
> |
88.23 s
> 3936 | let export = integrand.export_uv_forest_graph(
88.23 s
> | ^^^^^^^^^^^^^^^^^^^^^^ private method
88.23 s
> |
88.23 s
> ::: crates/gammalooprs/src/uv/export.rs:125:5
88.23 s
> |
88.23 s
> 125 | / pub(crate) fn export_uv_forest_graph(
88.23 s
> 126 | | &self,
88.23 s
> 127 | | graph_id: usize,
88.23 s
> 128 | | orientation: Option<OrientationProjection<'_>>,
88.23 s
> 129 | | generation_settings: &GenerationSettings,
88.23 s
> 130 | | export_settings: &UVForestExportSettings,
88.23 s
> 131 | | ) -> Result<UVForestExport> {
88.23 s
> | |_______________________________- private method defined here
88.23 s
>
88.23 s
> error[E0624] : method `export_uv_forest_graph` is private
88.23 s
> --> tests/tests/uv.rs:4128:36
88.23 s
> |
88.23 s
> 4128 | let export = integrand.export_uv_forest_graph(
88.23 s
> | ^^^^^^^^^^^^^^^^^^^^^^ private method
88.23 s
> |
88.23 s
> ::: crates/gammalooprs/src/uv/export.rs:125:5
88.23 s
> |
88.23 s
> 125 | / pub(crate) fn export_uv_forest_graph(
88.23 s
> 126 | | &self,
88.23 s
> 127 | | graph_id: usize,
88.23 s
> 128 | | orientation: Option<OrientationProjection<'_>>,
88.23 s
> 129 | | generation_settings: &GenerationSettings,
88.23 s
> 130 | | export_settings: &UVForestExportSettings,
88.23 s
> 131 | | ) -> Result<UVForestExport> {
88.23 s
> | |_______________________________- private method defined here
88.23 s
>
88.23 s
> error[E0624] : method `export_uv_forest_graph` is private
88.23 s
> --> tests/tests/uv.rs:4335:36
88.23 s
> |
88.23 s
> 4335 | let export = integrand.export_uv_forest_graph(
88.23 s
> | ^^^^^^^^^^^^^^^^^^^^^^ private method
88.23 s
> |
88.23 s
> ::: crates/gammalooprs/src/uv/export.rs:125:5
88.23 s
> |
88.23 s
> 125 | / pub(crate) fn export_uv_forest_graph(
88.23 s
> 126 | | &self,
88.23 s
> 127 | | graph_id: usize,
88.23 s
> 128 | | orientation: Option<OrientationProjection<'_>>,
88.23 s
> 129 | | generation_settings: &GenerationSettings,
88.23 s
> 130 | | export_settings: &UVForestExportSettings,
88.23 s
> 131 | | ) -> Result<UVForestExport> {
88.23 s
> | |_______________________________- private method defined here
88.23 s
>
88.23 s
> error[E0061] : this method takes 5 arguments but 3 arguments were supplied
88.23 s
> --> tests/tests/uv.rs:4551:26
88.23 s
> |
88.23 s
> 4551 | parent_graph.cff(&parent_tree, &parent_cut, &OrientationPattern::default())?;
88.23 s
> | ^^^ ----------------------------------------------------------- two arguments of type `&three_dimensional_reps::generation::Generate3DExpressionOptions` and `Option<&symbolica::atom::Atom>` are missing
88.23 s
> |
88.23 s
> note : method defined here
88.23 s
> --> crates/gammalooprs/src/cff/mod.rs:755:12
88.23 s
> |
88.23 s
> 755 | pub fn cff<S: SubGraphLike + SubSetLike>(
88.23 s
> | ^^^
88.23 s
> help : provide the arguments
88.23 s
> |
88.23 s
> 4551 | parent_graph.cff(&parent_tree, &parent_cut, &OrientationPattern::default(), /* &three_dimensional_reps::generation::Generate3DExpressionOptions */, /* Option<&symbolica::atom::Atom> */ )?;
88.23 s
> | ++++++++++++++++++++++++++++++++++++++++++++++++++++++++++++++++++++++++++++++++++++++++++++++++++++++++++++++
88.23 s
>
88.23 s
> error[E0616] : field `orientations` of struct `CFFTerm` is private
88.23 s
> --> tests/tests/uv.rs:4555:36
88.23 s
> |
88.23 s
> 4555 | .flat_map(|term| &term.orientations)
88.23 s
> | ^^^^^^^^^^^^ private field
88.23 s
>
88.23 s
> error[E0609] : no field `orientations` on type `&GeneratedThreeDExpression<Esurface, Hsurface>`
88.23 s
> --> tests/tests/uv.rs:4653:18
88.23 s
> |
88.23 s
> 4653 | .orientations
88.23 s
> | ^^^^^^^^^^^^ unknown field
88.23 s
> |
88.23 s
> = note : the full name for the type has been written to '/build/source/target/ci-optim/deps/uv-ce4ce797f04de65a.long-type-18114926718083020756.txt'
88.23 s
> = note : consider using `--verbose` to print the full type name to the console
88.23 s
> help : one of the expressions' fields has a field of the same name
88.23 s
> |
88.23 s
> 4653 | .expression. orientations
88.23 s
> | +++++++++++
88.23 s
>
88.23 s
> error[E0624] : method `export_uv_forest_graph` is private
88.23 s
> --> tests/tests/uv.rs:4673:43
88.23 s
> |
88.23 s
> 4673 | let structural_forest = integrand.export_uv_forest_graph(
88.23 s
> | ^^^^^^^^^^^^^^^^^^^^^^ private method
88.23 s
> |
88.23 s
> ::: crates/gammalooprs/src/uv/export.rs:125:5
88.23 s
> |
88.23 s
> 125 | / pub(crate) fn export_uv_forest_graph(
88.23 s
> 126 | | &self,
88.23 s
> 127 | | graph_id: usize,
88.23 s
> 128 | | orientation: Option<OrientationProjection<'_>>,
88.23 s
> 129 | | generation_settings: &GenerationSettings,
88.23 s
> 130 | | export_settings: &UVForestExportSettings,
88.23 s
> 131 | | ) -> Result<UVForestExport> {
88.23 s
> | |_______________________________- private method defined here
88.23 s
>
88.23 s
> error[E0624] : method `export_uv_forest_graph` is private
88.23 s
> --> tests/tests/uv.rs:4897:43
88.23 s
> |
88.23 s
> 4897 | let structural_forest = integrand.export_uv_forest_graph(
88.23 s
> | ^^^^^^^^^^^^^^^^^^^^^^ private method
88.23 s
> |
88.23 s
> ::: crates/gammalooprs/src/uv/export.rs:125:5
88.23 s
> |
88.23 s
> 125 | / pub(crate) fn export_uv_forest_graph(
88.23 s
> 126 | | &self,
88.23 s
> 127 | | graph_id: usize,
88.23 s
> 128 | | orientation: Option<OrientationProjection<'_>>,
88.23 s
> 129 | | generation_settings: &GenerationSettings,
88.23 s
> 130 | | export_settings: &UVForestExportSettings,
88.23 s
> 131 | | ) -> Result<UVForestExport> {
88.23 s
> | |_______________________________- private method defined here
88.23 s
>
88.23 s
> error[E0624] : method `export_uv_forest_graph` is private
88.23 s
> --> tests/tests/uv.rs:5146:43
88.23 s
> |
88.23 s
> 5146 | let structural_forest = integrand.export_uv_forest_graph(
88.23 s
> | ^^^^^^^^^^^^^^^^^^^^^^ private method
88.23 s
> |
88.23 s
> ::: crates/gammalooprs/src/uv/export.rs:125:5
88.23 s
> |
88.23 s
> 125 | / pub(crate) fn export_uv_forest_graph(
88.23 s
> 126 | | &self,
88.23 s
> 127 | | graph_id: usize,
88.23 s
> 128 | | orientation: Option<OrientationProjection<'_>>,
88.23 s
> 129 | | generation_settings: &GenerationSettings,
88.23 s
> 130 | | export_settings: &UVForestExportSettings,
88.23 s
> 131 | | ) -> Result<UVForestExport> {
88.23 s
> | |_______________________________- private method defined here
88.23 s
>
88.23 s
> error[E0624] : method `export_uv_forest_graph` is private
88.23 s
> --> tests/tests/uv.rs:5161:41
88.23 s
> |
88.23 s
> 5161 | let computed_forest = integrand.export_uv_forest_graph(
88.23 s
> | ^^^^^^^^^^^^^^^^^^^^^^ private method
88.23 s
> |
88.23 s
> ::: crates/gammalooprs/src/uv/export.rs:125:5
88.23 s
> |
88.23 s
> 125 | / pub(crate) fn export_uv_forest_graph(
88.23 s
> 126 | | &self,
88.23 s
> 127 | | graph_id: usize,
88.23 s
> 128 | | orientation: Option<OrientationProjection<'_>>,
88.23 s
> 129 | | generation_settings: &GenerationSettings,
88.23 s
> 130 | | export_settings: &UVForestExportSettings,
88.23 s
> 131 | | ) -> Result<UVForestExport> {
88.23 s
> | |_______________________________- private method defined here
88.23 s
>
88.23 s
> error[E0624] : method `export_uv_forest_graph` is private
88.23 s
> --> tests/tests/uv.rs:5724:51
88.23 s
> |
88.23 s
> 5724 | let structural_forest = integrand.export_uv_forest_graph(
88.23 s
> | ^^^^^^^^^^^^^^^^^^^^^^ private method
88.23 s
> |
88.23 s
> ::: crates/gammalooprs/src/uv/export.rs:125:5
88.23 s
> |
88.23 s
> 125 | / pub(crate) fn export_uv_forest_graph(
88.23 s
> 126 | | &self,
88.23 s
> 127 | | graph_id: usize,
88.23 s
> 128 | | orientation: Option<OrientationProjection<'_>>,
88.23 s
> 129 | | generation_settings: &GenerationSettings,
88.23 s
> 130 | | export_settings: &UVForestExportSettings,
88.23 s
> 131 | | ) -> Result<UVForestExport> {
88.23 s
> | |_______________________________- private method defined here
88.23 s
>
88.23 s
> Some errors have detailed explanations: E0061, E0609, E0616, E0624.
88.23 s
> For more information about an error, try `rustc --explain E0061`.
88.23 s
> error : could not compile `gammaloop-integration-tests` (test "uv") due to 13 previous errors
88.23 s
> warning : build failed, waiting for other jobs to finish...
88.23 s
For full logs, run:
88.23 s
nix log /nix/store/jmdxlfvakb7hqqx0dbiq8qybml3didbp-gammaloop-crate-test-binaries-gammaloop-integration-tests-b8cda0d438c96d4f-deps-0.1.0.drv
88.23 s
error: Cannot build '/nix/store/iv6mkn8q4k8zm0nv65sm048v1mk2abq1-nix-ci-artifact-barrier-crate-test-binaries-gammaloop-integration-tests.drv '.
88.23 s
Reason: 1 dependency failed .
88.23 s
Output paths:
88.23 s
/nix/store/alqj26s1binb75rfk04kcvmmvic0a5vh-nix-ci-artifact-barrier-crate-test-binaries-gammaloop-integration-tests
88.23 s
Build failed due to failed dependency
88.24 s
Build failed.