1. 0.00 s $ /nix/store/9ypz3flqsrl5xl495mm8h645gadjsxi1-coreutils-9.11/bin/timeout --kill-after=15s 7200s /nix/store/23zk8sgzamrbmj1fday15szf7f2279s8-nix-2.34.7/bin/nix --extra-experimental-features nix-command --extra-experimental-features flakes flake clone git+https://github.com/alphal00p/gammaloop --dest /tmp/nix-ci-worker/stable-pwd/repo/
  2. 0.06 s Cloning into '/tmp/nix-ci-worker/stable-pwd/repo'...
  3. 2.18 s remote: Enumerating objects: 84794 remote: Enumerating objects: 93753, done.
  4. 2.40 s remote: Counting objects: 0% (1/8959) remote: Counting objects: 1% (90/8959) remote: Counting objects: 2% (180/8959) remote: Counting objects: 3% (269/8959) remote: Counting objects: 4% (359/8959) remote: Counting objects: 5% (448/8959) remote: Counting objects: 6% (538/8959) remote: Counting objects: 7% (628/8959) remote: Counting objects: 8% (717/8959) remote: Counting objects: 9% (807/8959) remote: Counting objects: 10% (896/8959) remote: Counting objects: 11% (986/8959) remote: Counting objects: 12% (1076/8959) remote: Counting objects: 13% (1165/8959) remote: Counting objects: 14% (1255/8959) remote: Counting objects: 15% (1344/8959) remote: Counting objects: 16% (1434/8959) remote: Counting objects: 17% (1524/8959) remote: Counting objects: 18% (1613/8959) remote: Counting objects: 19% (1703/8959) remote: Counting objects: 20% (1792/8959) remote: Counting objects: 21% (1882/8959) remote: Counting objects: 22% (1971/8959) remote: Counting objects: 23% (2061/8959) remote: Counting objects: 24% (2151/8959) remote: Counting objects: 25% (2240/8959) remote: Counting objects: 26% (2330/8959) remote: Counting objects: 27% (2419/8959) remote: Counting objects: 28% (2509/8959) remote: Counting objects: 29% (2599/8959) remote: Counting objects: 30% (2688/8959) remote: Counting objects: 31% (2778/8959) remote: Counting objects: 32% (2867/8959) remote: Counting objects: 33% (2957/8959) remote: Counting objects: 34% (3047/8959) remote: Counting objects: 35% (3136/8959) remote: Counting objects: 36% (3226/8959) remote: Counting objects: 37% (3315/8959) remote: Counting objects: 38% (3405/8959) remote: Counting objects: 39% (3495/8959) remote: Counting objects: 40% (3584/8959) remote: Counting objects: 41% (3674/8959) remote: Counting objects: 42% (3763/8959) remote: Counting objects: 43% (3853/8959) remote: Counting objects: 44% (3942/8959) remote: Counting objects: 45% (4032/8959) remote: Counting objects: 46% (4122/8959) remote: Counting objects: 47% (4211/8959) remote: Counting objects: 48% (4301/8959) remote: Counting objects: 49% (4390/8959) remote: Counting objects: 50% (4480/8959) remote: Counting objects: 51% (4570/8959) remote: Counting objects: 52% (4659/8959) remote: Counting objects: 53% (4749/8959) remote: Counting objects: 54% (4838/8959) remote: Counting objects: 55% (4928/8959) remote: Counting objects: 56% (5018/8959) remote: Counting objects: 57% (5107/8959) remote: Counting objects: 58% (5197/8959) remote: Counting objects: 59% (5286/8959) remote: Counting objects: 60% (5376/8959) remote: Counting objects: 61% (5465/8959) remote: Counting objects: 62% (5555/8959) remote: Counting objects: 63% (5645/8959) remote: Counting objects: 64% (5734/8959) remote: Counting objects: 65% (5824/8959) remote: Counting objects: 66% (5913/8959) remote: Counting objects: 67% (6003/8959) remote: Counting objects: 68% (6093/8959) remote: Counting objects: 69% (6182/8959) remote: Counting objects: 70% (6272/8959) remote: Counting objects: 71% (6361/8959) remote: Counting objects: 72% (6451/8959) remote: Counting objects: 73% (6541/8959) remote: Counting objects: 74% (6630/8959) remote: Counting objects: 75% (6720/8959) remote: Counting objects: 76% (6809/8959) remote: Counting objects: 77% (6899/8959) remote: Counting objects: 78% (6989/8959) remote: Counting objects: 79% (7078/8959) remote: Counting objects: 80% (7168/8959) remote: Counting objects: 81% (7257/8959) remote: Counting objects: 82% (7347/8959) remote: Counting objects: 83% (7436/8959) remote: Counting objects: 84% (7526/8959) remote: Counting objects: 85% (7616/8959) remote: Counting objects: 86% (7705/8959) remote: Counting objects: 87% (7795/8959) remote: Counting objects: 88% (7884/8959) remote: Counting objects: 89% (7974/8959) remote: Counting objects: 90% (8064/8959) remote: Counting objects: 91% (8153/8959) remote: Counting objects: 92% (8243/8959) remote: Counting objects: 93% (8332/8959) remote: Counting objects: 94% (8422/8959) remote: Counting objects: 95% (8512/8959) remote: Counting objects: 96% (8601/8959) remote: Counting objects: 97% (8691/8959) remote: Counting objects: 98% (8780/8959) remote: Counting objects: 99% (8870/8959) remote: Counting objects: 100% (8959/8959) remote: Counting objects: 100% (8959/8959), done.
  5. 4.73 s remote: Compressing objects: 0% (1/1787) remote: Compressing objects: 1% (18/1787) remote: Compressing objects: 2% (36/1787) remote: Compressing objects: 3% (54/1787) remote: Compressing objects: 4% (72/1787) remote: Compressing objects: 5% (90/1787) remote: Compressing objects: 5% (102/1787) remote: Compressing objects: 6% (108/1787) remote: Compressing objects: 7% (126/1787) remote: Compressing objects: 8% (143/1787) remote: Compressing objects: 9% (161/1787) remote: Compressing objects: 10% (179/1787) remote: Compressing objects: 11% (197/1787) remote: Compressing objects: 12% (215/1787) remote: Compressing objects: 13% (233/1787) remote: Compressing objects: 14% (251/1787) remote: Compressing objects: 15% (269/1787) remote: Compressing objects: 15% (284/1787) remote: Compressing objects: 16% (286/1787) remote: Compressing objects: 17% (304/1787) remote: Compressing objects: 18% (322/1787) remote: Compressing objects: 19% (340/1787) remote: Compressing objects: 20% (358/1787) remote: Compressing objects: 21% (376/1787) remote: Compressing objects: 22% (394/1787) remote: Compressing objects: 23% (412/1787) remote: Compressing objects: 24% (429/1787) remote: Compressing objects: 25% (447/1787) remote: Compressing objects: 26% (465/1787) remote: Compressing objects: 27% (483/1787) remote: Compressing objects: 28% (501/1787) remote: Compressing objects: 29% (519/1787) remote: Compressing objects: 30% (537/1787) remote: Compressing objects: 31% (554/1787) remote: Compressing objects: 32% (572/1787) remote: Compressing objects: 33% (590/1787) remote: Compressing objects: 34% (608/1787) remote: Compressing objects: 35% (626/1787) remote: Compressing objects: 36% (644/1787) remote: Compressing objects: 37% (662/1787) remote: Compressing objects: 38% (680/1787) remote: Compressing objects: 39% (697/1787) remote: Compressing objects: 40% (715/1787) remote: Compressing objects: 41% (733/1787) remote: Compressing objects: 42% (751/1787) remote: Compressing objects: 43% (769/1787) remote: Compressing objects: 44% (787/1787) remote: Compressing objects: 45% (805/1787) remote: Compressing objects: 46% (823/1787) remote: Compressing objects: 47% (840/1787) remote: Compressing objects: 48% (858/1787) remote: Compressing objects: 49% (876/1787) remote: Compressing objects: 50% (894/1787) remote: Compressing objects: 51% (912/1787) remote: Compressing objects: 52% (930/1787) remote: Compressing objects: 53% (948/1787) remote: Compressing objects: 54% (965/1787) remote: Compressing objects: 55% (983/1787) remote: Compressing objects: 56% (1001/1787) remote: Compressing objects: 57% (1019/1787) remote: Compressing objects: 58% (1037/1787) remote: Compressing objects: 59% (1055/1787) remote: Compressing objects: 60% (1073/1787) remote: Compressing objects: 61% (1091/1787) remote: Compressing objects: 62% (1108/1787) remote: Compressing objects: 63% (1126/1787) remote: Compressing objects: 64% (1144/1787) remote: Compressing objects: 65% (1162/1787) remote: Compressing objects: 66% (1180/1787) remote: Compressing objects: 67% (1198/1787) remote: Compressing objects: 68% (1216/1787) remote: Compressing objects: 69% (1234/1787) remote: Compressing objects: 70% (1251/1787) remote: Compressing objects: 71% (1269/1787) remote: Compressing objects: 72% (1287/1787) remote: Compressing objects: 73% (1305/1787) remote: Compressing objects: 74% (1323/1787) remote: Compressing objects: 75% (1341/1787) remote: Compressing objects: 76% (1359/1787) remote: Compressing objects: 77% (1376/1787) remote: Compressing objects: 78% (1394/1787) remote: Compressing objects: 79% (1412/1787) remote: Compressing objects: 80% (1430/1787) remote: Compressing objects: 81% (1448/1787) remote: Compressing objects: 82% (1466/1787) remote: Compressing objects: 83% (1484/1787) remote: Compressing objects: 84% (1502/1787) remote: Compressing objects: 85% (1519/1787) remote: Compressing objects: 86% (1537/1787) remote: Compressing objects: 87% (1555/1787) remote: Compressing objects: 88% (1573/1787) remote: Compressing objects: 89% (1591/1787) remote: Compressing objects: 90% (1609/1787) remote: Compressing objects: 91% (1627/1787) remote: Compressing objects: 92% (1645/1787) remote: Compressing objects: 93% (1662/1787) remote: Compressing objects: 94% (1680/1787) remote: Compressing objects: 95% (1698/1787) remote: Compressing objects: 96% (1716/1787) remote: Compressing objects: 97% (1734/1787) remote: Compressing objects: 98% (1752/1787) remote: Compressing objects: 99% (1770/1787) remote: Compressing objects: 100% (1787/1787) remote: Compressing objects: 100% (1787/1787), done.
  6. 13.98 s Receiving objects: 0% (1/93753) Receiving objects: 1% (938/93753) Receiving objects: 2% (1876/93753) Receiving objects: 3% (2813/93753) Receiving objects: 4% (3751/93753) Receiving objects: 5% (4688/93753) Receiving objects: 6% (5626/93753) Receiving objects: 7% (6563/93753) Receiving objects: 8% (7501/93753), 16.64 MiB | 33.26 MiB/s Receiving objects: 9% (8438/93753), 16.64 MiB | 33.26 MiB/s Receiving objects: 10% (9376/93753), 16.64 MiB | 33.26 MiB/s Receiving objects: 11% (10313/93753), 16.64 MiB | 33.26 MiB/s Receiving objects: 12% (11251/93753), 16.64 MiB | 33.26 MiB/s Receiving objects: 13% (12188/93753), 16.64 MiB | 33.26 MiB/s Receiving objects: 14% (13126/93753), 16.64 MiB | 33.26 MiB/s Receiving objects: 15% (14063/93753), 16.64 MiB | 33.26 MiB/s Receiving objects: 16% (15001/93753), 16.64 MiB | 33.26 MiB/s Receiving objects: 17% (15939/93753), 16.64 MiB | 33.26 MiB/s Receiving objects: 18% (16876/93753), 16.64 MiB | 33.26 MiB/s Receiving objects: 19% (17814/93753), 16.64 MiB | 33.26 MiB/s Receiving objects: 20% (18751/93753), 16.64 MiB | 33.26 MiB/s Receiving objects: 21% (19689/93753), 16.64 MiB | 33.26 MiB/s Receiving objects: 22% (20626/93753), 16.64 MiB | 33.26 MiB/s Receiving objects: 23% (21564/93753), 16.64 MiB | 33.26 MiB/s Receiving objects: 24% (22501/93753), 16.64 MiB | 33.26 MiB/s Receiving objects: 25% (23439/93753), 16.64 MiB | 33.26 MiB/s Receiving objects: 26% (24376/93753), 16.64 MiB | 33.26 MiB/s Receiving objects: 27% (25314/93753), 16.64 MiB | 33.26 MiB/s Receiving objects: 28% (26251/93753), 16.64 MiB | 33.26 MiB/s Receiving objects: 29% (27189/93753), 16.64 MiB | 33.26 MiB/s Receiving objects: 30% (28126/93753), 16.64 MiB | 33.26 MiB/s Receiving objects: 31% (29064/93753), 16.64 MiB | 33.26 MiB/s Receiving objects: 32% (30001/93753), 16.64 MiB | 33.26 MiB/s Receiving objects: 33% (30939/93753), 16.64 MiB | 33.26 MiB/s Receiving objects: 34% (31877/93753), 16.64 MiB | 33.26 MiB/s Receiving objects: 35% (32814/93753), 16.64 MiB | 33.26 MiB/s Receiving objects: 36% (33752/93753), 16.64 MiB | 33.26 MiB/s Receiving objects: 36% (34376/93753), 33.36 MiB | 32.59 MiB/s Receiving objects: 37% (34689/93753), 33.36 MiB | 32.59 MiB/s Receiving objects: 38% (35627/93753), 33.36 MiB | 32.59 MiB/s Receiving objects: 39% (36564/93753), 33.36 MiB | 32.59 MiB/s Receiving objects: 40% (37502/93753), 33.36 MiB | 32.59 MiB/s Receiving objects: 41% (38439/93753), 33.36 MiB | 32.59 MiB/s Receiving objects: 42% (39377/93753), 33.36 MiB | 32.59 MiB/s Receiving objects: 43% (40314/93753), 33.36 MiB | 32.59 MiB/s Receiving objects: 44% (41252/93753), 33.36 MiB | 32.59 MiB/s Receiving objects: 45% (42189/93753), 33.36 MiB | 32.59 MiB/s Receiving objects: 46% (43127/93753), 50.71 MiB | 33.30 MiB/s Receiving objects: 47% (44064/93753), 50.71 MiB | 33.30 MiB/s Receiving objects: 48% (45002/93753), 50.71 MiB | 33.30 MiB/s Receiving objects: 49% (45939/93753), 50.71 MiB | 33.30 MiB/s Receiving objects: 50% (46877/93753), 50.71 MiB | 33.30 MiB/s Receiving objects: 51% (47815/93753), 50.71 MiB | 33.30 MiB/s Receiving objects: 52% (48752/93753), 50.71 MiB | 33.30 MiB/s Receiving objects: 52% (48754/93753), 66.32 MiB | 32.79 MiB/s Receiving objects: 53% (49690/93753), 66.32 MiB | 32.79 MiB/s Receiving objects: 54% (50627/93753), 66.32 MiB | 32.79 MiB/s Receiving objects: 55% (51565/93753), 66.32 MiB | 32.79 MiB/s Receiving objects: 56% (52502/93753), 66.32 MiB | 32.79 MiB/s Receiving objects: 57% (53440/93753), 66.32 MiB | 32.79 MiB/s Receiving objects: 58% (54377/93753), 66.32 MiB | 32.79 MiB/s Receiving objects: 59% (55315/93753), 66.32 MiB | 32.79 MiB/s Receiving objects: 60% (56252/93753), 66.32 MiB | 32.79 MiB/s Receiving objects: 61% (57190/93753), 82.28 MiB | 32.61 MiB/s Receiving objects: 61% (57341/93753), 99.63 MiB | 32.86 MiB/s Receiving objects: 61% (57500/93753), 133.19 MiB | 32.85 MiB/s Receiving objects: 61% (57611/93753), 149.61 MiB | 32.84 MiB/s Receiving objects: 61% (58054/93753), 202.21 MiB | 33.08 MiB/s Receiving objects: 62% (58127/93753), 202.21 MiB | 33.08 MiB/s Receiving objects: 63% (59065/93753), 202.21 MiB | 33.08 MiB/s Receiving objects: 64% (60002/93753), 202.21 MiB | 33.08 MiB/s Receiving objects: 65% (60940/93753), 202.21 MiB | 33.08 MiB/s Receiving objects: 66% (61877/93753), 202.21 MiB | 33.08 MiB/s Receiving objects: 67% (62815/93753), 218.93 MiB | 33.31 MiB/s Receiving objects: 68% (63753/93753), 218.93 MiB | 33.31 MiB/s Receiving objects: 69% (64690/93753), 218.93 MiB | 33.31 MiB/s Receiving objects: 69% (65024/93753), 218.93 MiB | 33.31 MiB/s Receiving objects: 70% (65628/93753), 236.71 MiB | 33.56 MiB/s Receiving objects: 71% (66565/93753), 236.71 MiB | 33.56 MiB/s Receiving objects: 72% (67503/93753), 236.71 MiB | 33.56 MiB/s Receiving objects: 73% (68440/93753), 236.71 MiB | 33.56 MiB/s Receiving objects: 74% (69378/93753), 236.71 MiB | 33.56 MiB/s Receiving objects: 75% (70315/93753), 236.71 MiB | 33.56 MiB/s Receiving objects: 76% (71253/93753), 236.71 MiB | 33.56 MiB/s Receiving objects: 77% (72190/93753), 236.71 MiB | 33.56 MiB/s Receiving objects: 78% (73128/93753), 236.71 MiB | 33.56 MiB/s Receiving objects: 79% (74065/93753), 236.71 MiB | 33.56 MiB/s Receiving objects: 80% (75003/93753), 236.71 MiB | 33.56 MiB/s Receiving objects: 81% (75940/93753), 236.71 MiB | 33.56 MiB/s Receiving objects: 82% (76878/93753), 253.75 MiB | 33.56 MiB/s Receiving objects: 82% (77276/93753), 253.75 MiB | 33.56 MiB/s Receiving objects: 83% (77815/93753), 271.75 MiB | 33.72 MiB/s Receiving objects: 84% (78753/93753), 271.75 MiB | 33.72 MiB/s Receiving objects: 85% (79691/93753), 271.75 MiB | 33.72 MiB/s Receiving objects: 86% (80628/93753), 288.37 MiB | 33.79 MiB/s Receiving objects: 87% (81566/93753), 288.37 MiB | 33.79 MiB/s Receiving objects: 88% (82503/93753), 288.37 MiB | 33.79 MiB/s Receiving objects: 89% (83441/93753), 288.37 MiB | 33.79 MiB/s Receiving objects: 89% (84323/93753), 288.37 MiB | 33.79 MiB/s Receiving objects: 90% (84378/93753), 288.37 MiB | 33.79 MiB/s Receiving objects: 91% (85316/93753), 288.37 MiB | 33.79 MiB/s Receiving objects: 92% (86253/93753), 288.37 MiB | 33.79 MiB/s Receiving objects: 93% (87191/93753), 288.37 MiB | 33.79 MiB/s Receiving objects: 94% (88128/93753), 288.37 MiB | 33.79 MiB/s Receiving objects: 95% (89066/93753), 288.37 MiB | 33.79 MiB/s Receiving objects: 96% (90003/93753), 288.37 MiB | 33.79 MiB/s Receiving objects: 97% (90941/93753), 306.30 MiB | 34.13 MiB/s Receiving objects: 98% (91878/93753), 306.30 MiB | 34.13 MiB/s Receiving objects: 99% (92816/93753), 306.30 MiB | 34.13 MiB/s remote: Total 93753 (delta 7858), reused 7172 (delta 7172), pack-reused 84794 (from 3)
  7. 13.98 s Receiving objects: 100% (93753/93753), 306.30 MiB | 34.13 MiB/s Receiving objects: 100% (93753/93753), 309.19 MiB | 33.43 MiB/s, done.
  8. 14.97 s Resolving deltas: 0% (0/63113) Resolving deltas: 1% (632/63113) Resolving deltas: 2% (1263/63113) Resolving deltas: 3% (1894/63113) Resolving deltas: 4% (2525/63113) Resolving deltas: 5% (3156/63113) Resolving deltas: 6% (3787/63113) Resolving deltas: 7% (4418/63113) Resolving deltas: 8% (5050/63113) Resolving deltas: 9% (5681/63113) Resolving deltas: 10% (6312/63113) Resolving deltas: 11% (6944/63113) Resolving deltas: 12% (7574/63113) Resolving deltas: 13% (8205/63113) Resolving deltas: 14% (8837/63113) Resolving deltas: 15% (9467/63113) Resolving deltas: 16% (10099/63113) Resolving deltas: 17% (10730/63113) Resolving deltas: 18% (11361/63113) Resolving deltas: 19% (11992/63113) Resolving deltas: 20% (12623/63113) Resolving deltas: 21% (13254/63113) Resolving deltas: 22% (13885/63113) Resolving deltas: 23% (14516/63113) Resolving deltas: 24% (15148/63113) Resolving deltas: 25% (15779/63113) Resolving deltas: 26% (16410/63113) Resolving deltas: 27% (17043/63113) Resolving deltas: 28% (17672/63113) Resolving deltas: 29% (18303/63113) Resolving deltas: 30% (18934/63113) Resolving deltas: 31% (19566/63113) Resolving deltas: 32% (20197/63113) Resolving deltas: 33% (20829/63113) Resolving deltas: 34% (21460/63113) Resolving deltas: 35% (22090/63113) Resolving deltas: 36% (22721/63113) Resolving deltas: 37% (23352/63113) Resolving deltas: 38% (23983/63113) Resolving deltas: 39% (24615/63113) Resolving deltas: 40% (25247/63113) Resolving deltas: 41% (25877/63113) Resolving deltas: 42% (26508/63113) Resolving deltas: 43% (27139/63113) Resolving deltas: 44% (27770/63113) Resolving deltas: 45% (28401/63113) Resolving deltas: 46% (29032/63113) Resolving deltas: 47% (29664/63113) Resolving deltas: 48% (30295/63113) Resolving deltas: 49% (30926/63113) Resolving deltas: 50% (31557/63113) Resolving deltas: 51% (32188/63113) Resolving deltas: 52% (32819/63113) Resolving deltas: 53% (33452/63113) Resolving deltas: 54% (34085/63113) Resolving deltas: 55% (34715/63113) Resolving deltas: 56% (35344/63113) Resolving deltas: 57% (35975/63113) Resolving deltas: 58% (36606/63113) Resolving deltas: 59% (37237/63113) Resolving deltas: 60% (37868/63113) Resolving deltas: 61% (38499/63113) Resolving deltas: 62% (39131/63113) Resolving deltas: 63% (39763/63113) Resolving deltas: 64% (40393/63113) Resolving deltas: 65% (41024/63113) Resolving deltas: 66% (41655/63113) Resolving deltas: 67% (42286/63113) Resolving deltas: 68% (42917/63113) Resolving deltas: 69% (43548/63113) Resolving deltas: 70% (44180/63113) Resolving deltas: 71% (44811/63113) Resolving deltas: 72% (45442/63113) Resolving deltas: 73% (46074/63113) Resolving deltas: 74% (46704/63113) Resolving deltas: 75% (47335/63113) Resolving deltas: 76% (47966/63113) Resolving deltas: 77% (48598/63113) Resolving deltas: 78% (49229/63113) Resolving deltas: 79% (49860/63113) Resolving deltas: 80% (50491/63113) Resolving deltas: 81% (51125/63113) Resolving deltas: 82% (51756/63113) Resolving deltas: 83% (52384/63113) Resolving deltas: 84% (53015/63113) Resolving deltas: 85% (53647/63113) Resolving deltas: 86% (54278/63113) Resolving deltas: 87% (54909/63113) Resolving deltas: 88% (55540/63113) Resolving deltas: 89% (56173/63113) Resolving deltas: 90% (56802/63113) Resolving deltas: 91% (57433/63113) Resolving deltas: 92% (58064/63113) Resolving deltas: 93% (58696/63113) Resolving deltas: 94% (59327/63113) Resolving deltas: 95% (59958/63113) Resolving deltas: 96% (60589/63113) Resolving deltas: 97% (61220/63113) Resolving deltas: 98% (61851/63113) Resolving deltas: 99% (62484/63113) Resolving deltas: 100% (63113/63113) Resolving deltas: 100% (63113/63113), done.
  9. 15.44 s Fetching commit 01982f688b6810d5152f0317713db412ae7ea794 for codex/raised-energy-cff-reviewed ...
  10. 15.45 s $ /nix/store/bcnisk3ydfgv26v2gw3zlky24g00yww2-git-2.54.0/bin/git fetch origin 01982f688b6810d5152f0317713db412ae7ea794
  11. 15.86 s From https://github.com/alphal00p/gammaloop
  12. 15.86 s * branch 01982f688b6810d5152f0317713db412ae7ea794 -> FETCH_HEAD
  13. 15.87 s $ /nix/store/9ypz3flqsrl5xl495mm8h645gadjsxi1-coreutils-9.11/bin/timeout --kill-after=15s 7200s /nix/store/bcnisk3ydfgv26v2gw3zlky24g00yww2-git-2.54.0/bin/git -c advice.detachedHead=false checkout 01982f688b6810d5152f0317713db412ae7ea794
  14. 16.15 s HEAD is now at 01982f688 document the reviewed CFF stack and validation
  15. 16.16 s $ /nix/store/9ypz3flqsrl5xl495mm8h645gadjsxi1-coreutils-9.11/bin/timeout --kill-after=15s 7200s /nix/store/23zk8sgzamrbmj1fday15szf7f2279s8-nix-2.34.7/bin/nix --extra-experimental-features nix-command --extra-experimental-features flakes --log-format internal-json run .#packages.x86_64-linux.nix-ci-check-gammaloop-nextest-python-api --print-build-logs
  16. 23.07 s
  17. 23.18 s Downloading cached gammaloop-nextest-binaries-python-api-gammaloop-integration-tests from https://cache.nix-ci.com
  18. 23.23 s Downloaded cached gammaloop-nextest-binaries-python-api-gammaloop-integration-tests (8.5 MiB) in 53ms
  19. 23.23 s Progress: 0 of 1 built, 1 of 3 downloaded from cache
  20. 23.23 s Downloading cached gammaloop-nextest-binaries-python-api from https://cache.nix-ci.com
  21. 23.24 s Downloaded cached gammaloop-nextest-binaries-python-api (520 B) in 3ms
  22. 23.24 s Progress: 0 of 1 built, 2 of 3 downloaded from cache
  23. 23.24 s Downloading cached nix-ci-check-gammaloop-nextest-python-api from https://cache.nix-ci.com
  24. 23.24 s Downloaded cached nix-ci-check-gammaloop-nextest-python-api (1104 B) in 3ms
  25. 23.24 s Progress: 0 of 1 built, 3 of 3 downloaded from cache
  26. 30.15 s evaluating derivation 'g copying '/nix/store/8j7s evaluating derivation 'g copying '/nix/store/8j7s evaluating derivation 'g copying '/nix/store/8j7s evaluating derivation 'g copying '/nix/store/8j7s evaluating derivation 'g copying '/nix/store/8j7s evaluating derivation 'g copying '/nix/store/8j7s evaluating derivation 'g copying '/nix/store/8j7s evaluating derivation 'g querying gammaloop-nexte [3.2 KiB DL] querying in [1/0/6 built, 3/4/12 copbuilder.pl> Running phase: patchPhase
  27. 30.15 s [1/0/5 built, 2/5/12 copbuilder.pl> Running phase: updateAutotoolsGnuConfigScriptsPhase
  28. 30.16 s builder.pl> Running phase: configurePhase
  29. 30.17 s builder.pl> no configure script, doing nothing
  30. 30.17 s builder.pl> Running phase: buildPhase
  31. 30.17 s builder.pl> Running phase: checkPhase
  32. 30.18 s builder.pl> Running phase: installPhase
  33. 30.18 s builder.pl> no Makefile or custom installPhase, doing nothing
  34. 30.18 s builder.pl> Running phase: fixupPhase
  35. 30.19 s builder.pl> shrinking RPATHs of ELF executables and libraries in /nix/store/n17p4y03iknmyjpnfk30rj7i0klr448n-builder.pl
  36. 30.19 s builder.pl> checking for references to /build/ in /nix/store/n17p4y03iknmyjpnfk30rj7i0klr448n-builder.pl...
  37. 30.20 s builder.pl> patching script interpreter paths in /nix/store/n17p4y03iknmyjpnfk30rj7i0klr448n-builder.pl
  38. 30.23 s builder.pl (post)> Uploading to the NixCI cache: /nix/store/n17p4y03iknmyjpnfk30rj7i0klr448n-builder.pl
  39. 30.26 s builder.pl (post)> warning: 'warn-short-path-literals' is deprecated, use 'lint-short-path-literals = ignore' instead
  40. 30.29 s builder.pl (post)> copying 0 paths...
  41. 30.33 s builder.pl (post)> warning: 'warn-short-path-literals' is deprecated, use 'lint-short-path-literals = ignore' instead
  42. 30.37 s builder.pl (post)> copying 0 paths...
  43. 30.91 s [1/4 built, 2/7/12 copie [1/4 built, 1/11/12 copipython3> structuredAttrs is enabled
  44. 30.97 s [1/1/3 built, 12 copied python3> created 227 symlinks in user environment
  45. 31.71 s python3 (post)> Uploading to the NixCI cache: /nix/store/3gi2x25n327sf3xma8b08jd57aqv69x5-python3-3.13.14-env
  46. 31.75 s python3 (post)> warning: 'warn-short-path-literals' is deprecated, use 'lint-short-path-literals = ignore' instead
  47. 31.78 s python3 (post)> copying 0 paths...
  48. 31.82 s python3 (post)> warning: 'warn-short-path-literals' is deprecated, use 'lint-short-path-literals = ignore' instead
  49. 31.94 s python3 (post)> copying 0 paths...
  50. 32.22 s [2/4 built, 12 copied (2 [1/2/3 built, 12 copied gammaloop-nextest-python-api> Extracting 1 binary, 1 build script output directory, and 3 linked paths to /build/nextest-archive-PfBDF1
  51. 32.28 s gammaloop-nextest-python-api> Extracted 18 files to /build/nextest-archive-PfBDF1 in 0.06s
  52. 32.29 s gammaloop-nextest-python-api> ------------
  53. 32.29 s gammaloop-nextest-python-api> Nextest run ID 835a273b-adc2-41be-a789-8cb05bb8b832 with nextest profile: ci_gammaloop
  54. 32.29 s gammaloop-nextest-python-api> Starting 5 tests across 1 binary
  55. 32.40 s gammaloop-nextest-python-api> FAIL [ 0.110s] (1/5) gammaloop-integration-tests::test_python_api python_evaluate_samples_batch_and_momentum_space_have_expected_shape
  56. 32.40 s gammaloop-nextest-python-api> stdout ---
  57. 32.40 s gammaloop-nextest-python-api>
  58. 32.40 s gammaloop-nextest-python-api> running 1 test
  59. 32.40 s gammaloop-nextest-python-api> test python_evaluate_samples_batch_and_momentum_space_have_expected_shape ... FAILED
  60. 32.40 s gammaloop-nextest-python-api>
  61. 32.40 s gammaloop-nextest-python-api> failures:
  62. 32.40 s gammaloop-nextest-python-api>
  63. 32.40 s gammaloop-nextest-python-api> failures:
  64. 32.40 s gammaloop-nextest-python-api> python_evaluate_samples_batch_and_momentum_space_have_expected_shape
  65. 32.40 s gammaloop-nextest-python-api>
  66. 32.40 s gammaloop-nextest-python-api> test result: FAILED. 0 passed; 1 failed; 0 ignored; 0 measured; 4 filtered out; finished in 0.10s
  67. 32.40 s gammaloop-nextest-python-api>
  68. 32.40 s gammaloop-nextest-python-api> stderr ---
  69. 32.40 s gammaloop-nextest-python-api> Error: Python API test subprocess failed.
  70. 32.40 s gammaloop-nextest-python-api> stdout:
  71. 32.40 s gammaloop-nextest-python-api> ┌────────────────────────────────────────────────────────┐
  72. 32.40 s gammaloop-nextest-python-api> │ You are running a restricted Symbolica instance. │
  73. 32.40 s gammaloop-nextest-python-api> │ │
  74. 32.40 s gammaloop-nextest-python-api> │ This mode is only permitted for non-commercial use and │
  75. 32.40 s gammaloop-nextest-python-api> │ is limited to one instance and core per machine. │
  76. 32.40 s gammaloop-nextest-python-api> │ │
  77. 32.40 s gammaloop-nextest-python-api> │ Hobbyists can easily acquire a free license key │
  78. 32.40 s gammaloop-nextest-python-api> │ that unlocks all cores and removes this banner: │
  79. 32.40 s gammaloop-nextest-python-api> │ │
  80. 32.40 s gammaloop-nextest-python-api> │ from symbolica import * │
  81. 32.40 s gammaloop-nextest-python-api> │ request_hobbyist_license('YOUR_NAME', 'YOUR_EMAIL') │
  82. 32.40 s gammaloop-nextest-python-api> │ │
  83. 32.40 s gammaloop-nextest-python-api> │ All other users can obtain a free 30-day trial key: │
  84. 32.40 s gammaloop-nextest-python-api> │ │
  85. 32.40 s gammaloop-nextest-python-api> │ from symbolica import * │
  86. 32.40 s gammaloop-nextest-python-api> │ request_trial_license('NAME', 'EMAIL', 'EMPLOYER') │
  87. 32.40 s gammaloop-nextest-python-api> │ │
  88. 32.40 s gammaloop-nextest-python-api> │ See https://symbolica.io/docs/get_started.html#license │
  89. 32.40 s gammaloop-nextest-python-api> └────────────────────────────────────────────────────────┘
  90. 32.40 s gammaloop-nextest-python-api> ┌───────────────────────────────────────────────────────────────────────────────────────────────────────────┐
  91. 32.40 s gammaloop-nextest-python-api> │ Cannot start new unlicensed Symbolica instance since there is already another one running on the machine. │
  92. 32.40 s gammaloop-nextest-python-api> └───────────────────────────────────────────────────────────────────────────────────────────────────────────┘
  93. 32.40 s gammaloop-nextest-python-api>
  94. 32.40 s gammaloop-nextest-python-api> stderr:
  95. 32.40 s gammaloop-nextest-python-api>
  96. 32.40 s gammaloop-nextest-python-api> ┌───────────────────────────────────────────────────────────┐
  97. 32.40 s gammaloop-nextest-python-api> │ Could not resolve the IP of the Symbolica license server. │
  98. 32.40 s gammaloop-nextest-python-api> │ │
  99. 32.40 s gammaloop-nextest-python-api> │ Please check your DNS configuration. │
  100. 32.40 s gammaloop-nextest-python-api> └───────────────────────────────────────────────────────────┘
  101. 32.40 s gammaloop-nextest-python-api> Error: failed to lookup address information: Temporary failure in name resolution
  102. 32.40 s gammaloop-nextest-python-api>
  103. 32.40 s gammaloop-nextest-python-api>
  104. 32.40 s gammaloop-nextest-python-api> Location:
  105. 32.40 s gammaloop-nextest-python-api> tests/tests/test_python_api.rs:156:20
  106. 32.40 s gammaloop-nextest-python-api>
  107. 32.40 s gammaloop-nextest-python-api> FAIL [ 0.110s] (2/5) gammaloop-integration-tests::test_python_api python_evaluate_sample_preserves_graph_grouping_and_incoming_pdgs
  108. 32.40 s gammaloop-nextest-python-api> stdout ---
  109. 32.40 s gammaloop-nextest-python-api>
  110. 32.40 s gammaloop-nextest-python-api> running 1 test
  111. 32.40 s gammaloop-nextest-python-api> test python_evaluate_sample_preserves_graph_grouping_and_incoming_pdgs ... FAILED
  112. 32.40 s gammaloop-nextest-python-api>
  113. 32.40 s gammaloop-nextest-python-api> failures:
  114. 32.40 s gammaloop-nextest-python-api>
  115. 32.40 s gammaloop-nextest-python-api> failures:
  116. 32.40 s gammaloop-nextest-python-api> python_evaluate_sample_preserves_graph_grouping_and_incoming_pdgs
  117. 32.40 s gammaloop-nextest-python-api>
  118. 32.40 s gammaloop-nextest-python-api> test result: FAILED. 0 passed; 1 failed; 0 ignored; 0 measured; 4 filtered out; finished in 0.11s
  119. 32.40 s gammaloop-nextest-python-api>
  120. 32.40 s gammaloop-nextest-python-api> stderr ---
  121. 32.40 s gammaloop-nextest-python-api> Error: Python API test subprocess failed.
  122. 32.40 s gammaloop-nextest-python-api> stdout:
  123. 32.40 s gammaloop-nextest-python-api> ┌────────────────────────────────────────────────────────┐
  124. 32.40 s gammaloop-nextest-python-api> │ You are running a restricted Symbolica instance. │
  125. 32.40 s gammaloop-nextest-python-api> │ │
  126. 32.40 s gammaloop-nextest-python-api> │ This mode is only permitted for non-commercial use and │
  127. 32.40 s gammaloop-nextest-python-api> │ is limited to one instance and core per machine. │
  128. 32.40 s gammaloop-nextest-python-api> │ │
  129. 32.40 s gammaloop-nextest-python-api> │ Hobbyists can easily acquire a free license key │
  130. 32.40 s gammaloop-nextest-python-api> │ that unlocks all cores and removes this banner: │
  131. 32.40 s gammaloop-nextest-python-api> │ │
  132. 32.40 s gammaloop-nextest-python-api> │ from symbolica import * │
  133. 32.40 s gammaloop-nextest-python-api> │ request_hobbyist_license('YOUR_NAME', 'YOUR_EMAIL') │
  134. 32.40 s gammaloop-nextest-python-api> │ │
  135. 32.40 s gammaloop-nextest-python-api> │ All other users can obtain a free 30-day trial key: │
  136. 32.40 s gammaloop-nextest-python-api> │ │
  137. 32.40 s gammaloop-nextest-python-api> │ from symbolica import * │
  138. 32.40 s gammaloop-nextest-python-api> │ request_trial_license('NAME', 'EMAIL', 'EMPLOYER') │
  139. 32.40 s gammaloop-nextest-python-api> │ │
  140. 32.40 s gammaloop-nextest-python-api> │ See https://symbolica.io/docs/get_started.html#license │
  141. 32.40 s gammaloop-nextest-python-api> └────────────────────────────────────────────────────────┘
  142. 32.40 s gammaloop-nextest-python-api> ┌───────────────────────────────────────────────────────────────────────────────────────────────────────────┐
  143. 32.40 s gammaloop-nextest-python-api> │ Cannot start new unlicensed Symbolica instance since there is already another one running on the machine. │
  144. 32.40 s gammaloop-nextest-python-api> └───────────────────────────────────────────────────────────────────────────────────────────────────────────┘
  145. 32.40 s gammaloop-nextest-python-api>
  146. 32.40 s gammaloop-nextest-python-api> stderr:
  147. 32.40 s gammaloop-nextest-python-api>
  148. 32.40 s gammaloop-nextest-python-api> ┌───────────────────────────────────────────────────────────┐
  149. 32.40 s gammaloop-nextest-python-api> │ Could not resolve the IP of the Symbolica license server. │
  150. 32.40 s gammaloop-nextest-python-api> │ │
  151. 32.40 s gammaloop-nextest-python-api> │ Please check your DNS configuration. │
  152. 32.40 s gammaloop-nextest-python-api> └───────────────────────────────────────────────────────────┘
  153. 32.40 s gammaloop-nextest-python-api> Error: failed to lookup address information: Temporary failure in name resolution
  154. 32.40 s gammaloop-nextest-python-api>
  155. 32.40 s gammaloop-nextest-python-api>
  156. 32.40 s gammaloop-nextest-python-api> Location:
  157. 32.40 s gammaloop-nextest-python-api> tests/tests/test_python_api.rs:156:20
  158. 32.40 s gammaloop-nextest-python-api>
  159. 32.40 s gammaloop-nextest-python-api> FAIL [ 0.116s] (3/5) gammaloop-integration-tests::test_python_api python_session_getters_return_live_toml_and_command_blocks
  160. 32.40 s gammaloop-nextest-python-api> stdout ---
  161. 32.40 s gammaloop-nextest-python-api>
  162. 32.40 s gammaloop-nextest-python-api> running 1 test
  163. 32.40 s gammaloop-nextest-python-api> test python_session_getters_return_live_toml_and_command_blocks ... FAILED
  164. 32.40 s gammaloop-nextest-python-api>
  165. 32.40 s gammaloop-nextest-python-api> failures:
  166. 32.40 s gammaloop-nextest-python-api>
  167. 32.40 s gammaloop-nextest-python-api> failures:
  168. 32.40 s gammaloop-nextest-python-api> python_session_getters_return_live_toml_and_command_blocks
  169. 32.40 s gammaloop-nextest-python-api>
  170. 32.40 s gammaloop-nextest-python-api> test result: FAILED. 0 passed; 1 failed; 0 ignored; 0 measured; 4 filtered out; finished in 0.11s
  171. 32.40 s gammaloop-nextest-python-api>
  172. 32.40 s gammaloop-nextest-python-api> stderr ---
  173. 32.40 s gammaloop-nextest-python-api> Error: Python API test subprocess failed.
  174. 32.40 s gammaloop-nextest-python-api> stdout:
  175. 32.40 s gammaloop-nextest-python-api> ┌────────────────────────────────────────────────────────┐
  176. 32.40 s gammaloop-nextest-python-api> │ You are running a restricted Symbolica instance. │
  177. 32.40 s gammaloop-nextest-python-api> │ │
  178. 32.40 s gammaloop-nextest-python-api> │ This mode is only permitted for non-commercial use and │
  179. 32.40 s gammaloop-nextest-python-api> │ is limited to one instance and core per machine. │
  180. 32.40 s gammaloop-nextest-python-api> │ │
  181. 32.40 s gammaloop-nextest-python-api> │ Hobbyists can easily acquire a free license key │
  182. 32.40 s gammaloop-nextest-python-api> │ that unlocks all cores and removes this banner: │
  183. 32.40 s gammaloop-nextest-python-api> │ │
  184. 32.40 s gammaloop-nextest-python-api> │ from symbolica import * │
  185. 32.40 s gammaloop-nextest-python-api> │ request_hobbyist_license('YOUR_NAME', 'YOUR_EMAIL') │
  186. 32.40 s gammaloop-nextest-python-api> │ │
  187. 32.41 s gammaloop-nextest-python-api> │ All other users can obtain a free 30-day trial key: │
  188. 32.41 s gammaloop-nextest-python-api> │ │
  189. 32.41 s gammaloop-nextest-python-api> │ from symbolica import * │
  190. 32.41 s gammaloop-nextest-python-api> │ request_trial_license('NAME', 'EMAIL', 'EMPLOYER') │
  191. 32.41 s gammaloop-nextest-python-api> │ │
  192. 32.41 s gammaloop-nextest-python-api> │ See https://symbolica.io/docs/get_started.html#license │
  193. 32.41 s gammaloop-nextest-python-api> └────────────────────────────────────────────────────────┘
  194. 32.41 s gammaloop-nextest-python-api> ┌───────────────────────────────────────────────────────────────────────────────────────────────────────────┐
  195. 32.41 s gammaloop-nextest-python-api> │ Cannot start new unlicensed Symbolica instance since there is already another one running on the machine. │
  196. 32.41 s gammaloop-nextest-python-api> └───────────────────────────────────────────────────────────────────────────────────────────────────────────┘
  197. 32.41 s gammaloop-nextest-python-api>
  198. 32.41 s gammaloop-nextest-python-api> stderr:
  199. 32.41 s gammaloop-nextest-python-api>
  200. 32.41 s gammaloop-nextest-python-api> ┌───────────────────────────────────────────────────────────┐
  201. 32.41 s gammaloop-nextest-python-api> │ Could not resolve the IP of the Symbolica license server. │
  202. 32.41 s gammaloop-nextest-python-api> │ │
  203. 32.41 s gammaloop-nextest-python-api> │ Please check your DNS configuration. │
  204. 32.41 s gammaloop-nextest-python-api> └───────────────────────────────────────────────────────────┘
  205. 32.41 s gammaloop-nextest-python-api> Error: failed to lookup address information: Temporary failure in name resolution
  206. 32.41 s gammaloop-nextest-python-api>
  207. 32.41 s gammaloop-nextest-python-api>
  208. 32.41 s gammaloop-nextest-python-api> Location:
  209. 32.41 s gammaloop-nextest-python-api> tests/tests/test_python_api.rs:156:20
  210. 32.41 s gammaloop-nextest-python-api>
  211. 32.41 s gammaloop-nextest-python-api> FAIL [ 0.117s] (4/5) gammaloop-integration-tests::test_python_api python_evaluate_sample_honors_generate_events_and_observable_snapshots
  212. 32.41 s gammaloop-nextest-python-api> stdout ---
  213. 32.41 s gammaloop-nextest-python-api>
  214. 32.41 s gammaloop-nextest-python-api> running 1 test
  215. 32.41 s gammaloop-nextest-python-api> test python_evaluate_sample_honors_generate_events_and_observable_snapshots ... FAILED
  216. 32.41 s gammaloop-nextest-python-api>
  217. 32.41 s gammaloop-nextest-python-api> failures:
  218. 32.41 s gammaloop-nextest-python-api>
  219. 32.41 s gammaloop-nextest-python-api> failures:
  220. 32.41 s gammaloop-nextest-python-api> python_evaluate_sample_honors_generate_events_and_observable_snapshots
  221. 32.41 s gammaloop-nextest-python-api>
  222. 32.41 s gammaloop-nextest-python-api> test result: FAILED. 0 passed; 1 failed; 0 ignored; 0 measured; 4 filtered out; finished in 0.11s
  223. 32.41 s gammaloop-nextest-python-api>
  224. 32.41 s gammaloop-nextest-python-api> stderr ---
  225. 32.41 s gammaloop-nextest-python-api> Error: Python API test subprocess failed.
  226. 32.41 s gammaloop-nextest-python-api> stdout:
  227. 32.41 s gammaloop-nextest-python-api> ┌────────────────────────────────────────────────────────┐
  228. 32.41 s gammaloop-nextest-python-api> │ You are running a restricted Symbolica instance. │
  229. 32.41 s gammaloop-nextest-python-api> │ │
  230. 32.41 s gammaloop-nextest-python-api> │ This mode is only permitted for non-commercial use and │
  231. 32.41 s gammaloop-nextest-python-api> │ is limited to one instance and core per machine. │
  232. 32.41 s gammaloop-nextest-python-api> │ │
  233. 32.41 s gammaloop-nextest-python-api> │ Hobbyists can easily acquire a free license key │
  234. 32.41 s gammaloop-nextest-python-api> │ that unlocks all cores and removes this banner: │
  235. 32.41 s gammaloop-nextest-python-api> │ │
  236. 32.41 s gammaloop-nextest-python-api> │ from symbolica import * │
  237. 32.41 s gammaloop-nextest-python-api> │ request_hobbyist_license('YOUR_NAME', 'YOUR_EMAIL') │
  238. 32.41 s gammaloop-nextest-python-api> │ │
  239. 32.41 s gammaloop-nextest-python-api> │ All other users can obtain a free 30-day trial key: │
  240. 32.41 s gammaloop-nextest-python-api> │ │
  241. 32.41 s gammaloop-nextest-python-api> │ from symbolica import * │
  242. 32.41 s gammaloop-nextest-python-api> │ request_trial_license('NAME', 'EMAIL', 'EMPLOYER') │
  243. 32.41 s gammaloop-nextest-python-api> │ │
  244. 32.41 s gammaloop-nextest-python-api> │ See https://symbolica.io/docs/get_started.html#license │
  245. 32.41 s gammaloop-nextest-python-api> └────────────────────────────────────────────────────────┘
  246. 32.41 s gammaloop-nextest-python-api> ┌───────────────────────────────────────────────────────────────────────────────────────────────────────────┐
  247. 32.41 s gammaloop-nextest-python-api> │ Cannot start new unlicensed Symbolica instance since there is already another one running on the machine. │
  248. 32.41 s gammaloop-nextest-python-api> └───────────────────────────────────────────────────────────────────────────────────────────────────────────┘
  249. 32.41 s gammaloop-nextest-python-api>
  250. 32.41 s gammaloop-nextest-python-api> stderr:
  251. 32.41 s gammaloop-nextest-python-api>
  252. 32.41 s gammaloop-nextest-python-api> ┌───────────────────────────────────────────────────────────┐
  253. 32.41 s gammaloop-nextest-python-api> │ Could not resolve the IP of the Symbolica license server. │
  254. 32.41 s gammaloop-nextest-python-api> │ │
  255. 32.41 s gammaloop-nextest-python-api> │ Please check your DNS configuration. │
  256. 32.41 s gammaloop-nextest-python-api> └───────────────────────────────────────────────────────────┘
  257. 32.41 s gammaloop-nextest-python-api> Error: failed to lookup address information: Temporary failure in name resolution
  258. 32.41 s gammaloop-nextest-python-api>
  259. 32.41 s gammaloop-nextest-python-api>
  260. 32.41 s gammaloop-nextest-python-api> Location:
  261. 32.41 s gammaloop-nextest-python-api> tests/tests/test_python_api.rs:156:20
  262. 32.41 s gammaloop-nextest-python-api>
  263. 32.57 s gammaloop-nextest-python-api> ------------
  264. 32.57 s gammaloop-nextest-python-api> Summary [ 0.277s] 5 tests run: 1 passed, 4 failed, 0 skipped
  265. 32.57 s gammaloop-nextest-python-api> FAIL [ 0.110s] (1/5) gammaloop-integration-tests::test_python_api python_evaluate_samples_batch_and_momentum_space_have_expected_shape
  266. 32.57 s gammaloop-nextest-python-api> stdout ---
  267. 32.57 s gammaloop-nextest-python-api>
  268. 32.57 s gammaloop-nextest-python-api> running 1 test
  269. 32.57 s gammaloop-nextest-python-api> test python_evaluate_samples_batch_and_momentum_space_have_expected_shape ... FAILED
  270. 32.57 s gammaloop-nextest-python-api>
  271. 32.57 s gammaloop-nextest-python-api> failures:
  272. 32.57 s gammaloop-nextest-python-api>
  273. 32.57 s gammaloop-nextest-python-api> failures:
  274. 32.57 s gammaloop-nextest-python-api> python_evaluate_samples_batch_and_momentum_space_have_expected_shape
  275. 32.57 s gammaloop-nextest-python-api>
  276. 32.57 s gammaloop-nextest-python-api> test result: FAILED. 0 passed; 1 failed; 0 ignored; 0 measured; 4 filtered out; finished in 0.10s
  277. 32.57 s gammaloop-nextest-python-api>
  278. 32.57 s gammaloop-nextest-python-api> stderr ---
  279. 32.57 s gammaloop-nextest-python-api> Error: Python API test subprocess failed.
  280. 32.57 s gammaloop-nextest-python-api> stdout:
  281. 32.57 s gammaloop-nextest-python-api> ┌────────────────────────────────────────────────────────┐
  282. 32.57 s gammaloop-nextest-python-api> │ You are running a restricted Symbolica instance. │
  283. 32.57 s gammaloop-nextest-python-api> │ │
  284. 32.57 s gammaloop-nextest-python-api> │ This mode is only permitted for non-commercial use and │
  285. 32.57 s gammaloop-nextest-python-api> │ is limited to one instance and core per machine. │
  286. 32.57 s gammaloop-nextest-python-api> │ │
  287. 32.57 s gammaloop-nextest-python-api> │ Hobbyists can easily acquire a free license key │
  288. 32.57 s gammaloop-nextest-python-api> │ that unlocks all cores and removes this banner: │
  289. 32.57 s gammaloop-nextest-python-api> │ │
  290. 32.57 s gammaloop-nextest-python-api> │ from symbolica import * │
  291. 32.57 s gammaloop-nextest-python-api> │ request_hobbyist_license('YOUR_NAME', 'YOUR_EMAIL') │
  292. 32.57 s gammaloop-nextest-python-api> │ │
  293. 32.57 s gammaloop-nextest-python-api> │ All other users can obtain a free 30-day trial key: │
  294. 32.57 s gammaloop-nextest-python-api> │ │
  295. 32.57 s gammaloop-nextest-python-api> │ from symbolica import * │
  296. 32.57 s gammaloop-nextest-python-api> │ request_trial_license('NAME', 'EMAIL', 'EMPLOYER') │
  297. 32.57 s gammaloop-nextest-python-api> │ │
  298. 32.57 s gammaloop-nextest-python-api> │ See https://symbolica.io/docs/get_started.html#license │
  299. 32.57 s gammaloop-nextest-python-api> └────────────────────────────────────────────────────────┘
  300. 32.57 s gammaloop-nextest-python-api> ┌───────────────────────────────────────────────────────────────────────────────────────────────────────────┐
  301. 32.57 s gammaloop-nextest-python-api> │ Cannot start new unlicensed Symbolica instance since there is already another one running on the machine. │
  302. 32.57 s gammaloop-nextest-python-api> └───────────────────────────────────────────────────────────────────────────────────────────────────────────┘
  303. 32.57 s gammaloop-nextest-python-api>
  304. 32.57 s gammaloop-nextest-python-api> stderr:
  305. 32.57 s gammaloop-nextest-python-api>
  306. 32.57 s gammaloop-nextest-python-api> ┌───────────────────────────────────────────────────────────┐
  307. 32.57 s gammaloop-nextest-python-api> │ Could not resolve the IP of the Symbolica license server. │
  308. 32.57 s gammaloop-nextest-python-api> │ │
  309. 32.57 s gammaloop-nextest-python-api> │ Please check your DNS configuration. │
  310. 32.57 s gammaloop-nextest-python-api> └───────────────────────────────────────────────────────────┘
  311. 32.57 s gammaloop-nextest-python-api> Error: failed to lookup address information: Temporary failure in name resolution
  312. 32.57 s gammaloop-nextest-python-api>
  313. 32.57 s gammaloop-nextest-python-api>
  314. 32.57 s gammaloop-nextest-python-api> Location:
  315. 32.57 s gammaloop-nextest-python-api> tests/tests/test_python_api.rs:156:20
  316. 32.57 s gammaloop-nextest-python-api>
  317. 32.57 s gammaloop-nextest-python-api> FAIL [ 0.110s] (2/5) gammaloop-integration-tests::test_python_api python_evaluate_sample_preserves_graph_grouping_and_incoming_pdgs
  318. 32.57 s gammaloop-nextest-python-api> stdout ---
  319. 32.57 s gammaloop-nextest-python-api>
  320. 32.57 s gammaloop-nextest-python-api> running 1 test
  321. 32.57 s gammaloop-nextest-python-api> test python_evaluate_sample_preserves_graph_grouping_and_incoming_pdgs ... FAILED
  322. 32.57 s gammaloop-nextest-python-api>
  323. 32.57 s gammaloop-nextest-python-api> failures:
  324. 32.57 s gammaloop-nextest-python-api>
  325. 32.57 s gammaloop-nextest-python-api> failures:
  326. 32.57 s gammaloop-nextest-python-api> python_evaluate_sample_preserves_graph_grouping_and_incoming_pdgs
  327. 32.57 s gammaloop-nextest-python-api>
  328. 32.57 s gammaloop-nextest-python-api> test result: FAILED. 0 passed; 1 failed; 0 ignored; 0 measured; 4 filtered out; finished in 0.11s
  329. 32.57 s gammaloop-nextest-python-api>
  330. 32.57 s gammaloop-nextest-python-api> stderr ---
  331. 32.57 s gammaloop-nextest-python-api> Error: Python API test subprocess failed.
  332. 32.57 s gammaloop-nextest-python-api> stdout:
  333. 32.57 s gammaloop-nextest-python-api> ┌────────────────────────────────────────────────────────┐
  334. 32.57 s gammaloop-nextest-python-api> │ You are running a restricted Symbolica instance. │
  335. 32.57 s gammaloop-nextest-python-api> │ │
  336. 32.57 s gammaloop-nextest-python-api> │ This mode is only permitted for non-commercial use and │
  337. 32.57 s gammaloop-nextest-python-api> │ is limited to one instance and core per machine. │
  338. 32.57 s gammaloop-nextest-python-api> │ │
  339. 32.57 s gammaloop-nextest-python-api> │ Hobbyists can easily acquire a free license key │
  340. 32.57 s gammaloop-nextest-python-api> │ that unlocks all cores and removes this banner: │
  341. 32.57 s gammaloop-nextest-python-api> │ │
  342. 32.57 s gammaloop-nextest-python-api> │ from symbolica import * │
  343. 32.57 s gammaloop-nextest-python-api> │ request_hobbyist_license('YOUR_NAME', 'YOUR_EMAIL') │
  344. 32.57 s gammaloop-nextest-python-api> │ │
  345. 32.57 s gammaloop-nextest-python-api> │ All other users can obtain a free 30-day trial key: │
  346. 32.57 s gammaloop-nextest-python-api> │ │
  347. 32.57 s gammaloop-nextest-python-api> │ from symbolica import * │
  348. 32.57 s gammaloop-nextest-python-api> │ request_trial_license('NAME', 'EMAIL', 'EMPLOYER') │
  349. 32.57 s gammaloop-nextest-python-api> │ │
  350. 32.57 s gammaloop-nextest-python-api> │ See https://symbolica.io/docs/get_started.html#license │
  351. 32.57 s gammaloop-nextest-python-api> └────────────────────────────────────────────────────────┘
  352. 32.57 s gammaloop-nextest-python-api> ┌───────────────────────────────────────────────────────────────────────────────────────────────────────────┐
  353. 32.57 s gammaloop-nextest-python-api> │ Cannot start new unlicensed Symbolica instance since there is already another one running on the machine. │
  354. 32.57 s gammaloop-nextest-python-api> └───────────────────────────────────────────────────────────────────────────────────────────────────────────┘
  355. 32.57 s gammaloop-nextest-python-api>
  356. 32.57 s gammaloop-nextest-python-api> stderr:
  357. 32.57 s gammaloop-nextest-python-api>
  358. 32.57 s gammaloop-nextest-python-api> ┌───────────────────────────────────────────────────────────┐
  359. 32.57 s gammaloop-nextest-python-api> │ Could not resolve the IP of the Symbolica license server. │
  360. 32.57 s gammaloop-nextest-python-api> │ │
  361. 32.57 s gammaloop-nextest-python-api> │ Please check your DNS configuration. │
  362. 32.57 s gammaloop-nextest-python-api> └───────────────────────────────────────────────────────────┘
  363. 32.57 s gammaloop-nextest-python-api> Error: failed to lookup address information: Temporary failure in name resolution
  364. 32.57 s gammaloop-nextest-python-api>
  365. 32.57 s gammaloop-nextest-python-api>
  366. 32.57 s gammaloop-nextest-python-api> Location:
  367. 32.57 s gammaloop-nextest-python-api> tests/tests/test_python_api.rs:156:20
  368. 32.57 s gammaloop-nextest-python-api>
  369. 32.57 s gammaloop-nextest-python-api> FAIL [ 0.116s] (3/5) gammaloop-integration-tests::test_python_api python_session_getters_return_live_toml_and_command_blocks
  370. 32.57 s gammaloop-nextest-python-api> stdout ---
  371. 32.57 s gammaloop-nextest-python-api>
  372. 32.57 s gammaloop-nextest-python-api> running 1 test
  373. 32.57 s gammaloop-nextest-python-api> test python_session_getters_return_live_toml_and_command_blocks ... FAILED
  374. 32.57 s gammaloop-nextest-python-api>
  375. 32.57 s gammaloop-nextest-python-api> failures:
  376. 32.57 s gammaloop-nextest-python-api>
  377. 32.57 s gammaloop-nextest-python-api> failures:
  378. 32.57 s gammaloop-nextest-python-api> python_session_getters_return_live_toml_and_command_blocks
  379. 32.57 s gammaloop-nextest-python-api>
  380. 32.57 s gammaloop-nextest-python-api> test result: FAILED. 0 passed; 1 failed; 0 ignored; 0 measured; 4 filtered out; finished in 0.11s
  381. 32.57 s gammaloop-nextest-python-api>
  382. 32.57 s gammaloop-nextest-python-api> stderr ---
  383. 32.57 s gammaloop-nextest-python-api> Error: Python API test subprocess failed.
  384. 32.57 s gammaloop-nextest-python-api> stdout:
  385. 32.57 s gammaloop-nextest-python-api> ┌────────────────────────────────────────────────────────┐
  386. 32.57 s gammaloop-nextest-python-api> │ You are running a restricted Symbolica instance. │
  387. 32.57 s gammaloop-nextest-python-api> │ │
  388. 32.57 s gammaloop-nextest-python-api> │ This mode is only permitted for non-commercial use and │
  389. 32.57 s gammaloop-nextest-python-api> │ is limited to one instance and core per machine. │
  390. 32.57 s gammaloop-nextest-python-api> │ │
  391. 32.57 s gammaloop-nextest-python-api> │ Hobbyists can easily acquire a free license key │
  392. 32.57 s gammaloop-nextest-python-api> │ that unlocks all cores and removes this banner: │
  393. 32.57 s gammaloop-nextest-python-api> │ │
  394. 32.57 s gammaloop-nextest-python-api> │ from symbolica import * │
  395. 32.57 s gammaloop-nextest-python-api> │ request_hobbyist_license('YOUR_NAME', 'YOUR_EMAIL') │
  396. 32.57 s gammaloop-nextest-python-api> │ │
  397. 32.57 s gammaloop-nextest-python-api> │ All other users can obtain a free 30-day trial key: │
  398. 32.57 s gammaloop-nextest-python-api> │ │
  399. 32.57 s gammaloop-nextest-python-api> │ from symbolica import * │
  400. 32.57 s gammaloop-nextest-python-api> │ request_trial_license('NAME', 'EMAIL', 'EMPLOYER') │
  401. 32.57 s gammaloop-nextest-python-api> │ │
  402. 32.57 s gammaloop-nextest-python-api> │ See https://symbolica.io/docs/get_started.html#license │
  403. 32.57 s gammaloop-nextest-python-api> └────────────────────────────────────────────────────────┘
  404. 32.57 s gammaloop-nextest-python-api> ┌───────────────────────────────────────────────────────────────────────────────────────────────────────────┐
  405. 32.57 s gammaloop-nextest-python-api> │ Cannot start new unlicensed Symbolica instance since there is already another one running on the machine. │
  406. 32.57 s gammaloop-nextest-python-api> └───────────────────────────────────────────────────────────────────────────────────────────────────────────┘
  407. 32.57 s gammaloop-nextest-python-api>
  408. 32.57 s gammaloop-nextest-python-api> stderr:
  409. 32.57 s gammaloop-nextest-python-api>
  410. 32.57 s gammaloop-nextest-python-api> ┌───────────────────────────────────────────────────────────┐
  411. 32.57 s gammaloop-nextest-python-api> │ Could not resolve the IP of the Symbolica license server. │
  412. 32.57 s gammaloop-nextest-python-api> │ │
  413. 32.57 s gammaloop-nextest-python-api> │ Please check your DNS configuration. │
  414. 32.57 s gammaloop-nextest-python-api> └───────────────────────────────────────────────────────────┘
  415. 32.57 s gammaloop-nextest-python-api> Error: failed to lookup address information: Temporary failure in name resolution
  416. 32.57 s gammaloop-nextest-python-api>
  417. 32.57 s gammaloop-nextest-python-api>
  418. 32.57 s gammaloop-nextest-python-api> Location:
  419. 32.57 s gammaloop-nextest-python-api> tests/tests/test_python_api.rs:156:20
  420. 32.57 s gammaloop-nextest-python-api>
  421. 32.57 s gammaloop-nextest-python-api> FAIL [ 0.117s] (4/5) gammaloop-integration-tests::test_python_api python_evaluate_sample_honors_generate_events_and_observable_snapshots
  422. 32.57 s gammaloop-nextest-python-api> stdout ---
  423. 32.57 s gammaloop-nextest-python-api>
  424. 32.57 s gammaloop-nextest-python-api> running 1 test
  425. 32.57 s gammaloop-nextest-python-api> test python_evaluate_sample_honors_generate_events_and_observable_snapshots ... FAILED
  426. 32.57 s gammaloop-nextest-python-api>
  427. 32.57 s gammaloop-nextest-python-api> failures:
  428. 32.57 s gammaloop-nextest-python-api>
  429. 32.57 s gammaloop-nextest-python-api> failures:
  430. 32.57 s gammaloop-nextest-python-api> python_evaluate_sample_honors_generate_events_and_observable_snapshots
  431. 32.57 s gammaloop-nextest-python-api>
  432. 32.57 s gammaloop-nextest-python-api> test result: FAILED. 0 passed; 1 failed; 0 ignored; 0 measured; 4 filtered out; finished in 0.11s
  433. 32.57 s gammaloop-nextest-python-api>
  434. 32.57 s gammaloop-nextest-python-api> stderr ---
  435. 32.57 s gammaloop-nextest-python-api> Error: Python API test subprocess failed.
  436. 32.57 s gammaloop-nextest-python-api> stdout:
  437. 32.57 s gammaloop-nextest-python-api> ┌────────────────────────────────────────────────────────┐
  438. 32.57 s gammaloop-nextest-python-api> │ You are running a restricted Symbolica instance. │
  439. 32.57 s gammaloop-nextest-python-api> │ │
  440. 32.57 s gammaloop-nextest-python-api> │ This mode is only permitted for non-commercial use and │
  441. 32.57 s gammaloop-nextest-python-api> │ is limited to one instance and core per machine. │
  442. 32.57 s gammaloop-nextest-python-api> │ │
  443. 32.57 s gammaloop-nextest-python-api> │ Hobbyists can easily acquire a free license key │
  444. 32.57 s gammaloop-nextest-python-api> │ that unlocks all cores and removes this banner: │
  445. 32.57 s gammaloop-nextest-python-api> │ │
  446. 32.57 s gammaloop-nextest-python-api> │ from symbolica import * │
  447. 32.57 s gammaloop-nextest-python-api> │ request_hobbyist_license('YOUR_NAME', 'YOUR_EMAIL') │
  448. 32.57 s gammaloop-nextest-python-api> │ │
  449. 32.57 s gammaloop-nextest-python-api> │ All other users can obtain a free 30-day trial key: │
  450. 32.57 s gammaloop-nextest-python-api> │ │
  451. 32.57 s gammaloop-nextest-python-api> │ from symbolica import * │
  452. 32.57 s gammaloop-nextest-python-api> │ request_trial_license('NAME', 'EMAIL', 'EMPLOYER') │
  453. 32.57 s gammaloop-nextest-python-api> │ │
  454. 32.57 s gammaloop-nextest-python-api> │ See https://symbolica.io/docs/get_started.html#license │
  455. 32.57 s gammaloop-nextest-python-api> └────────────────────────────────────────────────────────┘
  456. 32.57 s gammaloop-nextest-python-api> ┌───────────────────────────────────────────────────────────────────────────────────────────────────────────┐
  457. 32.57 s gammaloop-nextest-python-api> │ Cannot start new unlicensed Symbolica instance since there is already another one running on the machine. │
  458. 32.57 s gammaloop-nextest-python-api> └───────────────────────────────────────────────────────────────────────────────────────────────────────────┘
  459. 32.57 s gammaloop-nextest-python-api>
  460. 32.57 s gammaloop-nextest-python-api> stderr:
  461. 32.57 s gammaloop-nextest-python-api>
  462. 32.57 s gammaloop-nextest-python-api> ┌───────────────────────────────────────────────────────────┐
  463. 32.57 s gammaloop-nextest-python-api> │ Could not resolve the IP of the Symbolica license server. │
  464. 32.57 s gammaloop-nextest-python-api> │ │
  465. 32.57 s gammaloop-nextest-python-api> │ Please check your DNS configuration. │
  466. 32.57 s gammaloop-nextest-python-api> └───────────────────────────────────────────────────────────┘
  467. 32.57 s gammaloop-nextest-python-api> Error: failed to lookup address information: Temporary failure in name resolution
  468. 32.57 s gammaloop-nextest-python-api>
  469. 32.57 s gammaloop-nextest-python-api>
  470. 32.57 s gammaloop-nextest-python-api> Location:
  471. 32.57 s gammaloop-nextest-python-api> tests/tests/test_python_api.rs:156:20
  472. 32.57 s gammaloop-nextest-python-api>
  473. 32.58 s gammaloop-nextest-python-api> error: test run failed
  474. 32.60 s gammaloop-nextest-python-api>
  475. 32.60 s gammaloop-nextest-python-api> ========== nextest test summary ==========
  476. 32.60 s gammaloop-nextest-python-api> report: target/nextest/ci_gammaloop/junit.xml
  477. 32.60 s gammaloop-nextest-python-api> tests: 5, failures: 4, errors: 0
  478. 32.60 s gammaloop-nextest-python-api>
  479. 32.60 s gammaloop-nextest-python-api> 1. gammaloop-integration-tests::test_python_api::python_evaluate_samples_batch_and_momentum_space_have_expected_shape
  480. 32.60 s gammaloop-nextest-python-api> failure: test failure with exit code 101
  481. 32.60 s gammaloop-nextest-python-api> Error: Python API test subprocess failed.
  482. 32.60 s gammaloop-nextest-python-api> stdout:
  483. 32.60 s gammaloop-nextest-python-api> ┌────────────────────────────────────────────────────────┐
  484. 32.60 s gammaloop-nextest-python-api> │ You are running a restricted Symbolica instance. │
  485. 32.60 s gammaloop-nextest-python-api> │ │
  486. 32.60 s gammaloop-nextest-python-api> │ This mode is only permitted for non-commercial use and │
  487. 32.60 s gammaloop-nextest-python-api> │ is limited to one instance and core per machine. │
  488. 32.60 s gammaloop-nextest-python-api> │ │
  489. 32.60 s gammaloop-nextest-python-api> │ Hobbyists can easily acquire a free license key │
  490. 32.60 s gammaloop-nextest-python-api> │ that unlocks all cores and removes this banner: │
  491. 32.60 s gammaloop-nextest-python-api> │ │
  492. 32.60 s gammaloop-nextest-python-api> │ from symbolica import * │
  493. 32.60 s gammaloop-nextest-python-api> │ request_hobbyist_license('YOUR_NAME', 'YOUR_EMAIL') │
  494. 32.60 s gammaloop-nextest-python-api> │ │
  495. 32.60 s gammaloop-nextest-python-api> │ All other users can obtain a free 30-day trial key: │
  496. 32.60 s gammaloop-nextest-python-api> │ │
  497. 32.60 s gammaloop-nextest-python-api> │ from symbolica import * │
  498. 32.60 s gammaloop-nextest-python-api> │ request_trial_license('NAME', 'EMAIL', 'EMPLOYER') │
  499. 32.60 s gammaloop-nextest-python-api> │ │
  500. 32.60 s gammaloop-nextest-python-api> │ See https://symbolica.io/docs/get_started.html#license │
  501. 32.60 s gammaloop-nextest-python-api> └────────────────────────────────────────────────────────┘
  502. 32.60 s gammaloop-nextest-python-api> ┌───────────────────────────────────────────────────────────────────────────────────────────────────────────┐
  503. 32.60 s gammaloop-nextest-python-api> │ Cannot start new unlicensed Symbolica instance since there is already another one running on the machine. │
  504. 32.60 s gammaloop-nextest-python-api> └───────────────────────────────────────────────────────────────────────────────────────────────────────────┘
  505. 32.60 s gammaloop-nextest-python-api>
  506. 32.60 s gammaloop-nextest-python-api> stderr:
  507. 32.60 s gammaloop-nextest-python-api>
  508. 32.60 s gammaloop-nextest-python-api> ┌───────────────────────────────────────────────────────────┐
  509. 32.60 s gammaloop-nextest-python-api> │ Could not resolve the IP of the Symbolica license server. │
  510. 32.60 s gammaloop-nextest-python-api> │ │
  511. 32.60 s gammaloop-nextest-python-api> │ Please check your DNS configuration. │
  512. 32.60 s gammaloop-nextest-python-api> └───────────────────────────────────────────────────────────┘
  513. 32.60 s gammaloop-nextest-python-api> Error: failed to lookup address information: Temporary failure in name resolution
  514. 32.60 s gammaloop-nextest-python-api>
  515. 32.60 s gammaloop-nextest-python-api>
  516. 32.60 s gammaloop-nextest-python-api> Location:
  517. 32.60 s gammaloop-nextest-python-api> tests/tests/test_python_api.rs:156:20
  518. 32.60 s gammaloop-nextest-python-api> system-out
  519. 32.60 s gammaloop-nextest-python-api> running 1 test
  520. 32.60 s gammaloop-nextest-python-api> test python_evaluate_samples_batch_and_momentum_space_have_expected_shape ... FAILED
  521. 32.60 s gammaloop-nextest-python-api>
  522. 32.60 s gammaloop-nextest-python-api> failures:
  523. 32.60 s gammaloop-nextest-python-api>
  524. 32.60 s gammaloop-nextest-python-api> failures:
  525. 32.60 s gammaloop-nextest-python-api> python_evaluate_samples_batch_and_momentum_space_have_expected_shape
  526. 32.60 s gammaloop-nextest-python-api>
  527. 32.60 s gammaloop-nextest-python-api> test result: FAILED. 0 passed; 1 failed; 0 ignored; 0 measured; 4 filtered out; finished in 0.10s
  528. 32.60 s gammaloop-nextest-python-api> system-err
  529. 32.60 s gammaloop-nextest-python-api> Error: Python API test subprocess failed.
  530. 32.60 s gammaloop-nextest-python-api> stdout:
  531. 32.60 s gammaloop-nextest-python-api> ┌────────────────────────────────────────────────────────┐
  532. 32.60 s gammaloop-nextest-python-api> │ You are running a restricted Symbolica instance. │
  533. 32.60 s gammaloop-nextest-python-api> │ │
  534. 32.60 s gammaloop-nextest-python-api> │ This mode is only permitted for non-commercial use and │
  535. 32.60 s gammaloop-nextest-python-api> │ is limited to one instance and core per machine. │
  536. 32.60 s gammaloop-nextest-python-api> │ │
  537. 32.60 s gammaloop-nextest-python-api> │ Hobbyists can easily acquire a free license key │
  538. 32.60 s gammaloop-nextest-python-api> │ that unlocks all cores and removes this banner: │
  539. 32.60 s gammaloop-nextest-python-api> │ │
  540. 32.60 s gammaloop-nextest-python-api> │ from symbolica import * │
  541. 32.60 s gammaloop-nextest-python-api> │ request_hobbyist_license('YOUR_NAME', 'YOUR_EMAIL') │
  542. 32.60 s gammaloop-nextest-python-api> │ │
  543. 32.60 s gammaloop-nextest-python-api> │ All other users can obtain a free 30-day trial key: │
  544. 32.60 s gammaloop-nextest-python-api> │ │
  545. 32.60 s gammaloop-nextest-python-api> │ from symbolica import * │
  546. 32.60 s gammaloop-nextest-python-api> │ request_trial_license('NAME', 'EMAIL', 'EMPLOYER') │
  547. 32.60 s gammaloop-nextest-python-api> │ │
  548. 32.60 s gammaloop-nextest-python-api> │ See https://symbolica.io/docs/get_started.html#license │
  549. 32.60 s gammaloop-nextest-python-api> └────────────────────────────────────────────────────────┘
  550. 32.60 s gammaloop-nextest-python-api> ┌───────────────────────────────────────────────────────────────────────────────────────────────────────────┐
  551. 32.60 s gammaloop-nextest-python-api> │ Cannot start new unlicensed Symbolica instance since there is already another one running on the machine. │
  552. 32.60 s gammaloop-nextest-python-api> └───────────────────────────────────────────────────────────────────────────────────────────────────────────┘
  553. 32.60 s gammaloop-nextest-python-api>
  554. 32.60 s gammaloop-nextest-python-api> stderr:
  555. 32.60 s gammaloop-nextest-python-api>
  556. 32.60 s gammaloop-nextest-python-api> ┌───────────────────────────────────────────────────────────┐
  557. 32.60 s gammaloop-nextest-python-api> │ Could not resolve the IP of the Symbolica license server. │
  558. 32.60 s gammaloop-nextest-python-api> │ │
  559. 32.60 s gammaloop-nextest-python-api> │ Please check your DNS configuration. │
  560. 32.60 s gammaloop-nextest-python-api> └───────────────────────────────────────────────────────────┘
  561. 32.60 s gammaloop-nextest-python-api> Error: failed to lookup address information: Temporary failure in name resolution
  562. 32.60 s gammaloop-nextest-python-api>
  563. 32.60 s gammaloop-nextest-python-api>
  564. 32.60 s gammaloop-nextest-python-api> Location:
  565. 32.60 s gammaloop-nextest-python-api> tests/tests/test_python_api.rs:156:20
  566. 32.60 s gammaloop-nextest-python-api>
  567. 32.60 s gammaloop-nextest-python-api> 2. gammaloop-integration-tests::test_python_api::python_evaluate_sample_preserves_graph_grouping_and_incoming_pdgs
  568. 32.60 s gammaloop-nextest-python-api> failure: test failure with exit code 101
  569. 32.60 s gammaloop-nextest-python-api> Error: Python API test subprocess failed.
  570. 32.60 s gammaloop-nextest-python-api> stdout:
  571. 32.60 s gammaloop-nextest-python-api> ┌────────────────────────────────────────────────────────┐
  572. 32.60 s gammaloop-nextest-python-api> │ You are running a restricted Symbolica instance. │
  573. 32.60 s gammaloop-nextest-python-api> │ │
  574. 32.60 s gammaloop-nextest-python-api> │ This mode is only permitted for non-commercial use and │
  575. 32.60 s gammaloop-nextest-python-api> │ is limited to one instance and core per machine. │
  576. 32.60 s gammaloop-nextest-python-api> │ │
  577. 32.60 s gammaloop-nextest-python-api> │ Hobbyists can easily acquire a free license key │
  578. 32.60 s gammaloop-nextest-python-api> │ that unlocks all cores and removes this banner: │
  579. 32.60 s gammaloop-nextest-python-api> │ │
  580. 32.60 s gammaloop-nextest-python-api> │ from symbolica import * │
  581. 32.60 s gammaloop-nextest-python-api> │ request_hobbyist_license('YOUR_NAME', 'YOUR_EMAIL') │
  582. 32.60 s gammaloop-nextest-python-api> │ │
  583. 32.60 s gammaloop-nextest-python-api> │ All other users can obtain a free 30-day trial key: │
  584. 32.60 s gammaloop-nextest-python-api> │ │
  585. 32.60 s gammaloop-nextest-python-api> │ from symbolica import * │
  586. 32.60 s gammaloop-nextest-python-api> │ request_trial_license('NAME', 'EMAIL', 'EMPLOYER') │
  587. 32.60 s gammaloop-nextest-python-api> │ │
  588. 32.60 s gammaloop-nextest-python-api> │ See https://symbolica.io/docs/get_started.html#license │
  589. 32.60 s gammaloop-nextest-python-api> └────────────────────────────────────────────────────────┘
  590. 32.60 s gammaloop-nextest-python-api> ┌───────────────────────────────────────────────────────────────────────────────────────────────────────────┐
  591. 32.60 s gammaloop-nextest-python-api> │ Cannot start new unlicensed Symbolica instance since there is already another one running on the machine. │
  592. 32.60 s gammaloop-nextest-python-api> └───────────────────────────────────────────────────────────────────────────────────────────────────────────┘
  593. 32.60 s gammaloop-nextest-python-api>
  594. 32.60 s gammaloop-nextest-python-api> stderr:
  595. 32.60 s gammaloop-nextest-python-api>
  596. 32.60 s gammaloop-nextest-python-api> ┌───────────────────────────────────────────────────────────┐
  597. 32.60 s gammaloop-nextest-python-api> │ Could not resolve the IP of the Symbolica license server. │
  598. 32.60 s gammaloop-nextest-python-api> │ │
  599. 32.60 s gammaloop-nextest-python-api> │ Please check your DNS configuration. │
  600. 32.60 s gammaloop-nextest-python-api> └───────────────────────────────────────────────────────────┘
  601. 32.60 s gammaloop-nextest-python-api> Error: failed to lookup address information: Temporary failure in name resolution
  602. 32.60 s gammaloop-nextest-python-api>
  603. 32.60 s gammaloop-nextest-python-api>
  604. 32.60 s gammaloop-nextest-python-api> Location:
  605. 32.60 s gammaloop-nextest-python-api> tests/tests/test_python_api.rs:156:20
  606. 32.60 s gammaloop-nextest-python-api> system-out
  607. 32.60 s gammaloop-nextest-python-api> running 1 test
  608. 32.60 s gammaloop-nextest-python-api> test python_evaluate_sample_preserves_graph_grouping_and_incoming_pdgs ... FAILED
  609. 32.60 s gammaloop-nextest-python-api>
  610. 32.60 s gammaloop-nextest-python-api> failures:
  611. 32.60 s gammaloop-nextest-python-api>
  612. 32.60 s gammaloop-nextest-python-api> failures:
  613. 32.60 s gammaloop-nextest-python-api> python_evaluate_sample_preserves_graph_grouping_and_incoming_pdgs
  614. 32.60 s gammaloop-nextest-python-api>
  615. 32.60 s gammaloop-nextest-python-api> test result: FAILED. 0 passed; 1 failed; 0 ignored; 0 measured; 4 filtered out; finished in 0.11s
  616. 32.60 s gammaloop-nextest-python-api> system-err
  617. 32.60 s gammaloop-nextest-python-api> Error: Python API test subprocess failed.
  618. 32.60 s gammaloop-nextest-python-api> stdout:
  619. 32.60 s gammaloop-nextest-python-api> ┌────────────────────────────────────────────────────────┐
  620. 32.60 s gammaloop-nextest-python-api> │ You are running a restricted Symbolica instance. │
  621. 32.60 s gammaloop-nextest-python-api> │ │
  622. 32.60 s gammaloop-nextest-python-api> │ This mode is only permitted for non-commercial use and │
  623. 32.60 s gammaloop-nextest-python-api> │ is limited to one instance and core per machine. │
  624. 32.60 s gammaloop-nextest-python-api> │ │
  625. 32.60 s gammaloop-nextest-python-api> │ Hobbyists can easily acquire a free license key │
  626. 32.60 s gammaloop-nextest-python-api> │ that unlocks all cores and removes this banner: │
  627. 32.60 s gammaloop-nextest-python-api> │ │
  628. 32.60 s gammaloop-nextest-python-api> │ from symbolica import * │
  629. 32.60 s gammaloop-nextest-python-api> │ request_hobbyist_license('YOUR_NAME', 'YOUR_EMAIL') │
  630. 32.60 s gammaloop-nextest-python-api> │ │
  631. 32.60 s gammaloop-nextest-python-api> │ All other users can obtain a free 30-day trial key: │
  632. 32.60 s gammaloop-nextest-python-api> │ │
  633. 32.60 s gammaloop-nextest-python-api> │ from symbolica import * │
  634. 32.60 s gammaloop-nextest-python-api> │ request_trial_license('NAME', 'EMAIL', 'EMPLOYER') │
  635. 32.60 s gammaloop-nextest-python-api> │ │
  636. 32.60 s gammaloop-nextest-python-api> │ See https://symbolica.io/docs/get_started.html#license │
  637. 32.60 s gammaloop-nextest-python-api> └────────────────────────────────────────────────────────┘
  638. 32.60 s gammaloop-nextest-python-api> ┌───────────────────────────────────────────────────────────────────────────────────────────────────────────┐
  639. 32.60 s gammaloop-nextest-python-api> │ Cannot start new unlicensed Symbolica instance since there is already another one running on the machine. │
  640. 32.60 s gammaloop-nextest-python-api> └───────────────────────────────────────────────────────────────────────────────────────────────────────────┘
  641. 32.60 s gammaloop-nextest-python-api>
  642. 32.60 s gammaloop-nextest-python-api> stderr:
  643. 32.60 s gammaloop-nextest-python-api>
  644. 32.60 s gammaloop-nextest-python-api> ┌───────────────────────────────────────────────────────────┐
  645. 32.60 s gammaloop-nextest-python-api> │ Could not resolve the IP of the Symbolica license server. │
  646. 32.60 s gammaloop-nextest-python-api> │ │
  647. 32.60 s gammaloop-nextest-python-api> │ Please check your DNS configuration. │
  648. 32.60 s gammaloop-nextest-python-api> └───────────────────────────────────────────────────────────┘
  649. 32.60 s gammaloop-nextest-python-api> Error: failed to lookup address information: Temporary failure in name resolution
  650. 32.60 s gammaloop-nextest-python-api>
  651. 32.60 s gammaloop-nextest-python-api>
  652. 32.60 s gammaloop-nextest-python-api> Location:
  653. 32.60 s gammaloop-nextest-python-api> tests/tests/test_python_api.rs:156:20
  654. 32.60 s gammaloop-nextest-python-api>
  655. 32.60 s gammaloop-nextest-python-api> 3. gammaloop-integration-tests::test_python_api::python_session_getters_return_live_toml_and_command_blocks
  656. 32.60 s gammaloop-nextest-python-api> failure: test failure with exit code 101
  657. 32.60 s gammaloop-nextest-python-api> Error: Python API test subprocess failed.
  658. 32.60 s gammaloop-nextest-python-api> stdout:
  659. 32.60 s gammaloop-nextest-python-api> ┌────────────────────────────────────────────────────────┐
  660. 32.60 s gammaloop-nextest-python-api> │ You are running a restricted Symbolica instance. │
  661. 32.60 s gammaloop-nextest-python-api> │ │
  662. 32.60 s gammaloop-nextest-python-api> │ This mode is only permitted for non-commercial use and │
  663. 32.60 s gammaloop-nextest-python-api> │ is limited to one instance and core per machine. │
  664. 32.60 s gammaloop-nextest-python-api> │ │
  665. 32.60 s gammaloop-nextest-python-api> │ Hobbyists can easily acquire a free license key │
  666. 32.60 s gammaloop-nextest-python-api> │ that unlocks all cores and removes this banner: │
  667. 32.60 s gammaloop-nextest-python-api> │ │
  668. 32.60 s gammaloop-nextest-python-api> │ from symbolica import * │
  669. 32.60 s gammaloop-nextest-python-api> │ request_hobbyist_license('YOUR_NAME', 'YOUR_EMAIL') │
  670. 32.60 s gammaloop-nextest-python-api> │ │
  671. 32.60 s gammaloop-nextest-python-api> │ All other users can obtain a free 30-day trial key: │
  672. 32.60 s gammaloop-nextest-python-api> │ │
  673. 32.60 s gammaloop-nextest-python-api> │ from symbolica import * │
  674. 32.60 s gammaloop-nextest-python-api> │ request_trial_license('NAME', 'EMAIL', 'EMPLOYER') │
  675. 32.60 s gammaloop-nextest-python-api> │ │
  676. 32.60 s gammaloop-nextest-python-api> │ See https://symbolica.io/docs/get_started.html#license │
  677. 32.60 s gammaloop-nextest-python-api> └────────────────────────────────────────────────────────┘
  678. 32.60 s gammaloop-nextest-python-api> ┌───────────────────────────────────────────────────────────────────────────────────────────────────────────┐
  679. 32.60 s gammaloop-nextest-python-api> │ Cannot start new unlicensed Symbolica instance since there is already another one running on the machine. │
  680. 32.60 s gammaloop-nextest-python-api> └───────────────────────────────────────────────────────────────────────────────────────────────────────────┘
  681. 32.60 s gammaloop-nextest-python-api>
  682. 32.60 s gammaloop-nextest-python-api> stderr:
  683. 32.60 s gammaloop-nextest-python-api>
  684. 32.60 s gammaloop-nextest-python-api> ┌───────────────────────────────────────────────────────────┐
  685. 32.60 s gammaloop-nextest-python-api> │ Could not resolve the IP of the Symbolica license server. │
  686. 32.60 s gammaloop-nextest-python-api> │ │
  687. 32.60 s gammaloop-nextest-python-api> │ Please check your DNS configuration. │
  688. 32.60 s gammaloop-nextest-python-api> └───────────────────────────────────────────────────────────┘
  689. 32.60 s gammaloop-nextest-python-api> Error: failed to lookup address information: Temporary failure in name resolution
  690. 32.60 s gammaloop-nextest-python-api>
  691. 32.60 s gammaloop-nextest-python-api>
  692. 32.60 s gammaloop-nextest-python-api> Location:
  693. 32.60 s gammaloop-nextest-python-api> tests/tests/test_python_api.rs:156:20
  694. 32.60 s gammaloop-nextest-python-api> system-out
  695. 32.60 s gammaloop-nextest-python-api> running 1 test
  696. 32.60 s gammaloop-nextest-python-api> test python_session_getters_return_live_toml_and_command_blocks ... FAILED
  697. 32.60 s gammaloop-nextest-python-api>
  698. 32.60 s gammaloop-nextest-python-api> failures:
  699. 32.60 s gammaloop-nextest-python-api>
  700. 32.60 s gammaloop-nextest-python-api> failures:
  701. 32.61 s gammaloop-nextest-python-api> python_session_getters_return_live_toml_and_command_blocks
  702. 32.61 s gammaloop-nextest-python-api>
  703. 32.61 s gammaloop-nextest-python-api> test result: FAILED. 0 passed; 1 failed; 0 ignored; 0 measured; 4 filtered out; finished in 0.11s
  704. 32.61 s gammaloop-nextest-python-api> system-err
  705. 32.61 s gammaloop-nextest-python-api> Error: Python API test subprocess failed.
  706. 32.61 s gammaloop-nextest-python-api> stdout:
  707. 32.61 s gammaloop-nextest-python-api> ┌────────────────────────────────────────────────────────┐
  708. 32.61 s gammaloop-nextest-python-api> │ You are running a restricted Symbolica instance. │
  709. 32.61 s gammaloop-nextest-python-api> │ │
  710. 32.61 s gammaloop-nextest-python-api> │ This mode is only permitted for non-commercial use and │
  711. 32.61 s gammaloop-nextest-python-api> │ is limited to one instance and core per machine. │
  712. 32.61 s gammaloop-nextest-python-api> │ │
  713. 32.61 s gammaloop-nextest-python-api> │ Hobbyists can easily acquire a free license key │
  714. 32.61 s gammaloop-nextest-python-api> │ that unlocks all cores and removes this banner: │
  715. 32.61 s gammaloop-nextest-python-api> │ │
  716. 32.61 s gammaloop-nextest-python-api> │ from symbolica import * │
  717. 32.61 s gammaloop-nextest-python-api> │ request_hobbyist_license('YOUR_NAME', 'YOUR_EMAIL') │
  718. 32.61 s gammaloop-nextest-python-api> │ │
  719. 32.61 s gammaloop-nextest-python-api> │ All other users can obtain a free 30-day trial key: │
  720. 32.61 s gammaloop-nextest-python-api> │ │
  721. 32.61 s gammaloop-nextest-python-api> │ from symbolica import * │
  722. 32.61 s gammaloop-nextest-python-api> │ request_trial_license('NAME', 'EMAIL', 'EMPLOYER') │
  723. 32.61 s gammaloop-nextest-python-api> │ │
  724. 32.61 s gammaloop-nextest-python-api> │ See https://symbolica.io/docs/get_started.html#license │
  725. 32.61 s gammaloop-nextest-python-api> └────────────────────────────────────────────────────────┘
  726. 32.61 s gammaloop-nextest-python-api> ┌───────────────────────────────────────────────────────────────────────────────────────────────────────────┐
  727. 32.61 s gammaloop-nextest-python-api> │ Cannot start new unlicensed Symbolica instance since there is already another one running on the machine. │
  728. 32.61 s gammaloop-nextest-python-api> └───────────────────────────────────────────────────────────────────────────────────────────────────────────┘
  729. 32.61 s gammaloop-nextest-python-api>
  730. 32.61 s gammaloop-nextest-python-api> stderr:
  731. 32.61 s gammaloop-nextest-python-api>
  732. 32.61 s gammaloop-nextest-python-api> ┌───────────────────────────────────────────────────────────┐
  733. 32.61 s gammaloop-nextest-python-api> │ Could not resolve the IP of the Symbolica license server. │
  734. 32.61 s gammaloop-nextest-python-api> │ │
  735. 32.61 s gammaloop-nextest-python-api> │ Please check your DNS configuration. │
  736. 32.61 s gammaloop-nextest-python-api> └───────────────────────────────────────────────────────────┘
  737. 32.61 s gammaloop-nextest-python-api> Error: failed to lookup address information: Temporary failure in name resolution
  738. 32.61 s gammaloop-nextest-python-api>
  739. 32.61 s gammaloop-nextest-python-api>
  740. 32.61 s gammaloop-nextest-python-api> Location:
  741. 32.61 s gammaloop-nextest-python-api> tests/tests/test_python_api.rs:156:20
  742. 32.61 s gammaloop-nextest-python-api>
  743. 32.61 s gammaloop-nextest-python-api> 4. gammaloop-integration-tests::test_python_api::python_evaluate_sample_honors_generate_events_and_observable_snapshots
  744. 32.61 s gammaloop-nextest-python-api> failure: test failure with exit code 101
  745. 32.61 s gammaloop-nextest-python-api> Error: Python API test subprocess failed.
  746. 32.61 s gammaloop-nextest-python-api> stdout:
  747. 32.61 s gammaloop-nextest-python-api> ┌────────────────────────────────────────────────────────┐
  748. 32.61 s gammaloop-nextest-python-api> │ You are running a restricted Symbolica instance. │
  749. 32.61 s gammaloop-nextest-python-api> │ │
  750. 32.61 s gammaloop-nextest-python-api> │ This mode is only permitted for non-commercial use and │
  751. 32.61 s gammaloop-nextest-python-api> │ is limited to one instance and core per machine. │
  752. 32.61 s gammaloop-nextest-python-api> │ │
  753. 32.61 s gammaloop-nextest-python-api> │ Hobbyists can easily acquire a free license key │
  754. 32.61 s gammaloop-nextest-python-api> │ that unlocks all cores and removes this banner: │
  755. 32.61 s gammaloop-nextest-python-api> │ │
  756. 32.61 s gammaloop-nextest-python-api> │ from symbolica import * │
  757. 32.61 s gammaloop-nextest-python-api> │ request_hobbyist_license('YOUR_NAME', 'YOUR_EMAIL') │
  758. 32.61 s gammaloop-nextest-python-api> │ │
  759. 32.61 s gammaloop-nextest-python-api> │ All other users can obtain a free 30-day trial key: │
  760. 32.61 s gammaloop-nextest-python-api> │ │
  761. 32.61 s gammaloop-nextest-python-api> │ from symbolica import * │
  762. 32.61 s gammaloop-nextest-python-api> │ request_trial_license('NAME', 'EMAIL', 'EMPLOYER') │
  763. 32.61 s gammaloop-nextest-python-api> │ │
  764. 32.61 s gammaloop-nextest-python-api> │ See https://symbolica.io/docs/get_started.html#license │
  765. 32.61 s gammaloop-nextest-python-api> └────────────────────────────────────────────────────────┘
  766. 32.61 s gammaloop-nextest-python-api> ┌───────────────────────────────────────────────────────────────────────────────────────────────────────────┐
  767. 32.61 s gammaloop-nextest-python-api> │ Cannot start new unlicensed Symbolica instance since there is already another one running on the machine. │
  768. 32.61 s gammaloop-nextest-python-api> └───────────────────────────────────────────────────────────────────────────────────────────────────────────┘
  769. 32.61 s gammaloop-nextest-python-api>
  770. 32.61 s gammaloop-nextest-python-api> stderr:
  771. 32.61 s gammaloop-nextest-python-api>
  772. 32.61 s gammaloop-nextest-python-api> ┌───────────────────────────────────────────────────────────┐
  773. 32.61 s gammaloop-nextest-python-api> │ Could not resolve the IP of the Symbolica license server. │
  774. 32.61 s gammaloop-nextest-python-api> │ │
  775. 32.61 s gammaloop-nextest-python-api> │ Please check your DNS configuration. │
  776. 32.61 s gammaloop-nextest-python-api> └───────────────────────────────────────────────────────────┘
  777. 32.61 s gammaloop-nextest-python-api> Error: failed to lookup address information: Temporary failure in name resolution
  778. 32.61 s gammaloop-nextest-python-api>
  779. 32.61 s gammaloop-nextest-python-api>
  780. 32.61 s gammaloop-nextest-python-api> Location:
  781. 32.61 s gammaloop-nextest-python-api> tests/tests/test_python_api.rs:156:20
  782. 32.61 s gammaloop-nextest-python-api> system-out
  783. 32.61 s gammaloop-nextest-python-api> running 1 test
  784. 32.61 s gammaloop-nextest-python-api> test python_evaluate_sample_honors_generate_events_and_observable_snapshots ... FAILED
  785. 32.61 s gammaloop-nextest-python-api>
  786. 32.61 s gammaloop-nextest-python-api> failures:
  787. 32.61 s gammaloop-nextest-python-api>
  788. 32.61 s gammaloop-nextest-python-api> failures:
  789. 32.61 s gammaloop-nextest-python-api> python_evaluate_sample_honors_generate_events_and_observable_snapshots
  790. 32.61 s gammaloop-nextest-python-api>
  791. 32.61 s gammaloop-nextest-python-api> test result: FAILED. 0 passed; 1 failed; 0 ignored; 0 measured; 4 filtered out; finished in 0.11s
  792. 32.61 s gammaloop-nextest-python-api> system-err
  793. 32.61 s gammaloop-nextest-python-api> Error: Python API test subprocess failed.
  794. 32.61 s gammaloop-nextest-python-api> stdout:
  795. 32.61 s gammaloop-nextest-python-api> ┌────────────────────────────────────────────────────────┐
  796. 32.61 s gammaloop-nextest-python-api> │ You are running a restricted Symbolica instance. │
  797. 32.61 s gammaloop-nextest-python-api> │ │
  798. 32.61 s gammaloop-nextest-python-api> │ This mode is only permitted for non-commercial use and │
  799. 32.61 s gammaloop-nextest-python-api> │ is limited to one instance and core per machine. │
  800. 32.61 s gammaloop-nextest-python-api> │ │
  801. 32.61 s gammaloop-nextest-python-api> │ Hobbyists can easily acquire a free license key │
  802. 32.61 s gammaloop-nextest-python-api> │ that unlocks all cores and removes this banner: │
  803. 32.61 s gammaloop-nextest-python-api> │ │
  804. 32.61 s gammaloop-nextest-python-api> │ from symbolica import * │
  805. 32.61 s gammaloop-nextest-python-api> │ request_hobbyist_license('YOUR_NAME', 'YOUR_EMAIL') │
  806. 32.61 s gammaloop-nextest-python-api> │ │
  807. 32.61 s gammaloop-nextest-python-api> │ All other users can obtain a free 30-day trial key: │
  808. 32.61 s gammaloop-nextest-python-api> │ │
  809. 32.61 s gammaloop-nextest-python-api> │ from symbolica import * │
  810. 32.61 s gammaloop-nextest-python-api> │ request_trial_license('NAME', 'EMAIL', 'EMPLOYER') │
  811. 32.61 s gammaloop-nextest-python-api> │ │
  812. 32.61 s gammaloop-nextest-python-api> │ See https://symbolica.io/docs/get_started.html#license │
  813. 32.61 s gammaloop-nextest-python-api> └────────────────────────────────────────────────────────┘
  814. 32.61 s gammaloop-nextest-python-api> ┌───────────────────────────────────────────────────────────────────────────────────────────────────────────┐
  815. 32.61 s gammaloop-nextest-python-api> │ Cannot start new unlicensed Symbolica instance since there is already another one running on the machine. │
  816. 32.61 s gammaloop-nextest-python-api> └───────────────────────────────────────────────────────────────────────────────────────────────────────────┘
  817. 32.61 s gammaloop-nextest-python-api>
  818. 32.61 s gammaloop-nextest-python-api> stderr:
  819. 32.61 s gammaloop-nextest-python-api>
  820. 32.61 s gammaloop-nextest-python-api> ┌───────────────────────────────────────────────────────────┐
  821. 32.61 s gammaloop-nextest-python-api> │ Could not resolve the IP of the Symbolica license server. │
  822. 32.61 s gammaloop-nextest-python-api> │ │
  823. 32.61 s gammaloop-nextest-python-api> │ Please check your DNS configuration. │
  824. 32.61 s gammaloop-nextest-python-api> └───────────────────────────────────────────────────────────┘
  825. 32.61 s gammaloop-nextest-python-api> Error: failed to lookup address information: Temporary failure in name resolution
  826. 32.61 s gammaloop-nextest-python-api>
  827. 32.61 s gammaloop-nextest-python-api>
  828. 32.61 s gammaloop-nextest-python-api> Location:
  829. 32.61 s gammaloop-nextest-python-api> tests/tests/test_python_api.rs:156:20
  830. 32.61 s gammaloop-nextest-python-api> =========================================
  831. 32.64 s error: Cannot build '/nix/store/6yfkarcx1yqfdkgaj26q9b9n3q0min5r-gammaloop-nextest-python-api.drv'.
  832. 32.64 s Reason: builder failed with exit code 100.
  833. 32.64 s Output paths:
  834. 32.64 s /nix/store/28q91q76k9l62yayywlk70ghfzfk0v47-gammaloop-nextest-python-api
  835. 32.64 s Last 781 log lines:
  836. 32.64 s > Extracting 1 binary, 1 build script output directory, and 3 linked paths to /build/nextest-archive-PfBDF1
  837. 32.64 s > Extracted 18 files to /build/nextest-archive-PfBDF1 in 0.06s
  838. 32.64 s > ------------
  839. 32.64 s > Nextest run ID 835a273b-adc2-41be-a789-8cb05bb8b832 with nextest profile: ci_gammaloop
  840. 32.64 s > Starting 5 tests across 1 binary
  841. 32.64 s > FAIL [ 0.110s] (1/5) gammaloop-integration-tests::test_python_api python_evaluate_samples_batch_and_momentum_space_have_expected_shape
  842. 32.64 s > stdout ---
  843. 32.64 s >
  844. 32.64 s > running 1 test
  845. 32.64 s > test python_evaluate_samples_batch_and_momentum_space_have_expected_shape ... FAILED
  846. 32.64 s >
  847. 32.64 s > failures:
  848. 32.64 s >
  849. 32.64 s > failures:
  850. 32.64 s > python_evaluate_samples_batch_and_momentum_space_have_expected_shape
  851. 32.64 s >
  852. 32.64 s > test result: FAILED. 0 passed; 1 failed; 0 ignored; 0 measured; 4 filtered out; finished in 0.10s
  853. 32.64 s >
  854. 32.64 s > stderr ---
  855. 32.64 s > Error: Python API test subprocess failed.
  856. 32.64 s > stdout:
  857. 32.64 s > ┌────────────────────────────────────────────────────────┐
  858. 32.64 s > │ You are running a restricted Symbolica instance. │
  859. 32.64 s > │ │
  860. 32.64 s > │ This mode is only permitted for non-commercial use and │
  861. 32.64 s > │ is limited to one instance and core per machine. │
  862. 32.64 s > │ │
  863. 32.64 s > │ Hobbyists can easily acquire a free license key │
  864. 32.64 s > │ that unlocks all cores and removes this banner: │
  865. 32.64 s > │ │
  866. 32.64 s > │ from symbolica import * │
  867. 32.64 s > │ request_hobbyist_license('YOUR_NAME', 'YOUR_EMAIL') │
  868. 32.64 s > │ │
  869. 32.64 s > │ All other users can obtain a free 30-day trial key: │
  870. 32.64 s > │ │
  871. 32.64 s > │ from symbolica import * │
  872. 32.64 s > │ request_trial_license('NAME', 'EMAIL', 'EMPLOYER') │
  873. 32.64 s > │ │
  874. 32.64 s > │ See https://symbolica.io/docs/get_started.html#license │
  875. 32.64 s > └────────────────────────────────────────────────────────┘
  876. 32.64 s > ┌───────────────────────────────────────────────────────────────────────────────────────────────────────────┐
  877. 32.64 s > │ Cannot start new unlicensed Symbolica instance since there is already another one running on the machine. │
  878. 32.64 s > └───────────────────────────────────────────────────────────────────────────────────────────────────────────┘
  879. 32.64 s >
  880. 32.64 s > stderr:
  881. 32.64 s >
  882. 32.64 s > ┌───────────────────────────────────────────────────────────┐
  883. 32.64 s > │ Could not resolve the IP of the Symbolica license server. │
  884. 32.64 s > │ │
  885. 32.64 s > │ Please check your DNS configuration. │
  886. 32.64 s > └───────────────────────────────────────────────────────────┘
  887. 32.64 s > Error: failed to lookup address information: Temporary failure in name resolution
  888. 32.64 s >
  889. 32.64 s >
  890. 32.64 s > Location:
  891. 32.64 s > tests/tests/test_python_api.rs:156:20
  892. 32.64 s >
  893. 32.64 s > FAIL [ 0.110s] (2/5) gammaloop-integration-tests::test_python_api python_evaluate_sample_preserves_graph_grouping_and_incoming_pdgs
  894. 32.64 s > stdout ---
  895. 32.64 s >
  896. 32.64 s > running 1 test
  897. 32.64 s > test python_evaluate_sample_preserves_graph_grouping_and_incoming_pdgs ... FAILED
  898. 32.64 s >
  899. 32.64 s > failures:
  900. 32.64 s >
  901. 32.64 s > failures:
  902. 32.64 s > python_evaluate_sample_preserves_graph_grouping_and_incoming_pdgs
  903. 32.64 s >
  904. 32.64 s > test result: FAILED. 0 passed; 1 failed; 0 ignored; 0 measured; 4 filtered out; finished in 0.11s
  905. 32.64 s >
  906. 32.64 s > stderr ---
  907. 32.64 s > Error: Python API test subprocess failed.
  908. 32.64 s > stdout:
  909. 32.64 s > ┌────────────────────────────────────────────────────────┐
  910. 32.64 s > │ You are running a restricted Symbolica instance. │
  911. 32.64 s > │ │
  912. 32.64 s > │ This mode is only permitted for non-commercial use and │
  913. 32.64 s > │ is limited to one instance and core per machine. │
  914. 32.64 s > │ │
  915. 32.64 s > │ Hobbyists can easily acquire a free license key │
  916. 32.64 s > │ that unlocks all cores and removes this banner: │
  917. 32.64 s > │ │
  918. 32.64 s > │ from symbolica import * │
  919. 32.64 s > │ request_hobbyist_license('YOUR_NAME', 'YOUR_EMAIL') │
  920. 32.64 s > │ │
  921. 32.64 s > │ All other users can obtain a free 30-day trial key: │
  922. 32.64 s > │ │
  923. 32.64 s > │ from symbolica import * │
  924. 32.64 s > │ request_trial_license('NAME', 'EMAIL', 'EMPLOYER') │
  925. 32.64 s > │ │
  926. 32.64 s > │ See https://symbolica.io/docs/get_started.html#license │
  927. 32.64 s > └────────────────────────────────────────────────────────┘
  928. 32.64 s > ┌───────────────────────────────────────────────────────────────────────────────────────────────────────────┐
  929. 32.64 s > │ Cannot start new unlicensed Symbolica instance since there is already another one running on the machine. │
  930. 32.64 s > └───────────────────────────────────────────────────────────────────────────────────────────────────────────┘
  931. 32.64 s >
  932. 32.64 s > stderr:
  933. 32.64 s >
  934. 32.64 s > ┌───────────────────────────────────────────────────────────┐
  935. 32.64 s > │ Could not resolve the IP of the Symbolica license server. │
  936. 32.64 s > │ │
  937. 32.64 s > │ Please check your DNS configuration. │
  938. 32.64 s > └───────────────────────────────────────────────────────────┘
  939. 32.64 s > Error: failed to lookup address information: Temporary failure in name resolution
  940. 32.64 s >
  941. 32.64 s >
  942. 32.64 s > Location:
  943. 32.64 s > tests/tests/test_python_api.rs:156:20
  944. 32.64 s >
  945. 32.64 s > FAIL [ 0.116s] (3/5) gammaloop-integration-tests::test_python_api python_session_getters_return_live_toml_and_command_blocks
  946. 32.64 s > stdout ---
  947. 32.64 s >
  948. 32.64 s > running 1 test
  949. 32.64 s > test python_session_getters_return_live_toml_and_command_blocks ... FAILED
  950. 32.64 s >
  951. 32.64 s > failures:
  952. 32.64 s >
  953. 32.64 s > failures:
  954. 32.64 s > python_session_getters_return_live_toml_and_command_blocks
  955. 32.64 s >
  956. 32.64 s > test result: FAILED. 0 passed; 1 failed; 0 ignored; 0 measured; 4 filtered out; finished in 0.11s
  957. 32.64 s >
  958. 32.64 s > stderr ---
  959. 32.64 s > Error: Python API test subprocess failed.
  960. 32.64 s > stdout:
  961. 32.64 s > ┌────────────────────────────────────────────────────────┐
  962. 32.64 s > │ You are running a restricted Symbolica instance. │
  963. 32.64 s > │ │
  964. 32.64 s > │ This mode is only permitted for non-commercial use and │
  965. 32.64 s > │ is limited to one instance and core per machine. │
  966. 32.64 s > │ │
  967. 32.64 s > │ Hobbyists can easily acquire a free license key │
  968. 32.64 s > │ that unlocks all cores and removes this banner: │
  969. 32.64 s > │ │
  970. 32.64 s > │ from symbolica import * │
  971. 32.64 s > │ request_hobbyist_license('YOUR_NAME', 'YOUR_EMAIL') │
  972. 32.64 s > │ │
  973. 32.64 s > │ All other users can obtain a free 30-day trial key: │
  974. 32.64 s > │ │
  975. 32.64 s > │ from symbolica import * │
  976. 32.64 s > │ request_trial_license('NAME', 'EMAIL', 'EMPLOYER') │
  977. 32.64 s > │ │
  978. 32.64 s > │ See https://symbolica.io/docs/get_started.html#license │
  979. 32.64 s > └────────────────────────────────────────────────────────┘
  980. 32.64 s > ┌───────────────────────────────────────────────────────────────────────────────────────────────────────────┐
  981. 32.64 s > │ Cannot start new unlicensed Symbolica instance since there is already another one running on the machine. │
  982. 32.64 s > └───────────────────────────────────────────────────────────────────────────────────────────────────────────┘
  983. 32.64 s >
  984. 32.64 s > stderr:
  985. 32.64 s >
  986. 32.64 s > ┌───────────────────────────────────────────────────────────┐
  987. 32.64 s > │ Could not resolve the IP of the Symbolica license server. │
  988. 32.64 s > │ │
  989. 32.64 s > │ Please check your DNS configuration. │
  990. 32.64 s > └───────────────────────────────────────────────────────────┘
  991. 32.64 s > Error: failed to lookup address information: Temporary failure in name resolution
  992. 32.64 s >
  993. 32.64 s >
  994. 32.64 s > Location:
  995. 32.64 s > tests/tests/test_python_api.rs:156:20
  996. 32.64 s >
  997. 32.64 s > FAIL [ 0.117s] (4/5) gammaloop-integration-tests::test_python_api python_evaluate_sample_honors_generate_events_and_observable_snapshots
  998. 32.64 s > stdout ---
  999. 32.64 s >
  1000. 32.64 s > running 1 test
  1001. 32.64 s > test python_evaluate_sample_honors_generate_events_and_observable_snapshots ... FAILED
  1002. 32.64 s >
  1003. 32.64 s > failures:
  1004. 32.64 s >
  1005. 32.64 s > failures:
  1006. 32.64 s > python_evaluate_sample_honors_generate_events_and_observable_snapshots
  1007. 32.64 s >
  1008. 32.64 s > test result: FAILED. 0 passed; 1 failed; 0 ignored; 0 measured; 4 filtered out; finished in 0.11s
  1009. 32.64 s >
  1010. 32.64 s > stderr ---
  1011. 32.64 s > Error: Python API test subprocess failed.
  1012. 32.64 s > stdout:
  1013. 32.64 s > ┌────────────────────────────────────────────────────────┐
  1014. 32.64 s > │ You are running a restricted Symbolica instance. │
  1015. 32.64 s > │ │
  1016. 32.64 s > │ This mode is only permitted for non-commercial use and │
  1017. 32.64 s > │ is limited to one instance and core per machine. │
  1018. 32.64 s > │ │
  1019. 32.64 s > │ Hobbyists can easily acquire a free license key │
  1020. 32.64 s > │ that unlocks all cores and removes this banner: │
  1021. 32.64 s > │ │
  1022. 32.64 s > │ from symbolica import * │
  1023. 32.64 s > │ request_hobbyist_license('YOUR_NAME', 'YOUR_EMAIL') │
  1024. 32.64 s > │ │
  1025. 32.64 s > │ All other users can obtain a free 30-day trial key: │
  1026. 32.64 s > │ │
  1027. 32.64 s > │ from symbolica import * │
  1028. 32.64 s > │ request_trial_license('NAME', 'EMAIL', 'EMPLOYER') │
  1029. 32.64 s > │ │
  1030. 32.64 s > │ See https://symbolica.io/docs/get_started.html#license │
  1031. 32.64 s > └────────────────────────────────────────────────────────┘
  1032. 32.64 s > ┌───────────────────────────────────────────────────────────────────────────────────────────────────────────┐
  1033. 32.64 s > │ Cannot start new unlicensed Symbolica instance since there is already another one running on the machine. │
  1034. 32.64 s > └───────────────────────────────────────────────────────────────────────────────────────────────────────────┘
  1035. 32.64 s >
  1036. 32.64 s > stderr:
  1037. 32.64 s >
  1038. 32.64 s > ┌───────────────────────────────────────────────────────────┐
  1039. 32.64 s > │ Could not resolve the IP of the Symbolica license server. │
  1040. 32.64 s > │ │
  1041. 32.64 s > │ Please check your DNS configuration. │
  1042. 32.64 s > └───────────────────────────────────────────────────────────┘
  1043. 32.64 s > Error: failed to lookup address information: Temporary failure in name resolution
  1044. 32.64 s >
  1045. 32.64 s >
  1046. 32.64 s > Location:
  1047. 32.64 s > tests/tests/test_python_api.rs:156:20
  1048. 32.64 s >
  1049. 32.64 s > ------------
  1050. 32.64 s > Summary [ 0.277s] 5 tests run: 1 passed, 4 failed, 0 skipped
  1051. 32.64 s > FAIL [ 0.110s] (1/5) gammaloop-integration-tests::test_python_api python_evaluate_samples_batch_and_momentum_space_have_expected_shape
  1052. 32.64 s > stdout ---
  1053. 32.64 s >
  1054. 32.64 s > running 1 test
  1055. 32.64 s > test python_evaluate_samples_batch_and_momentum_space_have_expected_shape ... FAILED
  1056. 32.64 s >
  1057. 32.64 s > failures:
  1058. 32.64 s >
  1059. 32.64 s > failures:
  1060. 32.64 s > python_evaluate_samples_batch_and_momentum_space_have_expected_shape
  1061. 32.64 s >
  1062. 32.64 s > test result: FAILED. 0 passed; 1 failed; 0 ignored; 0 measured; 4 filtered out; finished in 0.10s
  1063. 32.64 s >
  1064. 32.64 s > stderr ---
  1065. 32.64 s > Error: Python API test subprocess failed.
  1066. 32.64 s > stdout:
  1067. 32.64 s > ┌────────────────────────────────────────────────────────┐
  1068. 32.64 s > │ You are running a restricted Symbolica instance. │
  1069. 32.64 s > │ │
  1070. 32.64 s > │ This mode is only permitted for non-commercial use and │
  1071. 32.64 s > │ is limited to one instance and core per machine. │
  1072. 32.64 s > │ │
  1073. 32.64 s > │ Hobbyists can easily acquire a free license key │
  1074. 32.64 s > │ that unlocks all cores and removes this banner: │
  1075. 32.64 s > │ │
  1076. 32.64 s > │ from symbolica import * │
  1077. 32.64 s > │ request_hobbyist_license('YOUR_NAME', 'YOUR_EMAIL') │
  1078. 32.64 s > │ │
  1079. 32.64 s > │ All other users can obtain a free 30-day trial key: │
  1080. 32.64 s > │ │
  1081. 32.64 s > │ from symbolica import * │
  1082. 32.64 s > │ request_trial_license('NAME', 'EMAIL', 'EMPLOYER') │
  1083. 32.64 s > │ │
  1084. 32.64 s > │ See https://symbolica.io/docs/get_started.html#license │
  1085. 32.64 s > └────────────────────────────────────────────────────────┘
  1086. 32.64 s > ┌───────────────────────────────────────────────────────────────────────────────────────────────────────────┐
  1087. 32.64 s > │ Cannot start new unlicensed Symbolica instance since there is already another one running on the machine. │
  1088. 32.64 s > └───────────────────────────────────────────────────────────────────────────────────────────────────────────┘
  1089. 32.64 s >
  1090. 32.64 s > stderr:
  1091. 32.64 s >
  1092. 32.64 s > ┌───────────────────────────────────────────────────────────┐
  1093. 32.64 s > │ Could not resolve the IP of the Symbolica license server. │
  1094. 32.64 s > │ │
  1095. 32.64 s > │ Please check your DNS configuration. │
  1096. 32.64 s > └───────────────────────────────────────────────────────────┘
  1097. 32.64 s > Error: failed to lookup address information: Temporary failure in name resolution
  1098. 32.64 s >
  1099. 32.64 s >
  1100. 32.64 s > Location:
  1101. 32.64 s > tests/tests/test_python_api.rs:156:20
  1102. 32.64 s >
  1103. 32.64 s > FAIL [ 0.110s] (2/5) gammaloop-integration-tests::test_python_api python_evaluate_sample_preserves_graph_grouping_and_incoming_pdgs
  1104. 32.64 s > stdout ---
  1105. 32.64 s >
  1106. 32.64 s > running 1 test
  1107. 32.64 s > test python_evaluate_sample_preserves_graph_grouping_and_incoming_pdgs ... FAILED
  1108. 32.64 s >
  1109. 32.64 s > failures:
  1110. 32.64 s >
  1111. 32.64 s > failures:
  1112. 32.64 s > python_evaluate_sample_preserves_graph_grouping_and_incoming_pdgs
  1113. 32.64 s >
  1114. 32.64 s > test result: FAILED. 0 passed; 1 failed; 0 ignored; 0 measured; 4 filtered out; finished in 0.11s
  1115. 32.64 s >
  1116. 32.64 s > stderr ---
  1117. 32.64 s > Error: Python API test subprocess failed.
  1118. 32.64 s > stdout:
  1119. 32.64 s > ┌────────────────────────────────────────────────────────┐
  1120. 32.64 s > │ You are running a restricted Symbolica instance. │
  1121. 32.64 s > │ │
  1122. 32.64 s > │ This mode is only permitted for non-commercial use and │
  1123. 32.64 s > │ is limited to one instance and core per machine. │
  1124. 32.64 s > │ │
  1125. 32.64 s > │ Hobbyists can easily acquire a free license key │
  1126. 32.64 s > │ that unlocks all cores and removes this banner: │
  1127. 32.64 s > │ │
  1128. 32.64 s > │ from symbolica import * │
  1129. 32.64 s > │ request_hobbyist_license('YOUR_NAME', 'YOUR_EMAIL') │
  1130. 32.64 s > │ │
  1131. 32.64 s > │ All other users can obtain a free 30-day trial key: │
  1132. 32.64 s > │ │
  1133. 32.64 s > │ from symbolica import * │
  1134. 32.64 s > │ request_trial_license('NAME', 'EMAIL', 'EMPLOYER') │
  1135. 32.64 s > │ │
  1136. 32.64 s > │ See https://symbolica.io/docs/get_started.html#license │
  1137. 32.64 s > └────────────────────────────────────────────────────────┘
  1138. 32.64 s > ┌───────────────────────────────────────────────────────────────────────────────────────────────────────────┐
  1139. 32.64 s > │ Cannot start new unlicensed Symbolica instance since there is already another one running on the machine. │
  1140. 32.64 s > └───────────────────────────────────────────────────────────────────────────────────────────────────────────┘
  1141. 32.64 s >
  1142. 32.64 s > stderr:
  1143. 32.64 s >
  1144. 32.64 s > ┌───────────────────────────────────────────────────────────┐
  1145. 32.64 s > │ Could not resolve the IP of the Symbolica license server. │
  1146. 32.64 s > │ │
  1147. 32.64 s > │ Please check your DNS configuration. │
  1148. 32.64 s > └───────────────────────────────────────────────────────────┘
  1149. 32.64 s > Error: failed to lookup address information: Temporary failure in name resolution
  1150. 32.64 s >
  1151. 32.64 s >
  1152. 32.64 s > Location:
  1153. 32.64 s > tests/tests/test_python_api.rs:156:20
  1154. 32.64 s >
  1155. 32.64 s > FAIL [ 0.116s] (3/5) gammaloop-integration-tests::test_python_api python_session_getters_return_live_toml_and_command_blocks
  1156. 32.64 s > stdout ---
  1157. 32.64 s >
  1158. 32.64 s > running 1 test
  1159. 32.64 s > test python_session_getters_return_live_toml_and_command_blocks ... FAILED
  1160. 32.64 s >
  1161. 32.64 s > failures:
  1162. 32.64 s >
  1163. 32.64 s > failures:
  1164. 32.64 s > python_session_getters_return_live_toml_and_command_blocks
  1165. 32.64 s >
  1166. 32.64 s > test result: FAILED. 0 passed; 1 failed; 0 ignored; 0 measured; 4 filtered out; finished in 0.11s
  1167. 32.64 s >
  1168. 32.64 s > stderr ---
  1169. 32.64 s > Error: Python API test subprocess failed.
  1170. 32.64 s > stdout:
  1171. 32.64 s > ┌────────────────────────────────────────────────────────┐
  1172. 32.64 s > │ You are running a restricted Symbolica instance. │
  1173. 32.64 s > │ │
  1174. 32.64 s > │ This mode is only permitted for non-commercial use and │
  1175. 32.64 s > │ is limited to one instance and core per machine. │
  1176. 32.64 s > │ │
  1177. 32.64 s > │ Hobbyists can easily acquire a free license key │
  1178. 32.64 s > │ that unlocks all cores and removes this banner: │
  1179. 32.64 s > │ │
  1180. 32.64 s > │ from symbolica import * │
  1181. 32.64 s > │ request_hobbyist_license('YOUR_NAME', 'YOUR_EMAIL') │
  1182. 32.64 s > │ │
  1183. 32.64 s > │ All other users can obtain a free 30-day trial key: │
  1184. 32.64 s > │ │
  1185. 32.64 s > │ from symbolica import * │
  1186. 32.64 s > │ request_trial_license('NAME', 'EMAIL', 'EMPLOYER') │
  1187. 32.64 s > │ │
  1188. 32.64 s > │ See https://symbolica.io/docs/get_started.html#license │
  1189. 32.64 s > └────────────────────────────────────────────────────────┘
  1190. 32.64 s > ┌───────────────────────────────────────────────────────────────────────────────────────────────────────────┐
  1191. 32.64 s > │ Cannot start new unlicensed Symbolica instance since there is already another one running on the machine. │
  1192. 32.64 s > └───────────────────────────────────────────────────────────────────────────────────────────────────────────┘
  1193. 32.64 s >
  1194. 32.64 s > stderr:
  1195. 32.64 s >
  1196. 32.64 s > ┌───────────────────────────────────────────────────────────┐
  1197. 32.64 s > │ Could not resolve the IP of the Symbolica license server. │
  1198. 32.64 s > │ │
  1199. 32.64 s > │ Please check your DNS configuration. │
  1200. 32.64 s > └───────────────────────────────────────────────────────────┘
  1201. 32.64 s > Error: failed to lookup address information: Temporary failure in name resolution
  1202. 32.64 s >
  1203. 32.64 s >
  1204. 32.64 s > Location:
  1205. 32.64 s > tests/tests/test_python_api.rs:156:20
  1206. 32.64 s >
  1207. 32.64 s > FAIL [ 0.117s] (4/5) gammaloop-integration-tests::test_python_api python_evaluate_sample_honors_generate_events_and_observable_snapshots
  1208. 32.64 s > stdout ---
  1209. 32.64 s >
  1210. 32.64 s > running 1 test
  1211. 32.64 s > test python_evaluate_sample_honors_generate_events_and_observable_snapshots ... FAILED
  1212. 32.64 s >
  1213. 32.64 s > failures:
  1214. 32.64 s >
  1215. 32.64 s > failures:
  1216. 32.64 s > python_evaluate_sample_honors_generate_events_and_observable_snapshots
  1217. 32.64 s >
  1218. 32.64 s > test result: FAILED. 0 passed; 1 failed; 0 ignored; 0 measured; 4 filtered out; finished in 0.11s
  1219. 32.64 s >
  1220. 32.64 s > stderr ---
  1221. 32.64 s > Error: Python API test subprocess failed.
  1222. 32.64 s > stdout:
  1223. 32.64 s > ┌────────────────────────────────────────────────────────┐
  1224. 32.64 s > │ You are running a restricted Symbolica instance. │
  1225. 32.64 s > │ │
  1226. 32.64 s > │ This mode is only permitted for non-commercial use and │
  1227. 32.64 s > │ is limited to one instance and core per machine. │
  1228. 32.64 s > │ │
  1229. 32.64 s > │ Hobbyists can easily acquire a free license key │
  1230. 32.64 s > │ that unlocks all cores and removes this banner: │
  1231. 32.64 s > │ │
  1232. 32.64 s > │ from symbolica import * │
  1233. 32.64 s > │ request_hobbyist_license('YOUR_NAME', 'YOUR_EMAIL') │
  1234. 32.64 s > │ │
  1235. 32.64 s > │ All other users can obtain a free 30-day trial key: │
  1236. 32.64 s > │ │
  1237. 32.64 s > │ from symbolica import * │
  1238. 32.64 s > │ request_trial_license('NAME', 'EMAIL', 'EMPLOYER') │
  1239. 32.64 s > │ │
  1240. 32.64 s > │ See https://symbolica.io/docs/get_started.html#license │
  1241. 32.64 s > └────────────────────────────────────────────────────────┘
  1242. 32.64 s > ┌───────────────────────────────────────────────────────────────────────────────────────────────────────────┐
  1243. 32.64 s > │ Cannot start new unlicensed Symbolica instance since there is already another one running on the machine. │
  1244. 32.64 s > └───────────────────────────────────────────────────────────────────────────────────────────────────────────┘
  1245. 32.64 s >
  1246. 32.64 s > stderr:
  1247. 32.64 s >
  1248. 32.64 s > ┌───────────────────────────────────────────────────────────┐
  1249. 32.64 s > │ Could not resolve the IP of the Symbolica license server. │
  1250. 32.64 s > │ │
  1251. 32.64 s > │ Please check your DNS configuration. │
  1252. 32.64 s > └───────────────────────────────────────────────────────────┘
  1253. 32.64 s > Error: failed to lookup address information: Temporary failure in name resolution
  1254. 32.64 s >
  1255. 32.64 s >
  1256. 32.64 s > Location:
  1257. 32.64 s > tests/tests/test_python_api.rs:156:20
  1258. 32.64 s >
  1259. 32.64 s > error: test run failed
  1260. 32.64 s >
  1261. 32.64 s > ========== nextest test summary ==========
  1262. 32.64 s > report: target/nextest/ci_gammaloop/junit.xml
  1263. 32.64 s > tests: 5, failures: 4, errors: 0
  1264. 32.64 s >
  1265. 32.64 s > 1. gammaloop-integration-tests::test_python_api::python_evaluate_samples_batch_and_momentum_space_have_expected_shape
  1266. 32.64 s > failure: test failure with exit code 101
  1267. 32.64 s > Error: Python API test subprocess failed.
  1268. 32.64 s > stdout:
  1269. 32.64 s > ┌────────────────────────────────────────────────────────┐
  1270. 32.64 s > │ You are running a restricted Symbolica instance. │
  1271. 32.64 s > │ │
  1272. 32.64 s > │ This mode is only permitted for non-commercial use and │
  1273. 32.64 s > │ is limited to one instance and core per machine. │
  1274. 32.64 s > │ │
  1275. 32.64 s > │ Hobbyists can easily acquire a free license key │
  1276. 32.64 s > │ that unlocks all cores and removes this banner: │
  1277. 32.64 s > │ │
  1278. 32.64 s > │ from symbolica import * │
  1279. 32.64 s > │ request_hobbyist_license('YOUR_NAME', 'YOUR_EMAIL') │
  1280. 32.64 s > │ │
  1281. 32.64 s > │ All other users can obtain a free 30-day trial key: │
  1282. 32.64 s > │ │
  1283. 32.64 s > │ from symbolica import * │
  1284. 32.64 s > │ request_trial_license('NAME', 'EMAIL', 'EMPLOYER') │
  1285. 32.64 s > │ │
  1286. 32.64 s > │ See https://symbolica.io/docs/get_started.html#license │
  1287. 32.64 s > └────────────────────────────────────────────────────────┘
  1288. 32.64 s > ┌───────────────────────────────────────────────────────────────────────────────────────────────────────────┐
  1289. 32.64 s > │ Cannot start new unlicensed Symbolica instance since there is already another one running on the machine. │
  1290. 32.64 s > └───────────────────────────────────────────────────────────────────────────────────────────────────────────┘
  1291. 32.64 s >
  1292. 32.64 s > stderr:
  1293. 32.64 s >
  1294. 32.64 s > ┌───────────────────────────────────────────────────────────┐
  1295. 32.64 s > │ Could not resolve the IP of the Symbolica license server. │
  1296. 32.64 s > │ │
  1297. 32.64 s > │ Please check your DNS configuration. │
  1298. 32.64 s > └───────────────────────────────────────────────────────────┘
  1299. 32.64 s > Error: failed to lookup address information: Temporary failure in name resolution
  1300. 32.64 s >
  1301. 32.64 s >
  1302. 32.64 s > Location:
  1303. 32.64 s > tests/tests/test_python_api.rs:156:20
  1304. 32.64 s > system-out
  1305. 32.64 s > running 1 test
  1306. 32.64 s > test python_evaluate_samples_batch_and_momentum_space_have_expected_shape ... FAILED
  1307. 32.64 s >
  1308. 32.64 s > failures:
  1309. 32.64 s >
  1310. 32.64 s > failures:
  1311. 32.64 s > python_evaluate_samples_batch_and_momentum_space_have_expected_shape
  1312. 32.64 s >
  1313. 32.64 s > test result: FAILED. 0 passed; 1 failed; 0 ignored; 0 measured; 4 filtered out; finished in 0.10s
  1314. 32.64 s > system-err
  1315. 32.64 s > Error: Python API test subprocess failed.
  1316. 32.64 s > stdout:
  1317. 32.64 s > ┌────────────────────────────────────────────────────────┐
  1318. 32.64 s > │ You are running a restricted Symbolica instance. │
  1319. 32.64 s > │ │
  1320. 32.64 s > │ This mode is only permitted for non-commercial use and │
  1321. 32.64 s > │ is limited to one instance and core per machine. │
  1322. 32.64 s > │ │
  1323. 32.64 s > │ Hobbyists can easily acquire a free license key │
  1324. 32.64 s > │ that unlocks all cores and removes this banner: │
  1325. 32.64 s > │ │
  1326. 32.64 s > │ from symbolica import * │
  1327. 32.64 s > │ request_hobbyist_license('YOUR_NAME', 'YOUR_EMAIL') │
  1328. 32.64 s > │ │
  1329. 32.64 s > │ All other users can obtain a free 30-day trial key: │
  1330. 32.64 s > │ │
  1331. 32.64 s > │ from symbolica import * │
  1332. 32.64 s > │ request_trial_license('NAME', 'EMAIL', 'EMPLOYER') │
  1333. 32.64 s > │ │
  1334. 32.64 s > │ See https://symbolica.io/docs/get_started.html#license │
  1335. 32.64 s > └────────────────────────────────────────────────────────┘
  1336. 32.64 s > ┌───────────────────────────────────────────────────────────────────────────────────────────────────────────┐
  1337. 32.64 s > │ Cannot start new unlicensed Symbolica instance since there is already another one running on the machine. │
  1338. 32.64 s > └───────────────────────────────────────────────────────────────────────────────────────────────────────────┘
  1339. 32.64 s >
  1340. 32.64 s > stderr:
  1341. 32.64 s >
  1342. 32.64 s > ┌───────────────────────────────────────────────────────────┐
  1343. 32.64 s > │ Could not resolve the IP of the Symbolica license server. │
  1344. 32.64 s > │ │
  1345. 32.64 s > │ Please check your DNS configuration. │
  1346. 32.64 s > └───────────────────────────────────────────────────────────┘
  1347. 32.64 s > Error: failed to lookup address information: Temporary failure in name resolution
  1348. 32.64 s >
  1349. 32.64 s >
  1350. 32.64 s > Location:
  1351. 32.64 s > tests/tests/test_python_api.rs:156:20
  1352. 32.64 s >
  1353. 32.64 s > 2. gammaloop-integration-tests::test_python_api::python_evaluate_sample_preserves_graph_grouping_and_incoming_pdgs
  1354. 32.64 s > failure: test failure with exit code 101
  1355. 32.64 s > Error: Python API test subprocess failed.
  1356. 32.64 s > stdout:
  1357. 32.64 s > ┌────────────────────────────────────────────────────────┐
  1358. 32.64 s > │ You are running a restricted Symbolica instance. │
  1359. 32.64 s > │ │
  1360. 32.64 s > │ This mode is only permitted for non-commercial use and │
  1361. 32.64 s > │ is limited to one instance and core per machine. │
  1362. 32.64 s > │ │
  1363. 32.64 s > │ Hobbyists can easily acquire a free license key │
  1364. 32.64 s > │ that unlocks all cores and removes this banner: │
  1365. 32.64 s > │ │
  1366. 32.64 s > │ from symbolica import * │
  1367. 32.64 s > │ request_hobbyist_license('YOUR_NAME', 'YOUR_EMAIL') │
  1368. 32.64 s > │ │
  1369. 32.64 s > │ All other users can obtain a free 30-day trial key: │
  1370. 32.64 s > │ │
  1371. 32.64 s > │ from symbolica import * │
  1372. 32.64 s > │ request_trial_license('NAME', 'EMAIL', 'EMPLOYER') │
  1373. 32.64 s > │ │
  1374. 32.64 s > │ See https://symbolica.io/docs/get_started.html#license │
  1375. 32.64 s > └────────────────────────────────────────────────────────┘
  1376. 32.64 s > ┌───────────────────────────────────────────────────────────────────────────────────────────────────────────┐
  1377. 32.64 s > │ Cannot start new unlicensed Symbolica instance since there is already another one running on the machine. │
  1378. 32.64 s > └───────────────────────────────────────────────────────────────────────────────────────────────────────────┘
  1379. 32.64 s >
  1380. 32.64 s > stderr:
  1381. 32.64 s >
  1382. 32.64 s > ┌───────────────────────────────────────────────────────────┐
  1383. 32.64 s > │ Could not resolve the IP of the Symbolica license server. │
  1384. 32.64 s > │ │
  1385. 32.64 s > │ Please check your DNS configuration. │
  1386. 32.64 s > └───────────────────────────────────────────────────────────┘
  1387. 32.64 s > Error: failed to lookup address information: Temporary failure in name resolution
  1388. 32.64 s >
  1389. 32.64 s >
  1390. 32.64 s > Location:
  1391. 32.64 s > tests/tests/test_python_api.rs:156:20
  1392. 32.64 s > system-out
  1393. 32.64 s > running 1 test
  1394. 32.64 s > test python_evaluate_sample_preserves_graph_grouping_and_incoming_pdgs ... FAILED
  1395. 32.64 s >
  1396. 32.64 s > failures:
  1397. 32.64 s >
  1398. 32.64 s > failures:
  1399. 32.64 s > python_evaluate_sample_preserves_graph_grouping_and_incoming_pdgs
  1400. 32.64 s >
  1401. 32.64 s > test result: FAILED. 0 passed; 1 failed; 0 ignored; 0 measured; 4 filtered out; finished in 0.11s
  1402. 32.64 s > system-err
  1403. 32.64 s > Error: Python API test subprocess failed.
  1404. 32.64 s > stdout:
  1405. 32.64 s > ┌────────────────────────────────────────────────────────┐
  1406. 32.64 s > │ You are running a restricted Symbolica instance. │
  1407. 32.64 s > │ │
  1408. 32.64 s > │ This mode is only permitted for non-commercial use and │
  1409. 32.64 s > │ is limited to one instance and core per machine. │
  1410. 32.64 s > │ │
  1411. 32.64 s > │ Hobbyists can easily acquire a free license key │
  1412. 32.64 s > │ that unlocks all cores and removes this banner: │
  1413. 32.64 s > │ │
  1414. 32.64 s > │ from symbolica import * │
  1415. 32.64 s > │ request_hobbyist_license('YOUR_NAME', 'YOUR_EMAIL') │
  1416. 32.64 s > │ │
  1417. 32.64 s > │ All other users can obtain a free 30-day trial key: │
  1418. 32.64 s > │ │
  1419. 32.64 s > │ from symbolica import * │
  1420. 32.64 s > │ request_trial_license('NAME', 'EMAIL', 'EMPLOYER') │
  1421. 32.64 s > │ │
  1422. 32.64 s > │ See https://symbolica.io/docs/get_started.html#license │
  1423. 32.64 s > └────────────────────────────────────────────────────────┘
  1424. 32.64 s > ┌───────────────────────────────────────────────────────────────────────────────────────────────────────────┐
  1425. 32.64 s > │ Cannot start new unlicensed Symbolica instance since there is already another one running on the machine. │
  1426. 32.64 s > └───────────────────────────────────────────────────────────────────────────────────────────────────────────┘
  1427. 32.64 s >
  1428. 32.64 s > stderr:
  1429. 32.64 s >
  1430. 32.64 s > ┌───────────────────────────────────────────────────────────┐
  1431. 32.64 s > │ Could not resolve the IP of the Symbolica license server. │
  1432. 32.64 s > │ │
  1433. 32.64 s > │ Please check your DNS configuration. │
  1434. 32.64 s > └───────────────────────────────────────────────────────────┘
  1435. 32.64 s > Error: failed to lookup address information: Temporary failure in name resolution
  1436. 32.64 s >
  1437. 32.64 s >
  1438. 32.64 s > Location:
  1439. 32.64 s > tests/tests/test_python_api.rs:156:20
  1440. 32.64 s >
  1441. 32.64 s > 3. gammaloop-integration-tests::test_python_api::python_session_getters_return_live_toml_and_command_blocks
  1442. 32.64 s > failure: test failure with exit code 101
  1443. 32.64 s > Error: Python API test subprocess failed.
  1444. 32.64 s > stdout:
  1445. 32.64 s > ┌────────────────────────────────────────────────────────┐
  1446. 32.64 s > │ You are running a restricted Symbolica instance. │
  1447. 32.64 s > │ │
  1448. 32.64 s > │ This mode is only permitted for non-commercial use and │
  1449. 32.64 s > │ is limited to one instance and core per machine. │
  1450. 32.64 s > │ │
  1451. 32.64 s > │ Hobbyists can easily acquire a free license key │
  1452. 32.64 s > │ that unlocks all cores and removes this banner: │
  1453. 32.64 s > │ │
  1454. 32.64 s > │ from symbolica import * │
  1455. 32.64 s > │ request_hobbyist_license('YOUR_NAME', 'YOUR_EMAIL') │
  1456. 32.64 s > │ │
  1457. 32.64 s > │ All other users can obtain a free 30-day trial key: │
  1458. 32.64 s > │ │
  1459. 32.64 s > │ from symbolica import * │
  1460. 32.64 s > │ request_trial_license('NAME', 'EMAIL', 'EMPLOYER') │
  1461. 32.64 s > │ │
  1462. 32.64 s > │ See https://symbolica.io/docs/get_started.html#license │
  1463. 32.64 s > └────────────────────────────────────────────────────────┘
  1464. 32.64 s > ┌───────────────────────────────────────────────────────────────────────────────────────────────────────────┐
  1465. 32.64 s > │ Cannot start new unlicensed Symbolica instance since there is already another one running on the machine. │
  1466. 32.64 s > └───────────────────────────────────────────────────────────────────────────────────────────────────────────┘
  1467. 32.64 s >
  1468. 32.64 s > stderr:
  1469. 32.64 s >
  1470. 32.64 s > ┌───────────────────────────────────────────────────────────┐
  1471. 32.64 s > │ Could not resolve the IP of the Symbolica license server. │
  1472. 32.64 s > │ │
  1473. 32.64 s > │ Please check your DNS configuration. │
  1474. 32.64 s > └───────────────────────────────────────────────────────────┘
  1475. 32.64 s > Error: failed to lookup address information: Temporary failure in name resolution
  1476. 32.64 s >
  1477. 32.64 s >
  1478. 32.64 s > Location:
  1479. 32.64 s > tests/tests/test_python_api.rs:156:20
  1480. 32.64 s > system-out
  1481. 32.64 s > running 1 test
  1482. 32.64 s > test python_session_getters_return_live_toml_and_command_blocks ... FAILED
  1483. 32.64 s >
  1484. 32.64 s > failures:
  1485. 32.64 s >
  1486. 32.64 s > failures:
  1487. 32.64 s > python_session_getters_return_live_toml_and_command_blocks
  1488. 32.64 s >
  1489. 32.64 s > test result: FAILED. 0 passed; 1 failed; 0 ignored; 0 measured; 4 filtered out; finished in 0.11s
  1490. 32.64 s > system-err
  1491. 32.64 s > Error: Python API test subprocess failed.
  1492. 32.64 s > stdout:
  1493. 32.64 s > ┌────────────────────────────────────────────────────────┐
  1494. 32.64 s > │ You are running a restricted Symbolica instance. │
  1495. 32.64 s > │ │
  1496. 32.64 s > │ This mode is only permitted for non-commercial use and │
  1497. 32.64 s > │ is limited to one instance and core per machine. │
  1498. 32.64 s > │ │
  1499. 32.64 s > │ Hobbyists can easily acquire a free license key │
  1500. 32.64 s > │ that unlocks all cores and removes this banner: │
  1501. 32.64 s > │ │
  1502. 32.64 s > │ from symbolica import * │
  1503. 32.64 s > │ request_hobbyist_license('YOUR_NAME', 'YOUR_EMAIL') │
  1504. 32.64 s > │ │
  1505. 32.64 s > │ All other users can obtain a free 30-day trial key: │
  1506. 32.64 s > │ │
  1507. 32.64 s > │ from symbolica import * │
  1508. 32.64 s > │ request_trial_license('NAME', 'EMAIL', 'EMPLOYER') │
  1509. 32.64 s > │ │
  1510. 32.64 s > │ See https://symbolica.io/docs/get_started.html#license │
  1511. 32.64 s > └────────────────────────────────────────────────────────┘
  1512. 32.64 s > ┌───────────────────────────────────────────────────────────────────────────────────────────────────────────┐
  1513. 32.64 s > │ Cannot start new unlicensed Symbolica instance since there is already another one running on the machine. │
  1514. 32.64 s > └───────────────────────────────────────────────────────────────────────────────────────────────────────────┘
  1515. 32.64 s >
  1516. 32.64 s > stderr:
  1517. 32.64 s >
  1518. 32.64 s > ┌───────────────────────────────────────────────────────────┐
  1519. 32.64 s > │ Could not resolve the IP of the Symbolica license server. │
  1520. 32.64 s > │ │
  1521. 32.64 s > │ Please check your DNS configuration. │
  1522. 32.64 s > └───────────────────────────────────────────────────────────┘
  1523. 32.64 s > Error: failed to lookup address information: Temporary failure in name resolution
  1524. 32.64 s >
  1525. 32.64 s >
  1526. 32.64 s > Location:
  1527. 32.64 s > tests/tests/test_python_api.rs:156:20
  1528. 32.64 s >
  1529. 32.64 s > 4. gammaloop-integration-tests::test_python_api::python_evaluate_sample_honors_generate_events_and_observable_snapshots
  1530. 32.64 s > failure: test failure with exit code 101
  1531. 32.64 s > Error: Python API test subprocess failed.
  1532. 32.64 s > stdout:
  1533. 32.64 s > ┌────────────────────────────────────────────────────────┐
  1534. 32.64 s > │ You are running a restricted Symbolica instance. │
  1535. 32.64 s > │ │
  1536. 32.64 s > │ This mode is only permitted for non-commercial use and │
  1537. 32.64 s > │ is limited to one instance and core per machine. │
  1538. 32.64 s > │ │
  1539. 32.64 s > │ Hobbyists can easily acquire a free license key │
  1540. 32.64 s > │ that unlocks all cores and removes this banner: │
  1541. 32.64 s > │ │
  1542. 32.64 s > │ from symbolica import * │
  1543. 32.64 s > │ request_hobbyist_license('YOUR_NAME', 'YOUR_EMAIL') │
  1544. 32.64 s > │ │
  1545. 32.64 s > │ All other users can obtain a free 30-day trial key: │
  1546. 32.64 s > │ │
  1547. 32.64 s > │ from symbolica import * │
  1548. 32.64 s > │ request_trial_license('NAME', 'EMAIL', 'EMPLOYER') │
  1549. 32.64 s > │ │
  1550. 32.64 s > │ See https://symbolica.io/docs/get_started.html#license │
  1551. 32.64 s > └────────────────────────────────────────────────────────┘
  1552. 32.64 s > ┌───────────────────────────────────────────────────────────────────────────────────────────────────────────┐
  1553. 32.64 s > │ Cannot start new unlicensed Symbolica instance since there is already another one running on the machine. │
  1554. 32.64 s > └───────────────────────────────────────────────────────────────────────────────────────────────────────────┘
  1555. 32.64 s >
  1556. 32.64 s > stderr:
  1557. 32.64 s >
  1558. 32.64 s > ┌───────────────────────────────────────────────────────────┐
  1559. 32.64 s > │ Could not resolve the IP of the Symbolica license server. │
  1560. 32.64 s > │ │
  1561. 32.64 s > │ Please check your DNS configuration. │
  1562. 32.64 s > └───────────────────────────────────────────────────────────┘
  1563. 32.64 s > Error: failed to lookup address information: Temporary failure in name resolution
  1564. 32.64 s >
  1565. 32.64 s >
  1566. 32.64 s > Location:
  1567. 32.64 s > tests/tests/test_python_api.rs:156:20
  1568. 32.64 s > system-out
  1569. 32.64 s > running 1 test
  1570. 32.64 s > test python_evaluate_sample_honors_generate_events_and_observable_snapshots ... FAILED
  1571. 32.64 s >
  1572. 32.64 s > failures:
  1573. 32.64 s >
  1574. 32.64 s > failures:
  1575. 32.64 s > python_evaluate_sample_honors_generate_events_and_observable_snapshots
  1576. 32.64 s >
  1577. 32.64 s > test result: FAILED. 0 passed; 1 failed; 0 ignored; 0 measured; 4 filtered out; finished in 0.11s
  1578. 32.64 s > system-err
  1579. 32.64 s > Error: Python API test subprocess failed.
  1580. 32.64 s > stdout:
  1581. 32.64 s > ┌────────────────────────────────────────────────────────┐
  1582. 32.64 s > │ You are running a restricted Symbolica instance. │
  1583. 32.64 s > │ │
  1584. 32.64 s > │ This mode is only permitted for non-commercial use and │
  1585. 32.64 s > │ is limited to one instance and core per machine. │
  1586. 32.64 s > │ │
  1587. 32.64 s > │ Hobbyists can easily acquire a free license key │
  1588. 32.64 s > │ that unlocks all cores and removes this banner: │
  1589. 32.64 s > │ │
  1590. 32.64 s > │ from symbolica import * │
  1591. 32.64 s > │ request_hobbyist_license('YOUR_NAME', 'YOUR_EMAIL') │
  1592. 32.64 s > │ │
  1593. 32.64 s > │ All other users can obtain a free 30-day trial key: │
  1594. 32.64 s > │ │
  1595. 32.64 s > │ from symbolica import * │
  1596. 32.64 s > │ request_trial_license('NAME', 'EMAIL', 'EMPLOYER') │
  1597. 32.64 s > │ │
  1598. 32.64 s > │ See https://symbolica.io/docs/get_started.html#license │
  1599. 32.64 s > └────────────────────────────────────────────────────────┘
  1600. 32.64 s > ┌───────────────────────────────────────────────────────────────────────────────────────────────────────────┐
  1601. 32.64 s > │ Cannot start new unlicensed Symbolica instance since there is already another one running on the machine. │
  1602. 32.64 s > └───────────────────────────────────────────────────────────────────────────────────────────────────────────┘
  1603. 32.64 s >
  1604. 32.64 s > stderr:
  1605. 32.64 s >
  1606. 32.64 s > ┌───────────────────────────────────────────────────────────┐
  1607. 32.64 s > │ Could not resolve the IP of the Symbolica license server. │
  1608. 32.64 s > │ │
  1609. 32.64 s > │ Please check your DNS configuration. │
  1610. 32.64 s > └───────────────────────────────────────────────────────────┘
  1611. 32.64 s > Error: failed to lookup address information: Temporary failure in name resolution
  1612. 32.64 s >
  1613. 32.64 s >
  1614. 32.64 s > Location:
  1615. 32.64 s > tests/tests/test_python_api.rs:156:20
  1616. 32.64 s > =========================================
  1617. 32.64 s For full logs, run:
  1618. 32.64 s nix log /nix/store/6yfkarcx1yqfdkgaj26q9b9n3q0min5r-gammaloop-nextest-python-api.drv
  1619. 32.79 s [2 built (1 failed), 12 Run failed.