test packages.x86_64-linux.nix-ci-check-gammaloop-nextest-python-api
- 0.00 s
$ /nix/store/9ypz3flqsrl5xl495mm8h645gadjsxi1-coreutils-9.11/bin/timeout --kill-after=15s 7200s /nix/store/23zk8sgzamrbmj1fday15szf7f2279s8-nix-2.34.7/bin/nix --extra-experimental-features nix-command --extra-experimental-features flakes flake clone git+https://github.com/alphal00p/gammaloop --dest /tmp/nix-ci-worker/stable-pwd/repo/
- 0.06 s
Cloning into '/tmp/nix-ci-worker/stable-pwd/repo'...
- 2.18 s
remote: Enumerating objects: 84794
remote: Enumerating objects: 93753, done.
- 2.40 s
remote: Counting objects: 0% (1/8959)
remote: Counting objects: 1% (90/8959)
remote: Counting objects: 2% (180/8959)
remote: Counting objects: 3% (269/8959)
remote: Counting objects: 4% (359/8959)
remote: Counting objects: 5% (448/8959)
remote: Counting objects: 6% (538/8959)
remote: Counting objects: 7% (628/8959)
remote: Counting objects: 8% (717/8959)
remote: Counting objects: 9% (807/8959)
remote: Counting objects: 10% (896/8959)
remote: Counting objects: 11% (986/8959)
remote: Counting objects: 12% (1076/8959)
remote: Counting objects: 13% (1165/8959)
remote: Counting objects: 14% (1255/8959)
remote: Counting objects: 15% (1344/8959)
remote: Counting objects: 16% (1434/8959)
remote: Counting objects: 17% (1524/8959)
remote: Counting objects: 18% (1613/8959)
remote: Counting objects: 19% (1703/8959)
remote: Counting objects: 20% (1792/8959)
remote: Counting objects: 21% (1882/8959)
remote: Counting objects: 22% (1971/8959)
remote: Counting objects: 23% (2061/8959)
remote: Counting objects: 24% (2151/8959)
remote: Counting objects: 25% (2240/8959)
remote: Counting objects: 26% (2330/8959)
remote: Counting objects: 27% (2419/8959)
remote: Counting objects: 28% (2509/8959)
remote: Counting objects: 29% (2599/8959)
remote: Counting objects: 30% (2688/8959)
remote: Counting objects: 31% (2778/8959)
remote: Counting objects: 32% (2867/8959)
remote: Counting objects: 33% (2957/8959)
remote: Counting objects: 34% (3047/8959)
remote: Counting objects: 35% (3136/8959)
remote: Counting objects: 36% (3226/8959)
remote: Counting objects: 37% (3315/8959)
remote: Counting objects: 38% (3405/8959)
remote: Counting objects: 39% (3495/8959)
remote: Counting objects: 40% (3584/8959)
remote: Counting objects: 41% (3674/8959)
remote: Counting objects: 42% (3763/8959)
remote: Counting objects: 43% (3853/8959)
remote: Counting objects: 44% (3942/8959)
remote: Counting objects: 45% (4032/8959)
remote: Counting objects: 46% (4122/8959)
remote: Counting objects: 47% (4211/8959)
remote: Counting objects: 48% (4301/8959)
remote: Counting objects: 49% (4390/8959)
remote: Counting objects: 50% (4480/8959)
remote: Counting objects: 51% (4570/8959)
remote: Counting objects: 52% (4659/8959)
remote: Counting objects: 53% (4749/8959)
remote: Counting objects: 54% (4838/8959)
remote: Counting objects: 55% (4928/8959)
remote: Counting objects: 56% (5018/8959)
remote: Counting objects: 57% (5107/8959)
remote: Counting objects: 58% (5197/8959)
remote: Counting objects: 59% (5286/8959)
remote: Counting objects: 60% (5376/8959)
remote: Counting objects: 61% (5465/8959)
remote: Counting objects: 62% (5555/8959)
remote: Counting objects: 63% (5645/8959)
remote: Counting objects: 64% (5734/8959)
remote: Counting objects: 65% (5824/8959)
remote: Counting objects: 66% (5913/8959)
remote: Counting objects: 67% (6003/8959)
remote: Counting objects: 68% (6093/8959)
remote: Counting objects: 69% (6182/8959)
remote: Counting objects: 70% (6272/8959)
remote: Counting objects: 71% (6361/8959)
remote: Counting objects: 72% (6451/8959)
remote: Counting objects: 73% (6541/8959)
remote: Counting objects: 74% (6630/8959)
remote: Counting objects: 75% (6720/8959)
remote: Counting objects: 76% (6809/8959)
remote: Counting objects: 77% (6899/8959)
remote: Counting objects: 78% (6989/8959)
remote: Counting objects: 79% (7078/8959)
remote: Counting objects: 80% (7168/8959)
remote: Counting objects: 81% (7257/8959)
remote: Counting objects: 82% (7347/8959)
remote: Counting objects: 83% (7436/8959)
remote: Counting objects: 84% (7526/8959)
remote: Counting objects: 85% (7616/8959)
remote: Counting objects: 86% (7705/8959)
remote: Counting objects: 87% (7795/8959)
remote: Counting objects: 88% (7884/8959)
remote: Counting objects: 89% (7974/8959)
remote: Counting objects: 90% (8064/8959)
remote: Counting objects: 91% (8153/8959)
remote: Counting objects: 92% (8243/8959)
remote: Counting objects: 93% (8332/8959)
remote: Counting objects: 94% (8422/8959)
remote: Counting objects: 95% (8512/8959)
remote: Counting objects: 96% (8601/8959)
remote: Counting objects: 97% (8691/8959)
remote: Counting objects: 98% (8780/8959)
remote: Counting objects: 99% (8870/8959)
remote: Counting objects: 100% (8959/8959)
remote: Counting objects: 100% (8959/8959), done.
- 4.73 s
remote: Compressing objects: 0% (1/1787)
remote: Compressing objects: 1% (18/1787)
remote: Compressing objects: 2% (36/1787)
remote: Compressing objects: 3% (54/1787)
remote: Compressing objects: 4% (72/1787)
remote: Compressing objects: 5% (90/1787)
remote: Compressing objects: 5% (102/1787)
remote: Compressing objects: 6% (108/1787)
remote: Compressing objects: 7% (126/1787)
remote: Compressing objects: 8% (143/1787)
remote: Compressing objects: 9% (161/1787)
remote: Compressing objects: 10% (179/1787)
remote: Compressing objects: 11% (197/1787)
remote: Compressing objects: 12% (215/1787)
remote: Compressing objects: 13% (233/1787)
remote: Compressing objects: 14% (251/1787)
remote: Compressing objects: 15% (269/1787)
remote: Compressing objects: 15% (284/1787)
remote: Compressing objects: 16% (286/1787)
remote: Compressing objects: 17% (304/1787)
remote: Compressing objects: 18% (322/1787)
remote: Compressing objects: 19% (340/1787)
remote: Compressing objects: 20% (358/1787)
remote: Compressing objects: 21% (376/1787)
remote: Compressing objects: 22% (394/1787)
remote: Compressing objects: 23% (412/1787)
remote: Compressing objects: 24% (429/1787)
remote: Compressing objects: 25% (447/1787)
remote: Compressing objects: 26% (465/1787)
remote: Compressing objects: 27% (483/1787)
remote: Compressing objects: 28% (501/1787)
remote: Compressing objects: 29% (519/1787)
remote: Compressing objects: 30% (537/1787)
remote: Compressing objects: 31% (554/1787)
remote: Compressing objects: 32% (572/1787)
remote: Compressing objects: 33% (590/1787)
remote: Compressing objects: 34% (608/1787)
remote: Compressing objects: 35% (626/1787)
remote: Compressing objects: 36% (644/1787)
remote: Compressing objects: 37% (662/1787)
remote: Compressing objects: 38% (680/1787)
remote: Compressing objects: 39% (697/1787)
remote: Compressing objects: 40% (715/1787)
remote: Compressing objects: 41% (733/1787)
remote: Compressing objects: 42% (751/1787)
remote: Compressing objects: 43% (769/1787)
remote: Compressing objects: 44% (787/1787)
remote: Compressing objects: 45% (805/1787)
remote: Compressing objects: 46% (823/1787)
remote: Compressing objects: 47% (840/1787)
remote: Compressing objects: 48% (858/1787)
remote: Compressing objects: 49% (876/1787)
remote: Compressing objects: 50% (894/1787)
remote: Compressing objects: 51% (912/1787)
remote: Compressing objects: 52% (930/1787)
remote: Compressing objects: 53% (948/1787)
remote: Compressing objects: 54% (965/1787)
remote: Compressing objects: 55% (983/1787)
remote: Compressing objects: 56% (1001/1787)
remote: Compressing objects: 57% (1019/1787)
remote: Compressing objects: 58% (1037/1787)
remote: Compressing objects: 59% (1055/1787)
remote: Compressing objects: 60% (1073/1787)
remote: Compressing objects: 61% (1091/1787)
remote: Compressing objects: 62% (1108/1787)
remote: Compressing objects: 63% (1126/1787)
remote: Compressing objects: 64% (1144/1787)
remote: Compressing objects: 65% (1162/1787)
remote: Compressing objects: 66% (1180/1787)
remote: Compressing objects: 67% (1198/1787)
remote: Compressing objects: 68% (1216/1787)
remote: Compressing objects: 69% (1234/1787)
remote: Compressing objects: 70% (1251/1787)
remote: Compressing objects: 71% (1269/1787)
remote: Compressing objects: 72% (1287/1787)
remote: Compressing objects: 73% (1305/1787)
remote: Compressing objects: 74% (1323/1787)
remote: Compressing objects: 75% (1341/1787)
remote: Compressing objects: 76% (1359/1787)
remote: Compressing objects: 77% (1376/1787)
remote: Compressing objects: 78% (1394/1787)
remote: Compressing objects: 79% (1412/1787)
remote: Compressing objects: 80% (1430/1787)
remote: Compressing objects: 81% (1448/1787)
remote: Compressing objects: 82% (1466/1787)
remote: Compressing objects: 83% (1484/1787)
remote: Compressing objects: 84% (1502/1787)
remote: Compressing objects: 85% (1519/1787)
remote: Compressing objects: 86% (1537/1787)
remote: Compressing objects: 87% (1555/1787)
remote: Compressing objects: 88% (1573/1787)
remote: Compressing objects: 89% (1591/1787)
remote: Compressing objects: 90% (1609/1787)
remote: Compressing objects: 91% (1627/1787)
remote: Compressing objects: 92% (1645/1787)
remote: Compressing objects: 93% (1662/1787)
remote: Compressing objects: 94% (1680/1787)
remote: Compressing objects: 95% (1698/1787)
remote: Compressing objects: 96% (1716/1787)
remote: Compressing objects: 97% (1734/1787)
remote: Compressing objects: 98% (1752/1787)
remote: Compressing objects: 99% (1770/1787)
remote: Compressing objects: 100% (1787/1787)
remote: Compressing objects: 100% (1787/1787), done.
- 13.98 s
Receiving objects: 0% (1/93753)
Receiving objects: 1% (938/93753)
Receiving objects: 2% (1876/93753)
Receiving objects: 3% (2813/93753)
Receiving objects: 4% (3751/93753)
Receiving objects: 5% (4688/93753)
Receiving objects: 6% (5626/93753)
Receiving objects: 7% (6563/93753)
Receiving objects: 8% (7501/93753), 16.64 MiB | 33.26 MiB/s
Receiving objects: 9% (8438/93753), 16.64 MiB | 33.26 MiB/s
Receiving objects: 10% (9376/93753), 16.64 MiB | 33.26 MiB/s
Receiving objects: 11% (10313/93753), 16.64 MiB | 33.26 MiB/s
Receiving objects: 12% (11251/93753), 16.64 MiB | 33.26 MiB/s
Receiving objects: 13% (12188/93753), 16.64 MiB | 33.26 MiB/s
Receiving objects: 14% (13126/93753), 16.64 MiB | 33.26 MiB/s
Receiving objects: 15% (14063/93753), 16.64 MiB | 33.26 MiB/s
Receiving objects: 16% (15001/93753), 16.64 MiB | 33.26 MiB/s
Receiving objects: 17% (15939/93753), 16.64 MiB | 33.26 MiB/s
Receiving objects: 18% (16876/93753), 16.64 MiB | 33.26 MiB/s
Receiving objects: 19% (17814/93753), 16.64 MiB | 33.26 MiB/s
Receiving objects: 20% (18751/93753), 16.64 MiB | 33.26 MiB/s
Receiving objects: 21% (19689/93753), 16.64 MiB | 33.26 MiB/s
Receiving objects: 22% (20626/93753), 16.64 MiB | 33.26 MiB/s
Receiving objects: 23% (21564/93753), 16.64 MiB | 33.26 MiB/s
Receiving objects: 24% (22501/93753), 16.64 MiB | 33.26 MiB/s
Receiving objects: 25% (23439/93753), 16.64 MiB | 33.26 MiB/s
Receiving objects: 26% (24376/93753), 16.64 MiB | 33.26 MiB/s
Receiving objects: 27% (25314/93753), 16.64 MiB | 33.26 MiB/s
Receiving objects: 28% (26251/93753), 16.64 MiB | 33.26 MiB/s
Receiving objects: 29% (27189/93753), 16.64 MiB | 33.26 MiB/s
Receiving objects: 30% (28126/93753), 16.64 MiB | 33.26 MiB/s
Receiving objects: 31% (29064/93753), 16.64 MiB | 33.26 MiB/s
Receiving objects: 32% (30001/93753), 16.64 MiB | 33.26 MiB/s
Receiving objects: 33% (30939/93753), 16.64 MiB | 33.26 MiB/s
Receiving objects: 34% (31877/93753), 16.64 MiB | 33.26 MiB/s
Receiving objects: 35% (32814/93753), 16.64 MiB | 33.26 MiB/s
Receiving objects: 36% (33752/93753), 16.64 MiB | 33.26 MiB/s
Receiving objects: 36% (34376/93753), 33.36 MiB | 32.59 MiB/s
Receiving objects: 37% (34689/93753), 33.36 MiB | 32.59 MiB/s
Receiving objects: 38% (35627/93753), 33.36 MiB | 32.59 MiB/s
Receiving objects: 39% (36564/93753), 33.36 MiB | 32.59 MiB/s
Receiving objects: 40% (37502/93753), 33.36 MiB | 32.59 MiB/s
Receiving objects: 41% (38439/93753), 33.36 MiB | 32.59 MiB/s
Receiving objects: 42% (39377/93753), 33.36 MiB | 32.59 MiB/s
Receiving objects: 43% (40314/93753), 33.36 MiB | 32.59 MiB/s
Receiving objects: 44% (41252/93753), 33.36 MiB | 32.59 MiB/s
Receiving objects: 45% (42189/93753), 33.36 MiB | 32.59 MiB/s
Receiving objects: 46% (43127/93753), 50.71 MiB | 33.30 MiB/s
Receiving objects: 47% (44064/93753), 50.71 MiB | 33.30 MiB/s
Receiving objects: 48% (45002/93753), 50.71 MiB | 33.30 MiB/s
Receiving objects: 49% (45939/93753), 50.71 MiB | 33.30 MiB/s
Receiving objects: 50% (46877/93753), 50.71 MiB | 33.30 MiB/s
Receiving objects: 51% (47815/93753), 50.71 MiB | 33.30 MiB/s
Receiving objects: 52% (48752/93753), 50.71 MiB | 33.30 MiB/s
Receiving objects: 52% (48754/93753), 66.32 MiB | 32.79 MiB/s
Receiving objects: 53% (49690/93753), 66.32 MiB | 32.79 MiB/s
Receiving objects: 54% (50627/93753), 66.32 MiB | 32.79 MiB/s
Receiving objects: 55% (51565/93753), 66.32 MiB | 32.79 MiB/s
Receiving objects: 56% (52502/93753), 66.32 MiB | 32.79 MiB/s
Receiving objects: 57% (53440/93753), 66.32 MiB | 32.79 MiB/s
Receiving objects: 58% (54377/93753), 66.32 MiB | 32.79 MiB/s
Receiving objects: 59% (55315/93753), 66.32 MiB | 32.79 MiB/s
Receiving objects: 60% (56252/93753), 66.32 MiB | 32.79 MiB/s
Receiving objects: 61% (57190/93753), 82.28 MiB | 32.61 MiB/s
Receiving objects: 61% (57341/93753), 99.63 MiB | 32.86 MiB/s
Receiving objects: 61% (57500/93753), 133.19 MiB | 32.85 MiB/s
Receiving objects: 61% (57611/93753), 149.61 MiB | 32.84 MiB/s
Receiving objects: 61% (58054/93753), 202.21 MiB | 33.08 MiB/s
Receiving objects: 62% (58127/93753), 202.21 MiB | 33.08 MiB/s
Receiving objects: 63% (59065/93753), 202.21 MiB | 33.08 MiB/s
Receiving objects: 64% (60002/93753), 202.21 MiB | 33.08 MiB/s
Receiving objects: 65% (60940/93753), 202.21 MiB | 33.08 MiB/s
Receiving objects: 66% (61877/93753), 202.21 MiB | 33.08 MiB/s
Receiving objects: 67% (62815/93753), 218.93 MiB | 33.31 MiB/s
Receiving objects: 68% (63753/93753), 218.93 MiB | 33.31 MiB/s
Receiving objects: 69% (64690/93753), 218.93 MiB | 33.31 MiB/s
Receiving objects: 69% (65024/93753), 218.93 MiB | 33.31 MiB/s
Receiving objects: 70% (65628/93753), 236.71 MiB | 33.56 MiB/s
Receiving objects: 71% (66565/93753), 236.71 MiB | 33.56 MiB/s
Receiving objects: 72% (67503/93753), 236.71 MiB | 33.56 MiB/s
Receiving objects: 73% (68440/93753), 236.71 MiB | 33.56 MiB/s
Receiving objects: 74% (69378/93753), 236.71 MiB | 33.56 MiB/s
Receiving objects: 75% (70315/93753), 236.71 MiB | 33.56 MiB/s
Receiving objects: 76% (71253/93753), 236.71 MiB | 33.56 MiB/s
Receiving objects: 77% (72190/93753), 236.71 MiB | 33.56 MiB/s
Receiving objects: 78% (73128/93753), 236.71 MiB | 33.56 MiB/s
Receiving objects: 79% (74065/93753), 236.71 MiB | 33.56 MiB/s
Receiving objects: 80% (75003/93753), 236.71 MiB | 33.56 MiB/s
Receiving objects: 81% (75940/93753), 236.71 MiB | 33.56 MiB/s
Receiving objects: 82% (76878/93753), 253.75 MiB | 33.56 MiB/s
Receiving objects: 82% (77276/93753), 253.75 MiB | 33.56 MiB/s
Receiving objects: 83% (77815/93753), 271.75 MiB | 33.72 MiB/s
Receiving objects: 84% (78753/93753), 271.75 MiB | 33.72 MiB/s
Receiving objects: 85% (79691/93753), 271.75 MiB | 33.72 MiB/s
Receiving objects: 86% (80628/93753), 288.37 MiB | 33.79 MiB/s
Receiving objects: 87% (81566/93753), 288.37 MiB | 33.79 MiB/s
Receiving objects: 88% (82503/93753), 288.37 MiB | 33.79 MiB/s
Receiving objects: 89% (83441/93753), 288.37 MiB | 33.79 MiB/s
Receiving objects: 89% (84323/93753), 288.37 MiB | 33.79 MiB/s
Receiving objects: 90% (84378/93753), 288.37 MiB | 33.79 MiB/s
Receiving objects: 91% (85316/93753), 288.37 MiB | 33.79 MiB/s
Receiving objects: 92% (86253/93753), 288.37 MiB | 33.79 MiB/s
Receiving objects: 93% (87191/93753), 288.37 MiB | 33.79 MiB/s
Receiving objects: 94% (88128/93753), 288.37 MiB | 33.79 MiB/s
Receiving objects: 95% (89066/93753), 288.37 MiB | 33.79 MiB/s
Receiving objects: 96% (90003/93753), 288.37 MiB | 33.79 MiB/s
Receiving objects: 97% (90941/93753), 306.30 MiB | 34.13 MiB/s
Receiving objects: 98% (91878/93753), 306.30 MiB | 34.13 MiB/s
Receiving objects: 99% (92816/93753), 306.30 MiB | 34.13 MiB/s
remote: Total 93753 (delta 7858), reused 7172 (delta 7172), pack-reused 84794 (from 3)
- 13.98 s
Receiving objects: 100% (93753/93753), 306.30 MiB | 34.13 MiB/s
Receiving objects: 100% (93753/93753), 309.19 MiB | 33.43 MiB/s, done.
- 14.97 s
Resolving deltas: 0% (0/63113)
Resolving deltas: 1% (632/63113)
Resolving deltas: 2% (1263/63113)
Resolving deltas: 3% (1894/63113)
Resolving deltas: 4% (2525/63113)
Resolving deltas: 5% (3156/63113)
Resolving deltas: 6% (3787/63113)
Resolving deltas: 7% (4418/63113)
Resolving deltas: 8% (5050/63113)
Resolving deltas: 9% (5681/63113)
Resolving deltas: 10% (6312/63113)
Resolving deltas: 11% (6944/63113)
Resolving deltas: 12% (7574/63113)
Resolving deltas: 13% (8205/63113)
Resolving deltas: 14% (8837/63113)
Resolving deltas: 15% (9467/63113)
Resolving deltas: 16% (10099/63113)
Resolving deltas: 17% (10730/63113)
Resolving deltas: 18% (11361/63113)
Resolving deltas: 19% (11992/63113)
Resolving deltas: 20% (12623/63113)
Resolving deltas: 21% (13254/63113)
Resolving deltas: 22% (13885/63113)
Resolving deltas: 23% (14516/63113)
Resolving deltas: 24% (15148/63113)
Resolving deltas: 25% (15779/63113)
Resolving deltas: 26% (16410/63113)
Resolving deltas: 27% (17043/63113)
Resolving deltas: 28% (17672/63113)
Resolving deltas: 29% (18303/63113)
Resolving deltas: 30% (18934/63113)
Resolving deltas: 31% (19566/63113)
Resolving deltas: 32% (20197/63113)
Resolving deltas: 33% (20829/63113)
Resolving deltas: 34% (21460/63113)
Resolving deltas: 35% (22090/63113)
Resolving deltas: 36% (22721/63113)
Resolving deltas: 37% (23352/63113)
Resolving deltas: 38% (23983/63113)
Resolving deltas: 39% (24615/63113)
Resolving deltas: 40% (25247/63113)
Resolving deltas: 41% (25877/63113)
Resolving deltas: 42% (26508/63113)
Resolving deltas: 43% (27139/63113)
Resolving deltas: 44% (27770/63113)
Resolving deltas: 45% (28401/63113)
Resolving deltas: 46% (29032/63113)
Resolving deltas: 47% (29664/63113)
Resolving deltas: 48% (30295/63113)
Resolving deltas: 49% (30926/63113)
Resolving deltas: 50% (31557/63113)
Resolving deltas: 51% (32188/63113)
Resolving deltas: 52% (32819/63113)
Resolving deltas: 53% (33452/63113)
Resolving deltas: 54% (34085/63113)
Resolving deltas: 55% (34715/63113)
Resolving deltas: 56% (35344/63113)
Resolving deltas: 57% (35975/63113)
Resolving deltas: 58% (36606/63113)
Resolving deltas: 59% (37237/63113)
Resolving deltas: 60% (37868/63113)
Resolving deltas: 61% (38499/63113)
Resolving deltas: 62% (39131/63113)
Resolving deltas: 63% (39763/63113)
Resolving deltas: 64% (40393/63113)
Resolving deltas: 65% (41024/63113)
Resolving deltas: 66% (41655/63113)
Resolving deltas: 67% (42286/63113)
Resolving deltas: 68% (42917/63113)
Resolving deltas: 69% (43548/63113)
Resolving deltas: 70% (44180/63113)
Resolving deltas: 71% (44811/63113)
Resolving deltas: 72% (45442/63113)
Resolving deltas: 73% (46074/63113)
Resolving deltas: 74% (46704/63113)
Resolving deltas: 75% (47335/63113)
Resolving deltas: 76% (47966/63113)
Resolving deltas: 77% (48598/63113)
Resolving deltas: 78% (49229/63113)
Resolving deltas: 79% (49860/63113)
Resolving deltas: 80% (50491/63113)
Resolving deltas: 81% (51125/63113)
Resolving deltas: 82% (51756/63113)
Resolving deltas: 83% (52384/63113)
Resolving deltas: 84% (53015/63113)
Resolving deltas: 85% (53647/63113)
Resolving deltas: 86% (54278/63113)
Resolving deltas: 87% (54909/63113)
Resolving deltas: 88% (55540/63113)
Resolving deltas: 89% (56173/63113)
Resolving deltas: 90% (56802/63113)
Resolving deltas: 91% (57433/63113)
Resolving deltas: 92% (58064/63113)
Resolving deltas: 93% (58696/63113)
Resolving deltas: 94% (59327/63113)
Resolving deltas: 95% (59958/63113)
Resolving deltas: 96% (60589/63113)
Resolving deltas: 97% (61220/63113)
Resolving deltas: 98% (61851/63113)
Resolving deltas: 99% (62484/63113)
Resolving deltas: 100% (63113/63113)
Resolving deltas: 100% (63113/63113), done.
- 15.44 s
Fetching commit 01982f688b6810d5152f0317713db412ae7ea794 for codex/raised-energy-cff-reviewed ...
- 15.45 s
$ /nix/store/bcnisk3ydfgv26v2gw3zlky24g00yww2-git-2.54.0/bin/git fetch origin 01982f688b6810d5152f0317713db412ae7ea794
- 15.86 s
From https://github.com/alphal00p/gammaloop
- 15.86 s
* branch 01982f688b6810d5152f0317713db412ae7ea794 -> FETCH_HEAD
- 15.87 s
$ /nix/store/9ypz3flqsrl5xl495mm8h645gadjsxi1-coreutils-9.11/bin/timeout --kill-after=15s 7200s /nix/store/bcnisk3ydfgv26v2gw3zlky24g00yww2-git-2.54.0/bin/git -c advice.detachedHead=false checkout 01982f688b6810d5152f0317713db412ae7ea794
- 16.15 s
HEAD is now at 01982f688 document the reviewed CFF stack and validation
- 16.16 s
$ /nix/store/9ypz3flqsrl5xl495mm8h645gadjsxi1-coreutils-9.11/bin/timeout --kill-after=15s 7200s /nix/store/23zk8sgzamrbmj1fday15szf7f2279s8-nix-2.34.7/bin/nix --extra-experimental-features nix-command --extra-experimental-features flakes --log-format internal-json run .#packages.x86_64-linux.nix-ci-check-gammaloop-nextest-python-api --print-build-logs
- 23.07 s
- 23.18 s
Downloading cached gammaloop-nextest-binaries-python-api-gammaloop-integration-tests from https://cache.nix-ci.com
- 23.23 s
Downloaded cached gammaloop-nextest-binaries-python-api-gammaloop-integration-tests (8.5 MiB) in 53ms
- 23.23 s
Progress: 0 of 1 built, 1 of 3 downloaded from cache
- 23.23 s
Downloading cached gammaloop-nextest-binaries-python-api from https://cache.nix-ci.com
- 23.24 s
Downloaded cached gammaloop-nextest-binaries-python-api (520 B) in 3ms
- 23.24 s
Progress: 0 of 1 built, 2 of 3 downloaded from cache
- 23.24 s
Downloading cached nix-ci-check-gammaloop-nextest-python-api from https://cache.nix-ci.com
- 23.24 s
Downloaded cached nix-ci-check-gammaloop-nextest-python-api (1104 B) in 3ms
- 23.24 s
Progress: 0 of 1 built, 3 of 3 downloaded from cache
- 30.15 s
evaluating derivation 'g
copying '/nix/store/8j7s
evaluating derivation 'g
copying '/nix/store/8j7s
evaluating derivation 'g
copying '/nix/store/8j7s
evaluating derivation 'g
copying '/nix/store/8j7s
evaluating derivation 'g
copying '/nix/store/8j7s
evaluating derivation 'g
copying '/nix/store/8j7s
evaluating derivation 'g
copying '/nix/store/8j7s
evaluating derivation 'g
querying gammaloop-nexte
[3.2 KiB DL] querying in
[1/0/6 built, 3/4/12 copbuilder.pl> Running phase: patchPhase
- 30.15 s
[1/0/5 built, 2/5/12 copbuilder.pl> Running phase: updateAutotoolsGnuConfigScriptsPhase
- 30.16 s
builder.pl> Running phase: configurePhase
- 30.17 s
builder.pl> no configure script, doing nothing
- 30.17 s
builder.pl> Running phase: buildPhase
- 30.17 s
builder.pl> Running phase: checkPhase
- 30.18 s
builder.pl> Running phase: installPhase
- 30.18 s
builder.pl> no Makefile or custom installPhase, doing nothing
- 30.18 s
builder.pl> Running phase: fixupPhase
- 30.19 s
builder.pl> shrinking RPATHs of ELF executables and libraries in /nix/store/n17p4y03iknmyjpnfk30rj7i0klr448n-builder.pl
- 30.19 s
builder.pl> checking for references to /build/ in /nix/store/n17p4y03iknmyjpnfk30rj7i0klr448n-builder.pl...
- 30.20 s
builder.pl> patching script interpreter paths in /nix/store/n17p4y03iknmyjpnfk30rj7i0klr448n-builder.pl
- 30.23 s
builder.pl (post)> Uploading to the NixCI cache: /nix/store/n17p4y03iknmyjpnfk30rj7i0klr448n-builder.pl
- 30.26 s
builder.pl (post)> warning: 'warn-short-path-literals' is deprecated, use 'lint-short-path-literals = ignore' instead
- 30.29 s
builder.pl (post)> copying 0 paths...
- 30.33 s
builder.pl (post)> warning: 'warn-short-path-literals' is deprecated, use 'lint-short-path-literals = ignore' instead
- 30.37 s
builder.pl (post)> copying 0 paths...
- 30.91 s
[1/4 built, 2/7/12 copie
[1/4 built, 1/11/12 copipython3> structuredAttrs is enabled
- 30.97 s
[1/1/3 built, 12 copied python3> created 227 symlinks in user environment
- 31.71 s
python3 (post)> Uploading to the NixCI cache: /nix/store/3gi2x25n327sf3xma8b08jd57aqv69x5-python3-3.13.14-env
- 31.75 s
python3 (post)> warning: 'warn-short-path-literals' is deprecated, use 'lint-short-path-literals = ignore' instead
- 31.78 s
python3 (post)> copying 0 paths...
- 31.82 s
python3 (post)> warning: 'warn-short-path-literals' is deprecated, use 'lint-short-path-literals = ignore' instead
- 31.94 s
python3 (post)> copying 0 paths...
- 32.22 s
[2/4 built, 12 copied (2
[1/2/3 built, 12 copied gammaloop-nextest-python-api> Extracting 1 binary, 1 build script output directory, and 3 linked paths to /build/nextest-archive-PfBDF1
- 32.28 s
gammaloop-nextest-python-api> Extracted 18 files to /build/nextest-archive-PfBDF1 in 0.06s
- 32.29 s
gammaloop-nextest-python-api> ------------
- 32.29 s
gammaloop-nextest-python-api> Nextest run ID 835a273b-adc2-41be-a789-8cb05bb8b832 with nextest profile: ci_gammaloop
- 32.29 s
gammaloop-nextest-python-api> Starting 5 tests across 1 binary
- 32.40 s
gammaloop-nextest-python-api> FAIL [ 0.110s] (1/5) gammaloop-integration-tests::test_python_api python_evaluate_samples_batch_and_momentum_space_have_expected_shape
- 32.40 s
gammaloop-nextest-python-api> stdout ---
- 32.40 s
gammaloop-nextest-python-api>
- 32.40 s
gammaloop-nextest-python-api> running 1 test
- 32.40 s
gammaloop-nextest-python-api> test python_evaluate_samples_batch_and_momentum_space_have_expected_shape ... FAILED
- 32.40 s
gammaloop-nextest-python-api>
- 32.40 s
gammaloop-nextest-python-api> failures:
- 32.40 s
gammaloop-nextest-python-api>
- 32.40 s
gammaloop-nextest-python-api> failures:
- 32.40 s
gammaloop-nextest-python-api> python_evaluate_samples_batch_and_momentum_space_have_expected_shape
- 32.40 s
gammaloop-nextest-python-api>
- 32.40 s
gammaloop-nextest-python-api> test result: FAILED. 0 passed; 1 failed; 0 ignored; 0 measured; 4 filtered out; finished in 0.10s
- 32.40 s
gammaloop-nextest-python-api>
- 32.40 s
gammaloop-nextest-python-api> stderr ---
- 32.40 s
gammaloop-nextest-python-api> Error: Python API test subprocess failed.
- 32.40 s
gammaloop-nextest-python-api> stdout:
- 32.40 s
gammaloop-nextest-python-api> ┌────────────────────────────────────────────────────────┐
- 32.40 s
gammaloop-nextest-python-api> │ You are running a restricted Symbolica instance. │
- 32.40 s
gammaloop-nextest-python-api> │ │
- 32.40 s
gammaloop-nextest-python-api> │ This mode is only permitted for non-commercial use and │
- 32.40 s
gammaloop-nextest-python-api> │ is limited to one instance and core per machine. │
- 32.40 s
gammaloop-nextest-python-api> │ │
- 32.40 s
gammaloop-nextest-python-api> │ Hobbyists can easily acquire a free license key │
- 32.40 s
gammaloop-nextest-python-api> │ that unlocks all cores and removes this banner: │
- 32.40 s
gammaloop-nextest-python-api> │ │
- 32.40 s
gammaloop-nextest-python-api> │ from symbolica import * │
- 32.40 s
gammaloop-nextest-python-api> │ request_hobbyist_license('YOUR_NAME', 'YOUR_EMAIL') │
- 32.40 s
gammaloop-nextest-python-api> │ │
- 32.40 s
gammaloop-nextest-python-api> │ All other users can obtain a free 30-day trial key: │
- 32.40 s
gammaloop-nextest-python-api> │ │
- 32.40 s
gammaloop-nextest-python-api> │ from symbolica import * │
- 32.40 s
gammaloop-nextest-python-api> │ request_trial_license('NAME', 'EMAIL', 'EMPLOYER') │
- 32.40 s
gammaloop-nextest-python-api> │ │
- 32.40 s
gammaloop-nextest-python-api> │ See https://symbolica.io/docs/get_started.html#license │
- 32.40 s
gammaloop-nextest-python-api> └────────────────────────────────────────────────────────┘
- 32.40 s
gammaloop-nextest-python-api> ┌───────────────────────────────────────────────────────────────────────────────────────────────────────────┐
- 32.40 s
gammaloop-nextest-python-api> │ Cannot start new unlicensed Symbolica instance since there is already another one running on the machine. │
- 32.40 s
gammaloop-nextest-python-api> └───────────────────────────────────────────────────────────────────────────────────────────────────────────┘
- 32.40 s
gammaloop-nextest-python-api>
- 32.40 s
gammaloop-nextest-python-api> stderr:
- 32.40 s
gammaloop-nextest-python-api>
- 32.40 s
gammaloop-nextest-python-api> ┌───────────────────────────────────────────────────────────┐
- 32.40 s
gammaloop-nextest-python-api> │ Could not resolve the IP of the Symbolica license server. │
- 32.40 s
gammaloop-nextest-python-api> │ │
- 32.40 s
gammaloop-nextest-python-api> │ Please check your DNS configuration. │
- 32.40 s
gammaloop-nextest-python-api> └───────────────────────────────────────────────────────────┘
- 32.40 s
gammaloop-nextest-python-api> Error: failed to lookup address information: Temporary failure in name resolution
- 32.40 s
gammaloop-nextest-python-api>
- 32.40 s
gammaloop-nextest-python-api>
- 32.40 s
gammaloop-nextest-python-api> Location:
- 32.40 s
gammaloop-nextest-python-api> tests/tests/test_python_api.rs:156:20
- 32.40 s
gammaloop-nextest-python-api>
- 32.40 s
gammaloop-nextest-python-api> FAIL [ 0.110s] (2/5) gammaloop-integration-tests::test_python_api python_evaluate_sample_preserves_graph_grouping_and_incoming_pdgs
- 32.40 s
gammaloop-nextest-python-api> stdout ---
- 32.40 s
gammaloop-nextest-python-api>
- 32.40 s
gammaloop-nextest-python-api> running 1 test
- 32.40 s
gammaloop-nextest-python-api> test python_evaluate_sample_preserves_graph_grouping_and_incoming_pdgs ... FAILED
- 32.40 s
gammaloop-nextest-python-api>
- 32.40 s
gammaloop-nextest-python-api> failures:
- 32.40 s
gammaloop-nextest-python-api>
- 32.40 s
gammaloop-nextest-python-api> failures:
- 32.40 s
gammaloop-nextest-python-api> python_evaluate_sample_preserves_graph_grouping_and_incoming_pdgs
- 32.40 s
gammaloop-nextest-python-api>
- 32.40 s
gammaloop-nextest-python-api> test result: FAILED. 0 passed; 1 failed; 0 ignored; 0 measured; 4 filtered out; finished in 0.11s
- 32.40 s
gammaloop-nextest-python-api>
- 32.40 s
gammaloop-nextest-python-api> stderr ---
- 32.40 s
gammaloop-nextest-python-api> Error: Python API test subprocess failed.
- 32.40 s
gammaloop-nextest-python-api> stdout:
- 32.40 s
gammaloop-nextest-python-api> ┌────────────────────────────────────────────────────────┐
- 32.40 s
gammaloop-nextest-python-api> │ You are running a restricted Symbolica instance. │
- 32.40 s
gammaloop-nextest-python-api> │ │
- 32.40 s
gammaloop-nextest-python-api> │ This mode is only permitted for non-commercial use and │
- 32.40 s
gammaloop-nextest-python-api> │ is limited to one instance and core per machine. │
- 32.40 s
gammaloop-nextest-python-api> │ │
- 32.40 s
gammaloop-nextest-python-api> │ Hobbyists can easily acquire a free license key │
- 32.40 s
gammaloop-nextest-python-api> │ that unlocks all cores and removes this banner: │
- 32.40 s
gammaloop-nextest-python-api> │ │
- 32.40 s
gammaloop-nextest-python-api> │ from symbolica import * │
- 32.40 s
gammaloop-nextest-python-api> │ request_hobbyist_license('YOUR_NAME', 'YOUR_EMAIL') │
- 32.40 s
gammaloop-nextest-python-api> │ │
- 32.40 s
gammaloop-nextest-python-api> │ All other users can obtain a free 30-day trial key: │
- 32.40 s
gammaloop-nextest-python-api> │ │
- 32.40 s
gammaloop-nextest-python-api> │ from symbolica import * │
- 32.40 s
gammaloop-nextest-python-api> │ request_trial_license('NAME', 'EMAIL', 'EMPLOYER') │
- 32.40 s
gammaloop-nextest-python-api> │ │
- 32.40 s
gammaloop-nextest-python-api> │ See https://symbolica.io/docs/get_started.html#license │
- 32.40 s
gammaloop-nextest-python-api> └────────────────────────────────────────────────────────┘
- 32.40 s
gammaloop-nextest-python-api> ┌───────────────────────────────────────────────────────────────────────────────────────────────────────────┐
- 32.40 s
gammaloop-nextest-python-api> │ Cannot start new unlicensed Symbolica instance since there is already another one running on the machine. │
- 32.40 s
gammaloop-nextest-python-api> └───────────────────────────────────────────────────────────────────────────────────────────────────────────┘
- 32.40 s
gammaloop-nextest-python-api>
- 32.40 s
gammaloop-nextest-python-api> stderr:
- 32.40 s
gammaloop-nextest-python-api>
- 32.40 s
gammaloop-nextest-python-api> ┌───────────────────────────────────────────────────────────┐
- 32.40 s
gammaloop-nextest-python-api> │ Could not resolve the IP of the Symbolica license server. │
- 32.40 s
gammaloop-nextest-python-api> │ │
- 32.40 s
gammaloop-nextest-python-api> │ Please check your DNS configuration. │
- 32.40 s
gammaloop-nextest-python-api> └───────────────────────────────────────────────────────────┘
- 32.40 s
gammaloop-nextest-python-api> Error: failed to lookup address information: Temporary failure in name resolution
- 32.40 s
gammaloop-nextest-python-api>
- 32.40 s
gammaloop-nextest-python-api>
- 32.40 s
gammaloop-nextest-python-api> Location:
- 32.40 s
gammaloop-nextest-python-api> tests/tests/test_python_api.rs:156:20
- 32.40 s
gammaloop-nextest-python-api>
- 32.40 s
gammaloop-nextest-python-api> FAIL [ 0.116s] (3/5) gammaloop-integration-tests::test_python_api python_session_getters_return_live_toml_and_command_blocks
- 32.40 s
gammaloop-nextest-python-api> stdout ---
- 32.40 s
gammaloop-nextest-python-api>
- 32.40 s
gammaloop-nextest-python-api> running 1 test
- 32.40 s
gammaloop-nextest-python-api> test python_session_getters_return_live_toml_and_command_blocks ... FAILED
- 32.40 s
gammaloop-nextest-python-api>
- 32.40 s
gammaloop-nextest-python-api> failures:
- 32.40 s
gammaloop-nextest-python-api>
- 32.40 s
gammaloop-nextest-python-api> failures:
- 32.40 s
gammaloop-nextest-python-api> python_session_getters_return_live_toml_and_command_blocks
- 32.40 s
gammaloop-nextest-python-api>
- 32.40 s
gammaloop-nextest-python-api> test result: FAILED. 0 passed; 1 failed; 0 ignored; 0 measured; 4 filtered out; finished in 0.11s
- 32.40 s
gammaloop-nextest-python-api>
- 32.40 s
gammaloop-nextest-python-api> stderr ---
- 32.40 s
gammaloop-nextest-python-api> Error: Python API test subprocess failed.
- 32.40 s
gammaloop-nextest-python-api> stdout:
- 32.40 s
gammaloop-nextest-python-api> ┌────────────────────────────────────────────────────────┐
- 32.40 s
gammaloop-nextest-python-api> │ You are running a restricted Symbolica instance. │
- 32.40 s
gammaloop-nextest-python-api> │ │
- 32.40 s
gammaloop-nextest-python-api> │ This mode is only permitted for non-commercial use and │
- 32.40 s
gammaloop-nextest-python-api> │ is limited to one instance and core per machine. │
- 32.40 s
gammaloop-nextest-python-api> │ │
- 32.40 s
gammaloop-nextest-python-api> │ Hobbyists can easily acquire a free license key │
- 32.40 s
gammaloop-nextest-python-api> │ that unlocks all cores and removes this banner: │
- 32.40 s
gammaloop-nextest-python-api> │ │
- 32.40 s
gammaloop-nextest-python-api> │ from symbolica import * │
- 32.40 s
gammaloop-nextest-python-api> │ request_hobbyist_license('YOUR_NAME', 'YOUR_EMAIL') │
- 32.40 s
gammaloop-nextest-python-api> │ │
- 32.41 s
gammaloop-nextest-python-api> │ All other users can obtain a free 30-day trial key: │
- 32.41 s
gammaloop-nextest-python-api> │ │
- 32.41 s
gammaloop-nextest-python-api> │ from symbolica import * │
- 32.41 s
gammaloop-nextest-python-api> │ request_trial_license('NAME', 'EMAIL', 'EMPLOYER') │
- 32.41 s
gammaloop-nextest-python-api> │ │
- 32.41 s
gammaloop-nextest-python-api> │ See https://symbolica.io/docs/get_started.html#license │
- 32.41 s
gammaloop-nextest-python-api> └────────────────────────────────────────────────────────┘
- 32.41 s
gammaloop-nextest-python-api> ┌───────────────────────────────────────────────────────────────────────────────────────────────────────────┐
- 32.41 s
gammaloop-nextest-python-api> │ Cannot start new unlicensed Symbolica instance since there is already another one running on the machine. │
- 32.41 s
gammaloop-nextest-python-api> └───────────────────────────────────────────────────────────────────────────────────────────────────────────┘
- 32.41 s
gammaloop-nextest-python-api>
- 32.41 s
gammaloop-nextest-python-api> stderr:
- 32.41 s
gammaloop-nextest-python-api>
- 32.41 s
gammaloop-nextest-python-api> ┌───────────────────────────────────────────────────────────┐
- 32.41 s
gammaloop-nextest-python-api> │ Could not resolve the IP of the Symbolica license server. │
- 32.41 s
gammaloop-nextest-python-api> │ │
- 32.41 s
gammaloop-nextest-python-api> │ Please check your DNS configuration. │
- 32.41 s
gammaloop-nextest-python-api> └───────────────────────────────────────────────────────────┘
- 32.41 s
gammaloop-nextest-python-api> Error: failed to lookup address information: Temporary failure in name resolution
- 32.41 s
gammaloop-nextest-python-api>
- 32.41 s
gammaloop-nextest-python-api>
- 32.41 s
gammaloop-nextest-python-api> Location:
- 32.41 s
gammaloop-nextest-python-api> tests/tests/test_python_api.rs:156:20
- 32.41 s
gammaloop-nextest-python-api>
- 32.41 s
gammaloop-nextest-python-api> FAIL [ 0.117s] (4/5) gammaloop-integration-tests::test_python_api python_evaluate_sample_honors_generate_events_and_observable_snapshots
- 32.41 s
gammaloop-nextest-python-api> stdout ---
- 32.41 s
gammaloop-nextest-python-api>
- 32.41 s
gammaloop-nextest-python-api> running 1 test
- 32.41 s
gammaloop-nextest-python-api> test python_evaluate_sample_honors_generate_events_and_observable_snapshots ... FAILED
- 32.41 s
gammaloop-nextest-python-api>
- 32.41 s
gammaloop-nextest-python-api> failures:
- 32.41 s
gammaloop-nextest-python-api>
- 32.41 s
gammaloop-nextest-python-api> failures:
- 32.41 s
gammaloop-nextest-python-api> python_evaluate_sample_honors_generate_events_and_observable_snapshots
- 32.41 s
gammaloop-nextest-python-api>
- 32.41 s
gammaloop-nextest-python-api> test result: FAILED. 0 passed; 1 failed; 0 ignored; 0 measured; 4 filtered out; finished in 0.11s
- 32.41 s
gammaloop-nextest-python-api>
- 32.41 s
gammaloop-nextest-python-api> stderr ---
- 32.41 s
gammaloop-nextest-python-api> Error: Python API test subprocess failed.
- 32.41 s
gammaloop-nextest-python-api> stdout:
- 32.41 s
gammaloop-nextest-python-api> ┌────────────────────────────────────────────────────────┐
- 32.41 s
gammaloop-nextest-python-api> │ You are running a restricted Symbolica instance. │
- 32.41 s
gammaloop-nextest-python-api> │ │
- 32.41 s
gammaloop-nextest-python-api> │ This mode is only permitted for non-commercial use and │
- 32.41 s
gammaloop-nextest-python-api> │ is limited to one instance and core per machine. │
- 32.41 s
gammaloop-nextest-python-api> │ │
- 32.41 s
gammaloop-nextest-python-api> │ Hobbyists can easily acquire a free license key │
- 32.41 s
gammaloop-nextest-python-api> │ that unlocks all cores and removes this banner: │
- 32.41 s
gammaloop-nextest-python-api> │ │
- 32.41 s
gammaloop-nextest-python-api> │ from symbolica import * │
- 32.41 s
gammaloop-nextest-python-api> │ request_hobbyist_license('YOUR_NAME', 'YOUR_EMAIL') │
- 32.41 s
gammaloop-nextest-python-api> │ │
- 32.41 s
gammaloop-nextest-python-api> │ All other users can obtain a free 30-day trial key: │
- 32.41 s
gammaloop-nextest-python-api> │ │
- 32.41 s
gammaloop-nextest-python-api> │ from symbolica import * │
- 32.41 s
gammaloop-nextest-python-api> │ request_trial_license('NAME', 'EMAIL', 'EMPLOYER') │
- 32.41 s
gammaloop-nextest-python-api> │ │
- 32.41 s
gammaloop-nextest-python-api> │ See https://symbolica.io/docs/get_started.html#license │
- 32.41 s
gammaloop-nextest-python-api> └────────────────────────────────────────────────────────┘
- 32.41 s
gammaloop-nextest-python-api> ┌───────────────────────────────────────────────────────────────────────────────────────────────────────────┐
- 32.41 s
gammaloop-nextest-python-api> │ Cannot start new unlicensed Symbolica instance since there is already another one running on the machine. │
- 32.41 s
gammaloop-nextest-python-api> └───────────────────────────────────────────────────────────────────────────────────────────────────────────┘
- 32.41 s
gammaloop-nextest-python-api>
- 32.41 s
gammaloop-nextest-python-api> stderr:
- 32.41 s
gammaloop-nextest-python-api>
- 32.41 s
gammaloop-nextest-python-api> ┌───────────────────────────────────────────────────────────┐
- 32.41 s
gammaloop-nextest-python-api> │ Could not resolve the IP of the Symbolica license server. │
- 32.41 s
gammaloop-nextest-python-api> │ │
- 32.41 s
gammaloop-nextest-python-api> │ Please check your DNS configuration. │
- 32.41 s
gammaloop-nextest-python-api> └───────────────────────────────────────────────────────────┘
- 32.41 s
gammaloop-nextest-python-api> Error: failed to lookup address information: Temporary failure in name resolution
- 32.41 s
gammaloop-nextest-python-api>
- 32.41 s
gammaloop-nextest-python-api>
- 32.41 s
gammaloop-nextest-python-api> Location:
- 32.41 s
gammaloop-nextest-python-api> tests/tests/test_python_api.rs:156:20
- 32.41 s
gammaloop-nextest-python-api>
- 32.57 s
gammaloop-nextest-python-api> ------------
- 32.57 s
gammaloop-nextest-python-api> Summary [ 0.277s] 5 tests run: 1 passed, 4 failed, 0 skipped
- 32.57 s
gammaloop-nextest-python-api> FAIL [ 0.110s] (1/5) gammaloop-integration-tests::test_python_api python_evaluate_samples_batch_and_momentum_space_have_expected_shape
- 32.57 s
gammaloop-nextest-python-api> stdout ---
- 32.57 s
gammaloop-nextest-python-api>
- 32.57 s
gammaloop-nextest-python-api> running 1 test
- 32.57 s
gammaloop-nextest-python-api> test python_evaluate_samples_batch_and_momentum_space_have_expected_shape ... FAILED
- 32.57 s
gammaloop-nextest-python-api>
- 32.57 s
gammaloop-nextest-python-api> failures:
- 32.57 s
gammaloop-nextest-python-api>
- 32.57 s
gammaloop-nextest-python-api> failures:
- 32.57 s
gammaloop-nextest-python-api> python_evaluate_samples_batch_and_momentum_space_have_expected_shape
- 32.57 s
gammaloop-nextest-python-api>
- 32.57 s
gammaloop-nextest-python-api> test result: FAILED. 0 passed; 1 failed; 0 ignored; 0 measured; 4 filtered out; finished in 0.10s
- 32.57 s
gammaloop-nextest-python-api>
- 32.57 s
gammaloop-nextest-python-api> stderr ---
- 32.57 s
gammaloop-nextest-python-api> Error: Python API test subprocess failed.
- 32.57 s
gammaloop-nextest-python-api> stdout:
- 32.57 s
gammaloop-nextest-python-api> ┌────────────────────────────────────────────────────────┐
- 32.57 s
gammaloop-nextest-python-api> │ You are running a restricted Symbolica instance. │
- 32.57 s
gammaloop-nextest-python-api> │ │
- 32.57 s
gammaloop-nextest-python-api> │ This mode is only permitted for non-commercial use and │
- 32.57 s
gammaloop-nextest-python-api> │ is limited to one instance and core per machine. │
- 32.57 s
gammaloop-nextest-python-api> │ │
- 32.57 s
gammaloop-nextest-python-api> │ Hobbyists can easily acquire a free license key │
- 32.57 s
gammaloop-nextest-python-api> │ that unlocks all cores and removes this banner: │
- 32.57 s
gammaloop-nextest-python-api> │ │
- 32.57 s
gammaloop-nextest-python-api> │ from symbolica import * │
- 32.57 s
gammaloop-nextest-python-api> │ request_hobbyist_license('YOUR_NAME', 'YOUR_EMAIL') │
- 32.57 s
gammaloop-nextest-python-api> │ │
- 32.57 s
gammaloop-nextest-python-api> │ All other users can obtain a free 30-day trial key: │
- 32.57 s
gammaloop-nextest-python-api> │ │
- 32.57 s
gammaloop-nextest-python-api> │ from symbolica import * │
- 32.57 s
gammaloop-nextest-python-api> │ request_trial_license('NAME', 'EMAIL', 'EMPLOYER') │
- 32.57 s
gammaloop-nextest-python-api> │ │
- 32.57 s
gammaloop-nextest-python-api> │ See https://symbolica.io/docs/get_started.html#license │
- 32.57 s
gammaloop-nextest-python-api> └────────────────────────────────────────────────────────┘
- 32.57 s
gammaloop-nextest-python-api> ┌───────────────────────────────────────────────────────────────────────────────────────────────────────────┐
- 32.57 s
gammaloop-nextest-python-api> │ Cannot start new unlicensed Symbolica instance since there is already another one running on the machine. │
- 32.57 s
gammaloop-nextest-python-api> └───────────────────────────────────────────────────────────────────────────────────────────────────────────┘
- 32.57 s
gammaloop-nextest-python-api>
- 32.57 s
gammaloop-nextest-python-api> stderr:
- 32.57 s
gammaloop-nextest-python-api>
- 32.57 s
gammaloop-nextest-python-api> ┌───────────────────────────────────────────────────────────┐
- 32.57 s
gammaloop-nextest-python-api> │ Could not resolve the IP of the Symbolica license server. │
- 32.57 s
gammaloop-nextest-python-api> │ │
- 32.57 s
gammaloop-nextest-python-api> │ Please check your DNS configuration. │
- 32.57 s
gammaloop-nextest-python-api> └───────────────────────────────────────────────────────────┘
- 32.57 s
gammaloop-nextest-python-api> Error: failed to lookup address information: Temporary failure in name resolution
- 32.57 s
gammaloop-nextest-python-api>
- 32.57 s
gammaloop-nextest-python-api>
- 32.57 s
gammaloop-nextest-python-api> Location:
- 32.57 s
gammaloop-nextest-python-api> tests/tests/test_python_api.rs:156:20
- 32.57 s
gammaloop-nextest-python-api>
- 32.57 s
gammaloop-nextest-python-api> FAIL [ 0.110s] (2/5) gammaloop-integration-tests::test_python_api python_evaluate_sample_preserves_graph_grouping_and_incoming_pdgs
- 32.57 s
gammaloop-nextest-python-api> stdout ---
- 32.57 s
gammaloop-nextest-python-api>
- 32.57 s
gammaloop-nextest-python-api> running 1 test
- 32.57 s
gammaloop-nextest-python-api> test python_evaluate_sample_preserves_graph_grouping_and_incoming_pdgs ... FAILED
- 32.57 s
gammaloop-nextest-python-api>
- 32.57 s
gammaloop-nextest-python-api> failures:
- 32.57 s
gammaloop-nextest-python-api>
- 32.57 s
gammaloop-nextest-python-api> failures:
- 32.57 s
gammaloop-nextest-python-api> python_evaluate_sample_preserves_graph_grouping_and_incoming_pdgs
- 32.57 s
gammaloop-nextest-python-api>
- 32.57 s
gammaloop-nextest-python-api> test result: FAILED. 0 passed; 1 failed; 0 ignored; 0 measured; 4 filtered out; finished in 0.11s
- 32.57 s
gammaloop-nextest-python-api>
- 32.57 s
gammaloop-nextest-python-api> stderr ---
- 32.57 s
gammaloop-nextest-python-api> Error: Python API test subprocess failed.
- 32.57 s
gammaloop-nextest-python-api> stdout:
- 32.57 s
gammaloop-nextest-python-api> ┌────────────────────────────────────────────────────────┐
- 32.57 s
gammaloop-nextest-python-api> │ You are running a restricted Symbolica instance. │
- 32.57 s
gammaloop-nextest-python-api> │ │
- 32.57 s
gammaloop-nextest-python-api> │ This mode is only permitted for non-commercial use and │
- 32.57 s
gammaloop-nextest-python-api> │ is limited to one instance and core per machine. │
- 32.57 s
gammaloop-nextest-python-api> │ │
- 32.57 s
gammaloop-nextest-python-api> │ Hobbyists can easily acquire a free license key │
- 32.57 s
gammaloop-nextest-python-api> │ that unlocks all cores and removes this banner: │
- 32.57 s
gammaloop-nextest-python-api> │ │
- 32.57 s
gammaloop-nextest-python-api> │ from symbolica import * │
- 32.57 s
gammaloop-nextest-python-api> │ request_hobbyist_license('YOUR_NAME', 'YOUR_EMAIL') │
- 32.57 s
gammaloop-nextest-python-api> │ │
- 32.57 s
gammaloop-nextest-python-api> │ All other users can obtain a free 30-day trial key: │
- 32.57 s
gammaloop-nextest-python-api> │ │
- 32.57 s
gammaloop-nextest-python-api> │ from symbolica import * │
- 32.57 s
gammaloop-nextest-python-api> │ request_trial_license('NAME', 'EMAIL', 'EMPLOYER') │
- 32.57 s
gammaloop-nextest-python-api> │ │
- 32.57 s
gammaloop-nextest-python-api> │ See https://symbolica.io/docs/get_started.html#license │
- 32.57 s
gammaloop-nextest-python-api> └────────────────────────────────────────────────────────┘
- 32.57 s
gammaloop-nextest-python-api> ┌───────────────────────────────────────────────────────────────────────────────────────────────────────────┐
- 32.57 s
gammaloop-nextest-python-api> │ Cannot start new unlicensed Symbolica instance since there is already another one running on the machine. │
- 32.57 s
gammaloop-nextest-python-api> └───────────────────────────────────────────────────────────────────────────────────────────────────────────┘
- 32.57 s
gammaloop-nextest-python-api>
- 32.57 s
gammaloop-nextest-python-api> stderr:
- 32.57 s
gammaloop-nextest-python-api>
- 32.57 s
gammaloop-nextest-python-api> ┌───────────────────────────────────────────────────────────┐
- 32.57 s
gammaloop-nextest-python-api> │ Could not resolve the IP of the Symbolica license server. │
- 32.57 s
gammaloop-nextest-python-api> │ │
- 32.57 s
gammaloop-nextest-python-api> │ Please check your DNS configuration. │
- 32.57 s
gammaloop-nextest-python-api> └───────────────────────────────────────────────────────────┘
- 32.57 s
gammaloop-nextest-python-api> Error: failed to lookup address information: Temporary failure in name resolution
- 32.57 s
gammaloop-nextest-python-api>
- 32.57 s
gammaloop-nextest-python-api>
- 32.57 s
gammaloop-nextest-python-api> Location:
- 32.57 s
gammaloop-nextest-python-api> tests/tests/test_python_api.rs:156:20
- 32.57 s
gammaloop-nextest-python-api>
- 32.57 s
gammaloop-nextest-python-api> FAIL [ 0.116s] (3/5) gammaloop-integration-tests::test_python_api python_session_getters_return_live_toml_and_command_blocks
- 32.57 s
gammaloop-nextest-python-api> stdout ---
- 32.57 s
gammaloop-nextest-python-api>
- 32.57 s
gammaloop-nextest-python-api> running 1 test
- 32.57 s
gammaloop-nextest-python-api> test python_session_getters_return_live_toml_and_command_blocks ... FAILED
- 32.57 s
gammaloop-nextest-python-api>
- 32.57 s
gammaloop-nextest-python-api> failures:
- 32.57 s
gammaloop-nextest-python-api>
- 32.57 s
gammaloop-nextest-python-api> failures:
- 32.57 s
gammaloop-nextest-python-api> python_session_getters_return_live_toml_and_command_blocks
- 32.57 s
gammaloop-nextest-python-api>
- 32.57 s
gammaloop-nextest-python-api> test result: FAILED. 0 passed; 1 failed; 0 ignored; 0 measured; 4 filtered out; finished in 0.11s
- 32.57 s
gammaloop-nextest-python-api>
- 32.57 s
gammaloop-nextest-python-api> stderr ---
- 32.57 s
gammaloop-nextest-python-api> Error: Python API test subprocess failed.
- 32.57 s
gammaloop-nextest-python-api> stdout:
- 32.57 s
gammaloop-nextest-python-api> ┌────────────────────────────────────────────────────────┐
- 32.57 s
gammaloop-nextest-python-api> │ You are running a restricted Symbolica instance. │
- 32.57 s
gammaloop-nextest-python-api> │ │
- 32.57 s
gammaloop-nextest-python-api> │ This mode is only permitted for non-commercial use and │
- 32.57 s
gammaloop-nextest-python-api> │ is limited to one instance and core per machine. │
- 32.57 s
gammaloop-nextest-python-api> │ │
- 32.57 s
gammaloop-nextest-python-api> │ Hobbyists can easily acquire a free license key │
- 32.57 s
gammaloop-nextest-python-api> │ that unlocks all cores and removes this banner: │
- 32.57 s
gammaloop-nextest-python-api> │ │
- 32.57 s
gammaloop-nextest-python-api> │ from symbolica import * │
- 32.57 s
gammaloop-nextest-python-api> │ request_hobbyist_license('YOUR_NAME', 'YOUR_EMAIL') │
- 32.57 s
gammaloop-nextest-python-api> │ │
- 32.57 s
gammaloop-nextest-python-api> │ All other users can obtain a free 30-day trial key: │
- 32.57 s
gammaloop-nextest-python-api> │ │
- 32.57 s
gammaloop-nextest-python-api> │ from symbolica import * │
- 32.57 s
gammaloop-nextest-python-api> │ request_trial_license('NAME', 'EMAIL', 'EMPLOYER') │
- 32.57 s
gammaloop-nextest-python-api> │ │
- 32.57 s
gammaloop-nextest-python-api> │ See https://symbolica.io/docs/get_started.html#license │
- 32.57 s
gammaloop-nextest-python-api> └────────────────────────────────────────────────────────┘
- 32.57 s
gammaloop-nextest-python-api> ┌───────────────────────────────────────────────────────────────────────────────────────────────────────────┐
- 32.57 s
gammaloop-nextest-python-api> │ Cannot start new unlicensed Symbolica instance since there is already another one running on the machine. │
- 32.57 s
gammaloop-nextest-python-api> └───────────────────────────────────────────────────────────────────────────────────────────────────────────┘
- 32.57 s
gammaloop-nextest-python-api>
- 32.57 s
gammaloop-nextest-python-api> stderr:
- 32.57 s
gammaloop-nextest-python-api>
- 32.57 s
gammaloop-nextest-python-api> ┌───────────────────────────────────────────────────────────┐
- 32.57 s
gammaloop-nextest-python-api> │ Could not resolve the IP of the Symbolica license server. │
- 32.57 s
gammaloop-nextest-python-api> │ │
- 32.57 s
gammaloop-nextest-python-api> │ Please check your DNS configuration. │
- 32.57 s
gammaloop-nextest-python-api> └───────────────────────────────────────────────────────────┘
- 32.57 s
gammaloop-nextest-python-api> Error: failed to lookup address information: Temporary failure in name resolution
- 32.57 s
gammaloop-nextest-python-api>
- 32.57 s
gammaloop-nextest-python-api>
- 32.57 s
gammaloop-nextest-python-api> Location:
- 32.57 s
gammaloop-nextest-python-api> tests/tests/test_python_api.rs:156:20
- 32.57 s
gammaloop-nextest-python-api>
- 32.57 s
gammaloop-nextest-python-api> FAIL [ 0.117s] (4/5) gammaloop-integration-tests::test_python_api python_evaluate_sample_honors_generate_events_and_observable_snapshots
- 32.57 s
gammaloop-nextest-python-api> stdout ---
- 32.57 s
gammaloop-nextest-python-api>
- 32.57 s
gammaloop-nextest-python-api> running 1 test
- 32.57 s
gammaloop-nextest-python-api> test python_evaluate_sample_honors_generate_events_and_observable_snapshots ... FAILED
- 32.57 s
gammaloop-nextest-python-api>
- 32.57 s
gammaloop-nextest-python-api> failures:
- 32.57 s
gammaloop-nextest-python-api>
- 32.57 s
gammaloop-nextest-python-api> failures:
- 32.57 s
gammaloop-nextest-python-api> python_evaluate_sample_honors_generate_events_and_observable_snapshots
- 32.57 s
gammaloop-nextest-python-api>
- 32.57 s
gammaloop-nextest-python-api> test result: FAILED. 0 passed; 1 failed; 0 ignored; 0 measured; 4 filtered out; finished in 0.11s
- 32.57 s
gammaloop-nextest-python-api>
- 32.57 s
gammaloop-nextest-python-api> stderr ---
- 32.57 s
gammaloop-nextest-python-api> Error: Python API test subprocess failed.
- 32.57 s
gammaloop-nextest-python-api> stdout:
- 32.57 s
gammaloop-nextest-python-api> ┌────────────────────────────────────────────────────────┐
- 32.57 s
gammaloop-nextest-python-api> │ You are running a restricted Symbolica instance. │
- 32.57 s
gammaloop-nextest-python-api> │ │
- 32.57 s
gammaloop-nextest-python-api> │ This mode is only permitted for non-commercial use and │
- 32.57 s
gammaloop-nextest-python-api> │ is limited to one instance and core per machine. │
- 32.57 s
gammaloop-nextest-python-api> │ │
- 32.57 s
gammaloop-nextest-python-api> │ Hobbyists can easily acquire a free license key │
- 32.57 s
gammaloop-nextest-python-api> │ that unlocks all cores and removes this banner: │
- 32.57 s
gammaloop-nextest-python-api> │ │
- 32.57 s
gammaloop-nextest-python-api> │ from symbolica import * │
- 32.57 s
gammaloop-nextest-python-api> │ request_hobbyist_license('YOUR_NAME', 'YOUR_EMAIL') │
- 32.57 s
gammaloop-nextest-python-api> │ │
- 32.57 s
gammaloop-nextest-python-api> │ All other users can obtain a free 30-day trial key: │
- 32.57 s
gammaloop-nextest-python-api> │ │
- 32.57 s
gammaloop-nextest-python-api> │ from symbolica import * │
- 32.57 s
gammaloop-nextest-python-api> │ request_trial_license('NAME', 'EMAIL', 'EMPLOYER') │
- 32.57 s
gammaloop-nextest-python-api> │ │
- 32.57 s
gammaloop-nextest-python-api> │ See https://symbolica.io/docs/get_started.html#license │
- 32.57 s
gammaloop-nextest-python-api> └────────────────────────────────────────────────────────┘
- 32.57 s
gammaloop-nextest-python-api> ┌───────────────────────────────────────────────────────────────────────────────────────────────────────────┐
- 32.57 s
gammaloop-nextest-python-api> │ Cannot start new unlicensed Symbolica instance since there is already another one running on the machine. │
- 32.57 s
gammaloop-nextest-python-api> └───────────────────────────────────────────────────────────────────────────────────────────────────────────┘
- 32.57 s
gammaloop-nextest-python-api>
- 32.57 s
gammaloop-nextest-python-api> stderr:
- 32.57 s
gammaloop-nextest-python-api>
- 32.57 s
gammaloop-nextest-python-api> ┌───────────────────────────────────────────────────────────┐
- 32.57 s
gammaloop-nextest-python-api> │ Could not resolve the IP of the Symbolica license server. │
- 32.57 s
gammaloop-nextest-python-api> │ │
- 32.57 s
gammaloop-nextest-python-api> │ Please check your DNS configuration. │
- 32.57 s
gammaloop-nextest-python-api> └───────────────────────────────────────────────────────────┘
- 32.57 s
gammaloop-nextest-python-api> Error: failed to lookup address information: Temporary failure in name resolution
- 32.57 s
gammaloop-nextest-python-api>
- 32.57 s
gammaloop-nextest-python-api>
- 32.57 s
gammaloop-nextest-python-api> Location:
- 32.57 s
gammaloop-nextest-python-api> tests/tests/test_python_api.rs:156:20
- 32.57 s
gammaloop-nextest-python-api>
- 32.58 s
gammaloop-nextest-python-api> error: test run failed
- 32.60 s
gammaloop-nextest-python-api>
- 32.60 s
gammaloop-nextest-python-api> ========== nextest test summary ==========
- 32.60 s
gammaloop-nextest-python-api> report: target/nextest/ci_gammaloop/junit.xml
- 32.60 s
gammaloop-nextest-python-api> tests: 5, failures: 4, errors: 0
- 32.60 s
gammaloop-nextest-python-api>
- 32.60 s
gammaloop-nextest-python-api> 1. gammaloop-integration-tests::test_python_api::python_evaluate_samples_batch_and_momentum_space_have_expected_shape
- 32.60 s
gammaloop-nextest-python-api> failure: test failure with exit code 101
- 32.60 s
gammaloop-nextest-python-api> Error: Python API test subprocess failed.
- 32.60 s
gammaloop-nextest-python-api> stdout:
- 32.60 s
gammaloop-nextest-python-api> ┌────────────────────────────────────────────────────────┐
- 32.60 s
gammaloop-nextest-python-api> │ You are running a restricted Symbolica instance. │
- 32.60 s
gammaloop-nextest-python-api> │ │
- 32.60 s
gammaloop-nextest-python-api> │ This mode is only permitted for non-commercial use and │
- 32.60 s
gammaloop-nextest-python-api> │ is limited to one instance and core per machine. │
- 32.60 s
gammaloop-nextest-python-api> │ │
- 32.60 s
gammaloop-nextest-python-api> │ Hobbyists can easily acquire a free license key │
- 32.60 s
gammaloop-nextest-python-api> │ that unlocks all cores and removes this banner: │
- 32.60 s
gammaloop-nextest-python-api> │ │
- 32.60 s
gammaloop-nextest-python-api> │ from symbolica import * │
- 32.60 s
gammaloop-nextest-python-api> │ request_hobbyist_license('YOUR_NAME', 'YOUR_EMAIL') │
- 32.60 s
gammaloop-nextest-python-api> │ │
- 32.60 s
gammaloop-nextest-python-api> │ All other users can obtain a free 30-day trial key: │
- 32.60 s
gammaloop-nextest-python-api> │ │
- 32.60 s
gammaloop-nextest-python-api> │ from symbolica import * │
- 32.60 s
gammaloop-nextest-python-api> │ request_trial_license('NAME', 'EMAIL', 'EMPLOYER') │
- 32.60 s
gammaloop-nextest-python-api> │ │
- 32.60 s
gammaloop-nextest-python-api> │ See https://symbolica.io/docs/get_started.html#license │
- 32.60 s
gammaloop-nextest-python-api> └────────────────────────────────────────────────────────┘
- 32.60 s
gammaloop-nextest-python-api> ┌───────────────────────────────────────────────────────────────────────────────────────────────────────────┐
- 32.60 s
gammaloop-nextest-python-api> │ Cannot start new unlicensed Symbolica instance since there is already another one running on the machine. │
- 32.60 s
gammaloop-nextest-python-api> └───────────────────────────────────────────────────────────────────────────────────────────────────────────┘
- 32.60 s
gammaloop-nextest-python-api>
- 32.60 s
gammaloop-nextest-python-api> stderr:
- 32.60 s
gammaloop-nextest-python-api>
- 32.60 s
gammaloop-nextest-python-api> ┌───────────────────────────────────────────────────────────┐
- 32.60 s
gammaloop-nextest-python-api> │ Could not resolve the IP of the Symbolica license server. │
- 32.60 s
gammaloop-nextest-python-api> │ │
- 32.60 s
gammaloop-nextest-python-api> │ Please check your DNS configuration. │
- 32.60 s
gammaloop-nextest-python-api> └───────────────────────────────────────────────────────────┘
- 32.60 s
gammaloop-nextest-python-api> Error: failed to lookup address information: Temporary failure in name resolution
- 32.60 s
gammaloop-nextest-python-api>
- 32.60 s
gammaloop-nextest-python-api>
- 32.60 s
gammaloop-nextest-python-api> Location:
- 32.60 s
gammaloop-nextest-python-api> tests/tests/test_python_api.rs:156:20
- 32.60 s
gammaloop-nextest-python-api> system-out
- 32.60 s
gammaloop-nextest-python-api> running 1 test
- 32.60 s
gammaloop-nextest-python-api> test python_evaluate_samples_batch_and_momentum_space_have_expected_shape ... FAILED
- 32.60 s
gammaloop-nextest-python-api>
- 32.60 s
gammaloop-nextest-python-api> failures:
- 32.60 s
gammaloop-nextest-python-api>
- 32.60 s
gammaloop-nextest-python-api> failures:
- 32.60 s
gammaloop-nextest-python-api> python_evaluate_samples_batch_and_momentum_space_have_expected_shape
- 32.60 s
gammaloop-nextest-python-api>
- 32.60 s
gammaloop-nextest-python-api> test result: FAILED. 0 passed; 1 failed; 0 ignored; 0 measured; 4 filtered out; finished in 0.10s
- 32.60 s
gammaloop-nextest-python-api> system-err
- 32.60 s
gammaloop-nextest-python-api> Error: Python API test subprocess failed.
- 32.60 s
gammaloop-nextest-python-api> stdout:
- 32.60 s
gammaloop-nextest-python-api> ┌────────────────────────────────────────────────────────┐
- 32.60 s
gammaloop-nextest-python-api> │ You are running a restricted Symbolica instance. │
- 32.60 s
gammaloop-nextest-python-api> │ │
- 32.60 s
gammaloop-nextest-python-api> │ This mode is only permitted for non-commercial use and │
- 32.60 s
gammaloop-nextest-python-api> │ is limited to one instance and core per machine. │
- 32.60 s
gammaloop-nextest-python-api> │ │
- 32.60 s
gammaloop-nextest-python-api> │ Hobbyists can easily acquire a free license key │
- 32.60 s
gammaloop-nextest-python-api> │ that unlocks all cores and removes this banner: │
- 32.60 s
gammaloop-nextest-python-api> │ │
- 32.60 s
gammaloop-nextest-python-api> │ from symbolica import * │
- 32.60 s
gammaloop-nextest-python-api> │ request_hobbyist_license('YOUR_NAME', 'YOUR_EMAIL') │
- 32.60 s
gammaloop-nextest-python-api> │ │
- 32.60 s
gammaloop-nextest-python-api> │ All other users can obtain a free 30-day trial key: │
- 32.60 s
gammaloop-nextest-python-api> │ │
- 32.60 s
gammaloop-nextest-python-api> │ from symbolica import * │
- 32.60 s
gammaloop-nextest-python-api> │ request_trial_license('NAME', 'EMAIL', 'EMPLOYER') │
- 32.60 s
gammaloop-nextest-python-api> │ │
- 32.60 s
gammaloop-nextest-python-api> │ See https://symbolica.io/docs/get_started.html#license │
- 32.60 s
gammaloop-nextest-python-api> └────────────────────────────────────────────────────────┘
- 32.60 s
gammaloop-nextest-python-api> ┌───────────────────────────────────────────────────────────────────────────────────────────────────────────┐
- 32.60 s
gammaloop-nextest-python-api> │ Cannot start new unlicensed Symbolica instance since there is already another one running on the machine. │
- 32.60 s
gammaloop-nextest-python-api> └───────────────────────────────────────────────────────────────────────────────────────────────────────────┘
- 32.60 s
gammaloop-nextest-python-api>
- 32.60 s
gammaloop-nextest-python-api> stderr:
- 32.60 s
gammaloop-nextest-python-api>
- 32.60 s
gammaloop-nextest-python-api> ┌───────────────────────────────────────────────────────────┐
- 32.60 s
gammaloop-nextest-python-api> │ Could not resolve the IP of the Symbolica license server. │
- 32.60 s
gammaloop-nextest-python-api> │ │
- 32.60 s
gammaloop-nextest-python-api> │ Please check your DNS configuration. │
- 32.60 s
gammaloop-nextest-python-api> └───────────────────────────────────────────────────────────┘
- 32.60 s
gammaloop-nextest-python-api> Error: failed to lookup address information: Temporary failure in name resolution
- 32.60 s
gammaloop-nextest-python-api>
- 32.60 s
gammaloop-nextest-python-api>
- 32.60 s
gammaloop-nextest-python-api> Location:
- 32.60 s
gammaloop-nextest-python-api> tests/tests/test_python_api.rs:156:20
- 32.60 s
gammaloop-nextest-python-api>
- 32.60 s
gammaloop-nextest-python-api> 2. gammaloop-integration-tests::test_python_api::python_evaluate_sample_preserves_graph_grouping_and_incoming_pdgs
- 32.60 s
gammaloop-nextest-python-api> failure: test failure with exit code 101
- 32.60 s
gammaloop-nextest-python-api> Error: Python API test subprocess failed.
- 32.60 s
gammaloop-nextest-python-api> stdout:
- 32.60 s
gammaloop-nextest-python-api> ┌────────────────────────────────────────────────────────┐
- 32.60 s
gammaloop-nextest-python-api> │ You are running a restricted Symbolica instance. │
- 32.60 s
gammaloop-nextest-python-api> │ │
- 32.60 s
gammaloop-nextest-python-api> │ This mode is only permitted for non-commercial use and │
- 32.60 s
gammaloop-nextest-python-api> │ is limited to one instance and core per machine. │
- 32.60 s
gammaloop-nextest-python-api> │ │
- 32.60 s
gammaloop-nextest-python-api> │ Hobbyists can easily acquire a free license key │
- 32.60 s
gammaloop-nextest-python-api> │ that unlocks all cores and removes this banner: │
- 32.60 s
gammaloop-nextest-python-api> │ │
- 32.60 s
gammaloop-nextest-python-api> │ from symbolica import * │
- 32.60 s
gammaloop-nextest-python-api> │ request_hobbyist_license('YOUR_NAME', 'YOUR_EMAIL') │
- 32.60 s
gammaloop-nextest-python-api> │ │
- 32.60 s
gammaloop-nextest-python-api> │ All other users can obtain a free 30-day trial key: │
- 32.60 s
gammaloop-nextest-python-api> │ │
- 32.60 s
gammaloop-nextest-python-api> │ from symbolica import * │
- 32.60 s
gammaloop-nextest-python-api> │ request_trial_license('NAME', 'EMAIL', 'EMPLOYER') │
- 32.60 s
gammaloop-nextest-python-api> │ │
- 32.60 s
gammaloop-nextest-python-api> │ See https://symbolica.io/docs/get_started.html#license │
- 32.60 s
gammaloop-nextest-python-api> └────────────────────────────────────────────────────────┘
- 32.60 s
gammaloop-nextest-python-api> ┌───────────────────────────────────────────────────────────────────────────────────────────────────────────┐
- 32.60 s
gammaloop-nextest-python-api> │ Cannot start new unlicensed Symbolica instance since there is already another one running on the machine. │
- 32.60 s
gammaloop-nextest-python-api> └───────────────────────────────────────────────────────────────────────────────────────────────────────────┘
- 32.60 s
gammaloop-nextest-python-api>
- 32.60 s
gammaloop-nextest-python-api> stderr:
- 32.60 s
gammaloop-nextest-python-api>
- 32.60 s
gammaloop-nextest-python-api> ┌───────────────────────────────────────────────────────────┐
- 32.60 s
gammaloop-nextest-python-api> │ Could not resolve the IP of the Symbolica license server. │
- 32.60 s
gammaloop-nextest-python-api> │ │
- 32.60 s
gammaloop-nextest-python-api> │ Please check your DNS configuration. │
- 32.60 s
gammaloop-nextest-python-api> └───────────────────────────────────────────────────────────┘
- 32.60 s
gammaloop-nextest-python-api> Error: failed to lookup address information: Temporary failure in name resolution
- 32.60 s
gammaloop-nextest-python-api>
- 32.60 s
gammaloop-nextest-python-api>
- 32.60 s
gammaloop-nextest-python-api> Location:
- 32.60 s
gammaloop-nextest-python-api> tests/tests/test_python_api.rs:156:20
- 32.60 s
gammaloop-nextest-python-api> system-out
- 32.60 s
gammaloop-nextest-python-api> running 1 test
- 32.60 s
gammaloop-nextest-python-api> test python_evaluate_sample_preserves_graph_grouping_and_incoming_pdgs ... FAILED
- 32.60 s
gammaloop-nextest-python-api>
- 32.60 s
gammaloop-nextest-python-api> failures:
- 32.60 s
gammaloop-nextest-python-api>
- 32.60 s
gammaloop-nextest-python-api> failures:
- 32.60 s
gammaloop-nextest-python-api> python_evaluate_sample_preserves_graph_grouping_and_incoming_pdgs
- 32.60 s
gammaloop-nextest-python-api>
- 32.60 s
gammaloop-nextest-python-api> test result: FAILED. 0 passed; 1 failed; 0 ignored; 0 measured; 4 filtered out; finished in 0.11s
- 32.60 s
gammaloop-nextest-python-api> system-err
- 32.60 s
gammaloop-nextest-python-api> Error: Python API test subprocess failed.
- 32.60 s
gammaloop-nextest-python-api> stdout:
- 32.60 s
gammaloop-nextest-python-api> ┌────────────────────────────────────────────────────────┐
- 32.60 s
gammaloop-nextest-python-api> │ You are running a restricted Symbolica instance. │
- 32.60 s
gammaloop-nextest-python-api> │ │
- 32.60 s
gammaloop-nextest-python-api> │ This mode is only permitted for non-commercial use and │
- 32.60 s
gammaloop-nextest-python-api> │ is limited to one instance and core per machine. │
- 32.60 s
gammaloop-nextest-python-api> │ │
- 32.60 s
gammaloop-nextest-python-api> │ Hobbyists can easily acquire a free license key │
- 32.60 s
gammaloop-nextest-python-api> │ that unlocks all cores and removes this banner: │
- 32.60 s
gammaloop-nextest-python-api> │ │
- 32.60 s
gammaloop-nextest-python-api> │ from symbolica import * │
- 32.60 s
gammaloop-nextest-python-api> │ request_hobbyist_license('YOUR_NAME', 'YOUR_EMAIL') │
- 32.60 s
gammaloop-nextest-python-api> │ │
- 32.60 s
gammaloop-nextest-python-api> │ All other users can obtain a free 30-day trial key: │
- 32.60 s
gammaloop-nextest-python-api> │ │
- 32.60 s
gammaloop-nextest-python-api> │ from symbolica import * │
- 32.60 s
gammaloop-nextest-python-api> │ request_trial_license('NAME', 'EMAIL', 'EMPLOYER') │
- 32.60 s
gammaloop-nextest-python-api> │ │
- 32.60 s
gammaloop-nextest-python-api> │ See https://symbolica.io/docs/get_started.html#license │
- 32.60 s
gammaloop-nextest-python-api> └────────────────────────────────────────────────────────┘
- 32.60 s
gammaloop-nextest-python-api> ┌───────────────────────────────────────────────────────────────────────────────────────────────────────────┐
- 32.60 s
gammaloop-nextest-python-api> │ Cannot start new unlicensed Symbolica instance since there is already another one running on the machine. │
- 32.60 s
gammaloop-nextest-python-api> └───────────────────────────────────────────────────────────────────────────────────────────────────────────┘
- 32.60 s
gammaloop-nextest-python-api>
- 32.60 s
gammaloop-nextest-python-api> stderr:
- 32.60 s
gammaloop-nextest-python-api>
- 32.60 s
gammaloop-nextest-python-api> ┌───────────────────────────────────────────────────────────┐
- 32.60 s
gammaloop-nextest-python-api> │ Could not resolve the IP of the Symbolica license server. │
- 32.60 s
gammaloop-nextest-python-api> │ │
- 32.60 s
gammaloop-nextest-python-api> │ Please check your DNS configuration. │
- 32.60 s
gammaloop-nextest-python-api> └───────────────────────────────────────────────────────────┘
- 32.60 s
gammaloop-nextest-python-api> Error: failed to lookup address information: Temporary failure in name resolution
- 32.60 s
gammaloop-nextest-python-api>
- 32.60 s
gammaloop-nextest-python-api>
- 32.60 s
gammaloop-nextest-python-api> Location:
- 32.60 s
gammaloop-nextest-python-api> tests/tests/test_python_api.rs:156:20
- 32.60 s
gammaloop-nextest-python-api>
- 32.60 s
gammaloop-nextest-python-api> 3. gammaloop-integration-tests::test_python_api::python_session_getters_return_live_toml_and_command_blocks
- 32.60 s
gammaloop-nextest-python-api> failure: test failure with exit code 101
- 32.60 s
gammaloop-nextest-python-api> Error: Python API test subprocess failed.
- 32.60 s
gammaloop-nextest-python-api> stdout:
- 32.60 s
gammaloop-nextest-python-api> ┌────────────────────────────────────────────────────────┐
- 32.60 s
gammaloop-nextest-python-api> │ You are running a restricted Symbolica instance. │
- 32.60 s
gammaloop-nextest-python-api> │ │
- 32.60 s
gammaloop-nextest-python-api> │ This mode is only permitted for non-commercial use and │
- 32.60 s
gammaloop-nextest-python-api> │ is limited to one instance and core per machine. │
- 32.60 s
gammaloop-nextest-python-api> │ │
- 32.60 s
gammaloop-nextest-python-api> │ Hobbyists can easily acquire a free license key │
- 32.60 s
gammaloop-nextest-python-api> │ that unlocks all cores and removes this banner: │
- 32.60 s
gammaloop-nextest-python-api> │ │
- 32.60 s
gammaloop-nextest-python-api> │ from symbolica import * │
- 32.60 s
gammaloop-nextest-python-api> │ request_hobbyist_license('YOUR_NAME', 'YOUR_EMAIL') │
- 32.60 s
gammaloop-nextest-python-api> │ │
- 32.60 s
gammaloop-nextest-python-api> │ All other users can obtain a free 30-day trial key: │
- 32.60 s
gammaloop-nextest-python-api> │ │
- 32.60 s
gammaloop-nextest-python-api> │ from symbolica import * │
- 32.60 s
gammaloop-nextest-python-api> │ request_trial_license('NAME', 'EMAIL', 'EMPLOYER') │
- 32.60 s
gammaloop-nextest-python-api> │ │
- 32.60 s
gammaloop-nextest-python-api> │ See https://symbolica.io/docs/get_started.html#license │
- 32.60 s
gammaloop-nextest-python-api> └────────────────────────────────────────────────────────┘
- 32.60 s
gammaloop-nextest-python-api> ┌───────────────────────────────────────────────────────────────────────────────────────────────────────────┐
- 32.60 s
gammaloop-nextest-python-api> │ Cannot start new unlicensed Symbolica instance since there is already another one running on the machine. │
- 32.60 s
gammaloop-nextest-python-api> └───────────────────────────────────────────────────────────────────────────────────────────────────────────┘
- 32.60 s
gammaloop-nextest-python-api>
- 32.60 s
gammaloop-nextest-python-api> stderr:
- 32.60 s
gammaloop-nextest-python-api>
- 32.60 s
gammaloop-nextest-python-api> ┌───────────────────────────────────────────────────────────┐
- 32.60 s
gammaloop-nextest-python-api> │ Could not resolve the IP of the Symbolica license server. │
- 32.60 s
gammaloop-nextest-python-api> │ │
- 32.60 s
gammaloop-nextest-python-api> │ Please check your DNS configuration. │
- 32.60 s
gammaloop-nextest-python-api> └───────────────────────────────────────────────────────────┘
- 32.60 s
gammaloop-nextest-python-api> Error: failed to lookup address information: Temporary failure in name resolution
- 32.60 s
gammaloop-nextest-python-api>
- 32.60 s
gammaloop-nextest-python-api>
- 32.60 s
gammaloop-nextest-python-api> Location:
- 32.60 s
gammaloop-nextest-python-api> tests/tests/test_python_api.rs:156:20
- 32.60 s
gammaloop-nextest-python-api> system-out
- 32.60 s
gammaloop-nextest-python-api> running 1 test
- 32.60 s
gammaloop-nextest-python-api> test python_session_getters_return_live_toml_and_command_blocks ... FAILED
- 32.60 s
gammaloop-nextest-python-api>
- 32.60 s
gammaloop-nextest-python-api> failures:
- 32.60 s
gammaloop-nextest-python-api>
- 32.60 s
gammaloop-nextest-python-api> failures:
- 32.61 s
gammaloop-nextest-python-api> python_session_getters_return_live_toml_and_command_blocks
- 32.61 s
gammaloop-nextest-python-api>
- 32.61 s
gammaloop-nextest-python-api> test result: FAILED. 0 passed; 1 failed; 0 ignored; 0 measured; 4 filtered out; finished in 0.11s
- 32.61 s
gammaloop-nextest-python-api> system-err
- 32.61 s
gammaloop-nextest-python-api> Error: Python API test subprocess failed.
- 32.61 s
gammaloop-nextest-python-api> stdout:
- 32.61 s
gammaloop-nextest-python-api> ┌────────────────────────────────────────────────────────┐
- 32.61 s
gammaloop-nextest-python-api> │ You are running a restricted Symbolica instance. │
- 32.61 s
gammaloop-nextest-python-api> │ │
- 32.61 s
gammaloop-nextest-python-api> │ This mode is only permitted for non-commercial use and │
- 32.61 s
gammaloop-nextest-python-api> │ is limited to one instance and core per machine. │
- 32.61 s
gammaloop-nextest-python-api> │ │
- 32.61 s
gammaloop-nextest-python-api> │ Hobbyists can easily acquire a free license key │
- 32.61 s
gammaloop-nextest-python-api> │ that unlocks all cores and removes this banner: │
- 32.61 s
gammaloop-nextest-python-api> │ │
- 32.61 s
gammaloop-nextest-python-api> │ from symbolica import * │
- 32.61 s
gammaloop-nextest-python-api> │ request_hobbyist_license('YOUR_NAME', 'YOUR_EMAIL') │
- 32.61 s
gammaloop-nextest-python-api> │ │
- 32.61 s
gammaloop-nextest-python-api> │ All other users can obtain a free 30-day trial key: │
- 32.61 s
gammaloop-nextest-python-api> │ │
- 32.61 s
gammaloop-nextest-python-api> │ from symbolica import * │
- 32.61 s
gammaloop-nextest-python-api> │ request_trial_license('NAME', 'EMAIL', 'EMPLOYER') │
- 32.61 s
gammaloop-nextest-python-api> │ │
- 32.61 s
gammaloop-nextest-python-api> │ See https://symbolica.io/docs/get_started.html#license │
- 32.61 s
gammaloop-nextest-python-api> └────────────────────────────────────────────────────────┘
- 32.61 s
gammaloop-nextest-python-api> ┌───────────────────────────────────────────────────────────────────────────────────────────────────────────┐
- 32.61 s
gammaloop-nextest-python-api> │ Cannot start new unlicensed Symbolica instance since there is already another one running on the machine. │
- 32.61 s
gammaloop-nextest-python-api> └───────────────────────────────────────────────────────────────────────────────────────────────────────────┘
- 32.61 s
gammaloop-nextest-python-api>
- 32.61 s
gammaloop-nextest-python-api> stderr:
- 32.61 s
gammaloop-nextest-python-api>
- 32.61 s
gammaloop-nextest-python-api> ┌───────────────────────────────────────────────────────────┐
- 32.61 s
gammaloop-nextest-python-api> │ Could not resolve the IP of the Symbolica license server. │
- 32.61 s
gammaloop-nextest-python-api> │ │
- 32.61 s
gammaloop-nextest-python-api> │ Please check your DNS configuration. │
- 32.61 s
gammaloop-nextest-python-api> └───────────────────────────────────────────────────────────┘
- 32.61 s
gammaloop-nextest-python-api> Error: failed to lookup address information: Temporary failure in name resolution
- 32.61 s
gammaloop-nextest-python-api>
- 32.61 s
gammaloop-nextest-python-api>
- 32.61 s
gammaloop-nextest-python-api> Location:
- 32.61 s
gammaloop-nextest-python-api> tests/tests/test_python_api.rs:156:20
- 32.61 s
gammaloop-nextest-python-api>
- 32.61 s
gammaloop-nextest-python-api> 4. gammaloop-integration-tests::test_python_api::python_evaluate_sample_honors_generate_events_and_observable_snapshots
- 32.61 s
gammaloop-nextest-python-api> failure: test failure with exit code 101
- 32.61 s
gammaloop-nextest-python-api> Error: Python API test subprocess failed.
- 32.61 s
gammaloop-nextest-python-api> stdout:
- 32.61 s
gammaloop-nextest-python-api> ┌────────────────────────────────────────────────────────┐
- 32.61 s
gammaloop-nextest-python-api> │ You are running a restricted Symbolica instance. │
- 32.61 s
gammaloop-nextest-python-api> │ │
- 32.61 s
gammaloop-nextest-python-api> │ This mode is only permitted for non-commercial use and │
- 32.61 s
gammaloop-nextest-python-api> │ is limited to one instance and core per machine. │
- 32.61 s
gammaloop-nextest-python-api> │ │
- 32.61 s
gammaloop-nextest-python-api> │ Hobbyists can easily acquire a free license key │
- 32.61 s
gammaloop-nextest-python-api> │ that unlocks all cores and removes this banner: │
- 32.61 s
gammaloop-nextest-python-api> │ │
- 32.61 s
gammaloop-nextest-python-api> │ from symbolica import * │
- 32.61 s
gammaloop-nextest-python-api> │ request_hobbyist_license('YOUR_NAME', 'YOUR_EMAIL') │
- 32.61 s
gammaloop-nextest-python-api> │ │
- 32.61 s
gammaloop-nextest-python-api> │ All other users can obtain a free 30-day trial key: │
- 32.61 s
gammaloop-nextest-python-api> │ │
- 32.61 s
gammaloop-nextest-python-api> │ from symbolica import * │
- 32.61 s
gammaloop-nextest-python-api> │ request_trial_license('NAME', 'EMAIL', 'EMPLOYER') │
- 32.61 s
gammaloop-nextest-python-api> │ │
- 32.61 s
gammaloop-nextest-python-api> │ See https://symbolica.io/docs/get_started.html#license │
- 32.61 s
gammaloop-nextest-python-api> └────────────────────────────────────────────────────────┘
- 32.61 s
gammaloop-nextest-python-api> ┌───────────────────────────────────────────────────────────────────────────────────────────────────────────┐
- 32.61 s
gammaloop-nextest-python-api> │ Cannot start new unlicensed Symbolica instance since there is already another one running on the machine. │
- 32.61 s
gammaloop-nextest-python-api> └───────────────────────────────────────────────────────────────────────────────────────────────────────────┘
- 32.61 s
gammaloop-nextest-python-api>
- 32.61 s
gammaloop-nextest-python-api> stderr:
- 32.61 s
gammaloop-nextest-python-api>
- 32.61 s
gammaloop-nextest-python-api> ┌───────────────────────────────────────────────────────────┐
- 32.61 s
gammaloop-nextest-python-api> │ Could not resolve the IP of the Symbolica license server. │
- 32.61 s
gammaloop-nextest-python-api> │ │
- 32.61 s
gammaloop-nextest-python-api> │ Please check your DNS configuration. │
- 32.61 s
gammaloop-nextest-python-api> └───────────────────────────────────────────────────────────┘
- 32.61 s
gammaloop-nextest-python-api> Error: failed to lookup address information: Temporary failure in name resolution
- 32.61 s
gammaloop-nextest-python-api>
- 32.61 s
gammaloop-nextest-python-api>
- 32.61 s
gammaloop-nextest-python-api> Location:
- 32.61 s
gammaloop-nextest-python-api> tests/tests/test_python_api.rs:156:20
- 32.61 s
gammaloop-nextest-python-api> system-out
- 32.61 s
gammaloop-nextest-python-api> running 1 test
- 32.61 s
gammaloop-nextest-python-api> test python_evaluate_sample_honors_generate_events_and_observable_snapshots ... FAILED
- 32.61 s
gammaloop-nextest-python-api>
- 32.61 s
gammaloop-nextest-python-api> failures:
- 32.61 s
gammaloop-nextest-python-api>
- 32.61 s
gammaloop-nextest-python-api> failures:
- 32.61 s
gammaloop-nextest-python-api> python_evaluate_sample_honors_generate_events_and_observable_snapshots
- 32.61 s
gammaloop-nextest-python-api>
- 32.61 s
gammaloop-nextest-python-api> test result: FAILED. 0 passed; 1 failed; 0 ignored; 0 measured; 4 filtered out; finished in 0.11s
- 32.61 s
gammaloop-nextest-python-api> system-err
- 32.61 s
gammaloop-nextest-python-api> Error: Python API test subprocess failed.
- 32.61 s
gammaloop-nextest-python-api> stdout:
- 32.61 s
gammaloop-nextest-python-api> ┌────────────────────────────────────────────────────────┐
- 32.61 s
gammaloop-nextest-python-api> │ You are running a restricted Symbolica instance. │
- 32.61 s
gammaloop-nextest-python-api> │ │
- 32.61 s
gammaloop-nextest-python-api> │ This mode is only permitted for non-commercial use and │
- 32.61 s
gammaloop-nextest-python-api> │ is limited to one instance and core per machine. │
- 32.61 s
gammaloop-nextest-python-api> │ │
- 32.61 s
gammaloop-nextest-python-api> │ Hobbyists can easily acquire a free license key │
- 32.61 s
gammaloop-nextest-python-api> │ that unlocks all cores and removes this banner: │
- 32.61 s
gammaloop-nextest-python-api> │ │
- 32.61 s
gammaloop-nextest-python-api> │ from symbolica import * │
- 32.61 s
gammaloop-nextest-python-api> │ request_hobbyist_license('YOUR_NAME', 'YOUR_EMAIL') │
- 32.61 s
gammaloop-nextest-python-api> │ │
- 32.61 s
gammaloop-nextest-python-api> │ All other users can obtain a free 30-day trial key: │
- 32.61 s
gammaloop-nextest-python-api> │ │
- 32.61 s
gammaloop-nextest-python-api> │ from symbolica import * │
- 32.61 s
gammaloop-nextest-python-api> │ request_trial_license('NAME', 'EMAIL', 'EMPLOYER') │
- 32.61 s
gammaloop-nextest-python-api> │ │
- 32.61 s
gammaloop-nextest-python-api> │ See https://symbolica.io/docs/get_started.html#license │
- 32.61 s
gammaloop-nextest-python-api> └────────────────────────────────────────────────────────┘
- 32.61 s
gammaloop-nextest-python-api> ┌───────────────────────────────────────────────────────────────────────────────────────────────────────────┐
- 32.61 s
gammaloop-nextest-python-api> │ Cannot start new unlicensed Symbolica instance since there is already another one running on the machine. │
- 32.61 s
gammaloop-nextest-python-api> └───────────────────────────────────────────────────────────────────────────────────────────────────────────┘
- 32.61 s
gammaloop-nextest-python-api>
- 32.61 s
gammaloop-nextest-python-api> stderr:
- 32.61 s
gammaloop-nextest-python-api>
- 32.61 s
gammaloop-nextest-python-api> ┌───────────────────────────────────────────────────────────┐
- 32.61 s
gammaloop-nextest-python-api> │ Could not resolve the IP of the Symbolica license server. │
- 32.61 s
gammaloop-nextest-python-api> │ │
- 32.61 s
gammaloop-nextest-python-api> │ Please check your DNS configuration. │
- 32.61 s
gammaloop-nextest-python-api> └───────────────────────────────────────────────────────────┘
- 32.61 s
gammaloop-nextest-python-api> Error: failed to lookup address information: Temporary failure in name resolution
- 32.61 s
gammaloop-nextest-python-api>
- 32.61 s
gammaloop-nextest-python-api>
- 32.61 s
gammaloop-nextest-python-api> Location:
- 32.61 s
gammaloop-nextest-python-api> tests/tests/test_python_api.rs:156:20
- 32.61 s
gammaloop-nextest-python-api> =========================================
- 32.64 s
error: Cannot build '/nix/store/6yfkarcx1yqfdkgaj26q9b9n3q0min5r-gammaloop-nextest-python-api.drv'.
- 32.64 s
Reason: builder failed with exit code 100.
- 32.64 s
Output paths:
- 32.64 s
/nix/store/28q91q76k9l62yayywlk70ghfzfk0v47-gammaloop-nextest-python-api
- 32.64 s
Last 781 log lines:
- 32.64 s
> Extracting 1 binary, 1 build script output directory, and 3 linked paths to /build/nextest-archive-PfBDF1
- 32.64 s
> Extracted 18 files to /build/nextest-archive-PfBDF1 in 0.06s
- 32.64 s
> ------------
- 32.64 s
> Nextest run ID 835a273b-adc2-41be-a789-8cb05bb8b832 with nextest profile: ci_gammaloop
- 32.64 s
> Starting 5 tests across 1 binary
- 32.64 s
> FAIL [ 0.110s] (1/5) gammaloop-integration-tests::test_python_api python_evaluate_samples_batch_and_momentum_space_have_expected_shape
- 32.64 s
> stdout ---
- 32.64 s
>
- 32.64 s
> running 1 test
- 32.64 s
> test python_evaluate_samples_batch_and_momentum_space_have_expected_shape ... FAILED
- 32.64 s
>
- 32.64 s
> failures:
- 32.64 s
>
- 32.64 s
> failures:
- 32.64 s
> python_evaluate_samples_batch_and_momentum_space_have_expected_shape
- 32.64 s
>
- 32.64 s
> test result: FAILED. 0 passed; 1 failed; 0 ignored; 0 measured; 4 filtered out; finished in 0.10s
- 32.64 s
>
- 32.64 s
> stderr ---
- 32.64 s
> Error: Python API test subprocess failed.
- 32.64 s
> stdout:
- 32.64 s
> ┌────────────────────────────────────────────────────────┐
- 32.64 s
> │ You are running a restricted Symbolica instance. │
- 32.64 s
> │ │
- 32.64 s
> │ This mode is only permitted for non-commercial use and │
- 32.64 s
> │ is limited to one instance and core per machine. │
- 32.64 s
> │ │
- 32.64 s
> │ Hobbyists can easily acquire a free license key │
- 32.64 s
> │ that unlocks all cores and removes this banner: │
- 32.64 s
> │ │
- 32.64 s
> │ from symbolica import * │
- 32.64 s
> │ request_hobbyist_license('YOUR_NAME', 'YOUR_EMAIL') │
- 32.64 s
> │ │
- 32.64 s
> │ All other users can obtain a free 30-day trial key: │
- 32.64 s
> │ │
- 32.64 s
> │ from symbolica import * │
- 32.64 s
> │ request_trial_license('NAME', 'EMAIL', 'EMPLOYER') │
- 32.64 s
> │ │
- 32.64 s
> │ See https://symbolica.io/docs/get_started.html#license │
- 32.64 s
> └────────────────────────────────────────────────────────┘
- 32.64 s
> ┌───────────────────────────────────────────────────────────────────────────────────────────────────────────┐
- 32.64 s
> │ Cannot start new unlicensed Symbolica instance since there is already another one running on the machine. │
- 32.64 s
> └───────────────────────────────────────────────────────────────────────────────────────────────────────────┘
- 32.64 s
>
- 32.64 s
> stderr:
- 32.64 s
>
- 32.64 s
> ┌───────────────────────────────────────────────────────────┐
- 32.64 s
> │ Could not resolve the IP of the Symbolica license server. │
- 32.64 s
> │ │
- 32.64 s
> │ Please check your DNS configuration. │
- 32.64 s
> └───────────────────────────────────────────────────────────┘
- 32.64 s
> Error: failed to lookup address information: Temporary failure in name resolution
- 32.64 s
>
- 32.64 s
>
- 32.64 s
> Location:
- 32.64 s
> tests/tests/test_python_api.rs:156:20
- 32.64 s
>
- 32.64 s
> FAIL [ 0.110s] (2/5) gammaloop-integration-tests::test_python_api python_evaluate_sample_preserves_graph_grouping_and_incoming_pdgs
- 32.64 s
> stdout ---
- 32.64 s
>
- 32.64 s
> running 1 test
- 32.64 s
> test python_evaluate_sample_preserves_graph_grouping_and_incoming_pdgs ... FAILED
- 32.64 s
>
- 32.64 s
> failures:
- 32.64 s
>
- 32.64 s
> failures:
- 32.64 s
> python_evaluate_sample_preserves_graph_grouping_and_incoming_pdgs
- 32.64 s
>
- 32.64 s
> test result: FAILED. 0 passed; 1 failed; 0 ignored; 0 measured; 4 filtered out; finished in 0.11s
- 32.64 s
>
- 32.64 s
> stderr ---
- 32.64 s
> Error: Python API test subprocess failed.
- 32.64 s
> stdout:
- 32.64 s
> ┌────────────────────────────────────────────────────────┐
- 32.64 s
> │ You are running a restricted Symbolica instance. │
- 32.64 s
> │ │
- 32.64 s
> │ This mode is only permitted for non-commercial use and │
- 32.64 s
> │ is limited to one instance and core per machine. │
- 32.64 s
> │ │
- 32.64 s
> │ Hobbyists can easily acquire a free license key │
- 32.64 s
> │ that unlocks all cores and removes this banner: │
- 32.64 s
> │ │
- 32.64 s
> │ from symbolica import * │
- 32.64 s
> │ request_hobbyist_license('YOUR_NAME', 'YOUR_EMAIL') │
- 32.64 s
> │ │
- 32.64 s
> │ All other users can obtain a free 30-day trial key: │
- 32.64 s
> │ │
- 32.64 s
> │ from symbolica import * │
- 32.64 s
> │ request_trial_license('NAME', 'EMAIL', 'EMPLOYER') │
- 32.64 s
> │ │
- 32.64 s
> │ See https://symbolica.io/docs/get_started.html#license │
- 32.64 s
> └────────────────────────────────────────────────────────┘
- 32.64 s
> ┌───────────────────────────────────────────────────────────────────────────────────────────────────────────┐
- 32.64 s
> │ Cannot start new unlicensed Symbolica instance since there is already another one running on the machine. │
- 32.64 s
> └───────────────────────────────────────────────────────────────────────────────────────────────────────────┘
- 32.64 s
>
- 32.64 s
> stderr:
- 32.64 s
>
- 32.64 s
> ┌───────────────────────────────────────────────────────────┐
- 32.64 s
> │ Could not resolve the IP of the Symbolica license server. │
- 32.64 s
> │ │
- 32.64 s
> │ Please check your DNS configuration. │
- 32.64 s
> └───────────────────────────────────────────────────────────┘
- 32.64 s
> Error: failed to lookup address information: Temporary failure in name resolution
- 32.64 s
>
- 32.64 s
>
- 32.64 s
> Location:
- 32.64 s
> tests/tests/test_python_api.rs:156:20
- 32.64 s
>
- 32.64 s
> FAIL [ 0.116s] (3/5) gammaloop-integration-tests::test_python_api python_session_getters_return_live_toml_and_command_blocks
- 32.64 s
> stdout ---
- 32.64 s
>
- 32.64 s
> running 1 test
- 32.64 s
> test python_session_getters_return_live_toml_and_command_blocks ... FAILED
- 32.64 s
>
- 32.64 s
> failures:
- 32.64 s
>
- 32.64 s
> failures:
- 32.64 s
> python_session_getters_return_live_toml_and_command_blocks
- 32.64 s
>
- 32.64 s
> test result: FAILED. 0 passed; 1 failed; 0 ignored; 0 measured; 4 filtered out; finished in 0.11s
- 32.64 s
>
- 32.64 s
> stderr ---
- 32.64 s
> Error: Python API test subprocess failed.
- 32.64 s
> stdout:
- 32.64 s
> ┌────────────────────────────────────────────────────────┐
- 32.64 s
> │ You are running a restricted Symbolica instance. │
- 32.64 s
> │ │
- 32.64 s
> │ This mode is only permitted for non-commercial use and │
- 32.64 s
> │ is limited to one instance and core per machine. │
- 32.64 s
> │ │
- 32.64 s
> │ Hobbyists can easily acquire a free license key │
- 32.64 s
> │ that unlocks all cores and removes this banner: │
- 32.64 s
> │ │
- 32.64 s
> │ from symbolica import * │
- 32.64 s
> │ request_hobbyist_license('YOUR_NAME', 'YOUR_EMAIL') │
- 32.64 s
> │ │
- 32.64 s
> │ All other users can obtain a free 30-day trial key: │
- 32.64 s
> │ │
- 32.64 s
> │ from symbolica import * │
- 32.64 s
> │ request_trial_license('NAME', 'EMAIL', 'EMPLOYER') │
- 32.64 s
> │ │
- 32.64 s
> │ See https://symbolica.io/docs/get_started.html#license │
- 32.64 s
> └────────────────────────────────────────────────────────┘
- 32.64 s
> ┌───────────────────────────────────────────────────────────────────────────────────────────────────────────┐
- 32.64 s
> │ Cannot start new unlicensed Symbolica instance since there is already another one running on the machine. │
- 32.64 s
> └───────────────────────────────────────────────────────────────────────────────────────────────────────────┘
- 32.64 s
>
- 32.64 s
> stderr:
- 32.64 s
>
- 32.64 s
> ┌───────────────────────────────────────────────────────────┐
- 32.64 s
> │ Could not resolve the IP of the Symbolica license server. │
- 32.64 s
> │ │
- 32.64 s
> │ Please check your DNS configuration. │
- 32.64 s
> └───────────────────────────────────────────────────────────┘
- 32.64 s
> Error: failed to lookup address information: Temporary failure in name resolution
- 32.64 s
>
- 32.64 s
>
- 32.64 s
> Location:
- 32.64 s
> tests/tests/test_python_api.rs:156:20
- 32.64 s
>
- 32.64 s
> FAIL [ 0.117s] (4/5) gammaloop-integration-tests::test_python_api python_evaluate_sample_honors_generate_events_and_observable_snapshots
- 32.64 s
> stdout ---
- 32.64 s
>
- 32.64 s
> running 1 test
- 32.64 s
> test python_evaluate_sample_honors_generate_events_and_observable_snapshots ... FAILED
- 32.64 s
>
- 32.64 s
> failures:
- 32.64 s
>
- 32.64 s
> failures:
- 32.64 s
> python_evaluate_sample_honors_generate_events_and_observable_snapshots
- 32.64 s
>
- 32.64 s
> test result: FAILED. 0 passed; 1 failed; 0 ignored; 0 measured; 4 filtered out; finished in 0.11s
- 32.64 s
>
- 32.64 s
> stderr ---
- 32.64 s
> Error: Python API test subprocess failed.
- 32.64 s
> stdout:
- 32.64 s
> ┌────────────────────────────────────────────────────────┐
- 32.64 s
> │ You are running a restricted Symbolica instance. │
- 32.64 s
> │ │
- 32.64 s
> │ This mode is only permitted for non-commercial use and │
- 32.64 s
> │ is limited to one instance and core per machine. │
- 32.64 s
> │ │
- 32.64 s
> │ Hobbyists can easily acquire a free license key │
- 32.64 s
> │ that unlocks all cores and removes this banner: │
- 32.64 s
> │ │
- 32.64 s
> │ from symbolica import * │
- 32.64 s
> │ request_hobbyist_license('YOUR_NAME', 'YOUR_EMAIL') │
- 32.64 s
> │ │
- 32.64 s
> │ All other users can obtain a free 30-day trial key: │
- 32.64 s
> │ │
- 32.64 s
> │ from symbolica import * │
- 32.64 s
> │ request_trial_license('NAME', 'EMAIL', 'EMPLOYER') │
- 32.64 s
> │ │
- 32.64 s
> │ See https://symbolica.io/docs/get_started.html#license │
- 32.64 s
> └────────────────────────────────────────────────────────┘
- 32.64 s
> ┌───────────────────────────────────────────────────────────────────────────────────────────────────────────┐
- 32.64 s
> │ Cannot start new unlicensed Symbolica instance since there is already another one running on the machine. │
- 32.64 s
> └───────────────────────────────────────────────────────────────────────────────────────────────────────────┘
- 32.64 s
>
- 32.64 s
> stderr:
- 32.64 s
>
- 32.64 s
> ┌───────────────────────────────────────────────────────────┐
- 32.64 s
> │ Could not resolve the IP of the Symbolica license server. │
- 32.64 s
> │ │
- 32.64 s
> │ Please check your DNS configuration. │
- 32.64 s
> └───────────────────────────────────────────────────────────┘
- 32.64 s
> Error: failed to lookup address information: Temporary failure in name resolution
- 32.64 s
>
- 32.64 s
>
- 32.64 s
> Location:
- 32.64 s
> tests/tests/test_python_api.rs:156:20
- 32.64 s
>
- 32.64 s
> ------------
- 32.64 s
> Summary [ 0.277s] 5 tests run: 1 passed, 4 failed, 0 skipped
- 32.64 s
> FAIL [ 0.110s] (1/5) gammaloop-integration-tests::test_python_api python_evaluate_samples_batch_and_momentum_space_have_expected_shape
- 32.64 s
> stdout ---
- 32.64 s
>
- 32.64 s
> running 1 test
- 32.64 s
> test python_evaluate_samples_batch_and_momentum_space_have_expected_shape ... FAILED
- 32.64 s
>
- 32.64 s
> failures:
- 32.64 s
>
- 32.64 s
> failures:
- 32.64 s
> python_evaluate_samples_batch_and_momentum_space_have_expected_shape
- 32.64 s
>
- 32.64 s
> test result: FAILED. 0 passed; 1 failed; 0 ignored; 0 measured; 4 filtered out; finished in 0.10s
- 32.64 s
>
- 32.64 s
> stderr ---
- 32.64 s
> Error: Python API test subprocess failed.
- 32.64 s
> stdout:
- 32.64 s
> ┌────────────────────────────────────────────────────────┐
- 32.64 s
> │ You are running a restricted Symbolica instance. │
- 32.64 s
> │ │
- 32.64 s
> │ This mode is only permitted for non-commercial use and │
- 32.64 s
> │ is limited to one instance and core per machine. │
- 32.64 s
> │ │
- 32.64 s
> │ Hobbyists can easily acquire a free license key │
- 32.64 s
> │ that unlocks all cores and removes this banner: │
- 32.64 s
> │ │
- 32.64 s
> │ from symbolica import * │
- 32.64 s
> │ request_hobbyist_license('YOUR_NAME', 'YOUR_EMAIL') │
- 32.64 s
> │ │
- 32.64 s
> │ All other users can obtain a free 30-day trial key: │
- 32.64 s
> │ │
- 32.64 s
> │ from symbolica import * │
- 32.64 s
> │ request_trial_license('NAME', 'EMAIL', 'EMPLOYER') │
- 32.64 s
> │ │
- 32.64 s
> │ See https://symbolica.io/docs/get_started.html#license │
- 32.64 s
> └────────────────────────────────────────────────────────┘
- 32.64 s
> ┌───────────────────────────────────────────────────────────────────────────────────────────────────────────┐
- 32.64 s
> │ Cannot start new unlicensed Symbolica instance since there is already another one running on the machine. │
- 32.64 s
> └───────────────────────────────────────────────────────────────────────────────────────────────────────────┘
- 32.64 s
>
- 32.64 s
> stderr:
- 32.64 s
>
- 32.64 s
> ┌───────────────────────────────────────────────────────────┐
- 32.64 s
> │ Could not resolve the IP of the Symbolica license server. │
- 32.64 s
> │ │
- 32.64 s
> │ Please check your DNS configuration. │
- 32.64 s
> └───────────────────────────────────────────────────────────┘
- 32.64 s
> Error: failed to lookup address information: Temporary failure in name resolution
- 32.64 s
>
- 32.64 s
>
- 32.64 s
> Location:
- 32.64 s
> tests/tests/test_python_api.rs:156:20
- 32.64 s
>
- 32.64 s
> FAIL [ 0.110s] (2/5) gammaloop-integration-tests::test_python_api python_evaluate_sample_preserves_graph_grouping_and_incoming_pdgs
- 32.64 s
> stdout ---
- 32.64 s
>
- 32.64 s
> running 1 test
- 32.64 s
> test python_evaluate_sample_preserves_graph_grouping_and_incoming_pdgs ... FAILED
- 32.64 s
>
- 32.64 s
> failures:
- 32.64 s
>
- 32.64 s
> failures:
- 32.64 s
> python_evaluate_sample_preserves_graph_grouping_and_incoming_pdgs
- 32.64 s
>
- 32.64 s
> test result: FAILED. 0 passed; 1 failed; 0 ignored; 0 measured; 4 filtered out; finished in 0.11s
- 32.64 s
>
- 32.64 s
> stderr ---
- 32.64 s
> Error: Python API test subprocess failed.
- 32.64 s
> stdout:
- 32.64 s
> ┌────────────────────────────────────────────────────────┐
- 32.64 s
> │ You are running a restricted Symbolica instance. │
- 32.64 s
> │ │
- 32.64 s
> │ This mode is only permitted for non-commercial use and │
- 32.64 s
> │ is limited to one instance and core per machine. │
- 32.64 s
> │ │
- 32.64 s
> │ Hobbyists can easily acquire a free license key │
- 32.64 s
> │ that unlocks all cores and removes this banner: │
- 32.64 s
> │ │
- 32.64 s
> │ from symbolica import * │
- 32.64 s
> │ request_hobbyist_license('YOUR_NAME', 'YOUR_EMAIL') │
- 32.64 s
> │ │
- 32.64 s
> │ All other users can obtain a free 30-day trial key: │
- 32.64 s
> │ │
- 32.64 s
> │ from symbolica import * │
- 32.64 s
> │ request_trial_license('NAME', 'EMAIL', 'EMPLOYER') │
- 32.64 s
> │ │
- 32.64 s
> │ See https://symbolica.io/docs/get_started.html#license │
- 32.64 s
> └────────────────────────────────────────────────────────┘
- 32.64 s
> ┌───────────────────────────────────────────────────────────────────────────────────────────────────────────┐
- 32.64 s
> │ Cannot start new unlicensed Symbolica instance since there is already another one running on the machine. │
- 32.64 s
> └───────────────────────────────────────────────────────────────────────────────────────────────────────────┘
- 32.64 s
>
- 32.64 s
> stderr:
- 32.64 s
>
- 32.64 s
> ┌───────────────────────────────────────────────────────────┐
- 32.64 s
> │ Could not resolve the IP of the Symbolica license server. │
- 32.64 s
> │ │
- 32.64 s
> │ Please check your DNS configuration. │
- 32.64 s
> └───────────────────────────────────────────────────────────┘
- 32.64 s
> Error: failed to lookup address information: Temporary failure in name resolution
- 32.64 s
>
- 32.64 s
>
- 32.64 s
> Location:
- 32.64 s
> tests/tests/test_python_api.rs:156:20
- 32.64 s
>
- 32.64 s
> FAIL [ 0.116s] (3/5) gammaloop-integration-tests::test_python_api python_session_getters_return_live_toml_and_command_blocks
- 32.64 s
> stdout ---
- 32.64 s
>
- 32.64 s
> running 1 test
- 32.64 s
> test python_session_getters_return_live_toml_and_command_blocks ... FAILED
- 32.64 s
>
- 32.64 s
> failures:
- 32.64 s
>
- 32.64 s
> failures:
- 32.64 s
> python_session_getters_return_live_toml_and_command_blocks
- 32.64 s
>
- 32.64 s
> test result: FAILED. 0 passed; 1 failed; 0 ignored; 0 measured; 4 filtered out; finished in 0.11s
- 32.64 s
>
- 32.64 s
> stderr ---
- 32.64 s
> Error: Python API test subprocess failed.
- 32.64 s
> stdout:
- 32.64 s
> ┌────────────────────────────────────────────────────────┐
- 32.64 s
> │ You are running a restricted Symbolica instance. │
- 32.64 s
> │ │
- 32.64 s
> │ This mode is only permitted for non-commercial use and │
- 32.64 s
> │ is limited to one instance and core per machine. │
- 32.64 s
> │ │
- 32.64 s
> │ Hobbyists can easily acquire a free license key │
- 32.64 s
> │ that unlocks all cores and removes this banner: │
- 32.64 s
> │ │
- 32.64 s
> │ from symbolica import * │
- 32.64 s
> │ request_hobbyist_license('YOUR_NAME', 'YOUR_EMAIL') │
- 32.64 s
> │ │
- 32.64 s
> │ All other users can obtain a free 30-day trial key: │
- 32.64 s
> │ │
- 32.64 s
> │ from symbolica import * │
- 32.64 s
> │ request_trial_license('NAME', 'EMAIL', 'EMPLOYER') │
- 32.64 s
> │ │
- 32.64 s
> │ See https://symbolica.io/docs/get_started.html#license │
- 32.64 s
> └────────────────────────────────────────────────────────┘
- 32.64 s
> ┌───────────────────────────────────────────────────────────────────────────────────────────────────────────┐
- 32.64 s
> │ Cannot start new unlicensed Symbolica instance since there is already another one running on the machine. │
- 32.64 s
> └───────────────────────────────────────────────────────────────────────────────────────────────────────────┘
- 32.64 s
>
- 32.64 s
> stderr:
- 32.64 s
>
- 32.64 s
> ┌───────────────────────────────────────────────────────────┐
- 32.64 s
> │ Could not resolve the IP of the Symbolica license server. │
- 32.64 s
> │ │
- 32.64 s
> │ Please check your DNS configuration. │
- 32.64 s
> └───────────────────────────────────────────────────────────┘
- 32.64 s
> Error: failed to lookup address information: Temporary failure in name resolution
- 32.64 s
>
- 32.64 s
>
- 32.64 s
> Location:
- 32.64 s
> tests/tests/test_python_api.rs:156:20
- 32.64 s
>
- 32.64 s
> FAIL [ 0.117s] (4/5) gammaloop-integration-tests::test_python_api python_evaluate_sample_honors_generate_events_and_observable_snapshots
- 32.64 s
> stdout ---
- 32.64 s
>
- 32.64 s
> running 1 test
- 32.64 s
> test python_evaluate_sample_honors_generate_events_and_observable_snapshots ... FAILED
- 32.64 s
>
- 32.64 s
> failures:
- 32.64 s
>
- 32.64 s
> failures:
- 32.64 s
> python_evaluate_sample_honors_generate_events_and_observable_snapshots
- 32.64 s
>
- 32.64 s
> test result: FAILED. 0 passed; 1 failed; 0 ignored; 0 measured; 4 filtered out; finished in 0.11s
- 32.64 s
>
- 32.64 s
> stderr ---
- 32.64 s
> Error: Python API test subprocess failed.
- 32.64 s
> stdout:
- 32.64 s
> ┌────────────────────────────────────────────────────────┐
- 32.64 s
> │ You are running a restricted Symbolica instance. │
- 32.64 s
> │ │
- 32.64 s
> │ This mode is only permitted for non-commercial use and │
- 32.64 s
> │ is limited to one instance and core per machine. │
- 32.64 s
> │ │
- 32.64 s
> │ Hobbyists can easily acquire a free license key │
- 32.64 s
> │ that unlocks all cores and removes this banner: │
- 32.64 s
> │ │
- 32.64 s
> │ from symbolica import * │
- 32.64 s
> │ request_hobbyist_license('YOUR_NAME', 'YOUR_EMAIL') │
- 32.64 s
> │ │
- 32.64 s
> │ All other users can obtain a free 30-day trial key: │
- 32.64 s
> │ │
- 32.64 s
> │ from symbolica import * │
- 32.64 s
> │ request_trial_license('NAME', 'EMAIL', 'EMPLOYER') │
- 32.64 s
> │ │
- 32.64 s
> │ See https://symbolica.io/docs/get_started.html#license │
- 32.64 s
> └────────────────────────────────────────────────────────┘
- 32.64 s
> ┌───────────────────────────────────────────────────────────────────────────────────────────────────────────┐
- 32.64 s
> │ Cannot start new unlicensed Symbolica instance since there is already another one running on the machine. │
- 32.64 s
> └───────────────────────────────────────────────────────────────────────────────────────────────────────────┘
- 32.64 s
>
- 32.64 s
> stderr:
- 32.64 s
>
- 32.64 s
> ┌───────────────────────────────────────────────────────────┐
- 32.64 s
> │ Could not resolve the IP of the Symbolica license server. │
- 32.64 s
> │ │
- 32.64 s
> │ Please check your DNS configuration. │
- 32.64 s
> └───────────────────────────────────────────────────────────┘
- 32.64 s
> Error: failed to lookup address information: Temporary failure in name resolution
- 32.64 s
>
- 32.64 s
>
- 32.64 s
> Location:
- 32.64 s
> tests/tests/test_python_api.rs:156:20
- 32.64 s
>
- 32.64 s
> error: test run failed
- 32.64 s
>
- 32.64 s
> ========== nextest test summary ==========
- 32.64 s
> report: target/nextest/ci_gammaloop/junit.xml
- 32.64 s
> tests: 5, failures: 4, errors: 0
- 32.64 s
>
- 32.64 s
> 1. gammaloop-integration-tests::test_python_api::python_evaluate_samples_batch_and_momentum_space_have_expected_shape
- 32.64 s
> failure: test failure with exit code 101
- 32.64 s
> Error: Python API test subprocess failed.
- 32.64 s
> stdout:
- 32.64 s
> ┌────────────────────────────────────────────────────────┐
- 32.64 s
> │ You are running a restricted Symbolica instance. │
- 32.64 s
> │ │
- 32.64 s
> │ This mode is only permitted for non-commercial use and │
- 32.64 s
> │ is limited to one instance and core per machine. │
- 32.64 s
> │ │
- 32.64 s
> │ Hobbyists can easily acquire a free license key │
- 32.64 s
> │ that unlocks all cores and removes this banner: │
- 32.64 s
> │ │
- 32.64 s
> │ from symbolica import * │
- 32.64 s
> │ request_hobbyist_license('YOUR_NAME', 'YOUR_EMAIL') │
- 32.64 s
> │ │
- 32.64 s
> │ All other users can obtain a free 30-day trial key: │
- 32.64 s
> │ │
- 32.64 s
> │ from symbolica import * │
- 32.64 s
> │ request_trial_license('NAME', 'EMAIL', 'EMPLOYER') │
- 32.64 s
> │ │
- 32.64 s
> │ See https://symbolica.io/docs/get_started.html#license │
- 32.64 s
> └────────────────────────────────────────────────────────┘
- 32.64 s
> ┌───────────────────────────────────────────────────────────────────────────────────────────────────────────┐
- 32.64 s
> │ Cannot start new unlicensed Symbolica instance since there is already another one running on the machine. │
- 32.64 s
> └───────────────────────────────────────────────────────────────────────────────────────────────────────────┘
- 32.64 s
>
- 32.64 s
> stderr:
- 32.64 s
>
- 32.64 s
> ┌───────────────────────────────────────────────────────────┐
- 32.64 s
> │ Could not resolve the IP of the Symbolica license server. │
- 32.64 s
> │ │
- 32.64 s
> │ Please check your DNS configuration. │
- 32.64 s
> └───────────────────────────────────────────────────────────┘
- 32.64 s
> Error: failed to lookup address information: Temporary failure in name resolution
- 32.64 s
>
- 32.64 s
>
- 32.64 s
> Location:
- 32.64 s
> tests/tests/test_python_api.rs:156:20
- 32.64 s
> system-out
- 32.64 s
> running 1 test
- 32.64 s
> test python_evaluate_samples_batch_and_momentum_space_have_expected_shape ... FAILED
- 32.64 s
>
- 32.64 s
> failures:
- 32.64 s
>
- 32.64 s
> failures:
- 32.64 s
> python_evaluate_samples_batch_and_momentum_space_have_expected_shape
- 32.64 s
>
- 32.64 s
> test result: FAILED. 0 passed; 1 failed; 0 ignored; 0 measured; 4 filtered out; finished in 0.10s
- 32.64 s
> system-err
- 32.64 s
> Error: Python API test subprocess failed.
- 32.64 s
> stdout:
- 32.64 s
> ┌────────────────────────────────────────────────────────┐
- 32.64 s
> │ You are running a restricted Symbolica instance. │
- 32.64 s
> │ │
- 32.64 s
> │ This mode is only permitted for non-commercial use and │
- 32.64 s
> │ is limited to one instance and core per machine. │
- 32.64 s
> │ │
- 32.64 s
> │ Hobbyists can easily acquire a free license key │
- 32.64 s
> │ that unlocks all cores and removes this banner: │
- 32.64 s
> │ │
- 32.64 s
> │ from symbolica import * │
- 32.64 s
> │ request_hobbyist_license('YOUR_NAME', 'YOUR_EMAIL') │
- 32.64 s
> │ │
- 32.64 s
> │ All other users can obtain a free 30-day trial key: │
- 32.64 s
> │ │
- 32.64 s
> │ from symbolica import * │
- 32.64 s
> │ request_trial_license('NAME', 'EMAIL', 'EMPLOYER') │
- 32.64 s
> │ │
- 32.64 s
> │ See https://symbolica.io/docs/get_started.html#license │
- 32.64 s
> └────────────────────────────────────────────────────────┘
- 32.64 s
> ┌───────────────────────────────────────────────────────────────────────────────────────────────────────────┐
- 32.64 s
> │ Cannot start new unlicensed Symbolica instance since there is already another one running on the machine. │
- 32.64 s
> └───────────────────────────────────────────────────────────────────────────────────────────────────────────┘
- 32.64 s
>
- 32.64 s
> stderr:
- 32.64 s
>
- 32.64 s
> ┌───────────────────────────────────────────────────────────┐
- 32.64 s
> │ Could not resolve the IP of the Symbolica license server. │
- 32.64 s
> │ │
- 32.64 s
> │ Please check your DNS configuration. │
- 32.64 s
> └───────────────────────────────────────────────────────────┘
- 32.64 s
> Error: failed to lookup address information: Temporary failure in name resolution
- 32.64 s
>
- 32.64 s
>
- 32.64 s
> Location:
- 32.64 s
> tests/tests/test_python_api.rs:156:20
- 32.64 s
>
- 32.64 s
> 2. gammaloop-integration-tests::test_python_api::python_evaluate_sample_preserves_graph_grouping_and_incoming_pdgs
- 32.64 s
> failure: test failure with exit code 101
- 32.64 s
> Error: Python API test subprocess failed.
- 32.64 s
> stdout:
- 32.64 s
> ┌────────────────────────────────────────────────────────┐
- 32.64 s
> │ You are running a restricted Symbolica instance. │
- 32.64 s
> │ │
- 32.64 s
> │ This mode is only permitted for non-commercial use and │
- 32.64 s
> │ is limited to one instance and core per machine. │
- 32.64 s
> │ │
- 32.64 s
> │ Hobbyists can easily acquire a free license key │
- 32.64 s
> │ that unlocks all cores and removes this banner: │
- 32.64 s
> │ │
- 32.64 s
> │ from symbolica import * │
- 32.64 s
> │ request_hobbyist_license('YOUR_NAME', 'YOUR_EMAIL') │
- 32.64 s
> │ │
- 32.64 s
> │ All other users can obtain a free 30-day trial key: │
- 32.64 s
> │ │
- 32.64 s
> │ from symbolica import * │
- 32.64 s
> │ request_trial_license('NAME', 'EMAIL', 'EMPLOYER') │
- 32.64 s
> │ │
- 32.64 s
> │ See https://symbolica.io/docs/get_started.html#license │
- 32.64 s
> └────────────────────────────────────────────────────────┘
- 32.64 s
> ┌───────────────────────────────────────────────────────────────────────────────────────────────────────────┐
- 32.64 s
> │ Cannot start new unlicensed Symbolica instance since there is already another one running on the machine. │
- 32.64 s
> └───────────────────────────────────────────────────────────────────────────────────────────────────────────┘
- 32.64 s
>
- 32.64 s
> stderr:
- 32.64 s
>
- 32.64 s
> ┌───────────────────────────────────────────────────────────┐
- 32.64 s
> │ Could not resolve the IP of the Symbolica license server. │
- 32.64 s
> │ │
- 32.64 s
> │ Please check your DNS configuration. │
- 32.64 s
> └───────────────────────────────────────────────────────────┘
- 32.64 s
> Error: failed to lookup address information: Temporary failure in name resolution
- 32.64 s
>
- 32.64 s
>
- 32.64 s
> Location:
- 32.64 s
> tests/tests/test_python_api.rs:156:20
- 32.64 s
> system-out
- 32.64 s
> running 1 test
- 32.64 s
> test python_evaluate_sample_preserves_graph_grouping_and_incoming_pdgs ... FAILED
- 32.64 s
>
- 32.64 s
> failures:
- 32.64 s
>
- 32.64 s
> failures:
- 32.64 s
> python_evaluate_sample_preserves_graph_grouping_and_incoming_pdgs
- 32.64 s
>
- 32.64 s
> test result: FAILED. 0 passed; 1 failed; 0 ignored; 0 measured; 4 filtered out; finished in 0.11s
- 32.64 s
> system-err
- 32.64 s
> Error: Python API test subprocess failed.
- 32.64 s
> stdout:
- 32.64 s
> ┌────────────────────────────────────────────────────────┐
- 32.64 s
> │ You are running a restricted Symbolica instance. │
- 32.64 s
> │ │
- 32.64 s
> │ This mode is only permitted for non-commercial use and │
- 32.64 s
> │ is limited to one instance and core per machine. │
- 32.64 s
> │ │
- 32.64 s
> │ Hobbyists can easily acquire a free license key │
- 32.64 s
> │ that unlocks all cores and removes this banner: │
- 32.64 s
> │ │
- 32.64 s
> │ from symbolica import * │
- 32.64 s
> │ request_hobbyist_license('YOUR_NAME', 'YOUR_EMAIL') │
- 32.64 s
> │ │
- 32.64 s
> │ All other users can obtain a free 30-day trial key: │
- 32.64 s
> │ │
- 32.64 s
> │ from symbolica import * │
- 32.64 s
> │ request_trial_license('NAME', 'EMAIL', 'EMPLOYER') │
- 32.64 s
> │ │
- 32.64 s
> │ See https://symbolica.io/docs/get_started.html#license │
- 32.64 s
> └────────────────────────────────────────────────────────┘
- 32.64 s
> ┌───────────────────────────────────────────────────────────────────────────────────────────────────────────┐
- 32.64 s
> │ Cannot start new unlicensed Symbolica instance since there is already another one running on the machine. │
- 32.64 s
> └───────────────────────────────────────────────────────────────────────────────────────────────────────────┘
- 32.64 s
>
- 32.64 s
> stderr:
- 32.64 s
>
- 32.64 s
> ┌───────────────────────────────────────────────────────────┐
- 32.64 s
> │ Could not resolve the IP of the Symbolica license server. │
- 32.64 s
> │ │
- 32.64 s
> │ Please check your DNS configuration. │
- 32.64 s
> └───────────────────────────────────────────────────────────┘
- 32.64 s
> Error: failed to lookup address information: Temporary failure in name resolution
- 32.64 s
>
- 32.64 s
>
- 32.64 s
> Location:
- 32.64 s
> tests/tests/test_python_api.rs:156:20
- 32.64 s
>
- 32.64 s
> 3. gammaloop-integration-tests::test_python_api::python_session_getters_return_live_toml_and_command_blocks
- 32.64 s
> failure: test failure with exit code 101
- 32.64 s
> Error: Python API test subprocess failed.
- 32.64 s
> stdout:
- 32.64 s
> ┌────────────────────────────────────────────────────────┐
- 32.64 s
> │ You are running a restricted Symbolica instance. │
- 32.64 s
> │ │
- 32.64 s
> │ This mode is only permitted for non-commercial use and │
- 32.64 s
> │ is limited to one instance and core per machine. │
- 32.64 s
> │ │
- 32.64 s
> │ Hobbyists can easily acquire a free license key │
- 32.64 s
> │ that unlocks all cores and removes this banner: │
- 32.64 s
> │ │
- 32.64 s
> │ from symbolica import * │
- 32.64 s
> │ request_hobbyist_license('YOUR_NAME', 'YOUR_EMAIL') │
- 32.64 s
> │ │
- 32.64 s
> │ All other users can obtain a free 30-day trial key: │
- 32.64 s
> │ │
- 32.64 s
> │ from symbolica import * │
- 32.64 s
> │ request_trial_license('NAME', 'EMAIL', 'EMPLOYER') │
- 32.64 s
> │ │
- 32.64 s
> │ See https://symbolica.io/docs/get_started.html#license │
- 32.64 s
> └────────────────────────────────────────────────────────┘
- 32.64 s
> ┌───────────────────────────────────────────────────────────────────────────────────────────────────────────┐
- 32.64 s
> │ Cannot start new unlicensed Symbolica instance since there is already another one running on the machine. │
- 32.64 s
> └───────────────────────────────────────────────────────────────────────────────────────────────────────────┘
- 32.64 s
>
- 32.64 s
> stderr:
- 32.64 s
>
- 32.64 s
> ┌───────────────────────────────────────────────────────────┐
- 32.64 s
> │ Could not resolve the IP of the Symbolica license server. │
- 32.64 s
> │ │
- 32.64 s
> │ Please check your DNS configuration. │
- 32.64 s
> └───────────────────────────────────────────────────────────┘
- 32.64 s
> Error: failed to lookup address information: Temporary failure in name resolution
- 32.64 s
>
- 32.64 s
>
- 32.64 s
> Location:
- 32.64 s
> tests/tests/test_python_api.rs:156:20
- 32.64 s
> system-out
- 32.64 s
> running 1 test
- 32.64 s
> test python_session_getters_return_live_toml_and_command_blocks ... FAILED
- 32.64 s
>
- 32.64 s
> failures:
- 32.64 s
>
- 32.64 s
> failures:
- 32.64 s
> python_session_getters_return_live_toml_and_command_blocks
- 32.64 s
>
- 32.64 s
> test result: FAILED. 0 passed; 1 failed; 0 ignored; 0 measured; 4 filtered out; finished in 0.11s
- 32.64 s
> system-err
- 32.64 s
> Error: Python API test subprocess failed.
- 32.64 s
> stdout:
- 32.64 s
> ┌────────────────────────────────────────────────────────┐
- 32.64 s
> │ You are running a restricted Symbolica instance. │
- 32.64 s
> │ │
- 32.64 s
> │ This mode is only permitted for non-commercial use and │
- 32.64 s
> │ is limited to one instance and core per machine. │
- 32.64 s
> │ │
- 32.64 s
> │ Hobbyists can easily acquire a free license key │
- 32.64 s
> │ that unlocks all cores and removes this banner: │
- 32.64 s
> │ │
- 32.64 s
> │ from symbolica import * │
- 32.64 s
> │ request_hobbyist_license('YOUR_NAME', 'YOUR_EMAIL') │
- 32.64 s
> │ │
- 32.64 s
> │ All other users can obtain a free 30-day trial key: │
- 32.64 s
> │ │
- 32.64 s
> │ from symbolica import * │
- 32.64 s
> │ request_trial_license('NAME', 'EMAIL', 'EMPLOYER') │
- 32.64 s
> │ │
- 32.64 s
> │ See https://symbolica.io/docs/get_started.html#license │
- 32.64 s
> └────────────────────────────────────────────────────────┘
- 32.64 s
> ┌───────────────────────────────────────────────────────────────────────────────────────────────────────────┐
- 32.64 s
> │ Cannot start new unlicensed Symbolica instance since there is already another one running on the machine. │
- 32.64 s
> └───────────────────────────────────────────────────────────────────────────────────────────────────────────┘
- 32.64 s
>
- 32.64 s
> stderr:
- 32.64 s
>
- 32.64 s
> ┌───────────────────────────────────────────────────────────┐
- 32.64 s
> │ Could not resolve the IP of the Symbolica license server. │
- 32.64 s
> │ │
- 32.64 s
> │ Please check your DNS configuration. │
- 32.64 s
> └───────────────────────────────────────────────────────────┘
- 32.64 s
> Error: failed to lookup address information: Temporary failure in name resolution
- 32.64 s
>
- 32.64 s
>
- 32.64 s
> Location:
- 32.64 s
> tests/tests/test_python_api.rs:156:20
- 32.64 s
>
- 32.64 s
> 4. gammaloop-integration-tests::test_python_api::python_evaluate_sample_honors_generate_events_and_observable_snapshots
- 32.64 s
> failure: test failure with exit code 101
- 32.64 s
> Error: Python API test subprocess failed.
- 32.64 s
> stdout:
- 32.64 s
> ┌────────────────────────────────────────────────────────┐
- 32.64 s
> │ You are running a restricted Symbolica instance. │
- 32.64 s
> │ │
- 32.64 s
> │ This mode is only permitted for non-commercial use and │
- 32.64 s
> │ is limited to one instance and core per machine. │
- 32.64 s
> │ │
- 32.64 s
> │ Hobbyists can easily acquire a free license key │
- 32.64 s
> │ that unlocks all cores and removes this banner: │
- 32.64 s
> │ │
- 32.64 s
> │ from symbolica import * │
- 32.64 s
> │ request_hobbyist_license('YOUR_NAME', 'YOUR_EMAIL') │
- 32.64 s
> │ │
- 32.64 s
> │ All other users can obtain a free 30-day trial key: │
- 32.64 s
> │ │
- 32.64 s
> │ from symbolica import * │
- 32.64 s
> │ request_trial_license('NAME', 'EMAIL', 'EMPLOYER') │
- 32.64 s
> │ │
- 32.64 s
> │ See https://symbolica.io/docs/get_started.html#license │
- 32.64 s
> └────────────────────────────────────────────────────────┘
- 32.64 s
> ┌───────────────────────────────────────────────────────────────────────────────────────────────────────────┐
- 32.64 s
> │ Cannot start new unlicensed Symbolica instance since there is already another one running on the machine. │
- 32.64 s
> └───────────────────────────────────────────────────────────────────────────────────────────────────────────┘
- 32.64 s
>
- 32.64 s
> stderr:
- 32.64 s
>
- 32.64 s
> ┌───────────────────────────────────────────────────────────┐
- 32.64 s
> │ Could not resolve the IP of the Symbolica license server. │
- 32.64 s
> │ │
- 32.64 s
> │ Please check your DNS configuration. │
- 32.64 s
> └───────────────────────────────────────────────────────────┘
- 32.64 s
> Error: failed to lookup address information: Temporary failure in name resolution
- 32.64 s
>
- 32.64 s
>
- 32.64 s
> Location:
- 32.64 s
> tests/tests/test_python_api.rs:156:20
- 32.64 s
> system-out
- 32.64 s
> running 1 test
- 32.64 s
> test python_evaluate_sample_honors_generate_events_and_observable_snapshots ... FAILED
- 32.64 s
>
- 32.64 s
> failures:
- 32.64 s
>
- 32.64 s
> failures:
- 32.64 s
> python_evaluate_sample_honors_generate_events_and_observable_snapshots
- 32.64 s
>
- 32.64 s
> test result: FAILED. 0 passed; 1 failed; 0 ignored; 0 measured; 4 filtered out; finished in 0.11s
- 32.64 s
> system-err
- 32.64 s
> Error: Python API test subprocess failed.
- 32.64 s
> stdout:
- 32.64 s
> ┌────────────────────────────────────────────────────────┐
- 32.64 s
> │ You are running a restricted Symbolica instance. │
- 32.64 s
> │ │
- 32.64 s
> │ This mode is only permitted for non-commercial use and │
- 32.64 s
> │ is limited to one instance and core per machine. │
- 32.64 s
> │ │
- 32.64 s
> │ Hobbyists can easily acquire a free license key │
- 32.64 s
> │ that unlocks all cores and removes this banner: │
- 32.64 s
> │ │
- 32.64 s
> │ from symbolica import * │
- 32.64 s
> │ request_hobbyist_license('YOUR_NAME', 'YOUR_EMAIL') │
- 32.64 s
> │ │
- 32.64 s
> │ All other users can obtain a free 30-day trial key: │
- 32.64 s
> │ │
- 32.64 s
> │ from symbolica import * │
- 32.64 s
> │ request_trial_license('NAME', 'EMAIL', 'EMPLOYER') │
- 32.64 s
> │ │
- 32.64 s
> │ See https://symbolica.io/docs/get_started.html#license │
- 32.64 s
> └────────────────────────────────────────────────────────┘
- 32.64 s
> ┌───────────────────────────────────────────────────────────────────────────────────────────────────────────┐
- 32.64 s
> │ Cannot start new unlicensed Symbolica instance since there is already another one running on the machine. │
- 32.64 s
> └───────────────────────────────────────────────────────────────────────────────────────────────────────────┘
- 32.64 s
>
- 32.64 s
> stderr:
- 32.64 s
>
- 32.64 s
> ┌───────────────────────────────────────────────────────────┐
- 32.64 s
> │ Could not resolve the IP of the Symbolica license server. │
- 32.64 s
> │ │
- 32.64 s
> │ Please check your DNS configuration. │
- 32.64 s
> └───────────────────────────────────────────────────────────┘
- 32.64 s
> Error: failed to lookup address information: Temporary failure in name resolution
- 32.64 s
>
- 32.64 s
>
- 32.64 s
> Location:
- 32.64 s
> tests/tests/test_python_api.rs:156:20
- 32.64 s
> =========================================
- 32.64 s
For full logs, run:
- 32.64 s
nix log /nix/store/6yfkarcx1yqfdkgaj26q9b9n3q0min5r-gammaloop-nextest-python-api.drv
- 32.79 s
[2 built (1 failed), 12 Run failed.