1. 0.00 s $ /nix/store/9ypz3flqsrl5xl495mm8h645gadjsxi1-coreutils-9.11/bin/timeout --kill-after=15s 7200s /nix/store/23zk8sgzamrbmj1fday15szf7f2279s8-nix-2.34.7/bin/nix --extra-experimental-features nix-command --extra-experimental-features flakes flake clone git+https://github.com/alphal00p/gammaloop --dest /tmp/nix-ci-worker/stable-pwd/repo/
  2. 0.07 s Cloning into '/tmp/nix-ci-worker/stable-pwd/repo'...
  3. 2.39 s remote: Enumerating objects: 84764 remote: Enumerating objects: 93753, done.
  4. 2.64 s remote: Counting objects: 0% (1/8989) remote: Counting objects: 1% (90/8989) remote: Counting objects: 2% (180/8989) remote: Counting objects: 3% (270/8989) remote: Counting objects: 4% (360/8989) remote: Counting objects: 5% (450/8989) remote: Counting objects: 6% (540/8989) remote: Counting objects: 7% (630/8989) remote: Counting objects: 8% (720/8989) remote: Counting objects: 9% (810/8989) remote: Counting objects: 10% (899/8989) remote: Counting objects: 11% (989/8989) remote: Counting objects: 12% (1079/8989) remote: Counting objects: 13% (1169/8989) remote: Counting objects: 14% (1259/8989) remote: Counting objects: 15% (1349/8989) remote: Counting objects: 16% (1439/8989) remote: Counting objects: 17% (1529/8989) remote: Counting objects: 18% (1619/8989) remote: Counting objects: 19% (1708/8989) remote: Counting objects: 20% (1798/8989) remote: Counting objects: 21% (1888/8989) remote: Counting objects: 22% (1978/8989) remote: Counting objects: 23% (2068/8989) remote: Counting objects: 24% (2158/8989) remote: Counting objects: 25% (2248/8989) remote: Counting objects: 26% (2338/8989) remote: Counting objects: 27% (2428/8989) remote: Counting objects: 28% (2517/8989) remote: Counting objects: 29% (2607/8989) remote: Counting objects: 30% (2697/8989) remote: Counting objects: 31% (2787/8989) remote: Counting objects: 32% (2877/8989) remote: Counting objects: 33% (2967/8989) remote: Counting objects: 34% (3057/8989) remote: Counting objects: 35% (3147/8989) remote: Counting objects: 36% (3237/8989) remote: Counting objects: 37% (3326/8989) remote: Counting objects: 38% (3416/8989) remote: Counting objects: 39% (3506/8989) remote: Counting objects: 40% (3596/8989) remote: Counting objects: 41% (3686/8989) remote: Counting objects: 42% (3776/8989) remote: Counting objects: 43% (3866/8989) remote: Counting objects: 44% (3956/8989) remote: Counting objects: 45% (4046/8989) remote: Counting objects: 46% (4135/8989) remote: Counting objects: 47% (4225/8989) remote: Counting objects: 48% (4315/8989) remote: Counting objects: 49% (4405/8989) remote: Counting objects: 50% (4495/8989) remote: Counting objects: 51% (4585/8989) remote: Counting objects: 52% (4675/8989) remote: Counting objects: 53% (4765/8989) remote: Counting objects: 54% (4855/8989) remote: Counting objects: 55% (4944/8989) remote: Counting objects: 56% (5034/8989) remote: Counting objects: 57% (5124/8989) remote: Counting objects: 58% (5214/8989) remote: Counting objects: 59% (5304/8989) remote: Counting objects: 60% (5394/8989) remote: Counting objects: 61% (5484/8989) remote: Counting objects: 62% (5574/8989) remote: Counting objects: 63% (5664/8989) remote: Counting objects: 64% (5753/8989) remote: Counting objects: 65% (5843/8989) remote: Counting objects: 66% (5933/8989) remote: Counting objects: 67% (6023/8989) remote: Counting objects: 68% (6113/8989) remote: Counting objects: 69% (6203/8989) remote: Counting objects: 70% (6293/8989) remote: Counting objects: 71% (6383/8989) remote: Counting objects: 72% (6473/8989) remote: Counting objects: 73% (6562/8989) remote: Counting objects: 74% (6652/8989) remote: Counting objects: 75% (6742/8989) remote: Counting objects: 76% (6832/8989) remote: Counting objects: 77% (6922/8989) remote: Counting objects: 78% (7012/8989) remote: Counting objects: 79% (7102/8989) remote: Counting objects: 80% (7192/8989) remote: Counting objects: 81% (7282/8989) remote: Counting objects: 82% (7371/8989) remote: Counting objects: 83% (7461/8989) remote: Counting objects: 84% (7551/8989) remote: Counting objects: 85% (7641/8989) remote: Counting objects: 86% (7731/8989) remote: Counting objects: 87% (7821/8989) remote: Counting objects: 88% (7911/8989) remote: Counting objects: 89% (8001/8989) remote: Counting objects: 90% (8091/8989) remote: Counting objects: 91% (8180/8989) remote: Counting objects: 92% (8270/8989) remote: Counting objects: 93% (8360/8989) remote: Counting objects: 94% (8450/8989) remote: Counting objects: 95% (8540/8989) remote: Counting objects: 96% (8630/8989) remote: Counting objects: 97% (8720/8989) remote: Counting objects: 98% (8810/8989) remote: Counting objects: 99% (8900/8989) remote: Counting objects: 100% (8989/8989) remote: Counting objects: 100% (8989/8989), done.
  5. 4.53 s remote: Compressing objects: 0% (1/1791) remote: Compressing objects: 1% (18/1791) remote: Compressing objects: 2% (36/1791) remote: Compressing objects: 3% (54/1791) remote: Compressing objects: 4% (72/1791) remote: Compressing objects: 5% (90/1791) remote: Compressing objects: 6% (108/1791) remote: Compressing objects: 7% (126/1791) remote: Compressing objects: 7% (134/1791) remote: Compressing objects: 8% (144/1791) remote: Compressing objects: 9% (162/1791) remote: Compressing objects: 10% (180/1791) remote: Compressing objects: 11% (198/1791) remote: Compressing objects: 12% (215/1791) remote: Compressing objects: 13% (233/1791) remote: Compressing objects: 14% (251/1791) remote: Compressing objects: 15% (269/1791) remote: Compressing objects: 16% (287/1791) remote: Compressing objects: 17% (305/1791) remote: Compressing objects: 18% (323/1791) remote: Compressing objects: 19% (341/1791) remote: Compressing objects: 20% (359/1791) remote: Compressing objects: 21% (377/1791) remote: Compressing objects: 22% (395/1791) remote: Compressing objects: 23% (412/1791) remote: Compressing objects: 24% (430/1791) remote: Compressing objects: 25% (448/1791) remote: Compressing objects: 26% (466/1791) remote: Compressing objects: 27% (484/1791) remote: Compressing objects: 28% (502/1791) remote: Compressing objects: 29% (520/1791) remote: Compressing objects: 29% (524/1791) remote: Compressing objects: 30% (538/1791) remote: Compressing objects: 31% (556/1791) remote: Compressing objects: 32% (574/1791) remote: Compressing objects: 33% (592/1791) remote: Compressing objects: 34% (609/1791) remote: Compressing objects: 35% (627/1791) remote: Compressing objects: 36% (645/1791) remote: Compressing objects: 37% (663/1791) remote: Compressing objects: 38% (681/1791) remote: Compressing objects: 39% (699/1791) remote: Compressing objects: 40% (717/1791) remote: Compressing objects: 41% (735/1791) remote: Compressing objects: 42% (753/1791) remote: Compressing objects: 43% (771/1791) remote: Compressing objects: 44% (789/1791) remote: Compressing objects: 45% (806/1791) remote: Compressing objects: 46% (824/1791) remote: Compressing objects: 47% (842/1791) remote: Compressing objects: 48% (860/1791) remote: Compressing objects: 49% (878/1791) remote: Compressing objects: 50% (896/1791) remote: Compressing objects: 51% (914/1791) remote: Compressing objects: 52% (932/1791) remote: Compressing objects: 53% (950/1791) remote: Compressing objects: 54% (968/1791) remote: Compressing objects: 55% (986/1791) remote: Compressing objects: 56% (1003/1791) remote: Compressing objects: 57% (1021/1791) remote: Compressing objects: 58% (1039/1791) remote: Compressing objects: 59% (1057/1791) remote: Compressing objects: 60% (1075/1791) remote: Compressing objects: 61% (1093/1791) remote: Compressing objects: 62% (1111/1791) remote: Compressing objects: 63% (1129/1791) remote: Compressing objects: 64% (1147/1791) remote: Compressing objects: 65% (1165/1791) remote: Compressing objects: 66% (1183/1791) remote: Compressing objects: 67% (1200/1791) remote: Compressing objects: 68% (1218/1791) remote: Compressing objects: 69% (1236/1791) remote: Compressing objects: 70% (1254/1791) remote: Compressing objects: 71% (1272/1791) remote: Compressing objects: 72% (1290/1791) remote: Compressing objects: 73% (1308/1791) remote: Compressing objects: 74% (1326/1791) remote: Compressing objects: 75% (1344/1791) remote: Compressing objects: 76% (1362/1791) remote: Compressing objects: 77% (1380/1791) remote: Compressing objects: 78% (1397/1791) remote: Compressing objects: 79% (1415/1791) remote: Compressing objects: 80% (1433/1791) remote: Compressing objects: 81% (1451/1791) remote: Compressing objects: 82% (1469/1791) remote: Compressing objects: 83% (1487/1791) remote: Compressing objects: 84% (1505/1791) remote: Compressing objects: 85% (1523/1791) remote: Compressing objects: 86% (1541/1791) remote: Compressing objects: 87% (1559/1791) remote: Compressing objects: 88% (1577/1791) remote: Compressing objects: 89% (1594/1791) remote: Compressing objects: 90% (1612/1791) remote: Compressing objects: 91% (1630/1791) remote: Compressing objects: 92% (1648/1791) remote: Compressing objects: 93% (1666/1791) remote: Compressing objects: 94% (1684/1791) remote: Compressing objects: 95% (1702/1791) remote: Compressing objects: 96% (1720/1791) remote: Compressing objects: 97% (1738/1791) remote: Compressing objects: 98% (1756/1791) remote: Compressing objects: 99% (1774/1791) remote: Compressing objects: 100% (1791/1791) remote: Compressing objects: 100% (1791/1791), done.
  6. 14.71 s Receiving objects: 0% (1/93753) Receiving objects: 1% (938/93753) Receiving objects: 2% (1876/93753) Receiving objects: 3% (2813/93753) Receiving objects: 4% (3751/93753) Receiving objects: 5% (4688/93753) Receiving objects: 6% (5626/93753) Receiving objects: 7% (6563/93753) Receiving objects: 8% (7501/93753), 15.52 MiB | 31.02 MiB/s Receiving objects: 9% (8438/93753), 15.52 MiB | 31.02 MiB/s Receiving objects: 10% (9376/93753), 15.52 MiB | 31.02 MiB/s Receiving objects: 11% (10313/93753), 15.52 MiB | 31.02 MiB/s Receiving objects: 12% (11251/93753), 15.52 MiB | 31.02 MiB/s Receiving objects: 13% (12188/93753), 15.52 MiB | 31.02 MiB/s Receiving objects: 14% (13126/93753), 15.52 MiB | 31.02 MiB/s Receiving objects: 15% (14063/93753), 15.52 MiB | 31.02 MiB/s Receiving objects: 16% (15001/93753), 15.52 MiB | 31.02 MiB/s Receiving objects: 17% (15939/93753), 15.52 MiB | 31.02 MiB/s Receiving objects: 18% (16876/93753), 15.52 MiB | 31.02 MiB/s Receiving objects: 19% (17814/93753), 15.52 MiB | 31.02 MiB/s Receiving objects: 20% (18751/93753), 15.52 MiB | 31.02 MiB/s Receiving objects: 21% (19689/93753), 15.52 MiB | 31.02 MiB/s Receiving objects: 22% (20626/93753), 15.52 MiB | 31.02 MiB/s Receiving objects: 23% (21564/93753), 15.52 MiB | 31.02 MiB/s Receiving objects: 24% (22501/93753), 15.52 MiB | 31.02 MiB/s Receiving objects: 25% (23439/93753), 15.52 MiB | 31.02 MiB/s Receiving objects: 26% (24376/93753), 15.52 MiB | 31.02 MiB/s Receiving objects: 27% (25314/93753), 15.52 MiB | 31.02 MiB/s Receiving objects: 28% (26251/93753), 15.52 MiB | 31.02 MiB/s Receiving objects: 29% (27189/93753), 15.52 MiB | 31.02 MiB/s Receiving objects: 30% (28126/93753), 15.52 MiB | 31.02 MiB/s Receiving objects: 31% (29064/93753), 15.52 MiB | 31.02 MiB/s Receiving objects: 32% (30001/93753), 15.52 MiB | 31.02 MiB/s Receiving objects: 33% (30939/93753), 15.52 MiB | 31.02 MiB/s Receiving objects: 34% (31877/93753), 15.52 MiB | 31.02 MiB/s Receiving objects: 35% (32814/93753), 15.52 MiB | 31.02 MiB/s Receiving objects: 35% (33165/93753), 15.52 MiB | 31.02 MiB/s Receiving objects: 36% (33752/93753), 31.04 MiB | 31.07 MiB/s Receiving objects: 37% (34689/93753), 31.04 MiB | 31.07 MiB/s Receiving objects: 38% (35627/93753), 31.04 MiB | 31.07 MiB/s Receiving objects: 39% (36564/93753), 31.04 MiB | 31.07 MiB/s Receiving objects: 40% (37502/93753), 31.04 MiB | 31.07 MiB/s Receiving objects: 41% (38439/93753), 31.04 MiB | 31.07 MiB/s Receiving objects: 42% (39377/93753), 31.04 MiB | 31.07 MiB/s Receiving objects: 43% (40314/93753), 46.95 MiB | 31.32 MiB/s Receiving objects: 44% (41252/93753), 46.95 MiB | 31.32 MiB/s Receiving objects: 45% (42189/93753), 46.95 MiB | 31.32 MiB/s Receiving objects: 46% (43127/93753), 46.95 MiB | 31.32 MiB/s Receiving objects: 47% (44064/93753), 46.95 MiB | 31.32 MiB/s Receiving objects: 48% (45002/93753), 46.95 MiB | 31.32 MiB/s Receiving objects: 49% (45939/93753), 46.95 MiB | 31.32 MiB/s Receiving objects: 50% (46877/93753), 46.95 MiB | 31.32 MiB/s Receiving objects: 51% (47815/93753), 46.95 MiB | 31.32 MiB/s Receiving objects: 51% (48725/93753), 62.44 MiB | 31.23 MiB/s Receiving objects: 52% (48752/93753), 62.44 MiB | 31.23 MiB/s Receiving objects: 53% (49690/93753), 62.44 MiB | 31.23 MiB/s Receiving objects: 54% (50627/93753), 62.44 MiB | 31.23 MiB/s Receiving objects: 55% (51565/93753), 62.44 MiB | 31.23 MiB/s Receiving objects: 56% (52502/93753), 62.44 MiB | 31.23 MiB/s Receiving objects: 57% (53440/93753), 62.44 MiB | 31.23 MiB/s Receiving objects: 58% (54377/93753), 78.47 MiB | 31.40 MiB/s Receiving objects: 59% (55315/93753), 78.47 MiB | 31.40 MiB/s Receiving objects: 60% (56252/93753), 78.47 MiB | 31.40 MiB/s Receiving objects: 60% (57042/93753), 93.86 MiB | 31.29 MiB/s Receiving objects: 60% (57111/93753), 125.56 MiB | 30.91 MiB/s Receiving objects: 61% (57190/93753), 141.43 MiB | 30.98 MiB/s Receiving objects: 61% (57205/93753), 156.81 MiB | 30.95 MiB/s Receiving objects: 61% (57629/93753), 166.87 MiB | 29.74 MiB/s Receiving objects: 62% (58127/93753), 180.61 MiB | 29.27 MiB/s Receiving objects: 63% (59065/93753), 180.61 MiB | 29.27 MiB/s Receiving objects: 64% (60002/93753), 180.61 MiB | 29.27 MiB/s Receiving objects: 65% (60940/93753), 180.61 MiB | 29.27 MiB/s Receiving objects: 66% (61877/93753), 180.61 MiB | 29.27 MiB/s Receiving objects: 67% (62815/93753), 180.61 MiB | 29.27 MiB/s Receiving objects: 68% (63753/93753), 196.31 MiB | 29.31 MiB/s Receiving objects: 69% (64690/93753), 196.31 MiB | 29.31 MiB/s Receiving objects: 69% (65143/93753), 196.31 MiB | 29.31 MiB/s Receiving objects: 70% (65628/93753), 196.31 MiB | 29.31 MiB/s Receiving objects: 71% (66565/93753), 196.31 MiB | 29.31 MiB/s Receiving objects: 72% (67503/93753), 196.31 MiB | 29.31 MiB/s Receiving objects: 73% (68440/93753), 212.07 MiB | 29.23 MiB/s Receiving objects: 74% (69378/93753), 212.07 MiB | 29.23 MiB/s Receiving objects: 75% (70315/93753), 212.07 MiB | 29.23 MiB/s Receiving objects: 76% (71253/93753), 212.07 MiB | 29.23 MiB/s Receiving objects: 77% (72190/93753), 212.07 MiB | 29.23 MiB/s Receiving objects: 78% (73128/93753), 212.07 MiB | 29.23 MiB/s Receiving objects: 79% (74065/93753), 212.07 MiB | 29.23 MiB/s Receiving objects: 80% (75003/93753), 212.07 MiB | 29.23 MiB/s Receiving objects: 81% (75940/93753), 227.93 MiB | 29.34 MiB/s Receiving objects: 82% (76878/93753), 227.93 MiB | 29.34 MiB/s Receiving objects: 82% (76880/93753), 227.93 MiB | 29.34 MiB/s Receiving objects: 83% (77815/93753), 243.47 MiB | 29.33 MiB/s Receiving objects: 84% (78753/93753), 243.47 MiB | 29.33 MiB/s Receiving objects: 85% (79691/93753), 243.47 MiB | 29.33 MiB/s Receiving objects: 86% (80628/93753), 259.24 MiB | 29.54 MiB/s Receiving objects: 87% (81566/93753), 259.24 MiB | 29.54 MiB/s Receiving objects: 88% (82503/93753), 259.24 MiB | 29.54 MiB/s Receiving objects: 89% (83441/93753), 259.24 MiB | 29.54 MiB/s Receiving objects: 89% (83881/93753), 259.24 MiB | 29.54 MiB/s Receiving objects: 90% (84378/93753), 259.24 MiB | 29.54 MiB/s Receiving objects: 90% (84753/93753), 290.74 MiB | 29.49 MiB/s Receiving objects: 91% (85316/93753), 290.74 MiB | 29.49 MiB/s Receiving objects: 92% (86253/93753), 290.74 MiB | 29.49 MiB/s Receiving objects: 93% (87191/93753), 290.74 MiB | 29.49 MiB/s Receiving objects: 94% (88128/93753), 290.74 MiB | 29.49 MiB/s Receiving objects: 95% (89066/93753), 290.74 MiB | 29.49 MiB/s Receiving objects: 96% (90003/93753), 290.74 MiB | 29.49 MiB/s Receiving objects: 97% (90941/93753), 290.74 MiB | 29.49 MiB/s Receiving objects: 98% (91878/93753), 306.55 MiB | 30.75 MiB/s Receiving objects: 99% (92816/93753), 306.55 MiB | 30.75 MiB/s remote: Total 93753 (delta 7889), reused 7198 (delta 7198), pack-reused 84764 (from 3)
  7. 14.71 s Receiving objects: 100% (93753/93753), 306.55 MiB | 30.75 MiB/s Receiving objects: 100% (93753/93753), 309.19 MiB | 30.40 MiB/s, done.
  8. 15.71 s Resolving deltas: 0% (0/63114) Resolving deltas: 1% (632/63114) Resolving deltas: 2% (1264/63114) Resolving deltas: 3% (1896/63114) Resolving deltas: 4% (2528/63114) Resolving deltas: 5% (3156/63114) Resolving deltas: 6% (3790/63114) Resolving deltas: 7% (4419/63114) Resolving deltas: 8% (5050/63114) Resolving deltas: 9% (5681/63114) Resolving deltas: 10% (6312/63114) Resolving deltas: 11% (6943/63114) Resolving deltas: 12% (7574/63114) Resolving deltas: 13% (8206/63114) Resolving deltas: 14% (8837/63114) Resolving deltas: 15% (9468/63114) Resolving deltas: 16% (10099/63114) Resolving deltas: 17% (10730/63114) Resolving deltas: 18% (11362/63114) Resolving deltas: 19% (11992/63114) Resolving deltas: 20% (12623/63114) Resolving deltas: 21% (13254/63114) Resolving deltas: 22% (13886/63114) Resolving deltas: 23% (14520/63114) Resolving deltas: 24% (15148/63114) Resolving deltas: 25% (15779/63114) Resolving deltas: 26% (16410/63114) Resolving deltas: 27% (17041/63114) Resolving deltas: 28% (17673/63114) Resolving deltas: 29% (18304/63114) Resolving deltas: 30% (18935/63114) Resolving deltas: 31% (19566/63114) Resolving deltas: 32% (20197/63114) Resolving deltas: 33% (20829/63114) Resolving deltas: 34% (21460/63114) Resolving deltas: 35% (22090/63114) Resolving deltas: 36% (22722/63114) Resolving deltas: 37% (23353/63114) Resolving deltas: 38% (23984/63114) Resolving deltas: 39% (24615/63114) Resolving deltas: 40% (25246/63114) Resolving deltas: 41% (25877/63114) Resolving deltas: 42% (26508/63114) Resolving deltas: 43% (27140/63114) Resolving deltas: 44% (27772/63114) Resolving deltas: 45% (28402/63114) Resolving deltas: 46% (29033/63114) Resolving deltas: 47% (29664/63114) Resolving deltas: 48% (30295/63114) Resolving deltas: 49% (30926/63114) Resolving deltas: 50% (31557/63114) Resolving deltas: 51% (32190/63114) Resolving deltas: 52% (32820/63114) Resolving deltas: 53% (33451/63114) Resolving deltas: 54% (34083/63114) Resolving deltas: 55% (34713/63114) Resolving deltas: 56% (35344/63114) Resolving deltas: 57% (35975/63114) Resolving deltas: 58% (36607/63114) Resolving deltas: 59% (37238/63114) Resolving deltas: 60% (37869/63114) Resolving deltas: 61% (38500/63114) Resolving deltas: 62% (39131/63114) Resolving deltas: 63% (39762/63114) Resolving deltas: 64% (40393/63114) Resolving deltas: 65% (41025/63114) Resolving deltas: 66% (41656/63114) Resolving deltas: 67% (42288/63114) Resolving deltas: 68% (42918/63114) Resolving deltas: 69% (43549/63114) Resolving deltas: 70% (44180/63114) Resolving deltas: 71% (44811/63114) Resolving deltas: 72% (45443/63114) Resolving deltas: 73% (46075/63114) Resolving deltas: 74% (46705/63114) Resolving deltas: 75% (47336/63114) Resolving deltas: 76% (47967/63114) Resolving deltas: 77% (48598/63114) Resolving deltas: 78% (49229/63114) Resolving deltas: 79% (49861/63114) Resolving deltas: 80% (50494/63114) Resolving deltas: 81% (51123/63114) Resolving deltas: 82% (51754/63114) Resolving deltas: 83% (52386/63114) Resolving deltas: 84% (53016/63114) Resolving deltas: 85% (53647/63114) Resolving deltas: 86% (54279/63114) Resolving deltas: 87% (54912/63114) Resolving deltas: 88% (55541/63114) Resolving deltas: 89% (56173/63114) Resolving deltas: 90% (56803/63114) Resolving deltas: 91% (57434/63114) Resolving deltas: 92% (58067/63114) Resolving deltas: 93% (58697/63114) Resolving deltas: 94% (59328/63114) Resolving deltas: 95% (59960/63114) Resolving deltas: 96% (60590/63114) Resolving deltas: 97% (61221/63114) Resolving deltas: 98% (61852/63114) Resolving deltas: 99% (62484/63114) Resolving deltas: 100% (63114/63114) Resolving deltas: 100% (63114/63114), done.
  9. 16.20 s Fetching commit 01982f688b6810d5152f0317713db412ae7ea794 for codex/raised-energy-cff-reviewed ...
  10. 16.20 s $ /nix/store/bcnisk3ydfgv26v2gw3zlky24g00yww2-git-2.54.0/bin/git fetch origin 01982f688b6810d5152f0317713db412ae7ea794
  11. 16.60 s From https://github.com/alphal00p/gammaloop
  12. 16.60 s * branch 01982f688b6810d5152f0317713db412ae7ea794 -> FETCH_HEAD
  13. 16.61 s $ /nix/store/9ypz3flqsrl5xl495mm8h645gadjsxi1-coreutils-9.11/bin/timeout --kill-after=15s 7200s /nix/store/bcnisk3ydfgv26v2gw3zlky24g00yww2-git-2.54.0/bin/git -c advice.detachedHead=false checkout 01982f688b6810d5152f0317713db412ae7ea794
  14. 16.89 s HEAD is now at 01982f688 document the reviewed CFF stack and validation
  15. 16.90 s $ /nix/store/9ypz3flqsrl5xl495mm8h645gadjsxi1-coreutils-9.11/bin/timeout --kill-after=15s 7200s /nix/store/23zk8sgzamrbmj1fday15szf7f2279s8-nix-2.34.7/bin/nix --extra-experimental-features nix-command --extra-experimental-features flakes --log-format internal-json run .#packages.x86_64-linux.nix-ci-check-gammaloop-nextest-python-api --print-build-logs
  16. 23.75 s
  17. 23.87 s Downloading cached nix-ci-check-gammaloop-nextest-python-api from https://cache.nix-ci.com
  18. 23.88 s Downloaded cached nix-ci-check-gammaloop-nextest-python-api (1104 B) in 3ms
  19. 23.88 s Progress: 0 of 1 built, 1 of 1 downloaded from cache
  20. 31.24 s evaluating derivation 'g copying '/nix/store/8j7s evaluating derivation 'g copying '/nix/store/8j7s evaluating derivation 'g copying '/nix/store/8j7s evaluating derivation 'g copying '/nix/store/8j7s evaluating derivation 'g copying '/nix/store/8j7s evaluating derivation 'g copying '/nix/store/8j7s evaluating derivation 'g copying '/nix/store/8j7s evaluating derivation 'g querying gammaloop-nexte [0/1 built, 0.0 KiB DL] [1/0/1 built, 0.0 KiB DLgammaloop-nextest-python-api> Extracting 1 binary, 1 build script output directory, and 3 linked paths to /build/nextest-archive-MCQr5d
  21. 31.30 s gammaloop-nextest-python-api> Extracted 18 files to /build/nextest-archive-MCQr5d in 0.06s
  22. 31.31 s gammaloop-nextest-python-api> ------------
  23. 31.31 s gammaloop-nextest-python-api> Nextest run ID 2141cd37-3725-4f36-934f-18f6e0b33fd7 with nextest profile: ci_gammaloop
  24. 31.31 s gammaloop-nextest-python-api> Starting 5 tests across 1 binary
  25. 31.49 s gammaloop-nextest-python-api> FAIL [ 0.180s] (2/5) gammaloop-integration-tests::test_python_api python_evaluate_sample_preserves_graph_grouping_and_incoming_pdgs
  26. 31.49 s gammaloop-nextest-python-api> stdout ---
  27. 31.49 s gammaloop-nextest-python-api>
  28. 31.49 s gammaloop-nextest-python-api> running 1 test
  29. 31.49 s gammaloop-nextest-python-api> test python_evaluate_sample_preserves_graph_grouping_and_incoming_pdgs ... FAILED
  30. 31.49 s gammaloop-nextest-python-api>
  31. 31.49 s gammaloop-nextest-python-api> failures:
  32. 31.49 s gammaloop-nextest-python-api>
  33. 31.49 s gammaloop-nextest-python-api> failures:
  34. 31.49 s gammaloop-nextest-python-api> python_evaluate_sample_preserves_graph_grouping_and_incoming_pdgs
  35. 31.49 s gammaloop-nextest-python-api>
  36. 31.49 s gammaloop-nextest-python-api> test result: FAILED. 0 passed; 1 failed; 0 ignored; 0 measured; 4 filtered out; finished in 0.18s
  37. 31.49 s gammaloop-nextest-python-api>
  38. 31.49 s gammaloop-nextest-python-api> stderr ---
  39. 31.49 s gammaloop-nextest-python-api> Error: Python API test subprocess failed.
  40. 31.49 s gammaloop-nextest-python-api> stdout:
  41. 31.49 s gammaloop-nextest-python-api> ┌────────────────────────────────────────────────────────┐
  42. 31.49 s gammaloop-nextest-python-api> │ You are running a restricted Symbolica instance. │
  43. 31.49 s gammaloop-nextest-python-api> │ │
  44. 31.49 s gammaloop-nextest-python-api> │ This mode is only permitted for non-commercial use and │
  45. 31.49 s gammaloop-nextest-python-api> │ is limited to one instance and core per machine. │
  46. 31.49 s gammaloop-nextest-python-api> │ │
  47. 31.49 s gammaloop-nextest-python-api> │ Hobbyists can easily acquire a free license key │
  48. 31.49 s gammaloop-nextest-python-api> │ that unlocks all cores and removes this banner: │
  49. 31.49 s gammaloop-nextest-python-api> │ │
  50. 31.49 s gammaloop-nextest-python-api> │ from symbolica import * │
  51. 31.49 s gammaloop-nextest-python-api> │ request_hobbyist_license('YOUR_NAME', 'YOUR_EMAIL') │
  52. 31.49 s gammaloop-nextest-python-api> │ │
  53. 31.49 s gammaloop-nextest-python-api> │ All other users can obtain a free 30-day trial key: │
  54. 31.49 s gammaloop-nextest-python-api> │ │
  55. 31.49 s gammaloop-nextest-python-api> │ from symbolica import * │
  56. 31.49 s gammaloop-nextest-python-api> │ request_trial_license('NAME', 'EMAIL', 'EMPLOYER') │
  57. 31.49 s gammaloop-nextest-python-api> │ │
  58. 31.49 s gammaloop-nextest-python-api> │ See https://symbolica.io/docs/get_started.html#license │
  59. 31.49 s gammaloop-nextest-python-api> └────────────────────────────────────────────────────────┘
  60. 31.49 s gammaloop-nextest-python-api> ┌───────────────────────────────────────────────────────────────────────────────────────────────────────────┐
  61. 31.49 s gammaloop-nextest-python-api> │ Cannot start new unlicensed Symbolica instance since there is already another one running on the machine. │
  62. 31.49 s gammaloop-nextest-python-api> └───────────────────────────────────────────────────────────────────────────────────────────────────────────┘
  63. 31.49 s gammaloop-nextest-python-api>
  64. 31.49 s gammaloop-nextest-python-api> stderr:
  65. 31.49 s gammaloop-nextest-python-api>
  66. 31.49 s gammaloop-nextest-python-api> ┌───────────────────────────────────────────────────────────┐
  67. 31.49 s gammaloop-nextest-python-api> │ Could not resolve the IP of the Symbolica license server. │
  68. 31.49 s gammaloop-nextest-python-api> │ │
  69. 31.49 s gammaloop-nextest-python-api> │ Please check your DNS configuration. │
  70. 31.49 s gammaloop-nextest-python-api> └───────────────────────────────────────────────────────────┘
  71. 31.49 s gammaloop-nextest-python-api> Error: failed to lookup address information: Temporary failure in name resolution
  72. 31.49 s gammaloop-nextest-python-api>
  73. 31.49 s gammaloop-nextest-python-api>
  74. 31.49 s gammaloop-nextest-python-api> Location:
  75. 31.49 s gammaloop-nextest-python-api> tests/tests/test_python_api.rs:156:20
  76. 31.49 s gammaloop-nextest-python-api>
  77. 31.49 s gammaloop-nextest-python-api> FAIL [ 0.180s] (3/5) gammaloop-integration-tests::test_python_api python_evaluate_samples_batch_and_momentum_space_have_expected_shape
  78. 31.49 s gammaloop-nextest-python-api> stdout ---
  79. 31.49 s gammaloop-nextest-python-api>
  80. 31.49 s gammaloop-nextest-python-api> running 1 test
  81. 31.49 s gammaloop-nextest-python-api> test python_evaluate_samples_batch_and_momentum_space_have_expected_shape ... FAILED
  82. 31.49 s gammaloop-nextest-python-api>
  83. 31.49 s gammaloop-nextest-python-api> failures:
  84. 31.49 s gammaloop-nextest-python-api>
  85. 31.49 s gammaloop-nextest-python-api> failures:
  86. 31.49 s gammaloop-nextest-python-api> python_evaluate_samples_batch_and_momentum_space_have_expected_shape
  87. 31.49 s gammaloop-nextest-python-api>
  88. 31.49 s gammaloop-nextest-python-api> test result: FAILED. 0 passed; 1 failed; 0 ignored; 0 measured; 4 filtered out; finished in 0.18s
  89. 31.49 s gammaloop-nextest-python-api>
  90. 31.49 s gammaloop-nextest-python-api> stderr ---
  91. 31.49 s gammaloop-nextest-python-api> Error: Python API test subprocess failed.
  92. 31.49 s gammaloop-nextest-python-api> stdout:
  93. 31.49 s gammaloop-nextest-python-api> ┌────────────────────────────────────────────────────────┐
  94. 31.49 s gammaloop-nextest-python-api> │ You are running a restricted Symbolica instance. │
  95. 31.49 s gammaloop-nextest-python-api> │ │
  96. 31.49 s gammaloop-nextest-python-api> │ This mode is only permitted for non-commercial use and │
  97. 31.49 s gammaloop-nextest-python-api> │ is limited to one instance and core per machine. │
  98. 31.49 s gammaloop-nextest-python-api> │ │
  99. 31.49 s gammaloop-nextest-python-api> │ Hobbyists can easily acquire a free license key │
  100. 31.49 s gammaloop-nextest-python-api> │ that unlocks all cores and removes this banner: │
  101. 31.49 s gammaloop-nextest-python-api> │ │
  102. 31.49 s gammaloop-nextest-python-api> │ from symbolica import * │
  103. 31.49 s gammaloop-nextest-python-api> │ request_hobbyist_license('YOUR_NAME', 'YOUR_EMAIL') │
  104. 31.49 s gammaloop-nextest-python-api> │ │
  105. 31.49 s gammaloop-nextest-python-api> │ All other users can obtain a free 30-day trial key: │
  106. 31.49 s gammaloop-nextest-python-api> │ │
  107. 31.49 s gammaloop-nextest-python-api> │ from symbolica import * │
  108. 31.49 s gammaloop-nextest-python-api> │ request_trial_license('NAME', 'EMAIL', 'EMPLOYER') │
  109. 31.49 s gammaloop-nextest-python-api> │ │
  110. 31.49 s gammaloop-nextest-python-api> │ See https://symbolica.io/docs/get_started.html#license │
  111. 31.49 s gammaloop-nextest-python-api> └────────────────────────────────────────────────────────┘
  112. 31.49 s gammaloop-nextest-python-api> ┌───────────────────────────────────────────────────────────────────────────────────────────────────────────┐
  113. 31.49 s gammaloop-nextest-python-api> │ Cannot start new unlicensed Symbolica instance since there is already another one running on the machine. │
  114. 31.49 s gammaloop-nextest-python-api> └───────────────────────────────────────────────────────────────────────────────────────────────────────────┘
  115. 31.49 s gammaloop-nextest-python-api>
  116. 31.49 s gammaloop-nextest-python-api> stderr:
  117. 31.49 s gammaloop-nextest-python-api>
  118. 31.49 s gammaloop-nextest-python-api> ┌───────────────────────────────────────────────────────────┐
  119. 31.49 s gammaloop-nextest-python-api> │ Could not resolve the IP of the Symbolica license server. │
  120. 31.49 s gammaloop-nextest-python-api> │ │
  121. 31.49 s gammaloop-nextest-python-api> │ Please check your DNS configuration. │
  122. 31.49 s gammaloop-nextest-python-api> └───────────────────────────────────────────────────────────┘
  123. 31.49 s gammaloop-nextest-python-api> Error: failed to lookup address information: Temporary failure in name resolution
  124. 31.49 s gammaloop-nextest-python-api>
  125. 31.49 s gammaloop-nextest-python-api>
  126. 31.49 s gammaloop-nextest-python-api> Location:
  127. 31.49 s gammaloop-nextest-python-api> tests/tests/test_python_api.rs:156:20
  128. 31.49 s gammaloop-nextest-python-api>
  129. 31.50 s gammaloop-nextest-python-api> FAIL [ 0.187s] (4/5) gammaloop-integration-tests::test_python_api python_evaluate_sample_honors_generate_events_and_observable_snapshots
  130. 31.50 s gammaloop-nextest-python-api> stdout ---
  131. 31.50 s gammaloop-nextest-python-api>
  132. 31.50 s gammaloop-nextest-python-api> running 1 test
  133. 31.50 s gammaloop-nextest-python-api> test python_evaluate_sample_honors_generate_events_and_observable_snapshots ... FAILED
  134. 31.50 s gammaloop-nextest-python-api>
  135. 31.50 s gammaloop-nextest-python-api> failures:
  136. 31.50 s gammaloop-nextest-python-api>
  137. 31.50 s gammaloop-nextest-python-api> failures:
  138. 31.50 s gammaloop-nextest-python-api> python_evaluate_sample_honors_generate_events_and_observable_snapshots
  139. 31.50 s gammaloop-nextest-python-api>
  140. 31.50 s gammaloop-nextest-python-api> test result: FAILED. 0 passed; 1 failed; 0 ignored; 0 measured; 4 filtered out; finished in 0.18s
  141. 31.50 s gammaloop-nextest-python-api>
  142. 31.50 s gammaloop-nextest-python-api> stderr ---
  143. 31.50 s gammaloop-nextest-python-api> Error: Python API test subprocess failed.
  144. 31.50 s gammaloop-nextest-python-api> stdout:
  145. 31.50 s gammaloop-nextest-python-api> ┌────────────────────────────────────────────────────────┐
  146. 31.50 s gammaloop-nextest-python-api> │ You are running a restricted Symbolica instance. │
  147. 31.50 s gammaloop-nextest-python-api> │ │
  148. 31.50 s gammaloop-nextest-python-api> │ This mode is only permitted for non-commercial use and │
  149. 31.50 s gammaloop-nextest-python-api> │ is limited to one instance and core per machine. │
  150. 31.50 s gammaloop-nextest-python-api> │ │
  151. 31.50 s gammaloop-nextest-python-api> │ Hobbyists can easily acquire a free license key │
  152. 31.50 s gammaloop-nextest-python-api> │ that unlocks all cores and removes this banner: │
  153. 31.50 s gammaloop-nextest-python-api> │ │
  154. 31.50 s gammaloop-nextest-python-api> │ from symbolica import * │
  155. 31.50 s gammaloop-nextest-python-api> │ request_hobbyist_license('YOUR_NAME', 'YOUR_EMAIL') │
  156. 31.50 s gammaloop-nextest-python-api> │ │
  157. 31.50 s gammaloop-nextest-python-api> │ All other users can obtain a free 30-day trial key: │
  158. 31.50 s gammaloop-nextest-python-api> │ │
  159. 31.50 s gammaloop-nextest-python-api> │ from symbolica import * │
  160. 31.50 s gammaloop-nextest-python-api> │ request_trial_license('NAME', 'EMAIL', 'EMPLOYER') │
  161. 31.50 s gammaloop-nextest-python-api> │ │
  162. 31.50 s gammaloop-nextest-python-api> │ See https://symbolica.io/docs/get_started.html#license │
  163. 31.50 s gammaloop-nextest-python-api> └────────────────────────────────────────────────────────┘
  164. 31.50 s gammaloop-nextest-python-api> ┌───────────────────────────────────────────────────────────────────────────────────────────────────────────┐
  165. 31.50 s gammaloop-nextest-python-api> │ Cannot start new unlicensed Symbolica instance since there is already another one running on the machine. │
  166. 31.50 s gammaloop-nextest-python-api> └───────────────────────────────────────────────────────────────────────────────────────────────────────────┘
  167. 31.50 s gammaloop-nextest-python-api>
  168. 31.50 s gammaloop-nextest-python-api> stderr:
  169. 31.50 s gammaloop-nextest-python-api>
  170. 31.50 s gammaloop-nextest-python-api> ┌───────────────────────────────────────────────────────────┐
  171. 31.50 s gammaloop-nextest-python-api> │ Could not resolve the IP of the Symbolica license server. │
  172. 31.50 s gammaloop-nextest-python-api> │ │
  173. 31.50 s gammaloop-nextest-python-api> │ Please check your DNS configuration. │
  174. 31.50 s gammaloop-nextest-python-api> └───────────────────────────────────────────────────────────┘
  175. 31.50 s gammaloop-nextest-python-api> Error: failed to lookup address information: Temporary failure in name resolution
  176. 31.50 s gammaloop-nextest-python-api>
  177. 31.50 s gammaloop-nextest-python-api>
  178. 31.50 s gammaloop-nextest-python-api> Location:
  179. 31.50 s gammaloop-nextest-python-api> tests/tests/test_python_api.rs:156:20
  180. 31.50 s gammaloop-nextest-python-api>
  181. 31.57 s gammaloop-nextest-python-api> ------------
  182. 31.57 s gammaloop-nextest-python-api> Summary [ 0.252s] 5 tests run: 2 passed, 3 failed, 0 skipped
  183. 31.57 s gammaloop-nextest-python-api> FAIL [ 0.180s] (2/5) gammaloop-integration-tests::test_python_api python_evaluate_sample_preserves_graph_grouping_and_incoming_pdgs
  184. 31.57 s gammaloop-nextest-python-api> stdout ---
  185. 31.57 s gammaloop-nextest-python-api>
  186. 31.57 s gammaloop-nextest-python-api> running 1 test
  187. 31.57 s gammaloop-nextest-python-api> test python_evaluate_sample_preserves_graph_grouping_and_incoming_pdgs ... FAILED
  188. 31.57 s gammaloop-nextest-python-api>
  189. 31.57 s gammaloop-nextest-python-api> failures:
  190. 31.57 s gammaloop-nextest-python-api>
  191. 31.57 s gammaloop-nextest-python-api> failures:
  192. 31.57 s gammaloop-nextest-python-api> python_evaluate_sample_preserves_graph_grouping_and_incoming_pdgs
  193. 31.57 s gammaloop-nextest-python-api>
  194. 31.57 s gammaloop-nextest-python-api> test result: FAILED. 0 passed; 1 failed; 0 ignored; 0 measured; 4 filtered out; finished in 0.18s
  195. 31.57 s gammaloop-nextest-python-api>
  196. 31.57 s gammaloop-nextest-python-api> stderr ---
  197. 31.57 s gammaloop-nextest-python-api> Error: Python API test subprocess failed.
  198. 31.57 s gammaloop-nextest-python-api> stdout:
  199. 31.57 s gammaloop-nextest-python-api> ┌────────────────────────────────────────────────────────┐
  200. 31.57 s gammaloop-nextest-python-api> │ You are running a restricted Symbolica instance. │
  201. 31.57 s gammaloop-nextest-python-api> │ │
  202. 31.57 s gammaloop-nextest-python-api> │ This mode is only permitted for non-commercial use and │
  203. 31.57 s gammaloop-nextest-python-api> │ is limited to one instance and core per machine. │
  204. 31.57 s gammaloop-nextest-python-api> │ │
  205. 31.57 s gammaloop-nextest-python-api> │ Hobbyists can easily acquire a free license key │
  206. 31.57 s gammaloop-nextest-python-api> │ that unlocks all cores and removes this banner: │
  207. 31.57 s gammaloop-nextest-python-api> │ │
  208. 31.57 s gammaloop-nextest-python-api> │ from symbolica import * │
  209. 31.57 s gammaloop-nextest-python-api> │ request_hobbyist_license('YOUR_NAME', 'YOUR_EMAIL') │
  210. 31.57 s gammaloop-nextest-python-api> │ │
  211. 31.57 s gammaloop-nextest-python-api> │ All other users can obtain a free 30-day trial key: │
  212. 31.57 s gammaloop-nextest-python-api> │ │
  213. 31.57 s gammaloop-nextest-python-api> │ from symbolica import * │
  214. 31.57 s gammaloop-nextest-python-api> │ request_trial_license('NAME', 'EMAIL', 'EMPLOYER') │
  215. 31.57 s gammaloop-nextest-python-api> │ │
  216. 31.57 s gammaloop-nextest-python-api> │ See https://symbolica.io/docs/get_started.html#license │
  217. 31.57 s gammaloop-nextest-python-api> └────────────────────────────────────────────────────────┘
  218. 31.57 s gammaloop-nextest-python-api> ┌───────────────────────────────────────────────────────────────────────────────────────────────────────────┐
  219. 31.57 s gammaloop-nextest-python-api> │ Cannot start new unlicensed Symbolica instance since there is already another one running on the machine. │
  220. 31.57 s gammaloop-nextest-python-api> └───────────────────────────────────────────────────────────────────────────────────────────────────────────┘
  221. 31.57 s gammaloop-nextest-python-api>
  222. 31.57 s gammaloop-nextest-python-api> stderr:
  223. 31.57 s gammaloop-nextest-python-api>
  224. 31.57 s gammaloop-nextest-python-api> ┌───────────────────────────────────────────────────────────┐
  225. 31.57 s gammaloop-nextest-python-api> │ Could not resolve the IP of the Symbolica license server. │
  226. 31.57 s gammaloop-nextest-python-api> │ │
  227. 31.57 s gammaloop-nextest-python-api> │ Please check your DNS configuration. │
  228. 31.57 s gammaloop-nextest-python-api> └───────────────────────────────────────────────────────────┘
  229. 31.57 s gammaloop-nextest-python-api> Error: failed to lookup address information: Temporary failure in name resolution
  230. 31.57 s gammaloop-nextest-python-api>
  231. 31.57 s gammaloop-nextest-python-api>
  232. 31.57 s gammaloop-nextest-python-api> Location:
  233. 31.57 s gammaloop-nextest-python-api> tests/tests/test_python_api.rs:156:20
  234. 31.57 s gammaloop-nextest-python-api>
  235. 31.57 s gammaloop-nextest-python-api> FAIL [ 0.180s] (3/5) gammaloop-integration-tests::test_python_api python_evaluate_samples_batch_and_momentum_space_have_expected_shape
  236. 31.57 s gammaloop-nextest-python-api> stdout ---
  237. 31.57 s gammaloop-nextest-python-api>
  238. 31.57 s gammaloop-nextest-python-api> running 1 test
  239. 31.57 s gammaloop-nextest-python-api> test python_evaluate_samples_batch_and_momentum_space_have_expected_shape ... FAILED
  240. 31.57 s gammaloop-nextest-python-api>
  241. 31.57 s gammaloop-nextest-python-api> failures:
  242. 31.57 s gammaloop-nextest-python-api>
  243. 31.57 s gammaloop-nextest-python-api> failures:
  244. 31.57 s gammaloop-nextest-python-api> python_evaluate_samples_batch_and_momentum_space_have_expected_shape
  245. 31.57 s gammaloop-nextest-python-api>
  246. 31.57 s gammaloop-nextest-python-api> test result: FAILED. 0 passed; 1 failed; 0 ignored; 0 measured; 4 filtered out; finished in 0.18s
  247. 31.57 s gammaloop-nextest-python-api>
  248. 31.57 s gammaloop-nextest-python-api> stderr ---
  249. 31.57 s gammaloop-nextest-python-api> Error: Python API test subprocess failed.
  250. 31.57 s gammaloop-nextest-python-api> stdout:
  251. 31.57 s gammaloop-nextest-python-api> ┌────────────────────────────────────────────────────────┐
  252. 31.57 s gammaloop-nextest-python-api> │ You are running a restricted Symbolica instance. │
  253. 31.57 s gammaloop-nextest-python-api> │ │
  254. 31.57 s gammaloop-nextest-python-api> │ This mode is only permitted for non-commercial use and │
  255. 31.57 s gammaloop-nextest-python-api> │ is limited to one instance and core per machine. │
  256. 31.57 s gammaloop-nextest-python-api> │ │
  257. 31.57 s gammaloop-nextest-python-api> │ Hobbyists can easily acquire a free license key │
  258. 31.57 s gammaloop-nextest-python-api> │ that unlocks all cores and removes this banner: │
  259. 31.57 s gammaloop-nextest-python-api> │ │
  260. 31.57 s gammaloop-nextest-python-api> │ from symbolica import * │
  261. 31.57 s gammaloop-nextest-python-api> │ request_hobbyist_license('YOUR_NAME', 'YOUR_EMAIL') │
  262. 31.57 s gammaloop-nextest-python-api> │ │
  263. 31.57 s gammaloop-nextest-python-api> │ All other users can obtain a free 30-day trial key: │
  264. 31.57 s gammaloop-nextest-python-api> │ │
  265. 31.57 s gammaloop-nextest-python-api> │ from symbolica import * │
  266. 31.57 s gammaloop-nextest-python-api> │ request_trial_license('NAME', 'EMAIL', 'EMPLOYER') │
  267. 31.57 s gammaloop-nextest-python-api> │ │
  268. 31.57 s gammaloop-nextest-python-api> │ See https://symbolica.io/docs/get_started.html#license │
  269. 31.57 s gammaloop-nextest-python-api> └────────────────────────────────────────────────────────┘
  270. 31.57 s gammaloop-nextest-python-api> ┌───────────────────────────────────────────────────────────────────────────────────────────────────────────┐
  271. 31.57 s gammaloop-nextest-python-api> │ Cannot start new unlicensed Symbolica instance since there is already another one running on the machine. │
  272. 31.57 s gammaloop-nextest-python-api> └───────────────────────────────────────────────────────────────────────────────────────────────────────────┘
  273. 31.57 s gammaloop-nextest-python-api>
  274. 31.57 s gammaloop-nextest-python-api> stderr:
  275. 31.57 s gammaloop-nextest-python-api>
  276. 31.57 s gammaloop-nextest-python-api> ┌───────────────────────────────────────────────────────────┐
  277. 31.57 s gammaloop-nextest-python-api> │ Could not resolve the IP of the Symbolica license server. │
  278. 31.57 s gammaloop-nextest-python-api> │ │
  279. 31.57 s gammaloop-nextest-python-api> │ Please check your DNS configuration. │
  280. 31.57 s gammaloop-nextest-python-api> └───────────────────────────────────────────────────────────┘
  281. 31.57 s gammaloop-nextest-python-api> Error: failed to lookup address information: Temporary failure in name resolution
  282. 31.57 s gammaloop-nextest-python-api>
  283. 31.57 s gammaloop-nextest-python-api>
  284. 31.57 s gammaloop-nextest-python-api> Location:
  285. 31.57 s gammaloop-nextest-python-api> tests/tests/test_python_api.rs:156:20
  286. 31.57 s gammaloop-nextest-python-api>
  287. 31.57 s gammaloop-nextest-python-api> FAIL [ 0.187s] (4/5) gammaloop-integration-tests::test_python_api python_evaluate_sample_honors_generate_events_and_observable_snapshots
  288. 31.57 s gammaloop-nextest-python-api> stdout ---
  289. 31.57 s gammaloop-nextest-python-api>
  290. 31.57 s gammaloop-nextest-python-api> running 1 test
  291. 31.57 s gammaloop-nextest-python-api> test python_evaluate_sample_honors_generate_events_and_observable_snapshots ... FAILED
  292. 31.57 s gammaloop-nextest-python-api>
  293. 31.57 s gammaloop-nextest-python-api> failures:
  294. 31.57 s gammaloop-nextest-python-api>
  295. 31.57 s gammaloop-nextest-python-api> failures:
  296. 31.57 s gammaloop-nextest-python-api> python_evaluate_sample_honors_generate_events_and_observable_snapshots
  297. 31.57 s gammaloop-nextest-python-api>
  298. 31.57 s gammaloop-nextest-python-api> test result: FAILED. 0 passed; 1 failed; 0 ignored; 0 measured; 4 filtered out; finished in 0.18s
  299. 31.57 s gammaloop-nextest-python-api>
  300. 31.57 s gammaloop-nextest-python-api> stderr ---
  301. 31.57 s gammaloop-nextest-python-api> Error: Python API test subprocess failed.
  302. 31.57 s gammaloop-nextest-python-api> stdout:
  303. 31.57 s gammaloop-nextest-python-api> ┌────────────────────────────────────────────────────────┐
  304. 31.57 s gammaloop-nextest-python-api> │ You are running a restricted Symbolica instance. │
  305. 31.57 s gammaloop-nextest-python-api> │ │
  306. 31.57 s gammaloop-nextest-python-api> │ This mode is only permitted for non-commercial use and │
  307. 31.57 s gammaloop-nextest-python-api> │ is limited to one instance and core per machine. │
  308. 31.57 s gammaloop-nextest-python-api> │ │
  309. 31.57 s gammaloop-nextest-python-api> │ Hobbyists can easily acquire a free license key │
  310. 31.57 s gammaloop-nextest-python-api> │ that unlocks all cores and removes this banner: │
  311. 31.57 s gammaloop-nextest-python-api> │ │
  312. 31.57 s gammaloop-nextest-python-api> │ from symbolica import * │
  313. 31.57 s gammaloop-nextest-python-api> │ request_hobbyist_license('YOUR_NAME', 'YOUR_EMAIL') │
  314. 31.57 s gammaloop-nextest-python-api> │ │
  315. 31.57 s gammaloop-nextest-python-api> │ All other users can obtain a free 30-day trial key: │
  316. 31.57 s gammaloop-nextest-python-api> │ │
  317. 31.57 s gammaloop-nextest-python-api> │ from symbolica import * │
  318. 31.57 s gammaloop-nextest-python-api> │ request_trial_license('NAME', 'EMAIL', 'EMPLOYER') │
  319. 31.57 s gammaloop-nextest-python-api> │ │
  320. 31.57 s gammaloop-nextest-python-api> │ See https://symbolica.io/docs/get_started.html#license │
  321. 31.57 s gammaloop-nextest-python-api> └────────────────────────────────────────────────────────┘
  322. 31.57 s gammaloop-nextest-python-api> ┌───────────────────────────────────────────────────────────────────────────────────────────────────────────┐
  323. 31.57 s gammaloop-nextest-python-api> │ Cannot start new unlicensed Symbolica instance since there is already another one running on the machine. │
  324. 31.57 s gammaloop-nextest-python-api> └───────────────────────────────────────────────────────────────────────────────────────────────────────────┘
  325. 31.57 s gammaloop-nextest-python-api>
  326. 31.57 s gammaloop-nextest-python-api> stderr:
  327. 31.57 s gammaloop-nextest-python-api>
  328. 31.57 s gammaloop-nextest-python-api> ┌───────────────────────────────────────────────────────────┐
  329. 31.57 s gammaloop-nextest-python-api> │ Could not resolve the IP of the Symbolica license server. │
  330. 31.57 s gammaloop-nextest-python-api> │ │
  331. 31.57 s gammaloop-nextest-python-api> │ Please check your DNS configuration. │
  332. 31.57 s gammaloop-nextest-python-api> └───────────────────────────────────────────────────────────┘
  333. 31.57 s gammaloop-nextest-python-api> Error: failed to lookup address information: Temporary failure in name resolution
  334. 31.57 s gammaloop-nextest-python-api>
  335. 31.57 s gammaloop-nextest-python-api>
  336. 31.57 s gammaloop-nextest-python-api> Location:
  337. 31.57 s gammaloop-nextest-python-api> tests/tests/test_python_api.rs:156:20
  338. 31.57 s gammaloop-nextest-python-api>
  339. 31.58 s gammaloop-nextest-python-api> error: test run failed
  340. 31.60 s gammaloop-nextest-python-api>
  341. 31.60 s gammaloop-nextest-python-api> ========== nextest test summary ==========
  342. 31.60 s gammaloop-nextest-python-api> report: target/nextest/ci_gammaloop/junit.xml
  343. 31.60 s gammaloop-nextest-python-api> tests: 5, failures: 3, errors: 0
  344. 31.60 s gammaloop-nextest-python-api>
  345. 31.60 s gammaloop-nextest-python-api> 1. gammaloop-integration-tests::test_python_api::python_evaluate_sample_preserves_graph_grouping_and_incoming_pdgs
  346. 31.60 s gammaloop-nextest-python-api> failure: test failure with exit code 101
  347. 31.60 s gammaloop-nextest-python-api> Error: Python API test subprocess failed.
  348. 31.60 s gammaloop-nextest-python-api> stdout:
  349. 31.60 s gammaloop-nextest-python-api> ┌────────────────────────────────────────────────────────┐
  350. 31.60 s gammaloop-nextest-python-api> │ You are running a restricted Symbolica instance. │
  351. 31.60 s gammaloop-nextest-python-api> │ │
  352. 31.60 s gammaloop-nextest-python-api> │ This mode is only permitted for non-commercial use and │
  353. 31.60 s gammaloop-nextest-python-api> │ is limited to one instance and core per machine. │
  354. 31.60 s gammaloop-nextest-python-api> │ │
  355. 31.60 s gammaloop-nextest-python-api> │ Hobbyists can easily acquire a free license key │
  356. 31.60 s gammaloop-nextest-python-api> │ that unlocks all cores and removes this banner: │
  357. 31.60 s gammaloop-nextest-python-api> │ │
  358. 31.60 s gammaloop-nextest-python-api> │ from symbolica import * │
  359. 31.60 s gammaloop-nextest-python-api> │ request_hobbyist_license('YOUR_NAME', 'YOUR_EMAIL') │
  360. 31.60 s gammaloop-nextest-python-api> │ │
  361. 31.60 s gammaloop-nextest-python-api> │ All other users can obtain a free 30-day trial key: │
  362. 31.60 s gammaloop-nextest-python-api> │ │
  363. 31.60 s gammaloop-nextest-python-api> │ from symbolica import * │
  364. 31.60 s gammaloop-nextest-python-api> │ request_trial_license('NAME', 'EMAIL', 'EMPLOYER') │
  365. 31.60 s gammaloop-nextest-python-api> │ │
  366. 31.60 s gammaloop-nextest-python-api> │ See https://symbolica.io/docs/get_started.html#license │
  367. 31.60 s gammaloop-nextest-python-api> └────────────────────────────────────────────────────────┘
  368. 31.60 s gammaloop-nextest-python-api> ┌───────────────────────────────────────────────────────────────────────────────────────────────────────────┐
  369. 31.60 s gammaloop-nextest-python-api> │ Cannot start new unlicensed Symbolica instance since there is already another one running on the machine. │
  370. 31.60 s gammaloop-nextest-python-api> └───────────────────────────────────────────────────────────────────────────────────────────────────────────┘
  371. 31.60 s gammaloop-nextest-python-api>
  372. 31.60 s gammaloop-nextest-python-api> stderr:
  373. 31.60 s gammaloop-nextest-python-api>
  374. 31.60 s gammaloop-nextest-python-api> ┌───────────────────────────────────────────────────────────┐
  375. 31.60 s gammaloop-nextest-python-api> │ Could not resolve the IP of the Symbolica license server. │
  376. 31.60 s gammaloop-nextest-python-api> │ │
  377. 31.60 s gammaloop-nextest-python-api> │ Please check your DNS configuration. │
  378. 31.60 s gammaloop-nextest-python-api> └───────────────────────────────────────────────────────────┘
  379. 31.60 s gammaloop-nextest-python-api> Error: failed to lookup address information: Temporary failure in name resolution
  380. 31.60 s gammaloop-nextest-python-api>
  381. 31.60 s gammaloop-nextest-python-api>
  382. 31.60 s gammaloop-nextest-python-api> Location:
  383. 31.60 s gammaloop-nextest-python-api> tests/tests/test_python_api.rs:156:20
  384. 31.60 s gammaloop-nextest-python-api> system-out
  385. 31.60 s gammaloop-nextest-python-api> running 1 test
  386. 31.60 s gammaloop-nextest-python-api> test python_evaluate_sample_preserves_graph_grouping_and_incoming_pdgs ... FAILED
  387. 31.60 s gammaloop-nextest-python-api>
  388. 31.60 s gammaloop-nextest-python-api> failures:
  389. 31.60 s gammaloop-nextest-python-api>
  390. 31.60 s gammaloop-nextest-python-api> failures:
  391. 31.60 s gammaloop-nextest-python-api> python_evaluate_sample_preserves_graph_grouping_and_incoming_pdgs
  392. 31.60 s gammaloop-nextest-python-api>
  393. 31.60 s gammaloop-nextest-python-api> test result: FAILED. 0 passed; 1 failed; 0 ignored; 0 measured; 4 filtered out; finished in 0.18s
  394. 31.60 s gammaloop-nextest-python-api> system-err
  395. 31.60 s gammaloop-nextest-python-api> Error: Python API test subprocess failed.
  396. 31.60 s gammaloop-nextest-python-api> stdout:
  397. 31.60 s gammaloop-nextest-python-api> ┌────────────────────────────────────────────────────────┐
  398. 31.60 s gammaloop-nextest-python-api> │ You are running a restricted Symbolica instance. │
  399. 31.60 s gammaloop-nextest-python-api> │ │
  400. 31.60 s gammaloop-nextest-python-api> │ This mode is only permitted for non-commercial use and │
  401. 31.60 s gammaloop-nextest-python-api> │ is limited to one instance and core per machine. │
  402. 31.60 s gammaloop-nextest-python-api> │ │
  403. 31.60 s gammaloop-nextest-python-api> │ Hobbyists can easily acquire a free license key │
  404. 31.60 s gammaloop-nextest-python-api> │ that unlocks all cores and removes this banner: │
  405. 31.60 s gammaloop-nextest-python-api> │ │
  406. 31.60 s gammaloop-nextest-python-api> │ from symbolica import * │
  407. 31.60 s gammaloop-nextest-python-api> │ request_hobbyist_license('YOUR_NAME', 'YOUR_EMAIL') │
  408. 31.60 s gammaloop-nextest-python-api> │ │
  409. 31.60 s gammaloop-nextest-python-api> │ All other users can obtain a free 30-day trial key: │
  410. 31.60 s gammaloop-nextest-python-api> │ │
  411. 31.60 s gammaloop-nextest-python-api> │ from symbolica import * │
  412. 31.60 s gammaloop-nextest-python-api> │ request_trial_license('NAME', 'EMAIL', 'EMPLOYER') │
  413. 31.60 s gammaloop-nextest-python-api> │ │
  414. 31.60 s gammaloop-nextest-python-api> │ See https://symbolica.io/docs/get_started.html#license │
  415. 31.60 s gammaloop-nextest-python-api> └────────────────────────────────────────────────────────┘
  416. 31.60 s gammaloop-nextest-python-api> ┌───────────────────────────────────────────────────────────────────────────────────────────────────────────┐
  417. 31.60 s gammaloop-nextest-python-api> │ Cannot start new unlicensed Symbolica instance since there is already another one running on the machine. │
  418. 31.60 s gammaloop-nextest-python-api> └───────────────────────────────────────────────────────────────────────────────────────────────────────────┘
  419. 31.60 s gammaloop-nextest-python-api>
  420. 31.60 s gammaloop-nextest-python-api> stderr:
  421. 31.60 s gammaloop-nextest-python-api>
  422. 31.60 s gammaloop-nextest-python-api> ┌───────────────────────────────────────────────────────────┐
  423. 31.60 s gammaloop-nextest-python-api> │ Could not resolve the IP of the Symbolica license server. │
  424. 31.60 s gammaloop-nextest-python-api> │ │
  425. 31.60 s gammaloop-nextest-python-api> │ Please check your DNS configuration. │
  426. 31.60 s gammaloop-nextest-python-api> └───────────────────────────────────────────────────────────┘
  427. 31.60 s gammaloop-nextest-python-api> Error: failed to lookup address information: Temporary failure in name resolution
  428. 31.60 s gammaloop-nextest-python-api>
  429. 31.60 s gammaloop-nextest-python-api>
  430. 31.60 s gammaloop-nextest-python-api> Location:
  431. 31.60 s gammaloop-nextest-python-api> tests/tests/test_python_api.rs:156:20
  432. 31.60 s gammaloop-nextest-python-api>
  433. 31.60 s gammaloop-nextest-python-api> 2. gammaloop-integration-tests::test_python_api::python_evaluate_samples_batch_and_momentum_space_have_expected_shape
  434. 31.60 s gammaloop-nextest-python-api> failure: test failure with exit code 101
  435. 31.60 s gammaloop-nextest-python-api> Error: Python API test subprocess failed.
  436. 31.60 s gammaloop-nextest-python-api> stdout:
  437. 31.60 s gammaloop-nextest-python-api> ┌────────────────────────────────────────────────────────┐
  438. 31.60 s gammaloop-nextest-python-api> │ You are running a restricted Symbolica instance. │
  439. 31.60 s gammaloop-nextest-python-api> │ │
  440. 31.60 s gammaloop-nextest-python-api> │ This mode is only permitted for non-commercial use and │
  441. 31.60 s gammaloop-nextest-python-api> │ is limited to one instance and core per machine. │
  442. 31.60 s gammaloop-nextest-python-api> │ │
  443. 31.60 s gammaloop-nextest-python-api> │ Hobbyists can easily acquire a free license key │
  444. 31.60 s gammaloop-nextest-python-api> │ that unlocks all cores and removes this banner: │
  445. 31.60 s gammaloop-nextest-python-api> │ │
  446. 31.60 s gammaloop-nextest-python-api> │ from symbolica import * │
  447. 31.60 s gammaloop-nextest-python-api> │ request_hobbyist_license('YOUR_NAME', 'YOUR_EMAIL') │
  448. 31.60 s gammaloop-nextest-python-api> │ │
  449. 31.60 s gammaloop-nextest-python-api> │ All other users can obtain a free 30-day trial key: │
  450. 31.60 s gammaloop-nextest-python-api> │ │
  451. 31.60 s gammaloop-nextest-python-api> │ from symbolica import * │
  452. 31.60 s gammaloop-nextest-python-api> │ request_trial_license('NAME', 'EMAIL', 'EMPLOYER') │
  453. 31.60 s gammaloop-nextest-python-api> │ │
  454. 31.60 s gammaloop-nextest-python-api> │ See https://symbolica.io/docs/get_started.html#license │
  455. 31.60 s gammaloop-nextest-python-api> └────────────────────────────────────────────────────────┘
  456. 31.60 s gammaloop-nextest-python-api> ┌───────────────────────────────────────────────────────────────────────────────────────────────────────────┐
  457. 31.60 s gammaloop-nextest-python-api> │ Cannot start new unlicensed Symbolica instance since there is already another one running on the machine. │
  458. 31.60 s gammaloop-nextest-python-api> └───────────────────────────────────────────────────────────────────────────────────────────────────────────┘
  459. 31.60 s gammaloop-nextest-python-api>
  460. 31.60 s gammaloop-nextest-python-api> stderr:
  461. 31.60 s gammaloop-nextest-python-api>
  462. 31.60 s gammaloop-nextest-python-api> ┌───────────────────────────────────────────────────────────┐
  463. 31.60 s gammaloop-nextest-python-api> │ Could not resolve the IP of the Symbolica license server. │
  464. 31.60 s gammaloop-nextest-python-api> │ │
  465. 31.60 s gammaloop-nextest-python-api> │ Please check your DNS configuration. │
  466. 31.60 s gammaloop-nextest-python-api> └───────────────────────────────────────────────────────────┘
  467. 31.60 s gammaloop-nextest-python-api> Error: failed to lookup address information: Temporary failure in name resolution
  468. 31.60 s gammaloop-nextest-python-api>
  469. 31.60 s gammaloop-nextest-python-api>
  470. 31.60 s gammaloop-nextest-python-api> Location:
  471. 31.60 s gammaloop-nextest-python-api> tests/tests/test_python_api.rs:156:20
  472. 31.60 s gammaloop-nextest-python-api> system-out
  473. 31.60 s gammaloop-nextest-python-api> running 1 test
  474. 31.60 s gammaloop-nextest-python-api> test python_evaluate_samples_batch_and_momentum_space_have_expected_shape ... FAILED
  475. 31.60 s gammaloop-nextest-python-api>
  476. 31.60 s gammaloop-nextest-python-api> failures:
  477. 31.60 s gammaloop-nextest-python-api>
  478. 31.60 s gammaloop-nextest-python-api> failures:
  479. 31.60 s gammaloop-nextest-python-api> python_evaluate_samples_batch_and_momentum_space_have_expected_shape
  480. 31.60 s gammaloop-nextest-python-api>
  481. 31.60 s gammaloop-nextest-python-api> test result: FAILED. 0 passed; 1 failed; 0 ignored; 0 measured; 4 filtered out; finished in 0.18s
  482. 31.60 s gammaloop-nextest-python-api> system-err
  483. 31.60 s gammaloop-nextest-python-api> Error: Python API test subprocess failed.
  484. 31.60 s gammaloop-nextest-python-api> stdout:
  485. 31.60 s gammaloop-nextest-python-api> ┌────────────────────────────────────────────────────────┐
  486. 31.60 s gammaloop-nextest-python-api> │ You are running a restricted Symbolica instance. │
  487. 31.60 s gammaloop-nextest-python-api> │ │
  488. 31.60 s gammaloop-nextest-python-api> │ This mode is only permitted for non-commercial use and │
  489. 31.60 s gammaloop-nextest-python-api> │ is limited to one instance and core per machine. │
  490. 31.60 s gammaloop-nextest-python-api> │ │
  491. 31.60 s gammaloop-nextest-python-api> │ Hobbyists can easily acquire a free license key │
  492. 31.60 s gammaloop-nextest-python-api> │ that unlocks all cores and removes this banner: │
  493. 31.60 s gammaloop-nextest-python-api> │ │
  494. 31.60 s gammaloop-nextest-python-api> │ from symbolica import * │
  495. 31.60 s gammaloop-nextest-python-api> │ request_hobbyist_license('YOUR_NAME', 'YOUR_EMAIL') │
  496. 31.60 s gammaloop-nextest-python-api> │ │
  497. 31.60 s gammaloop-nextest-python-api> │ All other users can obtain a free 30-day trial key: │
  498. 31.60 s gammaloop-nextest-python-api> │ │
  499. 31.60 s gammaloop-nextest-python-api> │ from symbolica import * │
  500. 31.60 s gammaloop-nextest-python-api> │ request_trial_license('NAME', 'EMAIL', 'EMPLOYER') │
  501. 31.60 s gammaloop-nextest-python-api> │ │
  502. 31.60 s gammaloop-nextest-python-api> │ See https://symbolica.io/docs/get_started.html#license │
  503. 31.60 s gammaloop-nextest-python-api> └────────────────────────────────────────────────────────┘
  504. 31.60 s gammaloop-nextest-python-api> ┌───────────────────────────────────────────────────────────────────────────────────────────────────────────┐
  505. 31.60 s gammaloop-nextest-python-api> │ Cannot start new unlicensed Symbolica instance since there is already another one running on the machine. │
  506. 31.60 s gammaloop-nextest-python-api> └───────────────────────────────────────────────────────────────────────────────────────────────────────────┘
  507. 31.60 s gammaloop-nextest-python-api>
  508. 31.60 s gammaloop-nextest-python-api> stderr:
  509. 31.60 s gammaloop-nextest-python-api>
  510. 31.60 s gammaloop-nextest-python-api> ┌───────────────────────────────────────────────────────────┐
  511. 31.60 s gammaloop-nextest-python-api> │ Could not resolve the IP of the Symbolica license server. │
  512. 31.60 s gammaloop-nextest-python-api> │ │
  513. 31.60 s gammaloop-nextest-python-api> │ Please check your DNS configuration. │
  514. 31.60 s gammaloop-nextest-python-api> └───────────────────────────────────────────────────────────┘
  515. 31.60 s gammaloop-nextest-python-api> Error: failed to lookup address information: Temporary failure in name resolution
  516. 31.60 s gammaloop-nextest-python-api>
  517. 31.60 s gammaloop-nextest-python-api>
  518. 31.60 s gammaloop-nextest-python-api> Location:
  519. 31.60 s gammaloop-nextest-python-api> tests/tests/test_python_api.rs:156:20
  520. 31.60 s gammaloop-nextest-python-api>
  521. 31.60 s gammaloop-nextest-python-api> 3. gammaloop-integration-tests::test_python_api::python_evaluate_sample_honors_generate_events_and_observable_snapshots
  522. 31.60 s gammaloop-nextest-python-api> failure: test failure with exit code 101
  523. 31.60 s gammaloop-nextest-python-api> Error: Python API test subprocess failed.
  524. 31.60 s gammaloop-nextest-python-api> stdout:
  525. 31.60 s gammaloop-nextest-python-api> ┌────────────────────────────────────────────────────────┐
  526. 31.60 s gammaloop-nextest-python-api> │ You are running a restricted Symbolica instance. │
  527. 31.60 s gammaloop-nextest-python-api> │ │
  528. 31.60 s gammaloop-nextest-python-api> │ This mode is only permitted for non-commercial use and │
  529. 31.60 s gammaloop-nextest-python-api> │ is limited to one instance and core per machine. │
  530. 31.60 s gammaloop-nextest-python-api> │ │
  531. 31.60 s gammaloop-nextest-python-api> │ Hobbyists can easily acquire a free license key │
  532. 31.60 s gammaloop-nextest-python-api> │ that unlocks all cores and removes this banner: │
  533. 31.60 s gammaloop-nextest-python-api> │ │
  534. 31.60 s gammaloop-nextest-python-api> │ from symbolica import * │
  535. 31.60 s gammaloop-nextest-python-api> │ request_hobbyist_license('YOUR_NAME', 'YOUR_EMAIL') │
  536. 31.60 s gammaloop-nextest-python-api> │ │
  537. 31.60 s gammaloop-nextest-python-api> │ All other users can obtain a free 30-day trial key: │
  538. 31.60 s gammaloop-nextest-python-api> │ │
  539. 31.60 s gammaloop-nextest-python-api> │ from symbolica import * │
  540. 31.60 s gammaloop-nextest-python-api> │ request_trial_license('NAME', 'EMAIL', 'EMPLOYER') │
  541. 31.60 s gammaloop-nextest-python-api> │ │
  542. 31.60 s gammaloop-nextest-python-api> │ See https://symbolica.io/docs/get_started.html#license │
  543. 31.60 s gammaloop-nextest-python-api> └────────────────────────────────────────────────────────┘
  544. 31.60 s gammaloop-nextest-python-api> ┌───────────────────────────────────────────────────────────────────────────────────────────────────────────┐
  545. 31.60 s gammaloop-nextest-python-api> │ Cannot start new unlicensed Symbolica instance since there is already another one running on the machine. │
  546. 31.60 s gammaloop-nextest-python-api> └───────────────────────────────────────────────────────────────────────────────────────────────────────────┘
  547. 31.60 s gammaloop-nextest-python-api>
  548. 31.60 s gammaloop-nextest-python-api> stderr:
  549. 31.60 s gammaloop-nextest-python-api>
  550. 31.60 s gammaloop-nextest-python-api> ┌───────────────────────────────────────────────────────────┐
  551. 31.60 s gammaloop-nextest-python-api> │ Could not resolve the IP of the Symbolica license server. │
  552. 31.60 s gammaloop-nextest-python-api> │ │
  553. 31.60 s gammaloop-nextest-python-api> │ Please check your DNS configuration. │
  554. 31.60 s gammaloop-nextest-python-api> └───────────────────────────────────────────────────────────┘
  555. 31.60 s gammaloop-nextest-python-api> Error: failed to lookup address information: Temporary failure in name resolution
  556. 31.60 s gammaloop-nextest-python-api>
  557. 31.60 s gammaloop-nextest-python-api>
  558. 31.60 s gammaloop-nextest-python-api> Location:
  559. 31.60 s gammaloop-nextest-python-api> tests/tests/test_python_api.rs:156:20
  560. 31.60 s gammaloop-nextest-python-api> system-out
  561. 31.60 s gammaloop-nextest-python-api> running 1 test
  562. 31.60 s gammaloop-nextest-python-api> test python_evaluate_sample_honors_generate_events_and_observable_snapshots ... FAILED
  563. 31.60 s gammaloop-nextest-python-api>
  564. 31.60 s gammaloop-nextest-python-api> failures:
  565. 31.60 s gammaloop-nextest-python-api>
  566. 31.60 s gammaloop-nextest-python-api> failures:
  567. 31.60 s gammaloop-nextest-python-api> python_evaluate_sample_honors_generate_events_and_observable_snapshots
  568. 31.60 s gammaloop-nextest-python-api>
  569. 31.60 s gammaloop-nextest-python-api> test result: FAILED. 0 passed; 1 failed; 0 ignored; 0 measured; 4 filtered out; finished in 0.18s
  570. 31.60 s gammaloop-nextest-python-api> system-err
  571. 31.60 s gammaloop-nextest-python-api> Error: Python API test subprocess failed.
  572. 31.60 s gammaloop-nextest-python-api> stdout:
  573. 31.60 s gammaloop-nextest-python-api> ┌────────────────────────────────────────────────────────┐
  574. 31.60 s gammaloop-nextest-python-api> │ You are running a restricted Symbolica instance. │
  575. 31.60 s gammaloop-nextest-python-api> │ │
  576. 31.60 s gammaloop-nextest-python-api> │ This mode is only permitted for non-commercial use and │
  577. 31.60 s gammaloop-nextest-python-api> │ is limited to one instance and core per machine. │
  578. 31.60 s gammaloop-nextest-python-api> │ │
  579. 31.60 s gammaloop-nextest-python-api> │ Hobbyists can easily acquire a free license key │
  580. 31.60 s gammaloop-nextest-python-api> │ that unlocks all cores and removes this banner: │
  581. 31.60 s gammaloop-nextest-python-api> │ │
  582. 31.60 s gammaloop-nextest-python-api> │ from symbolica import * │
  583. 31.60 s gammaloop-nextest-python-api> │ request_hobbyist_license('YOUR_NAME', 'YOUR_EMAIL') │
  584. 31.60 s gammaloop-nextest-python-api> │ │
  585. 31.60 s gammaloop-nextest-python-api> │ All other users can obtain a free 30-day trial key: │
  586. 31.60 s gammaloop-nextest-python-api> │ │
  587. 31.60 s gammaloop-nextest-python-api> │ from symbolica import * │
  588. 31.60 s gammaloop-nextest-python-api> │ request_trial_license('NAME', 'EMAIL', 'EMPLOYER') │
  589. 31.60 s gammaloop-nextest-python-api> │ │
  590. 31.60 s gammaloop-nextest-python-api> │ See https://symbolica.io/docs/get_started.html#license │
  591. 31.60 s gammaloop-nextest-python-api> └────────────────────────────────────────────────────────┘
  592. 31.60 s gammaloop-nextest-python-api> ┌───────────────────────────────────────────────────────────────────────────────────────────────────────────┐
  593. 31.60 s gammaloop-nextest-python-api> │ Cannot start new unlicensed Symbolica instance since there is already another one running on the machine. │
  594. 31.60 s gammaloop-nextest-python-api> └───────────────────────────────────────────────────────────────────────────────────────────────────────────┘
  595. 31.60 s gammaloop-nextest-python-api>
  596. 31.60 s gammaloop-nextest-python-api> stderr:
  597. 31.60 s gammaloop-nextest-python-api>
  598. 31.60 s gammaloop-nextest-python-api> ┌───────────────────────────────────────────────────────────┐
  599. 31.60 s gammaloop-nextest-python-api> │ Could not resolve the IP of the Symbolica license server. │
  600. 31.60 s gammaloop-nextest-python-api> │ │
  601. 31.60 s gammaloop-nextest-python-api> │ Please check your DNS configuration. │
  602. 31.60 s gammaloop-nextest-python-api> └───────────────────────────────────────────────────────────┘
  603. 31.60 s gammaloop-nextest-python-api> Error: failed to lookup address information: Temporary failure in name resolution
  604. 31.60 s gammaloop-nextest-python-api>
  605. 31.60 s gammaloop-nextest-python-api>
  606. 31.60 s gammaloop-nextest-python-api> Location:
  607. 31.60 s gammaloop-nextest-python-api> tests/tests/test_python_api.rs:156:20
  608. 31.60 s gammaloop-nextest-python-api> =========================================
  609. 31.64 s error: Cannot build '/nix/store/6yfkarcx1yqfdkgaj26q9b9n3q0min5r-gammaloop-nextest-python-api.drv'.
  610. 31.64 s Reason: builder failed with exit code 100.
  611. 31.64 s Output paths:
  612. 31.64 s /nix/store/28q91q76k9l62yayywlk70ghfzfk0v47-gammaloop-nextest-python-api
  613. 31.64 s Last 589 log lines:
  614. 31.64 s > Extracting 1 binary, 1 build script output directory, and 3 linked paths to /build/nextest-archive-MCQr5d
  615. 31.64 s > Extracted 18 files to /build/nextest-archive-MCQr5d in 0.06s
  616. 31.64 s > ------------
  617. 31.64 s > Nextest run ID 2141cd37-3725-4f36-934f-18f6e0b33fd7 with nextest profile: ci_gammaloop
  618. 31.64 s > Starting 5 tests across 1 binary
  619. 31.64 s > FAIL [ 0.180s] (2/5) gammaloop-integration-tests::test_python_api python_evaluate_sample_preserves_graph_grouping_and_incoming_pdgs
  620. 31.64 s > stdout ---
  621. 31.64 s >
  622. 31.64 s > running 1 test
  623. 31.64 s > test python_evaluate_sample_preserves_graph_grouping_and_incoming_pdgs ... FAILED
  624. 31.64 s >
  625. 31.64 s > failures:
  626. 31.64 s >
  627. 31.64 s > failures:
  628. 31.64 s > python_evaluate_sample_preserves_graph_grouping_and_incoming_pdgs
  629. 31.64 s >
  630. 31.64 s > test result: FAILED. 0 passed; 1 failed; 0 ignored; 0 measured; 4 filtered out; finished in 0.18s
  631. 31.64 s >
  632. 31.64 s > stderr ---
  633. 31.64 s > Error: Python API test subprocess failed.
  634. 31.64 s > stdout:
  635. 31.64 s > ┌────────────────────────────────────────────────────────┐
  636. 31.64 s > │ You are running a restricted Symbolica instance. │
  637. 31.64 s > │ │
  638. 31.64 s > │ This mode is only permitted for non-commercial use and │
  639. 31.64 s > │ is limited to one instance and core per machine. │
  640. 31.64 s > │ │
  641. 31.64 s > │ Hobbyists can easily acquire a free license key │
  642. 31.64 s > │ that unlocks all cores and removes this banner: │
  643. 31.64 s > │ │
  644. 31.64 s > │ from symbolica import * │
  645. 31.64 s > │ request_hobbyist_license('YOUR_NAME', 'YOUR_EMAIL') │
  646. 31.64 s > │ │
  647. 31.64 s > │ All other users can obtain a free 30-day trial key: │
  648. 31.64 s > │ │
  649. 31.64 s > │ from symbolica import * │
  650. 31.64 s > │ request_trial_license('NAME', 'EMAIL', 'EMPLOYER') │
  651. 31.64 s > │ │
  652. 31.64 s > │ See https://symbolica.io/docs/get_started.html#license │
  653. 31.64 s > └────────────────────────────────────────────────────────┘
  654. 31.64 s > ┌───────────────────────────────────────────────────────────────────────────────────────────────────────────┐
  655. 31.64 s > │ Cannot start new unlicensed Symbolica instance since there is already another one running on the machine. │
  656. 31.64 s > └───────────────────────────────────────────────────────────────────────────────────────────────────────────┘
  657. 31.64 s >
  658. 31.64 s > stderr:
  659. 31.64 s >
  660. 31.64 s > ┌───────────────────────────────────────────────────────────┐
  661. 31.64 s > │ Could not resolve the IP of the Symbolica license server. │
  662. 31.64 s > │ │
  663. 31.64 s > │ Please check your DNS configuration. │
  664. 31.64 s > └───────────────────────────────────────────────────────────┘
  665. 31.64 s > Error: failed to lookup address information: Temporary failure in name resolution
  666. 31.64 s >
  667. 31.64 s >
  668. 31.64 s > Location:
  669. 31.64 s > tests/tests/test_python_api.rs:156:20
  670. 31.64 s >
  671. 31.64 s > FAIL [ 0.180s] (3/5) gammaloop-integration-tests::test_python_api python_evaluate_samples_batch_and_momentum_space_have_expected_shape
  672. 31.64 s > stdout ---
  673. 31.64 s >
  674. 31.64 s > running 1 test
  675. 31.64 s > test python_evaluate_samples_batch_and_momentum_space_have_expected_shape ... FAILED
  676. 31.64 s >
  677. 31.64 s > failures:
  678. 31.64 s >
  679. 31.64 s > failures:
  680. 31.64 s > python_evaluate_samples_batch_and_momentum_space_have_expected_shape
  681. 31.64 s >
  682. 31.64 s > test result: FAILED. 0 passed; 1 failed; 0 ignored; 0 measured; 4 filtered out; finished in 0.18s
  683. 31.64 s >
  684. 31.64 s > stderr ---
  685. 31.64 s > Error: Python API test subprocess failed.
  686. 31.64 s > stdout:
  687. 31.64 s > ┌────────────────────────────────────────────────────────┐
  688. 31.64 s > │ You are running a restricted Symbolica instance. │
  689. 31.64 s > │ │
  690. 31.64 s > │ This mode is only permitted for non-commercial use and │
  691. 31.64 s > │ is limited to one instance and core per machine. │
  692. 31.64 s > │ │
  693. 31.64 s > │ Hobbyists can easily acquire a free license key │
  694. 31.64 s > │ that unlocks all cores and removes this banner: │
  695. 31.64 s > │ │
  696. 31.64 s > │ from symbolica import * │
  697. 31.64 s > │ request_hobbyist_license('YOUR_NAME', 'YOUR_EMAIL') │
  698. 31.64 s > │ │
  699. 31.64 s > │ All other users can obtain a free 30-day trial key: │
  700. 31.64 s > │ │
  701. 31.64 s > │ from symbolica import * │
  702. 31.64 s > │ request_trial_license('NAME', 'EMAIL', 'EMPLOYER') │
  703. 31.64 s > │ │
  704. 31.64 s > │ See https://symbolica.io/docs/get_started.html#license │
  705. 31.64 s > └────────────────────────────────────────────────────────┘
  706. 31.64 s > ┌───────────────────────────────────────────────────────────────────────────────────────────────────────────┐
  707. 31.64 s > │ Cannot start new unlicensed Symbolica instance since there is already another one running on the machine. │
  708. 31.64 s > └───────────────────────────────────────────────────────────────────────────────────────────────────────────┘
  709. 31.64 s >
  710. 31.64 s > stderr:
  711. 31.64 s >
  712. 31.64 s > ┌───────────────────────────────────────────────────────────┐
  713. 31.64 s > │ Could not resolve the IP of the Symbolica license server. │
  714. 31.64 s > │ │
  715. 31.64 s > │ Please check your DNS configuration. │
  716. 31.64 s > └───────────────────────────────────────────────────────────┘
  717. 31.64 s > Error: failed to lookup address information: Temporary failure in name resolution
  718. 31.64 s >
  719. 31.64 s >
  720. 31.64 s > Location:
  721. 31.64 s > tests/tests/test_python_api.rs:156:20
  722. 31.64 s >
  723. 31.64 s > FAIL [ 0.187s] (4/5) gammaloop-integration-tests::test_python_api python_evaluate_sample_honors_generate_events_and_observable_snapshots
  724. 31.64 s > stdout ---
  725. 31.64 s >
  726. 31.64 s > running 1 test
  727. 31.64 s > test python_evaluate_sample_honors_generate_events_and_observable_snapshots ... FAILED
  728. 31.64 s >
  729. 31.64 s > failures:
  730. 31.64 s >
  731. 31.64 s > failures:
  732. 31.64 s > python_evaluate_sample_honors_generate_events_and_observable_snapshots
  733. 31.64 s >
  734. 31.64 s > test result: FAILED. 0 passed; 1 failed; 0 ignored; 0 measured; 4 filtered out; finished in 0.18s
  735. 31.64 s >
  736. 31.64 s > stderr ---
  737. 31.64 s > Error: Python API test subprocess failed.
  738. 31.64 s > stdout:
  739. 31.64 s > ┌────────────────────────────────────────────────────────┐
  740. 31.64 s > │ You are running a restricted Symbolica instance. │
  741. 31.64 s > │ │
  742. 31.64 s > │ This mode is only permitted for non-commercial use and │
  743. 31.64 s > │ is limited to one instance and core per machine. │
  744. 31.64 s > │ │
  745. 31.64 s > │ Hobbyists can easily acquire a free license key │
  746. 31.64 s > │ that unlocks all cores and removes this banner: │
  747. 31.64 s > │ │
  748. 31.64 s > │ from symbolica import * │
  749. 31.64 s > │ request_hobbyist_license('YOUR_NAME', 'YOUR_EMAIL') │
  750. 31.64 s > │ │
  751. 31.64 s > │ All other users can obtain a free 30-day trial key: │
  752. 31.64 s > │ │
  753. 31.64 s > │ from symbolica import * │
  754. 31.64 s > │ request_trial_license('NAME', 'EMAIL', 'EMPLOYER') │
  755. 31.64 s > │ │
  756. 31.64 s > │ See https://symbolica.io/docs/get_started.html#license │
  757. 31.64 s > └────────────────────────────────────────────────────────┘
  758. 31.64 s > ┌───────────────────────────────────────────────────────────────────────────────────────────────────────────┐
  759. 31.64 s > │ Cannot start new unlicensed Symbolica instance since there is already another one running on the machine. │
  760. 31.64 s > └───────────────────────────────────────────────────────────────────────────────────────────────────────────┘
  761. 31.64 s >
  762. 31.64 s > stderr:
  763. 31.64 s >
  764. 31.64 s > ┌───────────────────────────────────────────────────────────┐
  765. 31.64 s > │ Could not resolve the IP of the Symbolica license server. │
  766. 31.64 s > │ │
  767. 31.64 s > │ Please check your DNS configuration. │
  768. 31.64 s > └───────────────────────────────────────────────────────────┘
  769. 31.64 s > Error: failed to lookup address information: Temporary failure in name resolution
  770. 31.64 s >
  771. 31.64 s >
  772. 31.64 s > Location:
  773. 31.64 s > tests/tests/test_python_api.rs:156:20
  774. 31.64 s >
  775. 31.64 s > ------------
  776. 31.64 s > Summary [ 0.252s] 5 tests run: 2 passed, 3 failed, 0 skipped
  777. 31.64 s > FAIL [ 0.180s] (2/5) gammaloop-integration-tests::test_python_api python_evaluate_sample_preserves_graph_grouping_and_incoming_pdgs
  778. 31.64 s > stdout ---
  779. 31.64 s >
  780. 31.64 s > running 1 test
  781. 31.64 s > test python_evaluate_sample_preserves_graph_grouping_and_incoming_pdgs ... FAILED
  782. 31.64 s >
  783. 31.64 s > failures:
  784. 31.64 s >
  785. 31.64 s > failures:
  786. 31.64 s > python_evaluate_sample_preserves_graph_grouping_and_incoming_pdgs
  787. 31.64 s >
  788. 31.64 s > test result: FAILED. 0 passed; 1 failed; 0 ignored; 0 measured; 4 filtered out; finished in 0.18s
  789. 31.64 s >
  790. 31.64 s > stderr ---
  791. 31.64 s > Error: Python API test subprocess failed.
  792. 31.64 s > stdout:
  793. 31.64 s > ┌────────────────────────────────────────────────────────┐
  794. 31.64 s > │ You are running a restricted Symbolica instance. │
  795. 31.64 s > │ │
  796. 31.64 s > │ This mode is only permitted for non-commercial use and │
  797. 31.64 s > │ is limited to one instance and core per machine. │
  798. 31.64 s > │ │
  799. 31.64 s > │ Hobbyists can easily acquire a free license key │
  800. 31.64 s > │ that unlocks all cores and removes this banner: │
  801. 31.64 s > │ │
  802. 31.64 s > │ from symbolica import * │
  803. 31.64 s > │ request_hobbyist_license('YOUR_NAME', 'YOUR_EMAIL') │
  804. 31.64 s > │ │
  805. 31.64 s > │ All other users can obtain a free 30-day trial key: │
  806. 31.64 s > │ │
  807. 31.64 s > │ from symbolica import * │
  808. 31.64 s > │ request_trial_license('NAME', 'EMAIL', 'EMPLOYER') │
  809. 31.64 s > │ │
  810. 31.64 s > │ See https://symbolica.io/docs/get_started.html#license │
  811. 31.64 s > └────────────────────────────────────────────────────────┘
  812. 31.64 s > ┌───────────────────────────────────────────────────────────────────────────────────────────────────────────┐
  813. 31.64 s > │ Cannot start new unlicensed Symbolica instance since there is already another one running on the machine. │
  814. 31.64 s > └───────────────────────────────────────────────────────────────────────────────────────────────────────────┘
  815. 31.64 s >
  816. 31.64 s > stderr:
  817. 31.64 s >
  818. 31.64 s > ┌───────────────────────────────────────────────────────────┐
  819. 31.64 s > │ Could not resolve the IP of the Symbolica license server. │
  820. 31.64 s > │ │
  821. 31.64 s > │ Please check your DNS configuration. │
  822. 31.64 s > └───────────────────────────────────────────────────────────┘
  823. 31.64 s > Error: failed to lookup address information: Temporary failure in name resolution
  824. 31.64 s >
  825. 31.64 s >
  826. 31.64 s > Location:
  827. 31.64 s > tests/tests/test_python_api.rs:156:20
  828. 31.64 s >
  829. 31.64 s > FAIL [ 0.180s] (3/5) gammaloop-integration-tests::test_python_api python_evaluate_samples_batch_and_momentum_space_have_expected_shape
  830. 31.64 s > stdout ---
  831. 31.64 s >
  832. 31.64 s > running 1 test
  833. 31.64 s > test python_evaluate_samples_batch_and_momentum_space_have_expected_shape ... FAILED
  834. 31.64 s >
  835. 31.64 s > failures:
  836. 31.64 s >
  837. 31.64 s > failures:
  838. 31.64 s > python_evaluate_samples_batch_and_momentum_space_have_expected_shape
  839. 31.64 s >
  840. 31.64 s > test result: FAILED. 0 passed; 1 failed; 0 ignored; 0 measured; 4 filtered out; finished in 0.18s
  841. 31.64 s >
  842. 31.64 s > stderr ---
  843. 31.64 s > Error: Python API test subprocess failed.
  844. 31.64 s > stdout:
  845. 31.64 s > ┌────────────────────────────────────────────────────────┐
  846. 31.64 s > │ You are running a restricted Symbolica instance. │
  847. 31.64 s > │ │
  848. 31.64 s > │ This mode is only permitted for non-commercial use and │
  849. 31.64 s > │ is limited to one instance and core per machine. │
  850. 31.64 s > │ │
  851. 31.64 s > │ Hobbyists can easily acquire a free license key │
  852. 31.64 s > │ that unlocks all cores and removes this banner: │
  853. 31.64 s > │ │
  854. 31.64 s > │ from symbolica import * │
  855. 31.64 s > │ request_hobbyist_license('YOUR_NAME', 'YOUR_EMAIL') │
  856. 31.64 s > │ │
  857. 31.64 s > │ All other users can obtain a free 30-day trial key: │
  858. 31.64 s > │ │
  859. 31.64 s > │ from symbolica import * │
  860. 31.64 s > │ request_trial_license('NAME', 'EMAIL', 'EMPLOYER') │
  861. 31.64 s > │ │
  862. 31.64 s > │ See https://symbolica.io/docs/get_started.html#license │
  863. 31.64 s > └────────────────────────────────────────────────────────┘
  864. 31.64 s > ┌───────────────────────────────────────────────────────────────────────────────────────────────────────────┐
  865. 31.64 s > │ Cannot start new unlicensed Symbolica instance since there is already another one running on the machine. │
  866. 31.64 s > └───────────────────────────────────────────────────────────────────────────────────────────────────────────┘
  867. 31.64 s >
  868. 31.64 s > stderr:
  869. 31.64 s >
  870. 31.64 s > ┌───────────────────────────────────────────────────────────┐
  871. 31.64 s > │ Could not resolve the IP of the Symbolica license server. │
  872. 31.64 s > │ │
  873. 31.64 s > │ Please check your DNS configuration. │
  874. 31.64 s > └───────────────────────────────────────────────────────────┘
  875. 31.64 s > Error: failed to lookup address information: Temporary failure in name resolution
  876. 31.64 s >
  877. 31.64 s >
  878. 31.64 s > Location:
  879. 31.64 s > tests/tests/test_python_api.rs:156:20
  880. 31.64 s >
  881. 31.64 s > FAIL [ 0.187s] (4/5) gammaloop-integration-tests::test_python_api python_evaluate_sample_honors_generate_events_and_observable_snapshots
  882. 31.64 s > stdout ---
  883. 31.64 s >
  884. 31.64 s > running 1 test
  885. 31.64 s > test python_evaluate_sample_honors_generate_events_and_observable_snapshots ... FAILED
  886. 31.64 s >
  887. 31.64 s > failures:
  888. 31.64 s >
  889. 31.64 s > failures:
  890. 31.64 s > python_evaluate_sample_honors_generate_events_and_observable_snapshots
  891. 31.64 s >
  892. 31.64 s > test result: FAILED. 0 passed; 1 failed; 0 ignored; 0 measured; 4 filtered out; finished in 0.18s
  893. 31.64 s >
  894. 31.64 s > stderr ---
  895. 31.64 s > Error: Python API test subprocess failed.
  896. 31.64 s > stdout:
  897. 31.64 s > ┌────────────────────────────────────────────────────────┐
  898. 31.64 s > │ You are running a restricted Symbolica instance. │
  899. 31.64 s > │ │
  900. 31.64 s > │ This mode is only permitted for non-commercial use and │
  901. 31.64 s > │ is limited to one instance and core per machine. │
  902. 31.64 s > │ │
  903. 31.64 s > │ Hobbyists can easily acquire a free license key │
  904. 31.64 s > │ that unlocks all cores and removes this banner: │
  905. 31.64 s > │ │
  906. 31.64 s > │ from symbolica import * │
  907. 31.64 s > │ request_hobbyist_license('YOUR_NAME', 'YOUR_EMAIL') │
  908. 31.64 s > │ │
  909. 31.64 s > │ All other users can obtain a free 30-day trial key: │
  910. 31.64 s > │ │
  911. 31.64 s > │ from symbolica import * │
  912. 31.64 s > │ request_trial_license('NAME', 'EMAIL', 'EMPLOYER') │
  913. 31.64 s > │ │
  914. 31.64 s > │ See https://symbolica.io/docs/get_started.html#license │
  915. 31.64 s > └────────────────────────────────────────────────────────┘
  916. 31.64 s > ┌───────────────────────────────────────────────────────────────────────────────────────────────────────────┐
  917. 31.64 s > │ Cannot start new unlicensed Symbolica instance since there is already another one running on the machine. │
  918. 31.64 s > └───────────────────────────────────────────────────────────────────────────────────────────────────────────┘
  919. 31.64 s >
  920. 31.64 s > stderr:
  921. 31.64 s >
  922. 31.64 s > ┌───────────────────────────────────────────────────────────┐
  923. 31.64 s > │ Could not resolve the IP of the Symbolica license server. │
  924. 31.64 s > │ │
  925. 31.64 s > │ Please check your DNS configuration. │
  926. 31.64 s > └───────────────────────────────────────────────────────────┘
  927. 31.64 s > Error: failed to lookup address information: Temporary failure in name resolution
  928. 31.64 s >
  929. 31.64 s >
  930. 31.64 s > Location:
  931. 31.64 s > tests/tests/test_python_api.rs:156:20
  932. 31.64 s >
  933. 31.64 s > error: test run failed
  934. 31.64 s >
  935. 31.64 s > ========== nextest test summary ==========
  936. 31.64 s > report: target/nextest/ci_gammaloop/junit.xml
  937. 31.64 s > tests: 5, failures: 3, errors: 0
  938. 31.64 s >
  939. 31.64 s > 1. gammaloop-integration-tests::test_python_api::python_evaluate_sample_preserves_graph_grouping_and_incoming_pdgs
  940. 31.64 s > failure: test failure with exit code 101
  941. 31.64 s > Error: Python API test subprocess failed.
  942. 31.64 s > stdout:
  943. 31.64 s > ┌────────────────────────────────────────────────────────┐
  944. 31.64 s > │ You are running a restricted Symbolica instance. │
  945. 31.64 s > │ │
  946. 31.64 s > │ This mode is only permitted for non-commercial use and │
  947. 31.64 s > │ is limited to one instance and core per machine. │
  948. 31.64 s > │ │
  949. 31.64 s > │ Hobbyists can easily acquire a free license key │
  950. 31.64 s > │ that unlocks all cores and removes this banner: │
  951. 31.64 s > │ │
  952. 31.64 s > │ from symbolica import * │
  953. 31.64 s > │ request_hobbyist_license('YOUR_NAME', 'YOUR_EMAIL') │
  954. 31.64 s > │ │
  955. 31.64 s > │ All other users can obtain a free 30-day trial key: │
  956. 31.64 s > │ │
  957. 31.64 s > │ from symbolica import * │
  958. 31.64 s > │ request_trial_license('NAME', 'EMAIL', 'EMPLOYER') │
  959. 31.64 s > │ │
  960. 31.64 s > │ See https://symbolica.io/docs/get_started.html#license │
  961. 31.64 s > └────────────────────────────────────────────────────────┘
  962. 31.64 s > ┌───────────────────────────────────────────────────────────────────────────────────────────────────────────┐
  963. 31.64 s > │ Cannot start new unlicensed Symbolica instance since there is already another one running on the machine. │
  964. 31.64 s > └───────────────────────────────────────────────────────────────────────────────────────────────────────────┘
  965. 31.64 s >
  966. 31.64 s > stderr:
  967. 31.64 s >
  968. 31.64 s > ┌───────────────────────────────────────────────────────────┐
  969. 31.64 s > │ Could not resolve the IP of the Symbolica license server. │
  970. 31.64 s > │ │
  971. 31.64 s > │ Please check your DNS configuration. │
  972. 31.64 s > └───────────────────────────────────────────────────────────┘
  973. 31.64 s > Error: failed to lookup address information: Temporary failure in name resolution
  974. 31.64 s >
  975. 31.64 s >
  976. 31.64 s > Location:
  977. 31.64 s > tests/tests/test_python_api.rs:156:20
  978. 31.64 s > system-out
  979. 31.64 s > running 1 test
  980. 31.64 s > test python_evaluate_sample_preserves_graph_grouping_and_incoming_pdgs ... FAILED
  981. 31.64 s >
  982. 31.64 s > failures:
  983. 31.64 s >
  984. 31.64 s > failures:
  985. 31.64 s > python_evaluate_sample_preserves_graph_grouping_and_incoming_pdgs
  986. 31.64 s >
  987. 31.64 s > test result: FAILED. 0 passed; 1 failed; 0 ignored; 0 measured; 4 filtered out; finished in 0.18s
  988. 31.64 s > system-err
  989. 31.64 s > Error: Python API test subprocess failed.
  990. 31.64 s > stdout:
  991. 31.64 s > ┌────────────────────────────────────────────────────────┐
  992. 31.64 s > │ You are running a restricted Symbolica instance. │
  993. 31.64 s > │ │
  994. 31.64 s > │ This mode is only permitted for non-commercial use and │
  995. 31.64 s > │ is limited to one instance and core per machine. │
  996. 31.64 s > │ │
  997. 31.64 s > │ Hobbyists can easily acquire a free license key │
  998. 31.64 s > │ that unlocks all cores and removes this banner: │
  999. 31.64 s > │ │
  1000. 31.64 s > │ from symbolica import * │
  1001. 31.64 s > │ request_hobbyist_license('YOUR_NAME', 'YOUR_EMAIL') │
  1002. 31.64 s > │ │
  1003. 31.64 s > │ All other users can obtain a free 30-day trial key: │
  1004. 31.64 s > │ │
  1005. 31.64 s > │ from symbolica import * │
  1006. 31.64 s > │ request_trial_license('NAME', 'EMAIL', 'EMPLOYER') │
  1007. 31.64 s > │ │
  1008. 31.64 s > │ See https://symbolica.io/docs/get_started.html#license │
  1009. 31.64 s > └────────────────────────────────────────────────────────┘
  1010. 31.64 s > ┌───────────────────────────────────────────────────────────────────────────────────────────────────────────┐
  1011. 31.64 s > │ Cannot start new unlicensed Symbolica instance since there is already another one running on the machine. │
  1012. 31.64 s > └───────────────────────────────────────────────────────────────────────────────────────────────────────────┘
  1013. 31.64 s >
  1014. 31.64 s > stderr:
  1015. 31.64 s >
  1016. 31.64 s > ┌───────────────────────────────────────────────────────────┐
  1017. 31.64 s > │ Could not resolve the IP of the Symbolica license server. │
  1018. 31.64 s > │ │
  1019. 31.64 s > │ Please check your DNS configuration. │
  1020. 31.64 s > └───────────────────────────────────────────────────────────┘
  1021. 31.64 s > Error: failed to lookup address information: Temporary failure in name resolution
  1022. 31.64 s >
  1023. 31.64 s >
  1024. 31.64 s > Location:
  1025. 31.64 s > tests/tests/test_python_api.rs:156:20
  1026. 31.64 s >
  1027. 31.64 s > 2. gammaloop-integration-tests::test_python_api::python_evaluate_samples_batch_and_momentum_space_have_expected_shape
  1028. 31.64 s > failure: test failure with exit code 101
  1029. 31.64 s > Error: Python API test subprocess failed.
  1030. 31.64 s > stdout:
  1031. 31.64 s > ┌────────────────────────────────────────────────────────┐
  1032. 31.64 s > │ You are running a restricted Symbolica instance. │
  1033. 31.64 s > │ │
  1034. 31.64 s > │ This mode is only permitted for non-commercial use and │
  1035. 31.64 s > │ is limited to one instance and core per machine. │
  1036. 31.64 s > │ │
  1037. 31.64 s > │ Hobbyists can easily acquire a free license key │
  1038. 31.64 s > │ that unlocks all cores and removes this banner: │
  1039. 31.64 s > │ │
  1040. 31.64 s > │ from symbolica import * │
  1041. 31.64 s > │ request_hobbyist_license('YOUR_NAME', 'YOUR_EMAIL') │
  1042. 31.64 s > │ │
  1043. 31.64 s > │ All other users can obtain a free 30-day trial key: │
  1044. 31.64 s > │ │
  1045. 31.64 s > │ from symbolica import * │
  1046. 31.64 s > │ request_trial_license('NAME', 'EMAIL', 'EMPLOYER') │
  1047. 31.64 s > │ │
  1048. 31.64 s > │ See https://symbolica.io/docs/get_started.html#license │
  1049. 31.64 s > └────────────────────────────────────────────────────────┘
  1050. 31.64 s > ┌───────────────────────────────────────────────────────────────────────────────────────────────────────────┐
  1051. 31.64 s > │ Cannot start new unlicensed Symbolica instance since there is already another one running on the machine. │
  1052. 31.64 s > └───────────────────────────────────────────────────────────────────────────────────────────────────────────┘
  1053. 31.64 s >
  1054. 31.64 s > stderr:
  1055. 31.64 s >
  1056. 31.64 s > ┌───────────────────────────────────────────────────────────┐
  1057. 31.64 s > │ Could not resolve the IP of the Symbolica license server. │
  1058. 31.64 s > │ │
  1059. 31.64 s > │ Please check your DNS configuration. │
  1060. 31.64 s > └───────────────────────────────────────────────────────────┘
  1061. 31.64 s > Error: failed to lookup address information: Temporary failure in name resolution
  1062. 31.64 s >
  1063. 31.64 s >
  1064. 31.64 s > Location:
  1065. 31.64 s > tests/tests/test_python_api.rs:156:20
  1066. 31.64 s > system-out
  1067. 31.64 s > running 1 test
  1068. 31.64 s > test python_evaluate_samples_batch_and_momentum_space_have_expected_shape ... FAILED
  1069. 31.64 s >
  1070. 31.64 s > failures:
  1071. 31.64 s >
  1072. 31.64 s > failures:
  1073. 31.64 s > python_evaluate_samples_batch_and_momentum_space_have_expected_shape
  1074. 31.64 s >
  1075. 31.64 s > test result: FAILED. 0 passed; 1 failed; 0 ignored; 0 measured; 4 filtered out; finished in 0.18s
  1076. 31.64 s > system-err
  1077. 31.64 s > Error: Python API test subprocess failed.
  1078. 31.64 s > stdout:
  1079. 31.64 s > ┌────────────────────────────────────────────────────────┐
  1080. 31.64 s > │ You are running a restricted Symbolica instance. │
  1081. 31.64 s > │ │
  1082. 31.64 s > │ This mode is only permitted for non-commercial use and │
  1083. 31.64 s > │ is limited to one instance and core per machine. │
  1084. 31.64 s > │ │
  1085. 31.64 s > │ Hobbyists can easily acquire a free license key │
  1086. 31.64 s > │ that unlocks all cores and removes this banner: │
  1087. 31.64 s > │ │
  1088. 31.64 s > │ from symbolica import * │
  1089. 31.64 s > │ request_hobbyist_license('YOUR_NAME', 'YOUR_EMAIL') │
  1090. 31.64 s > │ │
  1091. 31.64 s > │ All other users can obtain a free 30-day trial key: │
  1092. 31.64 s > │ │
  1093. 31.64 s > │ from symbolica import * │
  1094. 31.64 s > │ request_trial_license('NAME', 'EMAIL', 'EMPLOYER') │
  1095. 31.64 s > │ │
  1096. 31.64 s > │ See https://symbolica.io/docs/get_started.html#license │
  1097. 31.64 s > └────────────────────────────────────────────────────────┘
  1098. 31.64 s > ┌───────────────────────────────────────────────────────────────────────────────────────────────────────────┐
  1099. 31.64 s > │ Cannot start new unlicensed Symbolica instance since there is already another one running on the machine. │
  1100. 31.64 s > └───────────────────────────────────────────────────────────────────────────────────────────────────────────┘
  1101. 31.64 s >
  1102. 31.64 s > stderr:
  1103. 31.64 s >
  1104. 31.64 s > ┌───────────────────────────────────────────────────────────┐
  1105. 31.64 s > │ Could not resolve the IP of the Symbolica license server. │
  1106. 31.64 s > │ │
  1107. 31.64 s > │ Please check your DNS configuration. │
  1108. 31.64 s > └───────────────────────────────────────────────────────────┘
  1109. 31.64 s > Error: failed to lookup address information: Temporary failure in name resolution
  1110. 31.64 s >
  1111. 31.64 s >
  1112. 31.64 s > Location:
  1113. 31.64 s > tests/tests/test_python_api.rs:156:20
  1114. 31.64 s >
  1115. 31.64 s > 3. gammaloop-integration-tests::test_python_api::python_evaluate_sample_honors_generate_events_and_observable_snapshots
  1116. 31.64 s > failure: test failure with exit code 101
  1117. 31.64 s > Error: Python API test subprocess failed.
  1118. 31.64 s > stdout:
  1119. 31.64 s > ┌────────────────────────────────────────────────────────┐
  1120. 31.64 s > │ You are running a restricted Symbolica instance. │
  1121. 31.64 s > │ │
  1122. 31.64 s > │ This mode is only permitted for non-commercial use and │
  1123. 31.64 s > │ is limited to one instance and core per machine. │
  1124. 31.64 s > │ │
  1125. 31.64 s > │ Hobbyists can easily acquire a free license key │
  1126. 31.64 s > │ that unlocks all cores and removes this banner: │
  1127. 31.64 s > │ │
  1128. 31.64 s > │ from symbolica import * │
  1129. 31.64 s > │ request_hobbyist_license('YOUR_NAME', 'YOUR_EMAIL') │
  1130. 31.64 s > │ │
  1131. 31.64 s > │ All other users can obtain a free 30-day trial key: │
  1132. 31.64 s > │ │
  1133. 31.64 s > │ from symbolica import * │
  1134. 31.64 s > │ request_trial_license('NAME', 'EMAIL', 'EMPLOYER') │
  1135. 31.64 s > │ │
  1136. 31.64 s > │ See https://symbolica.io/docs/get_started.html#license │
  1137. 31.64 s > └────────────────────────────────────────────────────────┘
  1138. 31.64 s > ┌───────────────────────────────────────────────────────────────────────────────────────────────────────────┐
  1139. 31.64 s > │ Cannot start new unlicensed Symbolica instance since there is already another one running on the machine. │
  1140. 31.64 s > └───────────────────────────────────────────────────────────────────────────────────────────────────────────┘
  1141. 31.64 s >
  1142. 31.64 s > stderr:
  1143. 31.64 s >
  1144. 31.64 s > ┌───────────────────────────────────────────────────────────┐
  1145. 31.64 s > │ Could not resolve the IP of the Symbolica license server. │
  1146. 31.64 s > │ │
  1147. 31.64 s > │ Please check your DNS configuration. │
  1148. 31.64 s > └───────────────────────────────────────────────────────────┘
  1149. 31.64 s > Error: failed to lookup address information: Temporary failure in name resolution
  1150. 31.64 s >
  1151. 31.64 s >
  1152. 31.64 s > Location:
  1153. 31.64 s > tests/tests/test_python_api.rs:156:20
  1154. 31.64 s > system-out
  1155. 31.64 s > running 1 test
  1156. 31.64 s > test python_evaluate_sample_honors_generate_events_and_observable_snapshots ... FAILED
  1157. 31.64 s >
  1158. 31.64 s > failures:
  1159. 31.64 s >
  1160. 31.64 s > failures:
  1161. 31.64 s > python_evaluate_sample_honors_generate_events_and_observable_snapshots
  1162. 31.64 s >
  1163. 31.64 s > test result: FAILED. 0 passed; 1 failed; 0 ignored; 0 measured; 4 filtered out; finished in 0.18s
  1164. 31.64 s > system-err
  1165. 31.64 s > Error: Python API test subprocess failed.
  1166. 31.64 s > stdout:
  1167. 31.64 s > ┌────────────────────────────────────────────────────────┐
  1168. 31.64 s > │ You are running a restricted Symbolica instance. │
  1169. 31.64 s > │ │
  1170. 31.64 s > │ This mode is only permitted for non-commercial use and │
  1171. 31.64 s > │ is limited to one instance and core per machine. │
  1172. 31.64 s > │ │
  1173. 31.64 s > │ Hobbyists can easily acquire a free license key │
  1174. 31.64 s > │ that unlocks all cores and removes this banner: │
  1175. 31.64 s > │ │
  1176. 31.64 s > │ from symbolica import * │
  1177. 31.64 s > │ request_hobbyist_license('YOUR_NAME', 'YOUR_EMAIL') │
  1178. 31.64 s > │ │
  1179. 31.64 s > │ All other users can obtain a free 30-day trial key: │
  1180. 31.64 s > │ │
  1181. 31.64 s > │ from symbolica import * │
  1182. 31.64 s > │ request_trial_license('NAME', 'EMAIL', 'EMPLOYER') │
  1183. 31.64 s > │ │
  1184. 31.64 s > │ See https://symbolica.io/docs/get_started.html#license │
  1185. 31.64 s > └────────────────────────────────────────────────────────┘
  1186. 31.64 s > ┌───────────────────────────────────────────────────────────────────────────────────────────────────────────┐
  1187. 31.64 s > │ Cannot start new unlicensed Symbolica instance since there is already another one running on the machine. │
  1188. 31.64 s > └───────────────────────────────────────────────────────────────────────────────────────────────────────────┘
  1189. 31.64 s >
  1190. 31.64 s > stderr:
  1191. 31.64 s >
  1192. 31.64 s > ┌───────────────────────────────────────────────────────────┐
  1193. 31.64 s > │ Could not resolve the IP of the Symbolica license server. │
  1194. 31.64 s > │ │
  1195. 31.64 s > │ Please check your DNS configuration. │
  1196. 31.64 s > └───────────────────────────────────────────────────────────┘
  1197. 31.64 s > Error: failed to lookup address information: Temporary failure in name resolution
  1198. 31.64 s >
  1199. 31.64 s >
  1200. 31.64 s > Location:
  1201. 31.64 s > tests/tests/test_python_api.rs:156:20
  1202. 31.64 s > =========================================
  1203. 31.64 s For full logs, run:
  1204. 31.64 s nix log /nix/store/6yfkarcx1yqfdkgaj26q9b9n3q0min5r-gammaloop-nextest-python-api.drv
  1205. 31.79 s [0 built (1 failed), 0.0Run failed.