test packages.x86_64-linux.nix-ci-check-gammaloop-nextest-python-api
- 0.00 s
$ /nix/store/9ypz3flqsrl5xl495mm8h645gadjsxi1-coreutils-9.11/bin/timeout --kill-after=15s 7200s /nix/store/23zk8sgzamrbmj1fday15szf7f2279s8-nix-2.34.7/bin/nix --extra-experimental-features nix-command --extra-experimental-features flakes flake clone git+https://github.com/alphal00p/gammaloop --dest /tmp/nix-ci-worker/stable-pwd/repo/
- 0.07 s
Cloning into '/tmp/nix-ci-worker/stable-pwd/repo'...
- 2.39 s
remote: Enumerating objects: 84764
remote: Enumerating objects: 93753, done.
- 2.64 s
remote: Counting objects: 0% (1/8989)
remote: Counting objects: 1% (90/8989)
remote: Counting objects: 2% (180/8989)
remote: Counting objects: 3% (270/8989)
remote: Counting objects: 4% (360/8989)
remote: Counting objects: 5% (450/8989)
remote: Counting objects: 6% (540/8989)
remote: Counting objects: 7% (630/8989)
remote: Counting objects: 8% (720/8989)
remote: Counting objects: 9% (810/8989)
remote: Counting objects: 10% (899/8989)
remote: Counting objects: 11% (989/8989)
remote: Counting objects: 12% (1079/8989)
remote: Counting objects: 13% (1169/8989)
remote: Counting objects: 14% (1259/8989)
remote: Counting objects: 15% (1349/8989)
remote: Counting objects: 16% (1439/8989)
remote: Counting objects: 17% (1529/8989)
remote: Counting objects: 18% (1619/8989)
remote: Counting objects: 19% (1708/8989)
remote: Counting objects: 20% (1798/8989)
remote: Counting objects: 21% (1888/8989)
remote: Counting objects: 22% (1978/8989)
remote: Counting objects: 23% (2068/8989)
remote: Counting objects: 24% (2158/8989)
remote: Counting objects: 25% (2248/8989)
remote: Counting objects: 26% (2338/8989)
remote: Counting objects: 27% (2428/8989)
remote: Counting objects: 28% (2517/8989)
remote: Counting objects: 29% (2607/8989)
remote: Counting objects: 30% (2697/8989)
remote: Counting objects: 31% (2787/8989)
remote: Counting objects: 32% (2877/8989)
remote: Counting objects: 33% (2967/8989)
remote: Counting objects: 34% (3057/8989)
remote: Counting objects: 35% (3147/8989)
remote: Counting objects: 36% (3237/8989)
remote: Counting objects: 37% (3326/8989)
remote: Counting objects: 38% (3416/8989)
remote: Counting objects: 39% (3506/8989)
remote: Counting objects: 40% (3596/8989)
remote: Counting objects: 41% (3686/8989)
remote: Counting objects: 42% (3776/8989)
remote: Counting objects: 43% (3866/8989)
remote: Counting objects: 44% (3956/8989)
remote: Counting objects: 45% (4046/8989)
remote: Counting objects: 46% (4135/8989)
remote: Counting objects: 47% (4225/8989)
remote: Counting objects: 48% (4315/8989)
remote: Counting objects: 49% (4405/8989)
remote: Counting objects: 50% (4495/8989)
remote: Counting objects: 51% (4585/8989)
remote: Counting objects: 52% (4675/8989)
remote: Counting objects: 53% (4765/8989)
remote: Counting objects: 54% (4855/8989)
remote: Counting objects: 55% (4944/8989)
remote: Counting objects: 56% (5034/8989)
remote: Counting objects: 57% (5124/8989)
remote: Counting objects: 58% (5214/8989)
remote: Counting objects: 59% (5304/8989)
remote: Counting objects: 60% (5394/8989)
remote: Counting objects: 61% (5484/8989)
remote: Counting objects: 62% (5574/8989)
remote: Counting objects: 63% (5664/8989)
remote: Counting objects: 64% (5753/8989)
remote: Counting objects: 65% (5843/8989)
remote: Counting objects: 66% (5933/8989)
remote: Counting objects: 67% (6023/8989)
remote: Counting objects: 68% (6113/8989)
remote: Counting objects: 69% (6203/8989)
remote: Counting objects: 70% (6293/8989)
remote: Counting objects: 71% (6383/8989)
remote: Counting objects: 72% (6473/8989)
remote: Counting objects: 73% (6562/8989)
remote: Counting objects: 74% (6652/8989)
remote: Counting objects: 75% (6742/8989)
remote: Counting objects: 76% (6832/8989)
remote: Counting objects: 77% (6922/8989)
remote: Counting objects: 78% (7012/8989)
remote: Counting objects: 79% (7102/8989)
remote: Counting objects: 80% (7192/8989)
remote: Counting objects: 81% (7282/8989)
remote: Counting objects: 82% (7371/8989)
remote: Counting objects: 83% (7461/8989)
remote: Counting objects: 84% (7551/8989)
remote: Counting objects: 85% (7641/8989)
remote: Counting objects: 86% (7731/8989)
remote: Counting objects: 87% (7821/8989)
remote: Counting objects: 88% (7911/8989)
remote: Counting objects: 89% (8001/8989)
remote: Counting objects: 90% (8091/8989)
remote: Counting objects: 91% (8180/8989)
remote: Counting objects: 92% (8270/8989)
remote: Counting objects: 93% (8360/8989)
remote: Counting objects: 94% (8450/8989)
remote: Counting objects: 95% (8540/8989)
remote: Counting objects: 96% (8630/8989)
remote: Counting objects: 97% (8720/8989)
remote: Counting objects: 98% (8810/8989)
remote: Counting objects: 99% (8900/8989)
remote: Counting objects: 100% (8989/8989)
remote: Counting objects: 100% (8989/8989), done.
- 4.53 s
remote: Compressing objects: 0% (1/1791)
remote: Compressing objects: 1% (18/1791)
remote: Compressing objects: 2% (36/1791)
remote: Compressing objects: 3% (54/1791)
remote: Compressing objects: 4% (72/1791)
remote: Compressing objects: 5% (90/1791)
remote: Compressing objects: 6% (108/1791)
remote: Compressing objects: 7% (126/1791)
remote: Compressing objects: 7% (134/1791)
remote: Compressing objects: 8% (144/1791)
remote: Compressing objects: 9% (162/1791)
remote: Compressing objects: 10% (180/1791)
remote: Compressing objects: 11% (198/1791)
remote: Compressing objects: 12% (215/1791)
remote: Compressing objects: 13% (233/1791)
remote: Compressing objects: 14% (251/1791)
remote: Compressing objects: 15% (269/1791)
remote: Compressing objects: 16% (287/1791)
remote: Compressing objects: 17% (305/1791)
remote: Compressing objects: 18% (323/1791)
remote: Compressing objects: 19% (341/1791)
remote: Compressing objects: 20% (359/1791)
remote: Compressing objects: 21% (377/1791)
remote: Compressing objects: 22% (395/1791)
remote: Compressing objects: 23% (412/1791)
remote: Compressing objects: 24% (430/1791)
remote: Compressing objects: 25% (448/1791)
remote: Compressing objects: 26% (466/1791)
remote: Compressing objects: 27% (484/1791)
remote: Compressing objects: 28% (502/1791)
remote: Compressing objects: 29% (520/1791)
remote: Compressing objects: 29% (524/1791)
remote: Compressing objects: 30% (538/1791)
remote: Compressing objects: 31% (556/1791)
remote: Compressing objects: 32% (574/1791)
remote: Compressing objects: 33% (592/1791)
remote: Compressing objects: 34% (609/1791)
remote: Compressing objects: 35% (627/1791)
remote: Compressing objects: 36% (645/1791)
remote: Compressing objects: 37% (663/1791)
remote: Compressing objects: 38% (681/1791)
remote: Compressing objects: 39% (699/1791)
remote: Compressing objects: 40% (717/1791)
remote: Compressing objects: 41% (735/1791)
remote: Compressing objects: 42% (753/1791)
remote: Compressing objects: 43% (771/1791)
remote: Compressing objects: 44% (789/1791)
remote: Compressing objects: 45% (806/1791)
remote: Compressing objects: 46% (824/1791)
remote: Compressing objects: 47% (842/1791)
remote: Compressing objects: 48% (860/1791)
remote: Compressing objects: 49% (878/1791)
remote: Compressing objects: 50% (896/1791)
remote: Compressing objects: 51% (914/1791)
remote: Compressing objects: 52% (932/1791)
remote: Compressing objects: 53% (950/1791)
remote: Compressing objects: 54% (968/1791)
remote: Compressing objects: 55% (986/1791)
remote: Compressing objects: 56% (1003/1791)
remote: Compressing objects: 57% (1021/1791)
remote: Compressing objects: 58% (1039/1791)
remote: Compressing objects: 59% (1057/1791)
remote: Compressing objects: 60% (1075/1791)
remote: Compressing objects: 61% (1093/1791)
remote: Compressing objects: 62% (1111/1791)
remote: Compressing objects: 63% (1129/1791)
remote: Compressing objects: 64% (1147/1791)
remote: Compressing objects: 65% (1165/1791)
remote: Compressing objects: 66% (1183/1791)
remote: Compressing objects: 67% (1200/1791)
remote: Compressing objects: 68% (1218/1791)
remote: Compressing objects: 69% (1236/1791)
remote: Compressing objects: 70% (1254/1791)
remote: Compressing objects: 71% (1272/1791)
remote: Compressing objects: 72% (1290/1791)
remote: Compressing objects: 73% (1308/1791)
remote: Compressing objects: 74% (1326/1791)
remote: Compressing objects: 75% (1344/1791)
remote: Compressing objects: 76% (1362/1791)
remote: Compressing objects: 77% (1380/1791)
remote: Compressing objects: 78% (1397/1791)
remote: Compressing objects: 79% (1415/1791)
remote: Compressing objects: 80% (1433/1791)
remote: Compressing objects: 81% (1451/1791)
remote: Compressing objects: 82% (1469/1791)
remote: Compressing objects: 83% (1487/1791)
remote: Compressing objects: 84% (1505/1791)
remote: Compressing objects: 85% (1523/1791)
remote: Compressing objects: 86% (1541/1791)
remote: Compressing objects: 87% (1559/1791)
remote: Compressing objects: 88% (1577/1791)
remote: Compressing objects: 89% (1594/1791)
remote: Compressing objects: 90% (1612/1791)
remote: Compressing objects: 91% (1630/1791)
remote: Compressing objects: 92% (1648/1791)
remote: Compressing objects: 93% (1666/1791)
remote: Compressing objects: 94% (1684/1791)
remote: Compressing objects: 95% (1702/1791)
remote: Compressing objects: 96% (1720/1791)
remote: Compressing objects: 97% (1738/1791)
remote: Compressing objects: 98% (1756/1791)
remote: Compressing objects: 99% (1774/1791)
remote: Compressing objects: 100% (1791/1791)
remote: Compressing objects: 100% (1791/1791), done.
- 14.71 s
Receiving objects: 0% (1/93753)
Receiving objects: 1% (938/93753)
Receiving objects: 2% (1876/93753)
Receiving objects: 3% (2813/93753)
Receiving objects: 4% (3751/93753)
Receiving objects: 5% (4688/93753)
Receiving objects: 6% (5626/93753)
Receiving objects: 7% (6563/93753)
Receiving objects: 8% (7501/93753), 15.52 MiB | 31.02 MiB/s
Receiving objects: 9% (8438/93753), 15.52 MiB | 31.02 MiB/s
Receiving objects: 10% (9376/93753), 15.52 MiB | 31.02 MiB/s
Receiving objects: 11% (10313/93753), 15.52 MiB | 31.02 MiB/s
Receiving objects: 12% (11251/93753), 15.52 MiB | 31.02 MiB/s
Receiving objects: 13% (12188/93753), 15.52 MiB | 31.02 MiB/s
Receiving objects: 14% (13126/93753), 15.52 MiB | 31.02 MiB/s
Receiving objects: 15% (14063/93753), 15.52 MiB | 31.02 MiB/s
Receiving objects: 16% (15001/93753), 15.52 MiB | 31.02 MiB/s
Receiving objects: 17% (15939/93753), 15.52 MiB | 31.02 MiB/s
Receiving objects: 18% (16876/93753), 15.52 MiB | 31.02 MiB/s
Receiving objects: 19% (17814/93753), 15.52 MiB | 31.02 MiB/s
Receiving objects: 20% (18751/93753), 15.52 MiB | 31.02 MiB/s
Receiving objects: 21% (19689/93753), 15.52 MiB | 31.02 MiB/s
Receiving objects: 22% (20626/93753), 15.52 MiB | 31.02 MiB/s
Receiving objects: 23% (21564/93753), 15.52 MiB | 31.02 MiB/s
Receiving objects: 24% (22501/93753), 15.52 MiB | 31.02 MiB/s
Receiving objects: 25% (23439/93753), 15.52 MiB | 31.02 MiB/s
Receiving objects: 26% (24376/93753), 15.52 MiB | 31.02 MiB/s
Receiving objects: 27% (25314/93753), 15.52 MiB | 31.02 MiB/s
Receiving objects: 28% (26251/93753), 15.52 MiB | 31.02 MiB/s
Receiving objects: 29% (27189/93753), 15.52 MiB | 31.02 MiB/s
Receiving objects: 30% (28126/93753), 15.52 MiB | 31.02 MiB/s
Receiving objects: 31% (29064/93753), 15.52 MiB | 31.02 MiB/s
Receiving objects: 32% (30001/93753), 15.52 MiB | 31.02 MiB/s
Receiving objects: 33% (30939/93753), 15.52 MiB | 31.02 MiB/s
Receiving objects: 34% (31877/93753), 15.52 MiB | 31.02 MiB/s
Receiving objects: 35% (32814/93753), 15.52 MiB | 31.02 MiB/s
Receiving objects: 35% (33165/93753), 15.52 MiB | 31.02 MiB/s
Receiving objects: 36% (33752/93753), 31.04 MiB | 31.07 MiB/s
Receiving objects: 37% (34689/93753), 31.04 MiB | 31.07 MiB/s
Receiving objects: 38% (35627/93753), 31.04 MiB | 31.07 MiB/s
Receiving objects: 39% (36564/93753), 31.04 MiB | 31.07 MiB/s
Receiving objects: 40% (37502/93753), 31.04 MiB | 31.07 MiB/s
Receiving objects: 41% (38439/93753), 31.04 MiB | 31.07 MiB/s
Receiving objects: 42% (39377/93753), 31.04 MiB | 31.07 MiB/s
Receiving objects: 43% (40314/93753), 46.95 MiB | 31.32 MiB/s
Receiving objects: 44% (41252/93753), 46.95 MiB | 31.32 MiB/s
Receiving objects: 45% (42189/93753), 46.95 MiB | 31.32 MiB/s
Receiving objects: 46% (43127/93753), 46.95 MiB | 31.32 MiB/s
Receiving objects: 47% (44064/93753), 46.95 MiB | 31.32 MiB/s
Receiving objects: 48% (45002/93753), 46.95 MiB | 31.32 MiB/s
Receiving objects: 49% (45939/93753), 46.95 MiB | 31.32 MiB/s
Receiving objects: 50% (46877/93753), 46.95 MiB | 31.32 MiB/s
Receiving objects: 51% (47815/93753), 46.95 MiB | 31.32 MiB/s
Receiving objects: 51% (48725/93753), 62.44 MiB | 31.23 MiB/s
Receiving objects: 52% (48752/93753), 62.44 MiB | 31.23 MiB/s
Receiving objects: 53% (49690/93753), 62.44 MiB | 31.23 MiB/s
Receiving objects: 54% (50627/93753), 62.44 MiB | 31.23 MiB/s
Receiving objects: 55% (51565/93753), 62.44 MiB | 31.23 MiB/s
Receiving objects: 56% (52502/93753), 62.44 MiB | 31.23 MiB/s
Receiving objects: 57% (53440/93753), 62.44 MiB | 31.23 MiB/s
Receiving objects: 58% (54377/93753), 78.47 MiB | 31.40 MiB/s
Receiving objects: 59% (55315/93753), 78.47 MiB | 31.40 MiB/s
Receiving objects: 60% (56252/93753), 78.47 MiB | 31.40 MiB/s
Receiving objects: 60% (57042/93753), 93.86 MiB | 31.29 MiB/s
Receiving objects: 60% (57111/93753), 125.56 MiB | 30.91 MiB/s
Receiving objects: 61% (57190/93753), 141.43 MiB | 30.98 MiB/s
Receiving objects: 61% (57205/93753), 156.81 MiB | 30.95 MiB/s
Receiving objects: 61% (57629/93753), 166.87 MiB | 29.74 MiB/s
Receiving objects: 62% (58127/93753), 180.61 MiB | 29.27 MiB/s
Receiving objects: 63% (59065/93753), 180.61 MiB | 29.27 MiB/s
Receiving objects: 64% (60002/93753), 180.61 MiB | 29.27 MiB/s
Receiving objects: 65% (60940/93753), 180.61 MiB | 29.27 MiB/s
Receiving objects: 66% (61877/93753), 180.61 MiB | 29.27 MiB/s
Receiving objects: 67% (62815/93753), 180.61 MiB | 29.27 MiB/s
Receiving objects: 68% (63753/93753), 196.31 MiB | 29.31 MiB/s
Receiving objects: 69% (64690/93753), 196.31 MiB | 29.31 MiB/s
Receiving objects: 69% (65143/93753), 196.31 MiB | 29.31 MiB/s
Receiving objects: 70% (65628/93753), 196.31 MiB | 29.31 MiB/s
Receiving objects: 71% (66565/93753), 196.31 MiB | 29.31 MiB/s
Receiving objects: 72% (67503/93753), 196.31 MiB | 29.31 MiB/s
Receiving objects: 73% (68440/93753), 212.07 MiB | 29.23 MiB/s
Receiving objects: 74% (69378/93753), 212.07 MiB | 29.23 MiB/s
Receiving objects: 75% (70315/93753), 212.07 MiB | 29.23 MiB/s
Receiving objects: 76% (71253/93753), 212.07 MiB | 29.23 MiB/s
Receiving objects: 77% (72190/93753), 212.07 MiB | 29.23 MiB/s
Receiving objects: 78% (73128/93753), 212.07 MiB | 29.23 MiB/s
Receiving objects: 79% (74065/93753), 212.07 MiB | 29.23 MiB/s
Receiving objects: 80% (75003/93753), 212.07 MiB | 29.23 MiB/s
Receiving objects: 81% (75940/93753), 227.93 MiB | 29.34 MiB/s
Receiving objects: 82% (76878/93753), 227.93 MiB | 29.34 MiB/s
Receiving objects: 82% (76880/93753), 227.93 MiB | 29.34 MiB/s
Receiving objects: 83% (77815/93753), 243.47 MiB | 29.33 MiB/s
Receiving objects: 84% (78753/93753), 243.47 MiB | 29.33 MiB/s
Receiving objects: 85% (79691/93753), 243.47 MiB | 29.33 MiB/s
Receiving objects: 86% (80628/93753), 259.24 MiB | 29.54 MiB/s
Receiving objects: 87% (81566/93753), 259.24 MiB | 29.54 MiB/s
Receiving objects: 88% (82503/93753), 259.24 MiB | 29.54 MiB/s
Receiving objects: 89% (83441/93753), 259.24 MiB | 29.54 MiB/s
Receiving objects: 89% (83881/93753), 259.24 MiB | 29.54 MiB/s
Receiving objects: 90% (84378/93753), 259.24 MiB | 29.54 MiB/s
Receiving objects: 90% (84753/93753), 290.74 MiB | 29.49 MiB/s
Receiving objects: 91% (85316/93753), 290.74 MiB | 29.49 MiB/s
Receiving objects: 92% (86253/93753), 290.74 MiB | 29.49 MiB/s
Receiving objects: 93% (87191/93753), 290.74 MiB | 29.49 MiB/s
Receiving objects: 94% (88128/93753), 290.74 MiB | 29.49 MiB/s
Receiving objects: 95% (89066/93753), 290.74 MiB | 29.49 MiB/s
Receiving objects: 96% (90003/93753), 290.74 MiB | 29.49 MiB/s
Receiving objects: 97% (90941/93753), 290.74 MiB | 29.49 MiB/s
Receiving objects: 98% (91878/93753), 306.55 MiB | 30.75 MiB/s
Receiving objects: 99% (92816/93753), 306.55 MiB | 30.75 MiB/s
remote: Total 93753 (delta 7889), reused 7198 (delta 7198), pack-reused 84764 (from 3)
- 14.71 s
Receiving objects: 100% (93753/93753), 306.55 MiB | 30.75 MiB/s
Receiving objects: 100% (93753/93753), 309.19 MiB | 30.40 MiB/s, done.
- 15.71 s
Resolving deltas: 0% (0/63114)
Resolving deltas: 1% (632/63114)
Resolving deltas: 2% (1264/63114)
Resolving deltas: 3% (1896/63114)
Resolving deltas: 4% (2528/63114)
Resolving deltas: 5% (3156/63114)
Resolving deltas: 6% (3790/63114)
Resolving deltas: 7% (4419/63114)
Resolving deltas: 8% (5050/63114)
Resolving deltas: 9% (5681/63114)
Resolving deltas: 10% (6312/63114)
Resolving deltas: 11% (6943/63114)
Resolving deltas: 12% (7574/63114)
Resolving deltas: 13% (8206/63114)
Resolving deltas: 14% (8837/63114)
Resolving deltas: 15% (9468/63114)
Resolving deltas: 16% (10099/63114)
Resolving deltas: 17% (10730/63114)
Resolving deltas: 18% (11362/63114)
Resolving deltas: 19% (11992/63114)
Resolving deltas: 20% (12623/63114)
Resolving deltas: 21% (13254/63114)
Resolving deltas: 22% (13886/63114)
Resolving deltas: 23% (14520/63114)
Resolving deltas: 24% (15148/63114)
Resolving deltas: 25% (15779/63114)
Resolving deltas: 26% (16410/63114)
Resolving deltas: 27% (17041/63114)
Resolving deltas: 28% (17673/63114)
Resolving deltas: 29% (18304/63114)
Resolving deltas: 30% (18935/63114)
Resolving deltas: 31% (19566/63114)
Resolving deltas: 32% (20197/63114)
Resolving deltas: 33% (20829/63114)
Resolving deltas: 34% (21460/63114)
Resolving deltas: 35% (22090/63114)
Resolving deltas: 36% (22722/63114)
Resolving deltas: 37% (23353/63114)
Resolving deltas: 38% (23984/63114)
Resolving deltas: 39% (24615/63114)
Resolving deltas: 40% (25246/63114)
Resolving deltas: 41% (25877/63114)
Resolving deltas: 42% (26508/63114)
Resolving deltas: 43% (27140/63114)
Resolving deltas: 44% (27772/63114)
Resolving deltas: 45% (28402/63114)
Resolving deltas: 46% (29033/63114)
Resolving deltas: 47% (29664/63114)
Resolving deltas: 48% (30295/63114)
Resolving deltas: 49% (30926/63114)
Resolving deltas: 50% (31557/63114)
Resolving deltas: 51% (32190/63114)
Resolving deltas: 52% (32820/63114)
Resolving deltas: 53% (33451/63114)
Resolving deltas: 54% (34083/63114)
Resolving deltas: 55% (34713/63114)
Resolving deltas: 56% (35344/63114)
Resolving deltas: 57% (35975/63114)
Resolving deltas: 58% (36607/63114)
Resolving deltas: 59% (37238/63114)
Resolving deltas: 60% (37869/63114)
Resolving deltas: 61% (38500/63114)
Resolving deltas: 62% (39131/63114)
Resolving deltas: 63% (39762/63114)
Resolving deltas: 64% (40393/63114)
Resolving deltas: 65% (41025/63114)
Resolving deltas: 66% (41656/63114)
Resolving deltas: 67% (42288/63114)
Resolving deltas: 68% (42918/63114)
Resolving deltas: 69% (43549/63114)
Resolving deltas: 70% (44180/63114)
Resolving deltas: 71% (44811/63114)
Resolving deltas: 72% (45443/63114)
Resolving deltas: 73% (46075/63114)
Resolving deltas: 74% (46705/63114)
Resolving deltas: 75% (47336/63114)
Resolving deltas: 76% (47967/63114)
Resolving deltas: 77% (48598/63114)
Resolving deltas: 78% (49229/63114)
Resolving deltas: 79% (49861/63114)
Resolving deltas: 80% (50494/63114)
Resolving deltas: 81% (51123/63114)
Resolving deltas: 82% (51754/63114)
Resolving deltas: 83% (52386/63114)
Resolving deltas: 84% (53016/63114)
Resolving deltas: 85% (53647/63114)
Resolving deltas: 86% (54279/63114)
Resolving deltas: 87% (54912/63114)
Resolving deltas: 88% (55541/63114)
Resolving deltas: 89% (56173/63114)
Resolving deltas: 90% (56803/63114)
Resolving deltas: 91% (57434/63114)
Resolving deltas: 92% (58067/63114)
Resolving deltas: 93% (58697/63114)
Resolving deltas: 94% (59328/63114)
Resolving deltas: 95% (59960/63114)
Resolving deltas: 96% (60590/63114)
Resolving deltas: 97% (61221/63114)
Resolving deltas: 98% (61852/63114)
Resolving deltas: 99% (62484/63114)
Resolving deltas: 100% (63114/63114)
Resolving deltas: 100% (63114/63114), done.
- 16.20 s
Fetching commit 01982f688b6810d5152f0317713db412ae7ea794 for codex/raised-energy-cff-reviewed ...
- 16.20 s
$ /nix/store/bcnisk3ydfgv26v2gw3zlky24g00yww2-git-2.54.0/bin/git fetch origin 01982f688b6810d5152f0317713db412ae7ea794
- 16.60 s
From https://github.com/alphal00p/gammaloop
- 16.60 s
* branch 01982f688b6810d5152f0317713db412ae7ea794 -> FETCH_HEAD
- 16.61 s
$ /nix/store/9ypz3flqsrl5xl495mm8h645gadjsxi1-coreutils-9.11/bin/timeout --kill-after=15s 7200s /nix/store/bcnisk3ydfgv26v2gw3zlky24g00yww2-git-2.54.0/bin/git -c advice.detachedHead=false checkout 01982f688b6810d5152f0317713db412ae7ea794
- 16.89 s
HEAD is now at 01982f688 document the reviewed CFF stack and validation
- 16.90 s
$ /nix/store/9ypz3flqsrl5xl495mm8h645gadjsxi1-coreutils-9.11/bin/timeout --kill-after=15s 7200s /nix/store/23zk8sgzamrbmj1fday15szf7f2279s8-nix-2.34.7/bin/nix --extra-experimental-features nix-command --extra-experimental-features flakes --log-format internal-json run .#packages.x86_64-linux.nix-ci-check-gammaloop-nextest-python-api --print-build-logs
- 23.75 s
- 23.87 s
Downloading cached nix-ci-check-gammaloop-nextest-python-api from https://cache.nix-ci.com
- 23.88 s
Downloaded cached nix-ci-check-gammaloop-nextest-python-api (1104 B) in 3ms
- 23.88 s
Progress: 0 of 1 built, 1 of 1 downloaded from cache
- 31.24 s
evaluating derivation 'g
copying '/nix/store/8j7s
evaluating derivation 'g
copying '/nix/store/8j7s
evaluating derivation 'g
copying '/nix/store/8j7s
evaluating derivation 'g
copying '/nix/store/8j7s
evaluating derivation 'g
copying '/nix/store/8j7s
evaluating derivation 'g
copying '/nix/store/8j7s
evaluating derivation 'g
copying '/nix/store/8j7s
evaluating derivation 'g
querying gammaloop-nexte
[0/1 built, 0.0 KiB DL]
[1/0/1 built, 0.0 KiB DLgammaloop-nextest-python-api> Extracting 1 binary, 1 build script output directory, and 3 linked paths to /build/nextest-archive-MCQr5d
- 31.30 s
gammaloop-nextest-python-api> Extracted 18 files to /build/nextest-archive-MCQr5d in 0.06s
- 31.31 s
gammaloop-nextest-python-api> ------------
- 31.31 s
gammaloop-nextest-python-api> Nextest run ID 2141cd37-3725-4f36-934f-18f6e0b33fd7 with nextest profile: ci_gammaloop
- 31.31 s
gammaloop-nextest-python-api> Starting 5 tests across 1 binary
- 31.49 s
gammaloop-nextest-python-api> FAIL [ 0.180s] (2/5) gammaloop-integration-tests::test_python_api python_evaluate_sample_preserves_graph_grouping_and_incoming_pdgs
- 31.49 s
gammaloop-nextest-python-api> stdout ---
- 31.49 s
gammaloop-nextest-python-api>
- 31.49 s
gammaloop-nextest-python-api> running 1 test
- 31.49 s
gammaloop-nextest-python-api> test python_evaluate_sample_preserves_graph_grouping_and_incoming_pdgs ... FAILED
- 31.49 s
gammaloop-nextest-python-api>
- 31.49 s
gammaloop-nextest-python-api> failures:
- 31.49 s
gammaloop-nextest-python-api>
- 31.49 s
gammaloop-nextest-python-api> failures:
- 31.49 s
gammaloop-nextest-python-api> python_evaluate_sample_preserves_graph_grouping_and_incoming_pdgs
- 31.49 s
gammaloop-nextest-python-api>
- 31.49 s
gammaloop-nextest-python-api> test result: FAILED. 0 passed; 1 failed; 0 ignored; 0 measured; 4 filtered out; finished in 0.18s
- 31.49 s
gammaloop-nextest-python-api>
- 31.49 s
gammaloop-nextest-python-api> stderr ---
- 31.49 s
gammaloop-nextest-python-api> Error: Python API test subprocess failed.
- 31.49 s
gammaloop-nextest-python-api> stdout:
- 31.49 s
gammaloop-nextest-python-api> ┌────────────────────────────────────────────────────────┐
- 31.49 s
gammaloop-nextest-python-api> │ You are running a restricted Symbolica instance. │
- 31.49 s
gammaloop-nextest-python-api> │ │
- 31.49 s
gammaloop-nextest-python-api> │ This mode is only permitted for non-commercial use and │
- 31.49 s
gammaloop-nextest-python-api> │ is limited to one instance and core per machine. │
- 31.49 s
gammaloop-nextest-python-api> │ │
- 31.49 s
gammaloop-nextest-python-api> │ Hobbyists can easily acquire a free license key │
- 31.49 s
gammaloop-nextest-python-api> │ that unlocks all cores and removes this banner: │
- 31.49 s
gammaloop-nextest-python-api> │ │
- 31.49 s
gammaloop-nextest-python-api> │ from symbolica import * │
- 31.49 s
gammaloop-nextest-python-api> │ request_hobbyist_license('YOUR_NAME', 'YOUR_EMAIL') │
- 31.49 s
gammaloop-nextest-python-api> │ │
- 31.49 s
gammaloop-nextest-python-api> │ All other users can obtain a free 30-day trial key: │
- 31.49 s
gammaloop-nextest-python-api> │ │
- 31.49 s
gammaloop-nextest-python-api> │ from symbolica import * │
- 31.49 s
gammaloop-nextest-python-api> │ request_trial_license('NAME', 'EMAIL', 'EMPLOYER') │
- 31.49 s
gammaloop-nextest-python-api> │ │
- 31.49 s
gammaloop-nextest-python-api> │ See https://symbolica.io/docs/get_started.html#license │
- 31.49 s
gammaloop-nextest-python-api> └────────────────────────────────────────────────────────┘
- 31.49 s
gammaloop-nextest-python-api> ┌───────────────────────────────────────────────────────────────────────────────────────────────────────────┐
- 31.49 s
gammaloop-nextest-python-api> │ Cannot start new unlicensed Symbolica instance since there is already another one running on the machine. │
- 31.49 s
gammaloop-nextest-python-api> └───────────────────────────────────────────────────────────────────────────────────────────────────────────┘
- 31.49 s
gammaloop-nextest-python-api>
- 31.49 s
gammaloop-nextest-python-api> stderr:
- 31.49 s
gammaloop-nextest-python-api>
- 31.49 s
gammaloop-nextest-python-api> ┌───────────────────────────────────────────────────────────┐
- 31.49 s
gammaloop-nextest-python-api> │ Could not resolve the IP of the Symbolica license server. │
- 31.49 s
gammaloop-nextest-python-api> │ │
- 31.49 s
gammaloop-nextest-python-api> │ Please check your DNS configuration. │
- 31.49 s
gammaloop-nextest-python-api> └───────────────────────────────────────────────────────────┘
- 31.49 s
gammaloop-nextest-python-api> Error: failed to lookup address information: Temporary failure in name resolution
- 31.49 s
gammaloop-nextest-python-api>
- 31.49 s
gammaloop-nextest-python-api>
- 31.49 s
gammaloop-nextest-python-api> Location:
- 31.49 s
gammaloop-nextest-python-api> tests/tests/test_python_api.rs:156:20
- 31.49 s
gammaloop-nextest-python-api>
- 31.49 s
gammaloop-nextest-python-api> FAIL [ 0.180s] (3/5) gammaloop-integration-tests::test_python_api python_evaluate_samples_batch_and_momentum_space_have_expected_shape
- 31.49 s
gammaloop-nextest-python-api> stdout ---
- 31.49 s
gammaloop-nextest-python-api>
- 31.49 s
gammaloop-nextest-python-api> running 1 test
- 31.49 s
gammaloop-nextest-python-api> test python_evaluate_samples_batch_and_momentum_space_have_expected_shape ... FAILED
- 31.49 s
gammaloop-nextest-python-api>
- 31.49 s
gammaloop-nextest-python-api> failures:
- 31.49 s
gammaloop-nextest-python-api>
- 31.49 s
gammaloop-nextest-python-api> failures:
- 31.49 s
gammaloop-nextest-python-api> python_evaluate_samples_batch_and_momentum_space_have_expected_shape
- 31.49 s
gammaloop-nextest-python-api>
- 31.49 s
gammaloop-nextest-python-api> test result: FAILED. 0 passed; 1 failed; 0 ignored; 0 measured; 4 filtered out; finished in 0.18s
- 31.49 s
gammaloop-nextest-python-api>
- 31.49 s
gammaloop-nextest-python-api> stderr ---
- 31.49 s
gammaloop-nextest-python-api> Error: Python API test subprocess failed.
- 31.49 s
gammaloop-nextest-python-api> stdout:
- 31.49 s
gammaloop-nextest-python-api> ┌────────────────────────────────────────────────────────┐
- 31.49 s
gammaloop-nextest-python-api> │ You are running a restricted Symbolica instance. │
- 31.49 s
gammaloop-nextest-python-api> │ │
- 31.49 s
gammaloop-nextest-python-api> │ This mode is only permitted for non-commercial use and │
- 31.49 s
gammaloop-nextest-python-api> │ is limited to one instance and core per machine. │
- 31.49 s
gammaloop-nextest-python-api> │ │
- 31.49 s
gammaloop-nextest-python-api> │ Hobbyists can easily acquire a free license key │
- 31.49 s
gammaloop-nextest-python-api> │ that unlocks all cores and removes this banner: │
- 31.49 s
gammaloop-nextest-python-api> │ │
- 31.49 s
gammaloop-nextest-python-api> │ from symbolica import * │
- 31.49 s
gammaloop-nextest-python-api> │ request_hobbyist_license('YOUR_NAME', 'YOUR_EMAIL') │
- 31.49 s
gammaloop-nextest-python-api> │ │
- 31.49 s
gammaloop-nextest-python-api> │ All other users can obtain a free 30-day trial key: │
- 31.49 s
gammaloop-nextest-python-api> │ │
- 31.49 s
gammaloop-nextest-python-api> │ from symbolica import * │
- 31.49 s
gammaloop-nextest-python-api> │ request_trial_license('NAME', 'EMAIL', 'EMPLOYER') │
- 31.49 s
gammaloop-nextest-python-api> │ │
- 31.49 s
gammaloop-nextest-python-api> │ See https://symbolica.io/docs/get_started.html#license │
- 31.49 s
gammaloop-nextest-python-api> └────────────────────────────────────────────────────────┘
- 31.49 s
gammaloop-nextest-python-api> ┌───────────────────────────────────────────────────────────────────────────────────────────────────────────┐
- 31.49 s
gammaloop-nextest-python-api> │ Cannot start new unlicensed Symbolica instance since there is already another one running on the machine. │
- 31.49 s
gammaloop-nextest-python-api> └───────────────────────────────────────────────────────────────────────────────────────────────────────────┘
- 31.49 s
gammaloop-nextest-python-api>
- 31.49 s
gammaloop-nextest-python-api> stderr:
- 31.49 s
gammaloop-nextest-python-api>
- 31.49 s
gammaloop-nextest-python-api> ┌───────────────────────────────────────────────────────────┐
- 31.49 s
gammaloop-nextest-python-api> │ Could not resolve the IP of the Symbolica license server. │
- 31.49 s
gammaloop-nextest-python-api> │ │
- 31.49 s
gammaloop-nextest-python-api> │ Please check your DNS configuration. │
- 31.49 s
gammaloop-nextest-python-api> └───────────────────────────────────────────────────────────┘
- 31.49 s
gammaloop-nextest-python-api> Error: failed to lookup address information: Temporary failure in name resolution
- 31.49 s
gammaloop-nextest-python-api>
- 31.49 s
gammaloop-nextest-python-api>
- 31.49 s
gammaloop-nextest-python-api> Location:
- 31.49 s
gammaloop-nextest-python-api> tests/tests/test_python_api.rs:156:20
- 31.49 s
gammaloop-nextest-python-api>
- 31.50 s
gammaloop-nextest-python-api> FAIL [ 0.187s] (4/5) gammaloop-integration-tests::test_python_api python_evaluate_sample_honors_generate_events_and_observable_snapshots
- 31.50 s
gammaloop-nextest-python-api> stdout ---
- 31.50 s
gammaloop-nextest-python-api>
- 31.50 s
gammaloop-nextest-python-api> running 1 test
- 31.50 s
gammaloop-nextest-python-api> test python_evaluate_sample_honors_generate_events_and_observable_snapshots ... FAILED
- 31.50 s
gammaloop-nextest-python-api>
- 31.50 s
gammaloop-nextest-python-api> failures:
- 31.50 s
gammaloop-nextest-python-api>
- 31.50 s
gammaloop-nextest-python-api> failures:
- 31.50 s
gammaloop-nextest-python-api> python_evaluate_sample_honors_generate_events_and_observable_snapshots
- 31.50 s
gammaloop-nextest-python-api>
- 31.50 s
gammaloop-nextest-python-api> test result: FAILED. 0 passed; 1 failed; 0 ignored; 0 measured; 4 filtered out; finished in 0.18s
- 31.50 s
gammaloop-nextest-python-api>
- 31.50 s
gammaloop-nextest-python-api> stderr ---
- 31.50 s
gammaloop-nextest-python-api> Error: Python API test subprocess failed.
- 31.50 s
gammaloop-nextest-python-api> stdout:
- 31.50 s
gammaloop-nextest-python-api> ┌────────────────────────────────────────────────────────┐
- 31.50 s
gammaloop-nextest-python-api> │ You are running a restricted Symbolica instance. │
- 31.50 s
gammaloop-nextest-python-api> │ │
- 31.50 s
gammaloop-nextest-python-api> │ This mode is only permitted for non-commercial use and │
- 31.50 s
gammaloop-nextest-python-api> │ is limited to one instance and core per machine. │
- 31.50 s
gammaloop-nextest-python-api> │ │
- 31.50 s
gammaloop-nextest-python-api> │ Hobbyists can easily acquire a free license key │
- 31.50 s
gammaloop-nextest-python-api> │ that unlocks all cores and removes this banner: │
- 31.50 s
gammaloop-nextest-python-api> │ │
- 31.50 s
gammaloop-nextest-python-api> │ from symbolica import * │
- 31.50 s
gammaloop-nextest-python-api> │ request_hobbyist_license('YOUR_NAME', 'YOUR_EMAIL') │
- 31.50 s
gammaloop-nextest-python-api> │ │
- 31.50 s
gammaloop-nextest-python-api> │ All other users can obtain a free 30-day trial key: │
- 31.50 s
gammaloop-nextest-python-api> │ │
- 31.50 s
gammaloop-nextest-python-api> │ from symbolica import * │
- 31.50 s
gammaloop-nextest-python-api> │ request_trial_license('NAME', 'EMAIL', 'EMPLOYER') │
- 31.50 s
gammaloop-nextest-python-api> │ │
- 31.50 s
gammaloop-nextest-python-api> │ See https://symbolica.io/docs/get_started.html#license │
- 31.50 s
gammaloop-nextest-python-api> └────────────────────────────────────────────────────────┘
- 31.50 s
gammaloop-nextest-python-api> ┌───────────────────────────────────────────────────────────────────────────────────────────────────────────┐
- 31.50 s
gammaloop-nextest-python-api> │ Cannot start new unlicensed Symbolica instance since there is already another one running on the machine. │
- 31.50 s
gammaloop-nextest-python-api> └───────────────────────────────────────────────────────────────────────────────────────────────────────────┘
- 31.50 s
gammaloop-nextest-python-api>
- 31.50 s
gammaloop-nextest-python-api> stderr:
- 31.50 s
gammaloop-nextest-python-api>
- 31.50 s
gammaloop-nextest-python-api> ┌───────────────────────────────────────────────────────────┐
- 31.50 s
gammaloop-nextest-python-api> │ Could not resolve the IP of the Symbolica license server. │
- 31.50 s
gammaloop-nextest-python-api> │ │
- 31.50 s
gammaloop-nextest-python-api> │ Please check your DNS configuration. │
- 31.50 s
gammaloop-nextest-python-api> └───────────────────────────────────────────────────────────┘
- 31.50 s
gammaloop-nextest-python-api> Error: failed to lookup address information: Temporary failure in name resolution
- 31.50 s
gammaloop-nextest-python-api>
- 31.50 s
gammaloop-nextest-python-api>
- 31.50 s
gammaloop-nextest-python-api> Location:
- 31.50 s
gammaloop-nextest-python-api> tests/tests/test_python_api.rs:156:20
- 31.50 s
gammaloop-nextest-python-api>
- 31.57 s
gammaloop-nextest-python-api> ------------
- 31.57 s
gammaloop-nextest-python-api> Summary [ 0.252s] 5 tests run: 2 passed, 3 failed, 0 skipped
- 31.57 s
gammaloop-nextest-python-api> FAIL [ 0.180s] (2/5) gammaloop-integration-tests::test_python_api python_evaluate_sample_preserves_graph_grouping_and_incoming_pdgs
- 31.57 s
gammaloop-nextest-python-api> stdout ---
- 31.57 s
gammaloop-nextest-python-api>
- 31.57 s
gammaloop-nextest-python-api> running 1 test
- 31.57 s
gammaloop-nextest-python-api> test python_evaluate_sample_preserves_graph_grouping_and_incoming_pdgs ... FAILED
- 31.57 s
gammaloop-nextest-python-api>
- 31.57 s
gammaloop-nextest-python-api> failures:
- 31.57 s
gammaloop-nextest-python-api>
- 31.57 s
gammaloop-nextest-python-api> failures:
- 31.57 s
gammaloop-nextest-python-api> python_evaluate_sample_preserves_graph_grouping_and_incoming_pdgs
- 31.57 s
gammaloop-nextest-python-api>
- 31.57 s
gammaloop-nextest-python-api> test result: FAILED. 0 passed; 1 failed; 0 ignored; 0 measured; 4 filtered out; finished in 0.18s
- 31.57 s
gammaloop-nextest-python-api>
- 31.57 s
gammaloop-nextest-python-api> stderr ---
- 31.57 s
gammaloop-nextest-python-api> Error: Python API test subprocess failed.
- 31.57 s
gammaloop-nextest-python-api> stdout:
- 31.57 s
gammaloop-nextest-python-api> ┌────────────────────────────────────────────────────────┐
- 31.57 s
gammaloop-nextest-python-api> │ You are running a restricted Symbolica instance. │
- 31.57 s
gammaloop-nextest-python-api> │ │
- 31.57 s
gammaloop-nextest-python-api> │ This mode is only permitted for non-commercial use and │
- 31.57 s
gammaloop-nextest-python-api> │ is limited to one instance and core per machine. │
- 31.57 s
gammaloop-nextest-python-api> │ │
- 31.57 s
gammaloop-nextest-python-api> │ Hobbyists can easily acquire a free license key │
- 31.57 s
gammaloop-nextest-python-api> │ that unlocks all cores and removes this banner: │
- 31.57 s
gammaloop-nextest-python-api> │ │
- 31.57 s
gammaloop-nextest-python-api> │ from symbolica import * │
- 31.57 s
gammaloop-nextest-python-api> │ request_hobbyist_license('YOUR_NAME', 'YOUR_EMAIL') │
- 31.57 s
gammaloop-nextest-python-api> │ │
- 31.57 s
gammaloop-nextest-python-api> │ All other users can obtain a free 30-day trial key: │
- 31.57 s
gammaloop-nextest-python-api> │ │
- 31.57 s
gammaloop-nextest-python-api> │ from symbolica import * │
- 31.57 s
gammaloop-nextest-python-api> │ request_trial_license('NAME', 'EMAIL', 'EMPLOYER') │
- 31.57 s
gammaloop-nextest-python-api> │ │
- 31.57 s
gammaloop-nextest-python-api> │ See https://symbolica.io/docs/get_started.html#license │
- 31.57 s
gammaloop-nextest-python-api> └────────────────────────────────────────────────────────┘
- 31.57 s
gammaloop-nextest-python-api> ┌───────────────────────────────────────────────────────────────────────────────────────────────────────────┐
- 31.57 s
gammaloop-nextest-python-api> │ Cannot start new unlicensed Symbolica instance since there is already another one running on the machine. │
- 31.57 s
gammaloop-nextest-python-api> └───────────────────────────────────────────────────────────────────────────────────────────────────────────┘
- 31.57 s
gammaloop-nextest-python-api>
- 31.57 s
gammaloop-nextest-python-api> stderr:
- 31.57 s
gammaloop-nextest-python-api>
- 31.57 s
gammaloop-nextest-python-api> ┌───────────────────────────────────────────────────────────┐
- 31.57 s
gammaloop-nextest-python-api> │ Could not resolve the IP of the Symbolica license server. │
- 31.57 s
gammaloop-nextest-python-api> │ │
- 31.57 s
gammaloop-nextest-python-api> │ Please check your DNS configuration. │
- 31.57 s
gammaloop-nextest-python-api> └───────────────────────────────────────────────────────────┘
- 31.57 s
gammaloop-nextest-python-api> Error: failed to lookup address information: Temporary failure in name resolution
- 31.57 s
gammaloop-nextest-python-api>
- 31.57 s
gammaloop-nextest-python-api>
- 31.57 s
gammaloop-nextest-python-api> Location:
- 31.57 s
gammaloop-nextest-python-api> tests/tests/test_python_api.rs:156:20
- 31.57 s
gammaloop-nextest-python-api>
- 31.57 s
gammaloop-nextest-python-api> FAIL [ 0.180s] (3/5) gammaloop-integration-tests::test_python_api python_evaluate_samples_batch_and_momentum_space_have_expected_shape
- 31.57 s
gammaloop-nextest-python-api> stdout ---
- 31.57 s
gammaloop-nextest-python-api>
- 31.57 s
gammaloop-nextest-python-api> running 1 test
- 31.57 s
gammaloop-nextest-python-api> test python_evaluate_samples_batch_and_momentum_space_have_expected_shape ... FAILED
- 31.57 s
gammaloop-nextest-python-api>
- 31.57 s
gammaloop-nextest-python-api> failures:
- 31.57 s
gammaloop-nextest-python-api>
- 31.57 s
gammaloop-nextest-python-api> failures:
- 31.57 s
gammaloop-nextest-python-api> python_evaluate_samples_batch_and_momentum_space_have_expected_shape
- 31.57 s
gammaloop-nextest-python-api>
- 31.57 s
gammaloop-nextest-python-api> test result: FAILED. 0 passed; 1 failed; 0 ignored; 0 measured; 4 filtered out; finished in 0.18s
- 31.57 s
gammaloop-nextest-python-api>
- 31.57 s
gammaloop-nextest-python-api> stderr ---
- 31.57 s
gammaloop-nextest-python-api> Error: Python API test subprocess failed.
- 31.57 s
gammaloop-nextest-python-api> stdout:
- 31.57 s
gammaloop-nextest-python-api> ┌────────────────────────────────────────────────────────┐
- 31.57 s
gammaloop-nextest-python-api> │ You are running a restricted Symbolica instance. │
- 31.57 s
gammaloop-nextest-python-api> │ │
- 31.57 s
gammaloop-nextest-python-api> │ This mode is only permitted for non-commercial use and │
- 31.57 s
gammaloop-nextest-python-api> │ is limited to one instance and core per machine. │
- 31.57 s
gammaloop-nextest-python-api> │ │
- 31.57 s
gammaloop-nextest-python-api> │ Hobbyists can easily acquire a free license key │
- 31.57 s
gammaloop-nextest-python-api> │ that unlocks all cores and removes this banner: │
- 31.57 s
gammaloop-nextest-python-api> │ │
- 31.57 s
gammaloop-nextest-python-api> │ from symbolica import * │
- 31.57 s
gammaloop-nextest-python-api> │ request_hobbyist_license('YOUR_NAME', 'YOUR_EMAIL') │
- 31.57 s
gammaloop-nextest-python-api> │ │
- 31.57 s
gammaloop-nextest-python-api> │ All other users can obtain a free 30-day trial key: │
- 31.57 s
gammaloop-nextest-python-api> │ │
- 31.57 s
gammaloop-nextest-python-api> │ from symbolica import * │
- 31.57 s
gammaloop-nextest-python-api> │ request_trial_license('NAME', 'EMAIL', 'EMPLOYER') │
- 31.57 s
gammaloop-nextest-python-api> │ │
- 31.57 s
gammaloop-nextest-python-api> │ See https://symbolica.io/docs/get_started.html#license │
- 31.57 s
gammaloop-nextest-python-api> └────────────────────────────────────────────────────────┘
- 31.57 s
gammaloop-nextest-python-api> ┌───────────────────────────────────────────────────────────────────────────────────────────────────────────┐
- 31.57 s
gammaloop-nextest-python-api> │ Cannot start new unlicensed Symbolica instance since there is already another one running on the machine. │
- 31.57 s
gammaloop-nextest-python-api> └───────────────────────────────────────────────────────────────────────────────────────────────────────────┘
- 31.57 s
gammaloop-nextest-python-api>
- 31.57 s
gammaloop-nextest-python-api> stderr:
- 31.57 s
gammaloop-nextest-python-api>
- 31.57 s
gammaloop-nextest-python-api> ┌───────────────────────────────────────────────────────────┐
- 31.57 s
gammaloop-nextest-python-api> │ Could not resolve the IP of the Symbolica license server. │
- 31.57 s
gammaloop-nextest-python-api> │ │
- 31.57 s
gammaloop-nextest-python-api> │ Please check your DNS configuration. │
- 31.57 s
gammaloop-nextest-python-api> └───────────────────────────────────────────────────────────┘
- 31.57 s
gammaloop-nextest-python-api> Error: failed to lookup address information: Temporary failure in name resolution
- 31.57 s
gammaloop-nextest-python-api>
- 31.57 s
gammaloop-nextest-python-api>
- 31.57 s
gammaloop-nextest-python-api> Location:
- 31.57 s
gammaloop-nextest-python-api> tests/tests/test_python_api.rs:156:20
- 31.57 s
gammaloop-nextest-python-api>
- 31.57 s
gammaloop-nextest-python-api> FAIL [ 0.187s] (4/5) gammaloop-integration-tests::test_python_api python_evaluate_sample_honors_generate_events_and_observable_snapshots
- 31.57 s
gammaloop-nextest-python-api> stdout ---
- 31.57 s
gammaloop-nextest-python-api>
- 31.57 s
gammaloop-nextest-python-api> running 1 test
- 31.57 s
gammaloop-nextest-python-api> test python_evaluate_sample_honors_generate_events_and_observable_snapshots ... FAILED
- 31.57 s
gammaloop-nextest-python-api>
- 31.57 s
gammaloop-nextest-python-api> failures:
- 31.57 s
gammaloop-nextest-python-api>
- 31.57 s
gammaloop-nextest-python-api> failures:
- 31.57 s
gammaloop-nextest-python-api> python_evaluate_sample_honors_generate_events_and_observable_snapshots
- 31.57 s
gammaloop-nextest-python-api>
- 31.57 s
gammaloop-nextest-python-api> test result: FAILED. 0 passed; 1 failed; 0 ignored; 0 measured; 4 filtered out; finished in 0.18s
- 31.57 s
gammaloop-nextest-python-api>
- 31.57 s
gammaloop-nextest-python-api> stderr ---
- 31.57 s
gammaloop-nextest-python-api> Error: Python API test subprocess failed.
- 31.57 s
gammaloop-nextest-python-api> stdout:
- 31.57 s
gammaloop-nextest-python-api> ┌────────────────────────────────────────────────────────┐
- 31.57 s
gammaloop-nextest-python-api> │ You are running a restricted Symbolica instance. │
- 31.57 s
gammaloop-nextest-python-api> │ │
- 31.57 s
gammaloop-nextest-python-api> │ This mode is only permitted for non-commercial use and │
- 31.57 s
gammaloop-nextest-python-api> │ is limited to one instance and core per machine. │
- 31.57 s
gammaloop-nextest-python-api> │ │
- 31.57 s
gammaloop-nextest-python-api> │ Hobbyists can easily acquire a free license key │
- 31.57 s
gammaloop-nextest-python-api> │ that unlocks all cores and removes this banner: │
- 31.57 s
gammaloop-nextest-python-api> │ │
- 31.57 s
gammaloop-nextest-python-api> │ from symbolica import * │
- 31.57 s
gammaloop-nextest-python-api> │ request_hobbyist_license('YOUR_NAME', 'YOUR_EMAIL') │
- 31.57 s
gammaloop-nextest-python-api> │ │
- 31.57 s
gammaloop-nextest-python-api> │ All other users can obtain a free 30-day trial key: │
- 31.57 s
gammaloop-nextest-python-api> │ │
- 31.57 s
gammaloop-nextest-python-api> │ from symbolica import * │
- 31.57 s
gammaloop-nextest-python-api> │ request_trial_license('NAME', 'EMAIL', 'EMPLOYER') │
- 31.57 s
gammaloop-nextest-python-api> │ │
- 31.57 s
gammaloop-nextest-python-api> │ See https://symbolica.io/docs/get_started.html#license │
- 31.57 s
gammaloop-nextest-python-api> └────────────────────────────────────────────────────────┘
- 31.57 s
gammaloop-nextest-python-api> ┌───────────────────────────────────────────────────────────────────────────────────────────────────────────┐
- 31.57 s
gammaloop-nextest-python-api> │ Cannot start new unlicensed Symbolica instance since there is already another one running on the machine. │
- 31.57 s
gammaloop-nextest-python-api> └───────────────────────────────────────────────────────────────────────────────────────────────────────────┘
- 31.57 s
gammaloop-nextest-python-api>
- 31.57 s
gammaloop-nextest-python-api> stderr:
- 31.57 s
gammaloop-nextest-python-api>
- 31.57 s
gammaloop-nextest-python-api> ┌───────────────────────────────────────────────────────────┐
- 31.57 s
gammaloop-nextest-python-api> │ Could not resolve the IP of the Symbolica license server. │
- 31.57 s
gammaloop-nextest-python-api> │ │
- 31.57 s
gammaloop-nextest-python-api> │ Please check your DNS configuration. │
- 31.57 s
gammaloop-nextest-python-api> └───────────────────────────────────────────────────────────┘
- 31.57 s
gammaloop-nextest-python-api> Error: failed to lookup address information: Temporary failure in name resolution
- 31.57 s
gammaloop-nextest-python-api>
- 31.57 s
gammaloop-nextest-python-api>
- 31.57 s
gammaloop-nextest-python-api> Location:
- 31.57 s
gammaloop-nextest-python-api> tests/tests/test_python_api.rs:156:20
- 31.57 s
gammaloop-nextest-python-api>
- 31.58 s
gammaloop-nextest-python-api> error: test run failed
- 31.60 s
gammaloop-nextest-python-api>
- 31.60 s
gammaloop-nextest-python-api> ========== nextest test summary ==========
- 31.60 s
gammaloop-nextest-python-api> report: target/nextest/ci_gammaloop/junit.xml
- 31.60 s
gammaloop-nextest-python-api> tests: 5, failures: 3, errors: 0
- 31.60 s
gammaloop-nextest-python-api>
- 31.60 s
gammaloop-nextest-python-api> 1. gammaloop-integration-tests::test_python_api::python_evaluate_sample_preserves_graph_grouping_and_incoming_pdgs
- 31.60 s
gammaloop-nextest-python-api> failure: test failure with exit code 101
- 31.60 s
gammaloop-nextest-python-api> Error: Python API test subprocess failed.
- 31.60 s
gammaloop-nextest-python-api> stdout:
- 31.60 s
gammaloop-nextest-python-api> ┌────────────────────────────────────────────────────────┐
- 31.60 s
gammaloop-nextest-python-api> │ You are running a restricted Symbolica instance. │
- 31.60 s
gammaloop-nextest-python-api> │ │
- 31.60 s
gammaloop-nextest-python-api> │ This mode is only permitted for non-commercial use and │
- 31.60 s
gammaloop-nextest-python-api> │ is limited to one instance and core per machine. │
- 31.60 s
gammaloop-nextest-python-api> │ │
- 31.60 s
gammaloop-nextest-python-api> │ Hobbyists can easily acquire a free license key │
- 31.60 s
gammaloop-nextest-python-api> │ that unlocks all cores and removes this banner: │
- 31.60 s
gammaloop-nextest-python-api> │ │
- 31.60 s
gammaloop-nextest-python-api> │ from symbolica import * │
- 31.60 s
gammaloop-nextest-python-api> │ request_hobbyist_license('YOUR_NAME', 'YOUR_EMAIL') │
- 31.60 s
gammaloop-nextest-python-api> │ │
- 31.60 s
gammaloop-nextest-python-api> │ All other users can obtain a free 30-day trial key: │
- 31.60 s
gammaloop-nextest-python-api> │ │
- 31.60 s
gammaloop-nextest-python-api> │ from symbolica import * │
- 31.60 s
gammaloop-nextest-python-api> │ request_trial_license('NAME', 'EMAIL', 'EMPLOYER') │
- 31.60 s
gammaloop-nextest-python-api> │ │
- 31.60 s
gammaloop-nextest-python-api> │ See https://symbolica.io/docs/get_started.html#license │
- 31.60 s
gammaloop-nextest-python-api> └────────────────────────────────────────────────────────┘
- 31.60 s
gammaloop-nextest-python-api> ┌───────────────────────────────────────────────────────────────────────────────────────────────────────────┐
- 31.60 s
gammaloop-nextest-python-api> │ Cannot start new unlicensed Symbolica instance since there is already another one running on the machine. │
- 31.60 s
gammaloop-nextest-python-api> └───────────────────────────────────────────────────────────────────────────────────────────────────────────┘
- 31.60 s
gammaloop-nextest-python-api>
- 31.60 s
gammaloop-nextest-python-api> stderr:
- 31.60 s
gammaloop-nextest-python-api>
- 31.60 s
gammaloop-nextest-python-api> ┌───────────────────────────────────────────────────────────┐
- 31.60 s
gammaloop-nextest-python-api> │ Could not resolve the IP of the Symbolica license server. │
- 31.60 s
gammaloop-nextest-python-api> │ │
- 31.60 s
gammaloop-nextest-python-api> │ Please check your DNS configuration. │
- 31.60 s
gammaloop-nextest-python-api> └───────────────────────────────────────────────────────────┘
- 31.60 s
gammaloop-nextest-python-api> Error: failed to lookup address information: Temporary failure in name resolution
- 31.60 s
gammaloop-nextest-python-api>
- 31.60 s
gammaloop-nextest-python-api>
- 31.60 s
gammaloop-nextest-python-api> Location:
- 31.60 s
gammaloop-nextest-python-api> tests/tests/test_python_api.rs:156:20
- 31.60 s
gammaloop-nextest-python-api> system-out
- 31.60 s
gammaloop-nextest-python-api> running 1 test
- 31.60 s
gammaloop-nextest-python-api> test python_evaluate_sample_preserves_graph_grouping_and_incoming_pdgs ... FAILED
- 31.60 s
gammaloop-nextest-python-api>
- 31.60 s
gammaloop-nextest-python-api> failures:
- 31.60 s
gammaloop-nextest-python-api>
- 31.60 s
gammaloop-nextest-python-api> failures:
- 31.60 s
gammaloop-nextest-python-api> python_evaluate_sample_preserves_graph_grouping_and_incoming_pdgs
- 31.60 s
gammaloop-nextest-python-api>
- 31.60 s
gammaloop-nextest-python-api> test result: FAILED. 0 passed; 1 failed; 0 ignored; 0 measured; 4 filtered out; finished in 0.18s
- 31.60 s
gammaloop-nextest-python-api> system-err
- 31.60 s
gammaloop-nextest-python-api> Error: Python API test subprocess failed.
- 31.60 s
gammaloop-nextest-python-api> stdout:
- 31.60 s
gammaloop-nextest-python-api> ┌────────────────────────────────────────────────────────┐
- 31.60 s
gammaloop-nextest-python-api> │ You are running a restricted Symbolica instance. │
- 31.60 s
gammaloop-nextest-python-api> │ │
- 31.60 s
gammaloop-nextest-python-api> │ This mode is only permitted for non-commercial use and │
- 31.60 s
gammaloop-nextest-python-api> │ is limited to one instance and core per machine. │
- 31.60 s
gammaloop-nextest-python-api> │ │
- 31.60 s
gammaloop-nextest-python-api> │ Hobbyists can easily acquire a free license key │
- 31.60 s
gammaloop-nextest-python-api> │ that unlocks all cores and removes this banner: │
- 31.60 s
gammaloop-nextest-python-api> │ │
- 31.60 s
gammaloop-nextest-python-api> │ from symbolica import * │
- 31.60 s
gammaloop-nextest-python-api> │ request_hobbyist_license('YOUR_NAME', 'YOUR_EMAIL') │
- 31.60 s
gammaloop-nextest-python-api> │ │
- 31.60 s
gammaloop-nextest-python-api> │ All other users can obtain a free 30-day trial key: │
- 31.60 s
gammaloop-nextest-python-api> │ │
- 31.60 s
gammaloop-nextest-python-api> │ from symbolica import * │
- 31.60 s
gammaloop-nextest-python-api> │ request_trial_license('NAME', 'EMAIL', 'EMPLOYER') │
- 31.60 s
gammaloop-nextest-python-api> │ │
- 31.60 s
gammaloop-nextest-python-api> │ See https://symbolica.io/docs/get_started.html#license │
- 31.60 s
gammaloop-nextest-python-api> └────────────────────────────────────────────────────────┘
- 31.60 s
gammaloop-nextest-python-api> ┌───────────────────────────────────────────────────────────────────────────────────────────────────────────┐
- 31.60 s
gammaloop-nextest-python-api> │ Cannot start new unlicensed Symbolica instance since there is already another one running on the machine. │
- 31.60 s
gammaloop-nextest-python-api> └───────────────────────────────────────────────────────────────────────────────────────────────────────────┘
- 31.60 s
gammaloop-nextest-python-api>
- 31.60 s
gammaloop-nextest-python-api> stderr:
- 31.60 s
gammaloop-nextest-python-api>
- 31.60 s
gammaloop-nextest-python-api> ┌───────────────────────────────────────────────────────────┐
- 31.60 s
gammaloop-nextest-python-api> │ Could not resolve the IP of the Symbolica license server. │
- 31.60 s
gammaloop-nextest-python-api> │ │
- 31.60 s
gammaloop-nextest-python-api> │ Please check your DNS configuration. │
- 31.60 s
gammaloop-nextest-python-api> └───────────────────────────────────────────────────────────┘
- 31.60 s
gammaloop-nextest-python-api> Error: failed to lookup address information: Temporary failure in name resolution
- 31.60 s
gammaloop-nextest-python-api>
- 31.60 s
gammaloop-nextest-python-api>
- 31.60 s
gammaloop-nextest-python-api> Location:
- 31.60 s
gammaloop-nextest-python-api> tests/tests/test_python_api.rs:156:20
- 31.60 s
gammaloop-nextest-python-api>
- 31.60 s
gammaloop-nextest-python-api> 2. gammaloop-integration-tests::test_python_api::python_evaluate_samples_batch_and_momentum_space_have_expected_shape
- 31.60 s
gammaloop-nextest-python-api> failure: test failure with exit code 101
- 31.60 s
gammaloop-nextest-python-api> Error: Python API test subprocess failed.
- 31.60 s
gammaloop-nextest-python-api> stdout:
- 31.60 s
gammaloop-nextest-python-api> ┌────────────────────────────────────────────────────────┐
- 31.60 s
gammaloop-nextest-python-api> │ You are running a restricted Symbolica instance. │
- 31.60 s
gammaloop-nextest-python-api> │ │
- 31.60 s
gammaloop-nextest-python-api> │ This mode is only permitted for non-commercial use and │
- 31.60 s
gammaloop-nextest-python-api> │ is limited to one instance and core per machine. │
- 31.60 s
gammaloop-nextest-python-api> │ │
- 31.60 s
gammaloop-nextest-python-api> │ Hobbyists can easily acquire a free license key │
- 31.60 s
gammaloop-nextest-python-api> │ that unlocks all cores and removes this banner: │
- 31.60 s
gammaloop-nextest-python-api> │ │
- 31.60 s
gammaloop-nextest-python-api> │ from symbolica import * │
- 31.60 s
gammaloop-nextest-python-api> │ request_hobbyist_license('YOUR_NAME', 'YOUR_EMAIL') │
- 31.60 s
gammaloop-nextest-python-api> │ │
- 31.60 s
gammaloop-nextest-python-api> │ All other users can obtain a free 30-day trial key: │
- 31.60 s
gammaloop-nextest-python-api> │ │
- 31.60 s
gammaloop-nextest-python-api> │ from symbolica import * │
- 31.60 s
gammaloop-nextest-python-api> │ request_trial_license('NAME', 'EMAIL', 'EMPLOYER') │
- 31.60 s
gammaloop-nextest-python-api> │ │
- 31.60 s
gammaloop-nextest-python-api> │ See https://symbolica.io/docs/get_started.html#license │
- 31.60 s
gammaloop-nextest-python-api> └────────────────────────────────────────────────────────┘
- 31.60 s
gammaloop-nextest-python-api> ┌───────────────────────────────────────────────────────────────────────────────────────────────────────────┐
- 31.60 s
gammaloop-nextest-python-api> │ Cannot start new unlicensed Symbolica instance since there is already another one running on the machine. │
- 31.60 s
gammaloop-nextest-python-api> └───────────────────────────────────────────────────────────────────────────────────────────────────────────┘
- 31.60 s
gammaloop-nextest-python-api>
- 31.60 s
gammaloop-nextest-python-api> stderr:
- 31.60 s
gammaloop-nextest-python-api>
- 31.60 s
gammaloop-nextest-python-api> ┌───────────────────────────────────────────────────────────┐
- 31.60 s
gammaloop-nextest-python-api> │ Could not resolve the IP of the Symbolica license server. │
- 31.60 s
gammaloop-nextest-python-api> │ │
- 31.60 s
gammaloop-nextest-python-api> │ Please check your DNS configuration. │
- 31.60 s
gammaloop-nextest-python-api> └───────────────────────────────────────────────────────────┘
- 31.60 s
gammaloop-nextest-python-api> Error: failed to lookup address information: Temporary failure in name resolution
- 31.60 s
gammaloop-nextest-python-api>
- 31.60 s
gammaloop-nextest-python-api>
- 31.60 s
gammaloop-nextest-python-api> Location:
- 31.60 s
gammaloop-nextest-python-api> tests/tests/test_python_api.rs:156:20
- 31.60 s
gammaloop-nextest-python-api> system-out
- 31.60 s
gammaloop-nextest-python-api> running 1 test
- 31.60 s
gammaloop-nextest-python-api> test python_evaluate_samples_batch_and_momentum_space_have_expected_shape ... FAILED
- 31.60 s
gammaloop-nextest-python-api>
- 31.60 s
gammaloop-nextest-python-api> failures:
- 31.60 s
gammaloop-nextest-python-api>
- 31.60 s
gammaloop-nextest-python-api> failures:
- 31.60 s
gammaloop-nextest-python-api> python_evaluate_samples_batch_and_momentum_space_have_expected_shape
- 31.60 s
gammaloop-nextest-python-api>
- 31.60 s
gammaloop-nextest-python-api> test result: FAILED. 0 passed; 1 failed; 0 ignored; 0 measured; 4 filtered out; finished in 0.18s
- 31.60 s
gammaloop-nextest-python-api> system-err
- 31.60 s
gammaloop-nextest-python-api> Error: Python API test subprocess failed.
- 31.60 s
gammaloop-nextest-python-api> stdout:
- 31.60 s
gammaloop-nextest-python-api> ┌────────────────────────────────────────────────────────┐
- 31.60 s
gammaloop-nextest-python-api> │ You are running a restricted Symbolica instance. │
- 31.60 s
gammaloop-nextest-python-api> │ │
- 31.60 s
gammaloop-nextest-python-api> │ This mode is only permitted for non-commercial use and │
- 31.60 s
gammaloop-nextest-python-api> │ is limited to one instance and core per machine. │
- 31.60 s
gammaloop-nextest-python-api> │ │
- 31.60 s
gammaloop-nextest-python-api> │ Hobbyists can easily acquire a free license key │
- 31.60 s
gammaloop-nextest-python-api> │ that unlocks all cores and removes this banner: │
- 31.60 s
gammaloop-nextest-python-api> │ │
- 31.60 s
gammaloop-nextest-python-api> │ from symbolica import * │
- 31.60 s
gammaloop-nextest-python-api> │ request_hobbyist_license('YOUR_NAME', 'YOUR_EMAIL') │
- 31.60 s
gammaloop-nextest-python-api> │ │
- 31.60 s
gammaloop-nextest-python-api> │ All other users can obtain a free 30-day trial key: │
- 31.60 s
gammaloop-nextest-python-api> │ │
- 31.60 s
gammaloop-nextest-python-api> │ from symbolica import * │
- 31.60 s
gammaloop-nextest-python-api> │ request_trial_license('NAME', 'EMAIL', 'EMPLOYER') │
- 31.60 s
gammaloop-nextest-python-api> │ │
- 31.60 s
gammaloop-nextest-python-api> │ See https://symbolica.io/docs/get_started.html#license │
- 31.60 s
gammaloop-nextest-python-api> └────────────────────────────────────────────────────────┘
- 31.60 s
gammaloop-nextest-python-api> ┌───────────────────────────────────────────────────────────────────────────────────────────────────────────┐
- 31.60 s
gammaloop-nextest-python-api> │ Cannot start new unlicensed Symbolica instance since there is already another one running on the machine. │
- 31.60 s
gammaloop-nextest-python-api> └───────────────────────────────────────────────────────────────────────────────────────────────────────────┘
- 31.60 s
gammaloop-nextest-python-api>
- 31.60 s
gammaloop-nextest-python-api> stderr:
- 31.60 s
gammaloop-nextest-python-api>
- 31.60 s
gammaloop-nextest-python-api> ┌───────────────────────────────────────────────────────────┐
- 31.60 s
gammaloop-nextest-python-api> │ Could not resolve the IP of the Symbolica license server. │
- 31.60 s
gammaloop-nextest-python-api> │ │
- 31.60 s
gammaloop-nextest-python-api> │ Please check your DNS configuration. │
- 31.60 s
gammaloop-nextest-python-api> └───────────────────────────────────────────────────────────┘
- 31.60 s
gammaloop-nextest-python-api> Error: failed to lookup address information: Temporary failure in name resolution
- 31.60 s
gammaloop-nextest-python-api>
- 31.60 s
gammaloop-nextest-python-api>
- 31.60 s
gammaloop-nextest-python-api> Location:
- 31.60 s
gammaloop-nextest-python-api> tests/tests/test_python_api.rs:156:20
- 31.60 s
gammaloop-nextest-python-api>
- 31.60 s
gammaloop-nextest-python-api> 3. gammaloop-integration-tests::test_python_api::python_evaluate_sample_honors_generate_events_and_observable_snapshots
- 31.60 s
gammaloop-nextest-python-api> failure: test failure with exit code 101
- 31.60 s
gammaloop-nextest-python-api> Error: Python API test subprocess failed.
- 31.60 s
gammaloop-nextest-python-api> stdout:
- 31.60 s
gammaloop-nextest-python-api> ┌────────────────────────────────────────────────────────┐
- 31.60 s
gammaloop-nextest-python-api> │ You are running a restricted Symbolica instance. │
- 31.60 s
gammaloop-nextest-python-api> │ │
- 31.60 s
gammaloop-nextest-python-api> │ This mode is only permitted for non-commercial use and │
- 31.60 s
gammaloop-nextest-python-api> │ is limited to one instance and core per machine. │
- 31.60 s
gammaloop-nextest-python-api> │ │
- 31.60 s
gammaloop-nextest-python-api> │ Hobbyists can easily acquire a free license key │
- 31.60 s
gammaloop-nextest-python-api> │ that unlocks all cores and removes this banner: │
- 31.60 s
gammaloop-nextest-python-api> │ │
- 31.60 s
gammaloop-nextest-python-api> │ from symbolica import * │
- 31.60 s
gammaloop-nextest-python-api> │ request_hobbyist_license('YOUR_NAME', 'YOUR_EMAIL') │
- 31.60 s
gammaloop-nextest-python-api> │ │
- 31.60 s
gammaloop-nextest-python-api> │ All other users can obtain a free 30-day trial key: │
- 31.60 s
gammaloop-nextest-python-api> │ │
- 31.60 s
gammaloop-nextest-python-api> │ from symbolica import * │
- 31.60 s
gammaloop-nextest-python-api> │ request_trial_license('NAME', 'EMAIL', 'EMPLOYER') │
- 31.60 s
gammaloop-nextest-python-api> │ │
- 31.60 s
gammaloop-nextest-python-api> │ See https://symbolica.io/docs/get_started.html#license │
- 31.60 s
gammaloop-nextest-python-api> └────────────────────────────────────────────────────────┘
- 31.60 s
gammaloop-nextest-python-api> ┌───────────────────────────────────────────────────────────────────────────────────────────────────────────┐
- 31.60 s
gammaloop-nextest-python-api> │ Cannot start new unlicensed Symbolica instance since there is already another one running on the machine. │
- 31.60 s
gammaloop-nextest-python-api> └───────────────────────────────────────────────────────────────────────────────────────────────────────────┘
- 31.60 s
gammaloop-nextest-python-api>
- 31.60 s
gammaloop-nextest-python-api> stderr:
- 31.60 s
gammaloop-nextest-python-api>
- 31.60 s
gammaloop-nextest-python-api> ┌───────────────────────────────────────────────────────────┐
- 31.60 s
gammaloop-nextest-python-api> │ Could not resolve the IP of the Symbolica license server. │
- 31.60 s
gammaloop-nextest-python-api> │ │
- 31.60 s
gammaloop-nextest-python-api> │ Please check your DNS configuration. │
- 31.60 s
gammaloop-nextest-python-api> └───────────────────────────────────────────────────────────┘
- 31.60 s
gammaloop-nextest-python-api> Error: failed to lookup address information: Temporary failure in name resolution
- 31.60 s
gammaloop-nextest-python-api>
- 31.60 s
gammaloop-nextest-python-api>
- 31.60 s
gammaloop-nextest-python-api> Location:
- 31.60 s
gammaloop-nextest-python-api> tests/tests/test_python_api.rs:156:20
- 31.60 s
gammaloop-nextest-python-api> system-out
- 31.60 s
gammaloop-nextest-python-api> running 1 test
- 31.60 s
gammaloop-nextest-python-api> test python_evaluate_sample_honors_generate_events_and_observable_snapshots ... FAILED
- 31.60 s
gammaloop-nextest-python-api>
- 31.60 s
gammaloop-nextest-python-api> failures:
- 31.60 s
gammaloop-nextest-python-api>
- 31.60 s
gammaloop-nextest-python-api> failures:
- 31.60 s
gammaloop-nextest-python-api> python_evaluate_sample_honors_generate_events_and_observable_snapshots
- 31.60 s
gammaloop-nextest-python-api>
- 31.60 s
gammaloop-nextest-python-api> test result: FAILED. 0 passed; 1 failed; 0 ignored; 0 measured; 4 filtered out; finished in 0.18s
- 31.60 s
gammaloop-nextest-python-api> system-err
- 31.60 s
gammaloop-nextest-python-api> Error: Python API test subprocess failed.
- 31.60 s
gammaloop-nextest-python-api> stdout:
- 31.60 s
gammaloop-nextest-python-api> ┌────────────────────────────────────────────────────────┐
- 31.60 s
gammaloop-nextest-python-api> │ You are running a restricted Symbolica instance. │
- 31.60 s
gammaloop-nextest-python-api> │ │
- 31.60 s
gammaloop-nextest-python-api> │ This mode is only permitted for non-commercial use and │
- 31.60 s
gammaloop-nextest-python-api> │ is limited to one instance and core per machine. │
- 31.60 s
gammaloop-nextest-python-api> │ │
- 31.60 s
gammaloop-nextest-python-api> │ Hobbyists can easily acquire a free license key │
- 31.60 s
gammaloop-nextest-python-api> │ that unlocks all cores and removes this banner: │
- 31.60 s
gammaloop-nextest-python-api> │ │
- 31.60 s
gammaloop-nextest-python-api> │ from symbolica import * │
- 31.60 s
gammaloop-nextest-python-api> │ request_hobbyist_license('YOUR_NAME', 'YOUR_EMAIL') │
- 31.60 s
gammaloop-nextest-python-api> │ │
- 31.60 s
gammaloop-nextest-python-api> │ All other users can obtain a free 30-day trial key: │
- 31.60 s
gammaloop-nextest-python-api> │ │
- 31.60 s
gammaloop-nextest-python-api> │ from symbolica import * │
- 31.60 s
gammaloop-nextest-python-api> │ request_trial_license('NAME', 'EMAIL', 'EMPLOYER') │
- 31.60 s
gammaloop-nextest-python-api> │ │
- 31.60 s
gammaloop-nextest-python-api> │ See https://symbolica.io/docs/get_started.html#license │
- 31.60 s
gammaloop-nextest-python-api> └────────────────────────────────────────────────────────┘
- 31.60 s
gammaloop-nextest-python-api> ┌───────────────────────────────────────────────────────────────────────────────────────────────────────────┐
- 31.60 s
gammaloop-nextest-python-api> │ Cannot start new unlicensed Symbolica instance since there is already another one running on the machine. │
- 31.60 s
gammaloop-nextest-python-api> └───────────────────────────────────────────────────────────────────────────────────────────────────────────┘
- 31.60 s
gammaloop-nextest-python-api>
- 31.60 s
gammaloop-nextest-python-api> stderr:
- 31.60 s
gammaloop-nextest-python-api>
- 31.60 s
gammaloop-nextest-python-api> ┌───────────────────────────────────────────────────────────┐
- 31.60 s
gammaloop-nextest-python-api> │ Could not resolve the IP of the Symbolica license server. │
- 31.60 s
gammaloop-nextest-python-api> │ │
- 31.60 s
gammaloop-nextest-python-api> │ Please check your DNS configuration. │
- 31.60 s
gammaloop-nextest-python-api> └───────────────────────────────────────────────────────────┘
- 31.60 s
gammaloop-nextest-python-api> Error: failed to lookup address information: Temporary failure in name resolution
- 31.60 s
gammaloop-nextest-python-api>
- 31.60 s
gammaloop-nextest-python-api>
- 31.60 s
gammaloop-nextest-python-api> Location:
- 31.60 s
gammaloop-nextest-python-api> tests/tests/test_python_api.rs:156:20
- 31.60 s
gammaloop-nextest-python-api> =========================================
- 31.64 s
error: Cannot build '/nix/store/6yfkarcx1yqfdkgaj26q9b9n3q0min5r-gammaloop-nextest-python-api.drv'.
- 31.64 s
Reason: builder failed with exit code 100.
- 31.64 s
Output paths:
- 31.64 s
/nix/store/28q91q76k9l62yayywlk70ghfzfk0v47-gammaloop-nextest-python-api
- 31.64 s
Last 589 log lines:
- 31.64 s
> Extracting 1 binary, 1 build script output directory, and 3 linked paths to /build/nextest-archive-MCQr5d
- 31.64 s
> Extracted 18 files to /build/nextest-archive-MCQr5d in 0.06s
- 31.64 s
> ------------
- 31.64 s
> Nextest run ID 2141cd37-3725-4f36-934f-18f6e0b33fd7 with nextest profile: ci_gammaloop
- 31.64 s
> Starting 5 tests across 1 binary
- 31.64 s
> FAIL [ 0.180s] (2/5) gammaloop-integration-tests::test_python_api python_evaluate_sample_preserves_graph_grouping_and_incoming_pdgs
- 31.64 s
> stdout ---
- 31.64 s
>
- 31.64 s
> running 1 test
- 31.64 s
> test python_evaluate_sample_preserves_graph_grouping_and_incoming_pdgs ... FAILED
- 31.64 s
>
- 31.64 s
> failures:
- 31.64 s
>
- 31.64 s
> failures:
- 31.64 s
> python_evaluate_sample_preserves_graph_grouping_and_incoming_pdgs
- 31.64 s
>
- 31.64 s
> test result: FAILED. 0 passed; 1 failed; 0 ignored; 0 measured; 4 filtered out; finished in 0.18s
- 31.64 s
>
- 31.64 s
> stderr ---
- 31.64 s
> Error: Python API test subprocess failed.
- 31.64 s
> stdout:
- 31.64 s
> ┌────────────────────────────────────────────────────────┐
- 31.64 s
> │ You are running a restricted Symbolica instance. │
- 31.64 s
> │ │
- 31.64 s
> │ This mode is only permitted for non-commercial use and │
- 31.64 s
> │ is limited to one instance and core per machine. │
- 31.64 s
> │ │
- 31.64 s
> │ Hobbyists can easily acquire a free license key │
- 31.64 s
> │ that unlocks all cores and removes this banner: │
- 31.64 s
> │ │
- 31.64 s
> │ from symbolica import * │
- 31.64 s
> │ request_hobbyist_license('YOUR_NAME', 'YOUR_EMAIL') │
- 31.64 s
> │ │
- 31.64 s
> │ All other users can obtain a free 30-day trial key: │
- 31.64 s
> │ │
- 31.64 s
> │ from symbolica import * │
- 31.64 s
> │ request_trial_license('NAME', 'EMAIL', 'EMPLOYER') │
- 31.64 s
> │ │
- 31.64 s
> │ See https://symbolica.io/docs/get_started.html#license │
- 31.64 s
> └────────────────────────────────────────────────────────┘
- 31.64 s
> ┌───────────────────────────────────────────────────────────────────────────────────────────────────────────┐
- 31.64 s
> │ Cannot start new unlicensed Symbolica instance since there is already another one running on the machine. │
- 31.64 s
> └───────────────────────────────────────────────────────────────────────────────────────────────────────────┘
- 31.64 s
>
- 31.64 s
> stderr:
- 31.64 s
>
- 31.64 s
> ┌───────────────────────────────────────────────────────────┐
- 31.64 s
> │ Could not resolve the IP of the Symbolica license server. │
- 31.64 s
> │ │
- 31.64 s
> │ Please check your DNS configuration. │
- 31.64 s
> └───────────────────────────────────────────────────────────┘
- 31.64 s
> Error: failed to lookup address information: Temporary failure in name resolution
- 31.64 s
>
- 31.64 s
>
- 31.64 s
> Location:
- 31.64 s
> tests/tests/test_python_api.rs:156:20
- 31.64 s
>
- 31.64 s
> FAIL [ 0.180s] (3/5) gammaloop-integration-tests::test_python_api python_evaluate_samples_batch_and_momentum_space_have_expected_shape
- 31.64 s
> stdout ---
- 31.64 s
>
- 31.64 s
> running 1 test
- 31.64 s
> test python_evaluate_samples_batch_and_momentum_space_have_expected_shape ... FAILED
- 31.64 s
>
- 31.64 s
> failures:
- 31.64 s
>
- 31.64 s
> failures:
- 31.64 s
> python_evaluate_samples_batch_and_momentum_space_have_expected_shape
- 31.64 s
>
- 31.64 s
> test result: FAILED. 0 passed; 1 failed; 0 ignored; 0 measured; 4 filtered out; finished in 0.18s
- 31.64 s
>
- 31.64 s
> stderr ---
- 31.64 s
> Error: Python API test subprocess failed.
- 31.64 s
> stdout:
- 31.64 s
> ┌────────────────────────────────────────────────────────┐
- 31.64 s
> │ You are running a restricted Symbolica instance. │
- 31.64 s
> │ │
- 31.64 s
> │ This mode is only permitted for non-commercial use and │
- 31.64 s
> │ is limited to one instance and core per machine. │
- 31.64 s
> │ │
- 31.64 s
> │ Hobbyists can easily acquire a free license key │
- 31.64 s
> │ that unlocks all cores and removes this banner: │
- 31.64 s
> │ │
- 31.64 s
> │ from symbolica import * │
- 31.64 s
> │ request_hobbyist_license('YOUR_NAME', 'YOUR_EMAIL') │
- 31.64 s
> │ │
- 31.64 s
> │ All other users can obtain a free 30-day trial key: │
- 31.64 s
> │ │
- 31.64 s
> │ from symbolica import * │
- 31.64 s
> │ request_trial_license('NAME', 'EMAIL', 'EMPLOYER') │
- 31.64 s
> │ │
- 31.64 s
> │ See https://symbolica.io/docs/get_started.html#license │
- 31.64 s
> └────────────────────────────────────────────────────────┘
- 31.64 s
> ┌───────────────────────────────────────────────────────────────────────────────────────────────────────────┐
- 31.64 s
> │ Cannot start new unlicensed Symbolica instance since there is already another one running on the machine. │
- 31.64 s
> └───────────────────────────────────────────────────────────────────────────────────────────────────────────┘
- 31.64 s
>
- 31.64 s
> stderr:
- 31.64 s
>
- 31.64 s
> ┌───────────────────────────────────────────────────────────┐
- 31.64 s
> │ Could not resolve the IP of the Symbolica license server. │
- 31.64 s
> │ │
- 31.64 s
> │ Please check your DNS configuration. │
- 31.64 s
> └───────────────────────────────────────────────────────────┘
- 31.64 s
> Error: failed to lookup address information: Temporary failure in name resolution
- 31.64 s
>
- 31.64 s
>
- 31.64 s
> Location:
- 31.64 s
> tests/tests/test_python_api.rs:156:20
- 31.64 s
>
- 31.64 s
> FAIL [ 0.187s] (4/5) gammaloop-integration-tests::test_python_api python_evaluate_sample_honors_generate_events_and_observable_snapshots
- 31.64 s
> stdout ---
- 31.64 s
>
- 31.64 s
> running 1 test
- 31.64 s
> test python_evaluate_sample_honors_generate_events_and_observable_snapshots ... FAILED
- 31.64 s
>
- 31.64 s
> failures:
- 31.64 s
>
- 31.64 s
> failures:
- 31.64 s
> python_evaluate_sample_honors_generate_events_and_observable_snapshots
- 31.64 s
>
- 31.64 s
> test result: FAILED. 0 passed; 1 failed; 0 ignored; 0 measured; 4 filtered out; finished in 0.18s
- 31.64 s
>
- 31.64 s
> stderr ---
- 31.64 s
> Error: Python API test subprocess failed.
- 31.64 s
> stdout:
- 31.64 s
> ┌────────────────────────────────────────────────────────┐
- 31.64 s
> │ You are running a restricted Symbolica instance. │
- 31.64 s
> │ │
- 31.64 s
> │ This mode is only permitted for non-commercial use and │
- 31.64 s
> │ is limited to one instance and core per machine. │
- 31.64 s
> │ │
- 31.64 s
> │ Hobbyists can easily acquire a free license key │
- 31.64 s
> │ that unlocks all cores and removes this banner: │
- 31.64 s
> │ │
- 31.64 s
> │ from symbolica import * │
- 31.64 s
> │ request_hobbyist_license('YOUR_NAME', 'YOUR_EMAIL') │
- 31.64 s
> │ │
- 31.64 s
> │ All other users can obtain a free 30-day trial key: │
- 31.64 s
> │ │
- 31.64 s
> │ from symbolica import * │
- 31.64 s
> │ request_trial_license('NAME', 'EMAIL', 'EMPLOYER') │
- 31.64 s
> │ │
- 31.64 s
> │ See https://symbolica.io/docs/get_started.html#license │
- 31.64 s
> └────────────────────────────────────────────────────────┘
- 31.64 s
> ┌───────────────────────────────────────────────────────────────────────────────────────────────────────────┐
- 31.64 s
> │ Cannot start new unlicensed Symbolica instance since there is already another one running on the machine. │
- 31.64 s
> └───────────────────────────────────────────────────────────────────────────────────────────────────────────┘
- 31.64 s
>
- 31.64 s
> stderr:
- 31.64 s
>
- 31.64 s
> ┌───────────────────────────────────────────────────────────┐
- 31.64 s
> │ Could not resolve the IP of the Symbolica license server. │
- 31.64 s
> │ │
- 31.64 s
> │ Please check your DNS configuration. │
- 31.64 s
> └───────────────────────────────────────────────────────────┘
- 31.64 s
> Error: failed to lookup address information: Temporary failure in name resolution
- 31.64 s
>
- 31.64 s
>
- 31.64 s
> Location:
- 31.64 s
> tests/tests/test_python_api.rs:156:20
- 31.64 s
>
- 31.64 s
> ------------
- 31.64 s
> Summary [ 0.252s] 5 tests run: 2 passed, 3 failed, 0 skipped
- 31.64 s
> FAIL [ 0.180s] (2/5) gammaloop-integration-tests::test_python_api python_evaluate_sample_preserves_graph_grouping_and_incoming_pdgs
- 31.64 s
> stdout ---
- 31.64 s
>
- 31.64 s
> running 1 test
- 31.64 s
> test python_evaluate_sample_preserves_graph_grouping_and_incoming_pdgs ... FAILED
- 31.64 s
>
- 31.64 s
> failures:
- 31.64 s
>
- 31.64 s
> failures:
- 31.64 s
> python_evaluate_sample_preserves_graph_grouping_and_incoming_pdgs
- 31.64 s
>
- 31.64 s
> test result: FAILED. 0 passed; 1 failed; 0 ignored; 0 measured; 4 filtered out; finished in 0.18s
- 31.64 s
>
- 31.64 s
> stderr ---
- 31.64 s
> Error: Python API test subprocess failed.
- 31.64 s
> stdout:
- 31.64 s
> ┌────────────────────────────────────────────────────────┐
- 31.64 s
> │ You are running a restricted Symbolica instance. │
- 31.64 s
> │ │
- 31.64 s
> │ This mode is only permitted for non-commercial use and │
- 31.64 s
> │ is limited to one instance and core per machine. │
- 31.64 s
> │ │
- 31.64 s
> │ Hobbyists can easily acquire a free license key │
- 31.64 s
> │ that unlocks all cores and removes this banner: │
- 31.64 s
> │ │
- 31.64 s
> │ from symbolica import * │
- 31.64 s
> │ request_hobbyist_license('YOUR_NAME', 'YOUR_EMAIL') │
- 31.64 s
> │ │
- 31.64 s
> │ All other users can obtain a free 30-day trial key: │
- 31.64 s
> │ │
- 31.64 s
> │ from symbolica import * │
- 31.64 s
> │ request_trial_license('NAME', 'EMAIL', 'EMPLOYER') │
- 31.64 s
> │ │
- 31.64 s
> │ See https://symbolica.io/docs/get_started.html#license │
- 31.64 s
> └────────────────────────────────────────────────────────┘
- 31.64 s
> ┌───────────────────────────────────────────────────────────────────────────────────────────────────────────┐
- 31.64 s
> │ Cannot start new unlicensed Symbolica instance since there is already another one running on the machine. │
- 31.64 s
> └───────────────────────────────────────────────────────────────────────────────────────────────────────────┘
- 31.64 s
>
- 31.64 s
> stderr:
- 31.64 s
>
- 31.64 s
> ┌───────────────────────────────────────────────────────────┐
- 31.64 s
> │ Could not resolve the IP of the Symbolica license server. │
- 31.64 s
> │ │
- 31.64 s
> │ Please check your DNS configuration. │
- 31.64 s
> └───────────────────────────────────────────────────────────┘
- 31.64 s
> Error: failed to lookup address information: Temporary failure in name resolution
- 31.64 s
>
- 31.64 s
>
- 31.64 s
> Location:
- 31.64 s
> tests/tests/test_python_api.rs:156:20
- 31.64 s
>
- 31.64 s
> FAIL [ 0.180s] (3/5) gammaloop-integration-tests::test_python_api python_evaluate_samples_batch_and_momentum_space_have_expected_shape
- 31.64 s
> stdout ---
- 31.64 s
>
- 31.64 s
> running 1 test
- 31.64 s
> test python_evaluate_samples_batch_and_momentum_space_have_expected_shape ... FAILED
- 31.64 s
>
- 31.64 s
> failures:
- 31.64 s
>
- 31.64 s
> failures:
- 31.64 s
> python_evaluate_samples_batch_and_momentum_space_have_expected_shape
- 31.64 s
>
- 31.64 s
> test result: FAILED. 0 passed; 1 failed; 0 ignored; 0 measured; 4 filtered out; finished in 0.18s
- 31.64 s
>
- 31.64 s
> stderr ---
- 31.64 s
> Error: Python API test subprocess failed.
- 31.64 s
> stdout:
- 31.64 s
> ┌────────────────────────────────────────────────────────┐
- 31.64 s
> │ You are running a restricted Symbolica instance. │
- 31.64 s
> │ │
- 31.64 s
> │ This mode is only permitted for non-commercial use and │
- 31.64 s
> │ is limited to one instance and core per machine. │
- 31.64 s
> │ │
- 31.64 s
> │ Hobbyists can easily acquire a free license key │
- 31.64 s
> │ that unlocks all cores and removes this banner: │
- 31.64 s
> │ │
- 31.64 s
> │ from symbolica import * │
- 31.64 s
> │ request_hobbyist_license('YOUR_NAME', 'YOUR_EMAIL') │
- 31.64 s
> │ │
- 31.64 s
> │ All other users can obtain a free 30-day trial key: │
- 31.64 s
> │ │
- 31.64 s
> │ from symbolica import * │
- 31.64 s
> │ request_trial_license('NAME', 'EMAIL', 'EMPLOYER') │
- 31.64 s
> │ │
- 31.64 s
> │ See https://symbolica.io/docs/get_started.html#license │
- 31.64 s
> └────────────────────────────────────────────────────────┘
- 31.64 s
> ┌───────────────────────────────────────────────────────────────────────────────────────────────────────────┐
- 31.64 s
> │ Cannot start new unlicensed Symbolica instance since there is already another one running on the machine. │
- 31.64 s
> └───────────────────────────────────────────────────────────────────────────────────────────────────────────┘
- 31.64 s
>
- 31.64 s
> stderr:
- 31.64 s
>
- 31.64 s
> ┌───────────────────────────────────────────────────────────┐
- 31.64 s
> │ Could not resolve the IP of the Symbolica license server. │
- 31.64 s
> │ │
- 31.64 s
> │ Please check your DNS configuration. │
- 31.64 s
> └───────────────────────────────────────────────────────────┘
- 31.64 s
> Error: failed to lookup address information: Temporary failure in name resolution
- 31.64 s
>
- 31.64 s
>
- 31.64 s
> Location:
- 31.64 s
> tests/tests/test_python_api.rs:156:20
- 31.64 s
>
- 31.64 s
> FAIL [ 0.187s] (4/5) gammaloop-integration-tests::test_python_api python_evaluate_sample_honors_generate_events_and_observable_snapshots
- 31.64 s
> stdout ---
- 31.64 s
>
- 31.64 s
> running 1 test
- 31.64 s
> test python_evaluate_sample_honors_generate_events_and_observable_snapshots ... FAILED
- 31.64 s
>
- 31.64 s
> failures:
- 31.64 s
>
- 31.64 s
> failures:
- 31.64 s
> python_evaluate_sample_honors_generate_events_and_observable_snapshots
- 31.64 s
>
- 31.64 s
> test result: FAILED. 0 passed; 1 failed; 0 ignored; 0 measured; 4 filtered out; finished in 0.18s
- 31.64 s
>
- 31.64 s
> stderr ---
- 31.64 s
> Error: Python API test subprocess failed.
- 31.64 s
> stdout:
- 31.64 s
> ┌────────────────────────────────────────────────────────┐
- 31.64 s
> │ You are running a restricted Symbolica instance. │
- 31.64 s
> │ │
- 31.64 s
> │ This mode is only permitted for non-commercial use and │
- 31.64 s
> │ is limited to one instance and core per machine. │
- 31.64 s
> │ │
- 31.64 s
> │ Hobbyists can easily acquire a free license key │
- 31.64 s
> │ that unlocks all cores and removes this banner: │
- 31.64 s
> │ │
- 31.64 s
> │ from symbolica import * │
- 31.64 s
> │ request_hobbyist_license('YOUR_NAME', 'YOUR_EMAIL') │
- 31.64 s
> │ │
- 31.64 s
> │ All other users can obtain a free 30-day trial key: │
- 31.64 s
> │ │
- 31.64 s
> │ from symbolica import * │
- 31.64 s
> │ request_trial_license('NAME', 'EMAIL', 'EMPLOYER') │
- 31.64 s
> │ │
- 31.64 s
> │ See https://symbolica.io/docs/get_started.html#license │
- 31.64 s
> └────────────────────────────────────────────────────────┘
- 31.64 s
> ┌───────────────────────────────────────────────────────────────────────────────────────────────────────────┐
- 31.64 s
> │ Cannot start new unlicensed Symbolica instance since there is already another one running on the machine. │
- 31.64 s
> └───────────────────────────────────────────────────────────────────────────────────────────────────────────┘
- 31.64 s
>
- 31.64 s
> stderr:
- 31.64 s
>
- 31.64 s
> ┌───────────────────────────────────────────────────────────┐
- 31.64 s
> │ Could not resolve the IP of the Symbolica license server. │
- 31.64 s
> │ │
- 31.64 s
> │ Please check your DNS configuration. │
- 31.64 s
> └───────────────────────────────────────────────────────────┘
- 31.64 s
> Error: failed to lookup address information: Temporary failure in name resolution
- 31.64 s
>
- 31.64 s
>
- 31.64 s
> Location:
- 31.64 s
> tests/tests/test_python_api.rs:156:20
- 31.64 s
>
- 31.64 s
> error: test run failed
- 31.64 s
>
- 31.64 s
> ========== nextest test summary ==========
- 31.64 s
> report: target/nextest/ci_gammaloop/junit.xml
- 31.64 s
> tests: 5, failures: 3, errors: 0
- 31.64 s
>
- 31.64 s
> 1. gammaloop-integration-tests::test_python_api::python_evaluate_sample_preserves_graph_grouping_and_incoming_pdgs
- 31.64 s
> failure: test failure with exit code 101
- 31.64 s
> Error: Python API test subprocess failed.
- 31.64 s
> stdout:
- 31.64 s
> ┌────────────────────────────────────────────────────────┐
- 31.64 s
> │ You are running a restricted Symbolica instance. │
- 31.64 s
> │ │
- 31.64 s
> │ This mode is only permitted for non-commercial use and │
- 31.64 s
> │ is limited to one instance and core per machine. │
- 31.64 s
> │ │
- 31.64 s
> │ Hobbyists can easily acquire a free license key │
- 31.64 s
> │ that unlocks all cores and removes this banner: │
- 31.64 s
> │ │
- 31.64 s
> │ from symbolica import * │
- 31.64 s
> │ request_hobbyist_license('YOUR_NAME', 'YOUR_EMAIL') │
- 31.64 s
> │ │
- 31.64 s
> │ All other users can obtain a free 30-day trial key: │
- 31.64 s
> │ │
- 31.64 s
> │ from symbolica import * │
- 31.64 s
> │ request_trial_license('NAME', 'EMAIL', 'EMPLOYER') │
- 31.64 s
> │ │
- 31.64 s
> │ See https://symbolica.io/docs/get_started.html#license │
- 31.64 s
> └────────────────────────────────────────────────────────┘
- 31.64 s
> ┌───────────────────────────────────────────────────────────────────────────────────────────────────────────┐
- 31.64 s
> │ Cannot start new unlicensed Symbolica instance since there is already another one running on the machine. │
- 31.64 s
> └───────────────────────────────────────────────────────────────────────────────────────────────────────────┘
- 31.64 s
>
- 31.64 s
> stderr:
- 31.64 s
>
- 31.64 s
> ┌───────────────────────────────────────────────────────────┐
- 31.64 s
> │ Could not resolve the IP of the Symbolica license server. │
- 31.64 s
> │ │
- 31.64 s
> │ Please check your DNS configuration. │
- 31.64 s
> └───────────────────────────────────────────────────────────┘
- 31.64 s
> Error: failed to lookup address information: Temporary failure in name resolution
- 31.64 s
>
- 31.64 s
>
- 31.64 s
> Location:
- 31.64 s
> tests/tests/test_python_api.rs:156:20
- 31.64 s
> system-out
- 31.64 s
> running 1 test
- 31.64 s
> test python_evaluate_sample_preserves_graph_grouping_and_incoming_pdgs ... FAILED
- 31.64 s
>
- 31.64 s
> failures:
- 31.64 s
>
- 31.64 s
> failures:
- 31.64 s
> python_evaluate_sample_preserves_graph_grouping_and_incoming_pdgs
- 31.64 s
>
- 31.64 s
> test result: FAILED. 0 passed; 1 failed; 0 ignored; 0 measured; 4 filtered out; finished in 0.18s
- 31.64 s
> system-err
- 31.64 s
> Error: Python API test subprocess failed.
- 31.64 s
> stdout:
- 31.64 s
> ┌────────────────────────────────────────────────────────┐
- 31.64 s
> │ You are running a restricted Symbolica instance. │
- 31.64 s
> │ │
- 31.64 s
> │ This mode is only permitted for non-commercial use and │
- 31.64 s
> │ is limited to one instance and core per machine. │
- 31.64 s
> │ │
- 31.64 s
> │ Hobbyists can easily acquire a free license key │
- 31.64 s
> │ that unlocks all cores and removes this banner: │
- 31.64 s
> │ │
- 31.64 s
> │ from symbolica import * │
- 31.64 s
> │ request_hobbyist_license('YOUR_NAME', 'YOUR_EMAIL') │
- 31.64 s
> │ │
- 31.64 s
> │ All other users can obtain a free 30-day trial key: │
- 31.64 s
> │ │
- 31.64 s
> │ from symbolica import * │
- 31.64 s
> │ request_trial_license('NAME', 'EMAIL', 'EMPLOYER') │
- 31.64 s
> │ │
- 31.64 s
> │ See https://symbolica.io/docs/get_started.html#license │
- 31.64 s
> └────────────────────────────────────────────────────────┘
- 31.64 s
> ┌───────────────────────────────────────────────────────────────────────────────────────────────────────────┐
- 31.64 s
> │ Cannot start new unlicensed Symbolica instance since there is already another one running on the machine. │
- 31.64 s
> └───────────────────────────────────────────────────────────────────────────────────────────────────────────┘
- 31.64 s
>
- 31.64 s
> stderr:
- 31.64 s
>
- 31.64 s
> ┌───────────────────────────────────────────────────────────┐
- 31.64 s
> │ Could not resolve the IP of the Symbolica license server. │
- 31.64 s
> │ │
- 31.64 s
> │ Please check your DNS configuration. │
- 31.64 s
> └───────────────────────────────────────────────────────────┘
- 31.64 s
> Error: failed to lookup address information: Temporary failure in name resolution
- 31.64 s
>
- 31.64 s
>
- 31.64 s
> Location:
- 31.64 s
> tests/tests/test_python_api.rs:156:20
- 31.64 s
>
- 31.64 s
> 2. gammaloop-integration-tests::test_python_api::python_evaluate_samples_batch_and_momentum_space_have_expected_shape
- 31.64 s
> failure: test failure with exit code 101
- 31.64 s
> Error: Python API test subprocess failed.
- 31.64 s
> stdout:
- 31.64 s
> ┌────────────────────────────────────────────────────────┐
- 31.64 s
> │ You are running a restricted Symbolica instance. │
- 31.64 s
> │ │
- 31.64 s
> │ This mode is only permitted for non-commercial use and │
- 31.64 s
> │ is limited to one instance and core per machine. │
- 31.64 s
> │ │
- 31.64 s
> │ Hobbyists can easily acquire a free license key │
- 31.64 s
> │ that unlocks all cores and removes this banner: │
- 31.64 s
> │ │
- 31.64 s
> │ from symbolica import * │
- 31.64 s
> │ request_hobbyist_license('YOUR_NAME', 'YOUR_EMAIL') │
- 31.64 s
> │ │
- 31.64 s
> │ All other users can obtain a free 30-day trial key: │
- 31.64 s
> │ │
- 31.64 s
> │ from symbolica import * │
- 31.64 s
> │ request_trial_license('NAME', 'EMAIL', 'EMPLOYER') │
- 31.64 s
> │ │
- 31.64 s
> │ See https://symbolica.io/docs/get_started.html#license │
- 31.64 s
> └────────────────────────────────────────────────────────┘
- 31.64 s
> ┌───────────────────────────────────────────────────────────────────────────────────────────────────────────┐
- 31.64 s
> │ Cannot start new unlicensed Symbolica instance since there is already another one running on the machine. │
- 31.64 s
> └───────────────────────────────────────────────────────────────────────────────────────────────────────────┘
- 31.64 s
>
- 31.64 s
> stderr:
- 31.64 s
>
- 31.64 s
> ┌───────────────────────────────────────────────────────────┐
- 31.64 s
> │ Could not resolve the IP of the Symbolica license server. │
- 31.64 s
> │ │
- 31.64 s
> │ Please check your DNS configuration. │
- 31.64 s
> └───────────────────────────────────────────────────────────┘
- 31.64 s
> Error: failed to lookup address information: Temporary failure in name resolution
- 31.64 s
>
- 31.64 s
>
- 31.64 s
> Location:
- 31.64 s
> tests/tests/test_python_api.rs:156:20
- 31.64 s
> system-out
- 31.64 s
> running 1 test
- 31.64 s
> test python_evaluate_samples_batch_and_momentum_space_have_expected_shape ... FAILED
- 31.64 s
>
- 31.64 s
> failures:
- 31.64 s
>
- 31.64 s
> failures:
- 31.64 s
> python_evaluate_samples_batch_and_momentum_space_have_expected_shape
- 31.64 s
>
- 31.64 s
> test result: FAILED. 0 passed; 1 failed; 0 ignored; 0 measured; 4 filtered out; finished in 0.18s
- 31.64 s
> system-err
- 31.64 s
> Error: Python API test subprocess failed.
- 31.64 s
> stdout:
- 31.64 s
> ┌────────────────────────────────────────────────────────┐
- 31.64 s
> │ You are running a restricted Symbolica instance. │
- 31.64 s
> │ │
- 31.64 s
> │ This mode is only permitted for non-commercial use and │
- 31.64 s
> │ is limited to one instance and core per machine. │
- 31.64 s
> │ │
- 31.64 s
> │ Hobbyists can easily acquire a free license key │
- 31.64 s
> │ that unlocks all cores and removes this banner: │
- 31.64 s
> │ │
- 31.64 s
> │ from symbolica import * │
- 31.64 s
> │ request_hobbyist_license('YOUR_NAME', 'YOUR_EMAIL') │
- 31.64 s
> │ │
- 31.64 s
> │ All other users can obtain a free 30-day trial key: │
- 31.64 s
> │ │
- 31.64 s
> │ from symbolica import * │
- 31.64 s
> │ request_trial_license('NAME', 'EMAIL', 'EMPLOYER') │
- 31.64 s
> │ │
- 31.64 s
> │ See https://symbolica.io/docs/get_started.html#license │
- 31.64 s
> └────────────────────────────────────────────────────────┘
- 31.64 s
> ┌───────────────────────────────────────────────────────────────────────────────────────────────────────────┐
- 31.64 s
> │ Cannot start new unlicensed Symbolica instance since there is already another one running on the machine. │
- 31.64 s
> └───────────────────────────────────────────────────────────────────────────────────────────────────────────┘
- 31.64 s
>
- 31.64 s
> stderr:
- 31.64 s
>
- 31.64 s
> ┌───────────────────────────────────────────────────────────┐
- 31.64 s
> │ Could not resolve the IP of the Symbolica license server. │
- 31.64 s
> │ │
- 31.64 s
> │ Please check your DNS configuration. │
- 31.64 s
> └───────────────────────────────────────────────────────────┘
- 31.64 s
> Error: failed to lookup address information: Temporary failure in name resolution
- 31.64 s
>
- 31.64 s
>
- 31.64 s
> Location:
- 31.64 s
> tests/tests/test_python_api.rs:156:20
- 31.64 s
>
- 31.64 s
> 3. gammaloop-integration-tests::test_python_api::python_evaluate_sample_honors_generate_events_and_observable_snapshots
- 31.64 s
> failure: test failure with exit code 101
- 31.64 s
> Error: Python API test subprocess failed.
- 31.64 s
> stdout:
- 31.64 s
> ┌────────────────────────────────────────────────────────┐
- 31.64 s
> │ You are running a restricted Symbolica instance. │
- 31.64 s
> │ │
- 31.64 s
> │ This mode is only permitted for non-commercial use and │
- 31.64 s
> │ is limited to one instance and core per machine. │
- 31.64 s
> │ │
- 31.64 s
> │ Hobbyists can easily acquire a free license key │
- 31.64 s
> │ that unlocks all cores and removes this banner: │
- 31.64 s
> │ │
- 31.64 s
> │ from symbolica import * │
- 31.64 s
> │ request_hobbyist_license('YOUR_NAME', 'YOUR_EMAIL') │
- 31.64 s
> │ │
- 31.64 s
> │ All other users can obtain a free 30-day trial key: │
- 31.64 s
> │ │
- 31.64 s
> │ from symbolica import * │
- 31.64 s
> │ request_trial_license('NAME', 'EMAIL', 'EMPLOYER') │
- 31.64 s
> │ │
- 31.64 s
> │ See https://symbolica.io/docs/get_started.html#license │
- 31.64 s
> └────────────────────────────────────────────────────────┘
- 31.64 s
> ┌───────────────────────────────────────────────────────────────────────────────────────────────────────────┐
- 31.64 s
> │ Cannot start new unlicensed Symbolica instance since there is already another one running on the machine. │
- 31.64 s
> └───────────────────────────────────────────────────────────────────────────────────────────────────────────┘
- 31.64 s
>
- 31.64 s
> stderr:
- 31.64 s
>
- 31.64 s
> ┌───────────────────────────────────────────────────────────┐
- 31.64 s
> │ Could not resolve the IP of the Symbolica license server. │
- 31.64 s
> │ │
- 31.64 s
> │ Please check your DNS configuration. │
- 31.64 s
> └───────────────────────────────────────────────────────────┘
- 31.64 s
> Error: failed to lookup address information: Temporary failure in name resolution
- 31.64 s
>
- 31.64 s
>
- 31.64 s
> Location:
- 31.64 s
> tests/tests/test_python_api.rs:156:20
- 31.64 s
> system-out
- 31.64 s
> running 1 test
- 31.64 s
> test python_evaluate_sample_honors_generate_events_and_observable_snapshots ... FAILED
- 31.64 s
>
- 31.64 s
> failures:
- 31.64 s
>
- 31.64 s
> failures:
- 31.64 s
> python_evaluate_sample_honors_generate_events_and_observable_snapshots
- 31.64 s
>
- 31.64 s
> test result: FAILED. 0 passed; 1 failed; 0 ignored; 0 measured; 4 filtered out; finished in 0.18s
- 31.64 s
> system-err
- 31.64 s
> Error: Python API test subprocess failed.
- 31.64 s
> stdout:
- 31.64 s
> ┌────────────────────────────────────────────────────────┐
- 31.64 s
> │ You are running a restricted Symbolica instance. │
- 31.64 s
> │ │
- 31.64 s
> │ This mode is only permitted for non-commercial use and │
- 31.64 s
> │ is limited to one instance and core per machine. │
- 31.64 s
> │ │
- 31.64 s
> │ Hobbyists can easily acquire a free license key │
- 31.64 s
> │ that unlocks all cores and removes this banner: │
- 31.64 s
> │ │
- 31.64 s
> │ from symbolica import * │
- 31.64 s
> │ request_hobbyist_license('YOUR_NAME', 'YOUR_EMAIL') │
- 31.64 s
> │ │
- 31.64 s
> │ All other users can obtain a free 30-day trial key: │
- 31.64 s
> │ │
- 31.64 s
> │ from symbolica import * │
- 31.64 s
> │ request_trial_license('NAME', 'EMAIL', 'EMPLOYER') │
- 31.64 s
> │ │
- 31.64 s
> │ See https://symbolica.io/docs/get_started.html#license │
- 31.64 s
> └────────────────────────────────────────────────────────┘
- 31.64 s
> ┌───────────────────────────────────────────────────────────────────────────────────────────────────────────┐
- 31.64 s
> │ Cannot start new unlicensed Symbolica instance since there is already another one running on the machine. │
- 31.64 s
> └───────────────────────────────────────────────────────────────────────────────────────────────────────────┘
- 31.64 s
>
- 31.64 s
> stderr:
- 31.64 s
>
- 31.64 s
> ┌───────────────────────────────────────────────────────────┐
- 31.64 s
> │ Could not resolve the IP of the Symbolica license server. │
- 31.64 s
> │ │
- 31.64 s
> │ Please check your DNS configuration. │
- 31.64 s
> └───────────────────────────────────────────────────────────┘
- 31.64 s
> Error: failed to lookup address information: Temporary failure in name resolution
- 31.64 s
>
- 31.64 s
>
- 31.64 s
> Location:
- 31.64 s
> tests/tests/test_python_api.rs:156:20
- 31.64 s
> =========================================
- 31.64 s
For full logs, run:
- 31.64 s
nix log /nix/store/6yfkarcx1yqfdkgaj26q9b9n3q0min5r-gammaloop-nextest-python-api.drv
- 31.79 s
[0 built (1 failed), 0.0Run failed.