test packages.x86_64-linux.nix-ci-check-gammaloop-nextest-clinnet
0.02 s
$ /nix/store/bhv6xyvqw6gjs3j488gi1z6wdv18bdpa-coreutils-9.11/bin/timeout --kill-after=15s 7200s /nix/store/bxgja2ppiqi6w2bgn0r07d7mgnl1k6k2-nix-2.34.8/bin/nix --extra-experimental-features nix-command --extra-experimental-features flakes flake clone git+https://github.com/alphal00p/gammaloop --dest /tmp/nix-ci-worker/stable-pwd/repo/
0.25 s
Cloning into '/tmp/nix-ci-worker/stable-pwd/repo'...
1.01 s
remote: Enumerating objects: 162134, done.
1.12 s
remote: Counting objects: 0% (1/3710)
remote: Counting objects: 1% (38/3710)
remote: Counting objects: 2% (75/3710)
remote: Counting objects: 3% (112/3710)
remote: Counting objects: 4% (149/3710)
remote: Counting objects: 5% (186/3710)
remote: Counting objects: 6% (223/3710)
remote: Counting objects: 7% (260/3710)
remote: Counting objects: 8% (297/3710)
remote: Counting objects: 9% (334/3710)
remote: Counting objects: 10% (371/3710)
remote: Counting objects: 11% (409/3710)
remote: Counting objects: 12% (446/3710)
remote: Counting objects: 13% (483/3710)
remote: Counting objects: 14% (520/3710)
remote: Counting objects: 15% (557/3710)
remote: Counting objects: 16% (594/3710)
remote: Counting objects: 17% (631/3710)
remote: Counting objects: 18% (668/3710)
remote: Counting objects: 19% (705/3710)
remote: Counting objects: 20% (742/3710)
remote: Counting objects: 21% (780/3710)
remote: Counting objects: 22% (817/3710)
remote: Counting objects: 23% (854/3710)
remote: Counting objects: 24% (891/3710)
remote: Counting objects: 25% (928/3710)
remote: Counting objects: 26% (965/3710)
remote: Counting objects: 27% (1002/3710)
remote: Counting objects: 28% (1039/3710)
remote: Counting objects: 29% (1076/3710)
remote: Counting objects: 30% (1113/3710)
remote: Counting objects: 31% (1151/3710)
remote: Counting objects: 32% (1188/3710)
remote: Counting objects: 33% (1225/3710)
remote: Counting objects: 34% (1262/3710)
remote: Counting objects: 35% (1299/3710)
remote: Counting objects: 36% (1336/3710)
remote: Counting objects: 37% (1373/3710)
remote: Counting objects: 38% (1410/3710)
remote: Counting objects: 39% (1447/3710)
remote: Counting objects: 40% (1484/3710)
remote: Counting objects: 41% (1522/3710)
remote: Counting objects: 42% (1559/3710)
remote: Counting objects: 43% (1596/3710)
remote: Counting objects: 44% (1633/3710)
remote: Counting objects: 45% (1670/3710)
remote: Counting objects: 46% (1707/3710)
remote: Counting objects: 47% (1744/3710)
remote: Counting objects: 48% (1781/3710)
remote: Counting objects: 49% (1818/3710)
remote: Counting objects: 50% (1855/3710)
remote: Counting objects: 51% (1893/3710)
remote: Counting objects: 52% (1930/3710)
remote: Counting objects: 53% (1967/3710)
remote: Counting objects: 54% (2004/3710)
remote: Counting objects: 55% (2041/3710)
remote: Counting objects: 56% (2078/3710)
remote: Counting objects: 57% (2115/3710)
remote: Counting objects: 58% (2152/3710)
remote: Counting objects: 59% (2189/3710)
remote: Counting objects: 60% (2226/3710)
remote: Counting objects: 61% (2264/3710)
remote: Counting objects: 62% (2301/3710)
remote: Counting objects: 63% (2338/3710)
remote: Counting objects: 64% (2375/3710)
remote: Counting objects: 65% (2412/3710)
remote: Counting objects: 66% (2449/3710)
remote: Counting objects: 67% (2486/3710)
remote: Counting objects: 68% (2523/3710)
remote: Counting objects: 69% (2560/3710)
remote: Counting objects: 70% (2597/3710)
remote: Counting objects: 71% (2635/3710)
remote: Counting objects: 72% (2672/3710)
remote: Counting objects: 73% (2709/3710)
remote: Counting objects: 74% (2746/3710)
remote: Counting objects: 75% (2783/3710)
remote: Counting objects: 76% (2820/3710)
remote: Counting objects: 77% (2857/3710)
remote: Counting objects: 78% (2894/3710)
remote: Counting objects: 79% (2931/3710)
remote: Counting objects: 80% (2968/3710)
remote: Counting objects: 81% (3006/3710)
remote: Counting objects: 82% (3043/3710)
remote: Counting objects: 83% (3080/3710)
remote: Counting objects: 84% (3117/3710)
remote: Counting objects: 85% (3154/3710)
remote: Counting objects: 86% (3191/3710)
remote: Counting objects: 87% (3228/3710)
remote: Counting objects: 88% (3265/3710)
remote: Counting objects: 89% (3302/3710)
remote: Counting objects: 90% (3339/3710)
remote: Counting objects: 91% (3377/3710)
remote: Counting objects: 92% (3414/3710)
remote: Counting objects: 93% (3451/3710)
remote: Counting objects: 94% (3488/3710)
remote: Counting objects: 95% (3525/3710)
remote: Counting objects: 96% (3562/3710)
remote: Counting objects: 97% (3599/3710)
remote: Counting objects: 98% (3636/3710)
remote: Counting objects: 99% (3673/3710)
remote: Counting objects: 100% (3710/3710)
remote: Counting objects: 100% (3710/3710), done.
3.08 s
remote: Compressing objects: 0% (1/1481)
remote: Compressing objects: 1% (15/1481)
remote: Compressing objects: 2% (30/1481)
remote: Compressing objects: 3% (45/1481)
remote: Compressing objects: 4% (60/1481)
remote: Compressing objects: 5% (75/1481)
remote: Compressing objects: 6% (89/1481)
remote: Compressing objects: 7% (104/1481)
remote: Compressing objects: 8% (119/1481)
remote: Compressing objects: 9% (134/1481)
remote: Compressing objects: 10% (149/1481)
remote: Compressing objects: 11% (163/1481)
remote: Compressing objects: 12% (178/1481)
remote: Compressing objects: 13% (193/1481)
remote: Compressing objects: 14% (208/1481)
remote: Compressing objects: 15% (223/1481)
remote: Compressing objects: 16% (237/1481)
remote: Compressing objects: 17% (252/1481)
remote: Compressing objects: 18% (267/1481)
remote: Compressing objects: 19% (282/1481)
remote: Compressing objects: 20% (297/1481)
remote: Compressing objects: 21% (312/1481)
remote: Compressing objects: 22% (326/1481)
remote: Compressing objects: 23% (341/1481)
remote: Compressing objects: 24% (356/1481)
remote: Compressing objects: 25% (371/1481)
remote: Compressing objects: 26% (386/1481)
remote: Compressing objects: 27% (400/1481)
remote: Compressing objects: 28% (415/1481)
remote: Compressing objects: 29% (430/1481)
remote: Compressing objects: 30% (445/1481)
remote: Compressing objects: 31% (460/1481)
remote: Compressing objects: 31% (466/1481)
remote: Compressing objects: 32% (474/1481)
remote: Compressing objects: 33% (489/1481)
remote: Compressing objects: 34% (504/1481)
remote: Compressing objects: 35% (519/1481)
remote: Compressing objects: 36% (534/1481)
remote: Compressing objects: 37% (548/1481)
remote: Compressing objects: 38% (563/1481)
remote: Compressing objects: 39% (578/1481)
remote: Compressing objects: 40% (593/1481)
remote: Compressing objects: 40% (601/1481)
remote: Compressing objects: 41% (608/1481)
remote: Compressing objects: 42% (623/1481)
remote: Compressing objects: 43% (637/1481)
remote: Compressing objects: 44% (652/1481)
remote: Compressing objects: 45% (667/1481)
remote: Compressing objects: 46% (682/1481)
remote: Compressing objects: 47% (697/1481)
remote: Compressing objects: 48% (711/1481)
remote: Compressing objects: 49% (726/1481)
remote: Compressing objects: 50% (741/1481)
remote: Compressing objects: 51% (756/1481)
remote: Compressing objects: 52% (771/1481)
remote: Compressing objects: 53% (785/1481)
remote: Compressing objects: 54% (800/1481)
remote: Compressing objects: 55% (815/1481)
remote: Compressing objects: 56% (830/1481)
remote: Compressing objects: 57% (845/1481)
remote: Compressing objects: 58% (859/1481)
remote: Compressing objects: 59% (874/1481)
remote: Compressing objects: 60% (889/1481)
remote: Compressing objects: 61% (904/1481)
remote: Compressing objects: 62% (919/1481)
remote: Compressing objects: 63% (934/1481)
remote: Compressing objects: 64% (948/1481)
remote: Compressing objects: 65% (963/1481)
remote: Compressing objects: 66% (978/1481)
remote: Compressing objects: 67% (993/1481)
remote: Compressing objects: 68% (1008/1481)
remote: Compressing objects: 69% (1022/1481)
remote: Compressing objects: 70% (1037/1481)
remote: Compressing objects: 71% (1052/1481)
remote: Compressing objects: 72% (1067/1481)
remote: Compressing objects: 73% (1082/1481)
remote: Compressing objects: 74% (1096/1481)
remote: Compressing objects: 75% (1111/1481)
remote: Compressing objects: 76% (1126/1481)
remote: Compressing objects: 77% (1141/1481)
remote: Compressing objects: 78% (1156/1481)
remote: Compressing objects: 79% (1170/1481)
remote: Compressing objects: 80% (1185/1481)
remote: Compressing objects: 81% (1200/1481)
remote: Compressing objects: 82% (1215/1481)
remote: Compressing objects: 83% (1230/1481)
remote: Compressing objects: 84% (1245/1481)
remote: Compressing objects: 85% (1259/1481)
remote: Compressing objects: 86% (1274/1481)
remote: Compressing objects: 87% (1289/1481)
remote: Compressing objects: 88% (1304/1481)
remote: Compressing objects: 89% (1319/1481)
remote: Compressing objects: 90% (1333/1481)
remote: Compressing objects: 91% (1348/1481)
remote: Compressing objects: 92% (1363/1481)
remote: Compressing objects: 93% (1378/1481)
remote: Compressing objects: 94% (1393/1481)
remote: Compressing objects: 95% (1407/1481)
remote: Compressing objects: 96% (1422/1481)
remote: Compressing objects: 97% (1437/1481)
remote: Compressing objects: 98% (1452/1481)
remote: Compressing objects: 99% (1467/1481)
remote: Compressing objects: 100% (1481/1481)
remote: Compressing objects: 100% (1481/1481), done.
16.99 s
Receiving objects: 0% (1/162134)
Receiving objects: 1% (1622/162134)
Receiving objects: 2% (3243/162134)
Receiving objects: 3% (4865/162134)
Receiving objects: 4% (6486/162134)
Receiving objects: 5% (8107/162134), 17.34 MiB | 34.67 MiB/s
Receiving objects: 6% (9729/162134), 17.34 MiB | 34.67 MiB/s
Receiving objects: 6% (10001/162134), 35.61 MiB | 35.64 MiB/s
Receiving objects: 7% (11350/162134), 35.61 MiB | 35.64 MiB/s
Receiving objects: 8% (12971/162134), 35.61 MiB | 35.64 MiB/s
Receiving objects: 9% (14593/162134), 35.61 MiB | 35.64 MiB/s
Receiving objects: 10% (16214/162134), 35.61 MiB | 35.64 MiB/s
Receiving objects: 11% (17835/162134), 35.61 MiB | 35.64 MiB/s
Receiving objects: 12% (19457/162134), 53.30 MiB | 35.09 MiB/s
Receiving objects: 13% (21078/162134), 53.30 MiB | 35.09 MiB/s
Receiving objects: 14% (22699/162134), 53.30 MiB | 35.09 MiB/s
Receiving objects: 14% (22901/162134), 53.30 MiB | 35.09 MiB/s
Receiving objects: 15% (24321/162134), 72.87 MiB | 36.09 MiB/s
Receiving objects: 16% (25942/162134), 72.87 MiB | 36.09 MiB/s
Receiving objects: 17% (27563/162134), 89.58 MiB | 35.57 MiB/s
Receiving objects: 18% (29185/162134), 89.58 MiB | 35.57 MiB/s
Receiving objects: 19% (30806/162134), 89.58 MiB | 35.57 MiB/s
Receiving objects: 19% (32267/162134), 89.58 MiB | 35.57 MiB/s
Receiving objects: 20% (32427/162134), 89.58 MiB | 35.57 MiB/s
Receiving objects: 21% (34049/162134), 108.57 MiB | 35.62 MiB/s
Receiving objects: 22% (35670/162134), 108.57 MiB | 35.62 MiB/s
Receiving objects: 23% (37291/162134), 128.26 MiB | 36.15 MiB/s
Receiving objects: 24% (38913/162134), 128.26 MiB | 36.15 MiB/s
Receiving objects: 24% (39124/162134), 128.26 MiB | 36.15 MiB/s
Receiving objects: 25% (40534/162134), 144.74 MiB | 35.75 MiB/s
Receiving objects: 26% (42155/162134), 144.74 MiB | 35.75 MiB/s
Receiving objects: 27% (43777/162134), 144.74 MiB | 35.75 MiB/s
Receiving objects: 28% (45398/162134), 144.74 MiB | 35.75 MiB/s
Receiving objects: 29% (47019/162134), 144.74 MiB | 35.75 MiB/s
Receiving objects: 30% (48641/162134), 144.74 MiB | 35.75 MiB/s
Receiving objects: 31% (50262/162134), 163.29 MiB | 35.90 MiB/s
Receiving objects: 32% (51883/162134), 163.29 MiB | 35.90 MiB/s
Receiving objects: 33% (53505/162134), 163.29 MiB | 35.90 MiB/s
Receiving objects: 34% (55126/162134), 163.29 MiB | 35.90 MiB/s
Receiving objects: 35% (56747/162134), 163.29 MiB | 35.90 MiB/s
Receiving objects: 36% (58369/162134), 163.29 MiB | 35.90 MiB/s
Receiving objects: 37% (59990/162134), 163.29 MiB | 35.90 MiB/s
Receiving objects: 38% (61611/162134), 163.29 MiB | 35.90 MiB/s
Receiving objects: 38% (62791/162134), 163.29 MiB | 35.90 MiB/s
Receiving objects: 39% (63233/162134), 163.29 MiB | 35.90 MiB/s
Receiving objects: 40% (64854/162134), 181.02 MiB | 35.99 MiB/s
Receiving objects: 41% (66475/162134), 181.02 MiB | 35.99 MiB/s
Receiving objects: 42% (68097/162134), 181.02 MiB | 35.99 MiB/s
Receiving objects: 43% (69718/162134), 181.02 MiB | 35.99 MiB/s
Receiving objects: 44% (71339/162134), 181.02 MiB | 35.99 MiB/s
Receiving objects: 45% (72961/162134), 199.33 MiB | 35.90 MiB/s
Receiving objects: 46% (74582/162134), 199.33 MiB | 35.90 MiB/s
Receiving objects: 47% (76203/162134), 199.33 MiB | 35.90 MiB/s
Receiving objects: 48% (77825/162134), 199.33 MiB | 35.90 MiB/s
Receiving objects: 48% (77857/162134), 199.33 MiB | 35.90 MiB/s
Receiving objects: 48% (78211/162134), 238.50 MiB | 36.11 MiB/s
Receiving objects: 49% (79446/162134), 274.04 MiB | 36.07 MiB/s
Receiving objects: 50% (81067/162134), 274.04 MiB | 36.07 MiB/s
Receiving objects: 50% (81968/162134), 274.04 MiB | 36.07 MiB/s
Receiving objects: 51% (82689/162134), 293.67 MiB | 35.70 MiB/s
Receiving objects: 52% (84310/162134), 313.36 MiB | 36.03 MiB/s
Receiving objects: 53% (85932/162134), 313.36 MiB | 36.03 MiB/s
Receiving objects: 54% (87553/162134), 313.36 MiB | 36.03 MiB/s
Receiving objects: 54% (88283/162134), 313.36 MiB | 36.03 MiB/s
Receiving objects: 55% (89174/162134), 313.36 MiB | 36.03 MiB/s
Receiving objects: 56% (90796/162134), 329.27 MiB | 35.47 MiB/s
Receiving objects: 57% (92417/162134), 329.27 MiB | 35.47 MiB/s
Receiving objects: 58% (94038/162134), 329.27 MiB | 35.47 MiB/s
Receiving objects: 59% (95660/162134), 329.27 MiB | 35.47 MiB/s
Receiving objects: 60% (97281/162134), 329.27 MiB | 35.47 MiB/s
Receiving objects: 61% (98902/162134), 329.27 MiB | 35.47 MiB/s
Receiving objects: 62% (100524/162134), 329.27 MiB | 35.47 MiB/s
Receiving objects: 63% (102145/162134), 329.27 MiB | 35.47 MiB/s
Receiving objects: 64% (103766/162134), 329.27 MiB | 35.47 MiB/s
Receiving objects: 65% (105388/162134), 329.27 MiB | 35.47 MiB/s
Receiving objects: 66% (107009/162134), 329.27 MiB | 35.47 MiB/s
Receiving objects: 67% (108630/162134), 329.27 MiB | 35.47 MiB/s
Receiving objects: 68% (110252/162134), 329.27 MiB | 35.47 MiB/s
Receiving objects: 69% (111873/162134), 329.27 MiB | 35.47 MiB/s
Receiving objects: 70% (113494/162134), 329.27 MiB | 35.47 MiB/s
Receiving objects: 71% (115116/162134), 329.27 MiB | 35.47 MiB/s
Receiving objects: 72% (116737/162134), 329.27 MiB | 35.47 MiB/s
Receiving objects: 73% (118358/162134), 329.27 MiB | 35.47 MiB/s
Receiving objects: 74% (119980/162134), 329.27 MiB | 35.47 MiB/s
Receiving objects: 75% (121601/162134), 329.27 MiB | 35.47 MiB/s
Receiving objects: 76% (123222/162134), 349.50 MiB | 36.00 MiB/s
Receiving objects: 76% (123579/162134), 349.50 MiB | 36.00 MiB/s
Receiving objects: 77% (124844/162134), 349.50 MiB | 36.00 MiB/s
Receiving objects: 78% (126465/162134), 368.39 MiB | 36.00 MiB/s
Receiving objects: 79% (128086/162134), 368.39 MiB | 36.00 MiB/s
Receiving objects: 80% (129708/162134), 368.39 MiB | 36.00 MiB/s
Receiving objects: 81% (131329/162134), 368.39 MiB | 36.00 MiB/s
Receiving objects: 82% (132950/162134), 368.39 MiB | 36.00 MiB/s
Receiving objects: 82% (133437/162134), 388.20 MiB | 35.98 MiB/s
Receiving objects: 83% (134572/162134), 388.20 MiB | 35.98 MiB/s
Receiving objects: 84% (136193/162134), 388.20 MiB | 35.98 MiB/s
Receiving objects: 85% (137814/162134), 388.20 MiB | 35.98 MiB/s
Receiving objects: 86% (139436/162134), 408.00 MiB | 35.74 MiB/s
Receiving objects: 87% (141057/162134), 408.00 MiB | 35.74 MiB/s
Receiving objects: 88% (142678/162134), 408.00 MiB | 35.74 MiB/s
Receiving objects: 89% (144300/162134), 427.86 MiB | 36.00 MiB/s
Receiving objects: 89% (144532/162134), 427.86 MiB | 36.00 MiB/s
Receiving objects: 90% (145921/162134), 427.86 MiB | 36.00 MiB/s
Receiving objects: 91% (147542/162134), 447.55 MiB | 36.47 MiB/s
Receiving objects: 92% (149164/162134), 447.55 MiB | 36.47 MiB/s
Receiving objects: 93% (150785/162134), 447.55 MiB | 36.47 MiB/s
Receiving objects: 94% (152406/162134), 464.04 MiB | 36.16 MiB/s
Receiving objects: 94% (152754/162134), 464.04 MiB | 36.16 MiB/s
Receiving objects: 95% (154028/162134), 464.04 MiB | 36.16 MiB/s
Receiving objects: 96% (155649/162134), 483.15 MiB | 36.16 MiB/s
Receiving objects: 97% (157270/162134), 483.15 MiB | 36.16 MiB/s
Receiving objects: 98% (158892/162134), 483.15 MiB | 36.16 MiB/s
Receiving objects: 99% (160513/162134), 483.15 MiB | 36.16 MiB/s
remote: Total 162134 (delta 2584), reused 2717 (delta 2211), pack-reused 158424 (from 3)
16.99 s
Receiving objects: 100% (162134/162134), 483.15 MiB | 36.16 MiB/s
Receiving objects: 100% (162134/162134), 500.56 MiB | 35.99 MiB/s, done.
19.14 s
Resolving deltas: 0% (0/105592)
Resolving deltas: 1% (1056/105592)
Resolving deltas: 2% (2112/105592)
Resolving deltas: 3% (3168/105592)
Resolving deltas: 4% (4224/105592)
Resolving deltas: 5% (5280/105592)
Resolving deltas: 6% (6336/105592)
Resolving deltas: 7% (7397/105592)
Resolving deltas: 8% (8448/105592)
Resolving deltas: 9% (9506/105592)
Resolving deltas: 10% (10560/105592)
Resolving deltas: 11% (11617/105592)
Resolving deltas: 12% (12673/105592)
Resolving deltas: 13% (13729/105592)
Resolving deltas: 14% (14783/105592)
Resolving deltas: 15% (15841/105592)
Resolving deltas: 16% (16895/105592)
Resolving deltas: 17% (17951/105592)
Resolving deltas: 18% (19008/105592)
Resolving deltas: 19% (20065/105592)
Resolving deltas: 20% (21119/105592)
Resolving deltas: 21% (22175/105592)
Resolving deltas: 22% (23231/105592)
Resolving deltas: 23% (24287/105592)
Resolving deltas: 24% (25343/105592)
Resolving deltas: 25% (26401/105592)
Resolving deltas: 26% (27454/105592)
Resolving deltas: 27% (28511/105592)
Resolving deltas: 28% (29566/105592)
Resolving deltas: 29% (30622/105592)
Resolving deltas: 30% (31678/105592)
Resolving deltas: 31% (32737/105592)
Resolving deltas: 32% (33790/105592)
Resolving deltas: 33% (34847/105592)
Resolving deltas: 34% (35902/105592)
Resolving deltas: 35% (36958/105592)
Resolving deltas: 36% (38014/105592)
Resolving deltas: 37% (39070/105592)
Resolving deltas: 38% (40126/105592)
Resolving deltas: 39% (41181/105592)
Resolving deltas: 40% (42237/105592)
Resolving deltas: 41% (43293/105592)
Resolving deltas: 42% (44349/105592)
Resolving deltas: 43% (45405/105592)
Resolving deltas: 44% (46461/105592)
Resolving deltas: 44% (46831/105592)
Resolving deltas: 45% (47517/105592)
Resolving deltas: 46% (48575/105592)
Resolving deltas: 47% (49629/105592)
Resolving deltas: 48% (50685/105592)
Resolving deltas: 49% (51741/105592)
Resolving deltas: 50% (52796/105592)
Resolving deltas: 51% (53852/105592)
Resolving deltas: 52% (54908/105592)
Resolving deltas: 53% (55964/105592)
Resolving deltas: 54% (57020/105592)
Resolving deltas: 55% (58076/105592)
Resolving deltas: 56% (59132/105592)
Resolving deltas: 57% (60188/105592)
Resolving deltas: 58% (61244/105592)
Resolving deltas: 59% (62300/105592)
Resolving deltas: 60% (63356/105592)
Resolving deltas: 61% (64413/105592)
Resolving deltas: 62% (65468/105592)
Resolving deltas: 63% (66523/105592)
Resolving deltas: 64% (67579/105592)
Resolving deltas: 65% (68635/105592)
Resolving deltas: 66% (69692/105592)
Resolving deltas: 67% (70749/105592)
Resolving deltas: 68% (71803/105592)
Resolving deltas: 69% (72859/105592)
Resolving deltas: 70% (73916/105592)
Resolving deltas: 71% (74971/105592)
Resolving deltas: 72% (76027/105592)
Resolving deltas: 73% (77085/105592)
Resolving deltas: 74% (78139/105592)
Resolving deltas: 75% (79194/105592)
Resolving deltas: 76% (80250/105592)
Resolving deltas: 77% (81306/105592)
Resolving deltas: 78% (82363/105592)
Resolving deltas: 79% (83418/105592)
Resolving deltas: 80% (84474/105592)
Resolving deltas: 81% (85530/105592)
Resolving deltas: 82% (86586/105592)
Resolving deltas: 83% (87642/105592)
Resolving deltas: 84% (88698/105592)
Resolving deltas: 85% (89754/105592)
Resolving deltas: 86% (90812/105592)
Resolving deltas: 87% (91866/105592)
Resolving deltas: 88% (92921/105592)
Resolving deltas: 89% (93977/105592)
Resolving deltas: 90% (95036/105592)
Resolving deltas: 91% (96089/105592)
Resolving deltas: 92% (97145/105592)
Resolving deltas: 93% (98201/105592)
Resolving deltas: 94% (99257/105592)
Resolving deltas: 95% (100313/105592)
Resolving deltas: 95% (100728/105592)
Resolving deltas: 96% (101369/105592)
Resolving deltas: 97% (102425/105592)
Resolving deltas: 98% (103481/105592)
Resolving deltas: 99% (104537/105592)
Resolving deltas: 100% (105592/105592)
Resolving deltas: 100% (105592/105592), done.
19.84 s
Fetching commit 5927040624680bb00873a7e3587358a185c92900 for complex-null-spinors ...
19.84 s
$ /nix/store/b1wn5clix1mz4vpfih7x9cnj9qfh7c6h-git-2.54.0/bin/git fetch origin 5927040624680bb00873a7e3587358a185c92900
20.23 s
From https://github.com/alphal00p/gammaloop
20.23 s
* branch 5927040624680bb00873a7e3587358a185c92900 -> FETCH_HEAD
20.25 s
$ /nix/store/bhv6xyvqw6gjs3j488gi1z6wdv18bdpa-coreutils-9.11/bin/timeout --kill-after=15s 7200s /nix/store/b1wn5clix1mz4vpfih7x9cnj9qfh7c6h-git-2.54.0/bin/git -c advice.detachedHead=false checkout 5927040624680bb00873a7e3587358a185c92900
20.70 s
HEAD is now at 592704062 Merge branch 'codex/ninja-shared-types' into complex-null-spinors
20.71 s
$ /nix/store/bhv6xyvqw6gjs3j488gi1z6wdv18bdpa-coreutils-9.11/bin/timeout --kill-after=15s 7200s /nix/store/bxgja2ppiqi6w2bgn0r07d7mgnl1k6k2-nix-2.34.8/bin/nix --extra-experimental-features nix-command --extra-experimental-features flakes --log-format internal-json run .#packages.x86_64-linux.nix-ci-check-gammaloop-nextest-clinnet --print-build-logs
20.85 s
warning: ignoring untrusted flake configuration setting 'extra-substituters'.
20.85 s
Pass '--accept-flake-config' to trust it
20.85 s
warning: ignoring untrusted flake configuration setting 'extra-trusted-public-keys'.
20.85 s
Pass '--accept-flake-config' to trust it
25.62 s
25.88 s
evaluating derivation 'gdo you want to allow configuration setting 'extra-substituters' to be set to 'https://cache.nix-ci.com ' (y/N)? do you want to permanently mark this value as untrusted (y/N)? warning: ignoring untrusted flake configuration setting 'extra-substituters'.
25.88 s
Pass '--accept-flake-config' to trust it
25.88 s
do you want to allow configuration setting 'extra-trusted-public-keys' to be set to 'nix-ci:g3xV5BDTLtIBZr/A00IU1x0EtKKlb7YLgBN2SgYgM6A= ' (y/N)? do you want to permanently mark this value as untrusted (y/N)? warning: ignoring untrusted flake configuration setting 'extra-trusted-public-keys'.
25.88 s
Pass '--accept-flake-config' to trust it
37.32 s
copying '/nix/store/jhld
evaluating derivation 'g
copying '/nix/store/jhld
evaluating derivation 'g
copying '/nix/store/jhld
evaluating derivation 'g
copying '/nix/store/jhld
evaluating derivation 'g
copying '/nix/store/jhld
evaluating derivation 'g
[0 /1 built]
[1 /0 /1 built]
[1 /0 /1 built] building g gammaloop-nextest-clinnet> Nextest worker budget: 16
37.37 s
gammaloop-nextest-clinnet> Extracting 4 binaries (including 1 non-test binary), 1 build script output directory, and 1 linked path to /build/source
37.46 s
gammaloop-nextest-clinnet> Extracted 16 files to /build/source in 0.09s
37.50 s
gammaloop-nextest-clinnet> ------------
37.50 s
gammaloop-nextest-clinnet> Nextest run ID 21864be8-93df-4624-808d-e8e8264d1c74 with nextest profile: ci_gammaloop
37.50 s
gammaloop-nextest-clinnet> Starting 38 tests across 3 binaries
107.55 s
gammaloop-nextest-clinnet> FAIL [ 69.935s] (32/38) clinnet::public_typst_behavior public_linnest_momentum_layers_place_shafts_and_labels
107.55 s
gammaloop-nextest-clinnet> stdout ---
107.55 s
gammaloop-nextest-clinnet>
107.55 s
gammaloop-nextest-clinnet> running 1 test
107.55 s
gammaloop-nextest-clinnet> test public_linnest_momentum_layers_place_shafts_and_labels has been running for over 60 seconds
107.55 s
gammaloop-nextest-clinnet> test public_linnest_momentum_layers_place_shafts_and_labels ... FAILED
107.55 s
gammaloop-nextest-clinnet>
107.55 s
gammaloop-nextest-clinnet> failures:
107.55 s
gammaloop-nextest-clinnet>
107.55 s
gammaloop-nextest-clinnet> failures:
107.55 s
gammaloop-nextest-clinnet> public_linnest_momentum_layers_place_shafts_and_labels
107.55 s
gammaloop-nextest-clinnet>
107.55 s
gammaloop-nextest-clinnet> test result: FAILED. 0 passed; 1 failed; 0 ignored; 0 measured; 17 filtered out; finished in 69.92s
107.55 s
gammaloop-nextest-clinnet>
107.55 s
gammaloop-nextest-clinnet> stderr ---
107.55 s
gammaloop-nextest-clinnet>
107.55 s
gammaloop-nextest-clinnet> thread 'public_linnest_momentum_layers_place_shafts_and_labels' (287) panicked at crates/clinnet/tests/public_typst_behavior.rs:81:55:
107.55 s
gammaloop-nextest-clinnet> called `Result::unwrap()` on an `Err` value: typst failed while compiling template /build/.tmp1GG1hA/.clinnet/templates/linnest-public-behavior.svg
107.55 s
gammaloop-nextest-clinnet>
107.55 s
gammaloop-nextest-clinnet> Command executed:
107.55 s
gammaloop-nextest-clinnet> "typst" "c" "/build/.tmp1GG1hA/.clinnet/templates/linnest-public-behavior.typ" "/build/.tmp1GG1hA/.clinnet/templates/linnest-public-behavior.svg" "--root" "/build/.tmp1GG1hA/.clinnet/templates"
107.55 s
gammaloop-nextest-clinnet>
107.55 s
gammaloop-nextest-clinnet> Typst stdout:
107.55 s
gammaloop-nextest-clinnet>
107.55 s
gammaloop-nextest-clinnet>
107.55 s
gammaloop-nextest-clinnet> Typst stderr:
107.55 s
gammaloop-nextest-clinnet>
107.55 s
gammaloop-nextest-clinnet>
107.55 s
gammaloop-nextest-clinnet> Location:
107.55 s
gammaloop-nextest-clinnet> crates/clinnet/src/lib.rs:741:13
107.55 s
gammaloop-nextest-clinnet> stack backtrace:
107.55 s
gammaloop-nextest-clinnet> 0: __rustc::rust_begin_unwind
107.55 s
gammaloop-nextest-clinnet> 1: core::panicking::panic_fmt
107.55 s
gammaloop-nextest-clinnet> 2: core::result::unwrap_failed
107.55 s
gammaloop-nextest-clinnet> 3: public_typst_behavior::render
107.55 s
gammaloop-nextest-clinnet> 4: <std::sync::once::Once>::call_once_force::<<std::sync::once_lock::OnceLock<alloc::string::String>>::initialize<<std::sync::once_lock::OnceLock<alloc::string::String>>::get_or_init<public_typst_behavior::linnest_public_svg::{closure#0}>::{closure#0}, !>::{closure#0}>::{closure#0}
107.55 s
gammaloop-nextest-clinnet> 5: <std::sys::sync::once::futex::Once>::call
107.55 s
gammaloop-nextest-clinnet> 6: <std::sync::once_lock::OnceLock<alloc::string::String>>::initialize::<<std::sync::once_lock::OnceLock<alloc::string::String>>::get_or_init<public_typst_behavior::linnest_public_svg::{closure#0}>::{closure#0}, !>
107.55 s
gammaloop-nextest-clinnet> 7: <public_typst_behavior::public_linnest_momentum_layers_place_shafts_and_labels::{closure#0} as core::ops::function::FnOnce<()>>::call_once
107.55 s
gammaloop-nextest-clinnet> note: Some details are omitted, run with `RUST_BACKTRACE=full` for a verbose backtrace.
107.55 s
gammaloop-nextest-clinnet>
112.87 s
gammaloop-nextest-clinnet> FAIL [ 75.232s] (33/38) clinnet::public_typst_behavior public_linnest_edge_styles_skip_fallbacks
112.87 s
gammaloop-nextest-clinnet> stdout ---
112.87 s
gammaloop-nextest-clinnet>
112.87 s
gammaloop-nextest-clinnet> running 1 test
112.87 s
gammaloop-nextest-clinnet> test public_linnest_edge_styles_skip_fallbacks has been running for over 60 seconds
112.87 s
gammaloop-nextest-clinnet> test public_linnest_edge_styles_skip_fallbacks ... FAILED
112.87 s
gammaloop-nextest-clinnet>
112.87 s
gammaloop-nextest-clinnet> failures:
112.87 s
gammaloop-nextest-clinnet>
112.87 s
gammaloop-nextest-clinnet> failures:
112.87 s
gammaloop-nextest-clinnet> public_linnest_edge_styles_skip_fallbacks
112.87 s
gammaloop-nextest-clinnet>
112.87 s
gammaloop-nextest-clinnet> test result: FAILED. 0 passed; 1 failed; 0 ignored; 0 measured; 17 filtered out; finished in 75.20s
112.87 s
gammaloop-nextest-clinnet>
112.87 s
gammaloop-nextest-clinnet> stderr ---
112.87 s
gammaloop-nextest-clinnet>
112.87 s
gammaloop-nextest-clinnet> thread 'public_linnest_edge_styles_skip_fallbacks' (272) panicked at crates/clinnet/tests/public_typst_behavior.rs:81:55:
112.87 s
gammaloop-nextest-clinnet> called `Result::unwrap()` on an `Err` value: typst failed while compiling template /build/.tmpjzrRit/.clinnet/templates/linnest-public-behavior.svg
112.87 s
gammaloop-nextest-clinnet>
112.87 s
gammaloop-nextest-clinnet> Command executed:
112.87 s
gammaloop-nextest-clinnet> "typst" "c" "/build/.tmpjzrRit/.clinnet/templates/linnest-public-behavior.typ" "/build/.tmpjzrRit/.clinnet/templates/linnest-public-behavior.svg" "--root" "/build/.tmpjzrRit/.clinnet/templates"
112.87 s
gammaloop-nextest-clinnet>
112.87 s
gammaloop-nextest-clinnet> Typst stdout:
112.87 s
gammaloop-nextest-clinnet>
112.87 s
gammaloop-nextest-clinnet>
112.87 s
gammaloop-nextest-clinnet> Typst stderr:
112.87 s
gammaloop-nextest-clinnet>
112.87 s
gammaloop-nextest-clinnet>
112.87 s
gammaloop-nextest-clinnet> Location:
112.87 s
gammaloop-nextest-clinnet> crates/clinnet/src/lib.rs:741:13
112.87 s
gammaloop-nextest-clinnet> stack backtrace:
112.87 s
gammaloop-nextest-clinnet> 0: __rustc::rust_begin_unwind
112.87 s
gammaloop-nextest-clinnet> 1: core::panicking::panic_fmt
112.87 s
gammaloop-nextest-clinnet> 2: core::result::unwrap_failed
112.87 s
gammaloop-nextest-clinnet> 3: public_typst_behavior::render
112.87 s
gammaloop-nextest-clinnet> 4: <std::sync::once::Once>::call_once_force::<<std::sync::once_lock::OnceLock<alloc::string::String>>::initialize<<std::sync::once_lock::OnceLock<alloc::string::String>>::get_or_init<public_typst_behavior::linnest_public_svg::{closure#0}>::{closure#0}, !>::{closure#0}>::{closure#0}
112.87 s
gammaloop-nextest-clinnet> 5: <std::sys::sync::once::futex::Once>::call
112.87 s
gammaloop-nextest-clinnet> 6: <std::sync::once_lock::OnceLock<alloc::string::String>>::initialize::<<std::sync::once_lock::OnceLock<alloc::string::String>>::get_or_init<public_typst_behavior::linnest_public_svg::{closure#0}>::{closure#0}, !>
112.87 s
gammaloop-nextest-clinnet> 7: <public_typst_behavior::public_linnest_edge_styles_skip_fallbacks::{closure#0} as core::ops::function::FnOnce<()>>::call_once
112.87 s
gammaloop-nextest-clinnet> note: Some details are omitted, run with `RUST_BACKTRACE=full` for a verbose backtrace.
112.87 s
gammaloop-nextest-clinnet>
123.38 s
gammaloop-nextest-clinnet> FAIL [ 85.826s] (34/38) clinnet::public_typst_behavior public_linnest_fixture_assertions_hold
123.38 s
gammaloop-nextest-clinnet> stdout ---
123.38 s
gammaloop-nextest-clinnet>
123.38 s
gammaloop-nextest-clinnet> running 1 test
123.38 s
gammaloop-nextest-clinnet> test public_linnest_fixture_assertions_hold has been running for over 60 seconds
123.38 s
gammaloop-nextest-clinnet> test public_linnest_fixture_assertions_hold ... FAILED
123.38 s
gammaloop-nextest-clinnet>
123.38 s
gammaloop-nextest-clinnet> failures:
123.38 s
gammaloop-nextest-clinnet>
123.38 s
gammaloop-nextest-clinnet> failures:
123.38 s
gammaloop-nextest-clinnet> public_linnest_fixture_assertions_hold
123.38 s
gammaloop-nextest-clinnet>
123.38 s
gammaloop-nextest-clinnet> test result: FAILED. 0 passed; 1 failed; 0 ignored; 0 measured; 17 filtered out; finished in 85.81s
123.38 s
gammaloop-nextest-clinnet>
123.38 s
gammaloop-nextest-clinnet> stderr ---
123.38 s
gammaloop-nextest-clinnet>
123.38 s
gammaloop-nextest-clinnet> thread 'public_linnest_fixture_assertions_hold' (274) panicked at crates/clinnet/tests/public_typst_behavior.rs:81:55:
123.38 s
gammaloop-nextest-clinnet> called `Result::unwrap()` on an `Err` value: typst failed while compiling template /build/.tmp1F6fxQ/.clinnet/templates/linnest-public-behavior.svg
123.38 s
gammaloop-nextest-clinnet>
123.38 s
gammaloop-nextest-clinnet> Command executed:
123.38 s
gammaloop-nextest-clinnet> "typst" "c" "/build/.tmp1F6fxQ/.clinnet/templates/linnest-public-behavior.typ" "/build/.tmp1F6fxQ/.clinnet/templates/linnest-public-behavior.svg" "--root" "/build/.tmp1F6fxQ/.clinnet/templates"
123.38 s
gammaloop-nextest-clinnet>
123.38 s
gammaloop-nextest-clinnet> Typst stdout:
123.38 s
gammaloop-nextest-clinnet>
123.38 s
gammaloop-nextest-clinnet>
123.38 s
gammaloop-nextest-clinnet> Typst stderr:
123.38 s
gammaloop-nextest-clinnet>
123.38 s
gammaloop-nextest-clinnet>
123.38 s
gammaloop-nextest-clinnet> Location:
123.38 s
gammaloop-nextest-clinnet> crates/clinnet/src/lib.rs:741:13
123.38 s
gammaloop-nextest-clinnet> stack backtrace:
123.38 s
gammaloop-nextest-clinnet> 0: __rustc::rust_begin_unwind
123.38 s
gammaloop-nextest-clinnet> 1: core::panicking::panic_fmt
123.38 s
gammaloop-nextest-clinnet> 2: core::result::unwrap_failed
123.38 s
gammaloop-nextest-clinnet> 3: public_typst_behavior::render
123.38 s
gammaloop-nextest-clinnet> 4: <std::sync::once::Once>::call_once_force::<<std::sync::once_lock::OnceLock<alloc::string::String>>::initialize<<std::sync::once_lock::OnceLock<alloc::string::String>>::get_or_init<public_typst_behavior::linnest_public_svg::{closure#0}>::{closure#0}, !>::{closure#0}>::{closure#0}
123.38 s
gammaloop-nextest-clinnet> 5: <std::sys::sync::once::futex::Once>::call
123.38 s
gammaloop-nextest-clinnet> 6: <std::sync::once_lock::OnceLock<alloc::string::String>>::initialize::<<std::sync::once_lock::OnceLock<alloc::string::String>>::get_or_init<public_typst_behavior::linnest_public_svg::{closure#0}>::{closure#0}, !>
123.38 s
gammaloop-nextest-clinnet> 7: <public_typst_behavior::public_linnest_fixture_assertions_hold::{closure#0} as core::ops::function::FnOnce<()>>::call_once
123.38 s
gammaloop-nextest-clinnet> note: Some details are omitted, run with `RUST_BACKTRACE=full` for a verbose backtrace.
123.38 s
gammaloop-nextest-clinnet>
133.02 s
gammaloop-nextest-clinnet> ------------
133.02 s
gammaloop-nextest-clinnet> Summary [ 95.523s] 38 tests run: 35 passed , 3 failed , 0 skipped
133.02 s
gammaloop-nextest-clinnet> FAIL [ 69.935s] (32/38) clinnet::public_typst_behavior public_linnest_momentum_layers_place_shafts_and_labels
133.02 s
gammaloop-nextest-clinnet> stdout ---
133.02 s
gammaloop-nextest-clinnet>
133.02 s
gammaloop-nextest-clinnet> running 1 test
133.02 s
gammaloop-nextest-clinnet> test public_linnest_momentum_layers_place_shafts_and_labels has been running for over 60 seconds
133.02 s
gammaloop-nextest-clinnet> test public_linnest_momentum_layers_place_shafts_and_labels ... FAILED
133.02 s
gammaloop-nextest-clinnet>
133.02 s
gammaloop-nextest-clinnet> failures:
133.02 s
gammaloop-nextest-clinnet>
133.02 s
gammaloop-nextest-clinnet> failures:
133.02 s
gammaloop-nextest-clinnet> public_linnest_momentum_layers_place_shafts_and_labels
133.02 s
gammaloop-nextest-clinnet>
133.02 s
gammaloop-nextest-clinnet> test result: FAILED. 0 passed; 1 failed; 0 ignored; 0 measured; 17 filtered out; finished in 69.92s
133.02 s
gammaloop-nextest-clinnet>
133.02 s
gammaloop-nextest-clinnet> stderr ---
133.02 s
gammaloop-nextest-clinnet>
133.02 s
gammaloop-nextest-clinnet> thread 'public_linnest_momentum_layers_place_shafts_and_labels' (287) panicked at crates/clinnet/tests/public_typst_behavior.rs:81:55:
133.02 s
gammaloop-nextest-clinnet> called `Result::unwrap()` on an `Err` value: typst failed while compiling template /build/.tmp1GG1hA/.clinnet/templates/linnest-public-behavior.svg
133.02 s
gammaloop-nextest-clinnet>
133.02 s
gammaloop-nextest-clinnet> Command executed:
133.02 s
gammaloop-nextest-clinnet> "typst" "c" "/build/.tmp1GG1hA/.clinnet/templates/linnest-public-behavior.typ" "/build/.tmp1GG1hA/.clinnet/templates/linnest-public-behavior.svg" "--root" "/build/.tmp1GG1hA/.clinnet/templates"
133.02 s
gammaloop-nextest-clinnet>
133.02 s
gammaloop-nextest-clinnet> Typst stdout:
133.02 s
gammaloop-nextest-clinnet>
133.02 s
gammaloop-nextest-clinnet>
133.02 s
gammaloop-nextest-clinnet> Typst stderr:
133.02 s
gammaloop-nextest-clinnet>
133.02 s
gammaloop-nextest-clinnet>
133.02 s
gammaloop-nextest-clinnet> Location:
133.02 s
gammaloop-nextest-clinnet> crates/clinnet/src/lib.rs:741:13
133.02 s
gammaloop-nextest-clinnet> stack backtrace:
133.02 s
gammaloop-nextest-clinnet> 0: __rustc::rust_begin_unwind
133.02 s
gammaloop-nextest-clinnet> 1: core::panicking::panic_fmt
133.02 s
gammaloop-nextest-clinnet> 2: core::result::unwrap_failed
133.02 s
gammaloop-nextest-clinnet> 3: public_typst_behavior::render
133.02 s
gammaloop-nextest-clinnet> 4: <std::sync::once::Once>::call_once_force::<<std::sync::once_lock::OnceLock<alloc::string::String>>::initialize<<std::sync::once_lock::OnceLock<alloc::string::String>>::get_or_init<public_typst_behavior::linnest_public_svg::{closure#0}>::{closure#0}, !>::{closure#0}>::{closure#0}
133.02 s
gammaloop-nextest-clinnet> 5: <std::sys::sync::once::futex::Once>::call
133.02 s
gammaloop-nextest-clinnet> 6: <std::sync::once_lock::OnceLock<alloc::string::String>>::initialize::<<std::sync::once_lock::OnceLock<alloc::string::String>>::get_or_init<public_typst_behavior::linnest_public_svg::{closure#0}>::{closure#0}, !>
133.02 s
gammaloop-nextest-clinnet> 7: <public_typst_behavior::public_linnest_momentum_layers_place_shafts_and_labels::{closure#0} as core::ops::function::FnOnce<()>>::call_once
133.02 s
gammaloop-nextest-clinnet> note: Some details are omitted, run with `RUST_BACKTRACE=full` for a verbose backtrace.
133.02 s
gammaloop-nextest-clinnet>
133.02 s
gammaloop-nextest-clinnet> FAIL [ 75.232s] (33/38) clinnet::public_typst_behavior public_linnest_edge_styles_skip_fallbacks
133.02 s
gammaloop-nextest-clinnet> stdout ---
133.02 s
gammaloop-nextest-clinnet>
133.02 s
gammaloop-nextest-clinnet> running 1 test
133.02 s
gammaloop-nextest-clinnet> test public_linnest_edge_styles_skip_fallbacks has been running for over 60 seconds
133.02 s
gammaloop-nextest-clinnet> test public_linnest_edge_styles_skip_fallbacks ... FAILED
133.02 s
gammaloop-nextest-clinnet>
133.02 s
gammaloop-nextest-clinnet> failures:
133.02 s
gammaloop-nextest-clinnet>
133.02 s
gammaloop-nextest-clinnet> failures:
133.02 s
gammaloop-nextest-clinnet> public_linnest_edge_styles_skip_fallbacks
133.02 s
gammaloop-nextest-clinnet>
133.02 s
gammaloop-nextest-clinnet> test result: FAILED. 0 passed; 1 failed; 0 ignored; 0 measured; 17 filtered out; finished in 75.20s
133.02 s
gammaloop-nextest-clinnet>
133.02 s
gammaloop-nextest-clinnet> stderr ---
133.02 s
gammaloop-nextest-clinnet>
133.02 s
gammaloop-nextest-clinnet> thread 'public_linnest_edge_styles_skip_fallbacks' (272) panicked at crates/clinnet/tests/public_typst_behavior.rs:81:55:
133.02 s
gammaloop-nextest-clinnet> called `Result::unwrap()` on an `Err` value: typst failed while compiling template /build/.tmpjzrRit/.clinnet/templates/linnest-public-behavior.svg
133.02 s
gammaloop-nextest-clinnet>
133.02 s
gammaloop-nextest-clinnet> Command executed:
133.02 s
gammaloop-nextest-clinnet> "typst" "c" "/build/.tmpjzrRit/.clinnet/templates/linnest-public-behavior.typ" "/build/.tmpjzrRit/.clinnet/templates/linnest-public-behavior.svg" "--root" "/build/.tmpjzrRit/.clinnet/templates"
133.02 s
gammaloop-nextest-clinnet>
133.02 s
gammaloop-nextest-clinnet> Typst stdout:
133.02 s
gammaloop-nextest-clinnet>
133.02 s
gammaloop-nextest-clinnet>
133.02 s
gammaloop-nextest-clinnet> Typst stderr:
133.02 s
gammaloop-nextest-clinnet>
133.02 s
gammaloop-nextest-clinnet>
133.02 s
gammaloop-nextest-clinnet> Location:
133.02 s
gammaloop-nextest-clinnet> crates/clinnet/src/lib.rs:741:13
133.02 s
gammaloop-nextest-clinnet> stack backtrace:
133.02 s
gammaloop-nextest-clinnet> 0: __rustc::rust_begin_unwind
133.02 s
gammaloop-nextest-clinnet> 1: core::panicking::panic_fmt
133.02 s
gammaloop-nextest-clinnet> 2: core::result::unwrap_failed
133.02 s
gammaloop-nextest-clinnet> 3: public_typst_behavior::render
133.02 s
gammaloop-nextest-clinnet> 4: <std::sync::once::Once>::call_once_force::<<std::sync::once_lock::OnceLock<alloc::string::String>>::initialize<<std::sync::once_lock::OnceLock<alloc::string::String>>::get_or_init<public_typst_behavior::linnest_public_svg::{closure#0}>::{closure#0}, !>::{closure#0}>::{closure#0}
133.02 s
gammaloop-nextest-clinnet> 5: <std::sys::sync::once::futex::Once>::call
133.02 s
gammaloop-nextest-clinnet> 6: <std::sync::once_lock::OnceLock<alloc::string::String>>::initialize::<<std::sync::once_lock::OnceLock<alloc::string::String>>::get_or_init<public_typst_behavior::linnest_public_svg::{closure#0}>::{closure#0}, !>
133.02 s
gammaloop-nextest-clinnet> 7: <public_typst_behavior::public_linnest_edge_styles_skip_fallbacks::{closure#0} as core::ops::function::FnOnce<()>>::call_once
133.02 s
gammaloop-nextest-clinnet> note: Some details are omitted, run with `RUST_BACKTRACE=full` for a verbose backtrace.
133.02 s
gammaloop-nextest-clinnet>
133.02 s
gammaloop-nextest-clinnet> FAIL [ 85.826s] (34/38) clinnet::public_typst_behavior public_linnest_fixture_assertions_hold
133.02 s
gammaloop-nextest-clinnet> stdout ---
133.02 s
gammaloop-nextest-clinnet>
133.02 s
gammaloop-nextest-clinnet> running 1 test
133.02 s
gammaloop-nextest-clinnet> test public_linnest_fixture_assertions_hold has been running for over 60 seconds
133.02 s
gammaloop-nextest-clinnet> test public_linnest_fixture_assertions_hold ... FAILED
133.02 s
gammaloop-nextest-clinnet>
133.02 s
gammaloop-nextest-clinnet> failures:
133.02 s
gammaloop-nextest-clinnet>
133.02 s
gammaloop-nextest-clinnet> failures:
133.02 s
gammaloop-nextest-clinnet> public_linnest_fixture_assertions_hold
133.02 s
gammaloop-nextest-clinnet>
133.02 s
gammaloop-nextest-clinnet> test result: FAILED. 0 passed; 1 failed; 0 ignored; 0 measured; 17 filtered out; finished in 85.81s
133.02 s
gammaloop-nextest-clinnet>
133.02 s
gammaloop-nextest-clinnet> stderr ---
133.02 s
gammaloop-nextest-clinnet>
133.02 s
gammaloop-nextest-clinnet> thread 'public_linnest_fixture_assertions_hold' (274) panicked at crates/clinnet/tests/public_typst_behavior.rs:81:55:
133.02 s
gammaloop-nextest-clinnet> called `Result::unwrap()` on an `Err` value: typst failed while compiling template /build/.tmp1F6fxQ/.clinnet/templates/linnest-public-behavior.svg
133.02 s
gammaloop-nextest-clinnet>
133.02 s
gammaloop-nextest-clinnet> Command executed:
133.02 s
gammaloop-nextest-clinnet> "typst" "c" "/build/.tmp1F6fxQ/.clinnet/templates/linnest-public-behavior.typ" "/build/.tmp1F6fxQ/.clinnet/templates/linnest-public-behavior.svg" "--root" "/build/.tmp1F6fxQ/.clinnet/templates"
133.02 s
gammaloop-nextest-clinnet>
133.02 s
gammaloop-nextest-clinnet> Typst stdout:
133.02 s
gammaloop-nextest-clinnet>
133.02 s
gammaloop-nextest-clinnet>
133.02 s
gammaloop-nextest-clinnet> Typst stderr:
133.02 s
gammaloop-nextest-clinnet>
133.02 s
gammaloop-nextest-clinnet>
133.02 s
gammaloop-nextest-clinnet> Location:
133.02 s
gammaloop-nextest-clinnet> crates/clinnet/src/lib.rs:741:13
133.02 s
gammaloop-nextest-clinnet> stack backtrace:
133.02 s
gammaloop-nextest-clinnet> 0: __rustc::rust_begin_unwind
133.02 s
gammaloop-nextest-clinnet> 1: core::panicking::panic_fmt
133.02 s
gammaloop-nextest-clinnet> 2: core::result::unwrap_failed
133.02 s
gammaloop-nextest-clinnet> 3: public_typst_behavior::render
133.02 s
gammaloop-nextest-clinnet> 4: <std::sync::once::Once>::call_once_force::<<std::sync::once_lock::OnceLock<alloc::string::String>>::initialize<<std::sync::once_lock::OnceLock<alloc::string::String>>::get_or_init<public_typst_behavior::linnest_public_svg::{closure#0}>::{closure#0}, !>::{closure#0}>::{closure#0}
133.02 s
gammaloop-nextest-clinnet> 5: <std::sys::sync::once::futex::Once>::call
133.02 s
gammaloop-nextest-clinnet> 6: <std::sync::once_lock::OnceLock<alloc::string::String>>::initialize::<<std::sync::once_lock::OnceLock<alloc::string::String>>::get_or_init<public_typst_behavior::linnest_public_svg::{closure#0}>::{closure#0}, !>
133.02 s
gammaloop-nextest-clinnet> 7: <public_typst_behavior::public_linnest_fixture_assertions_hold::{closure#0} as core::ops::function::FnOnce<()>>::call_once
133.02 s
gammaloop-nextest-clinnet> note: Some details are omitted, run with `RUST_BACKTRACE=full` for a verbose backtrace.
133.02 s
gammaloop-nextest-clinnet>
133.03 s
gammaloop-nextest-clinnet> error : test run failed
133.07 s
gammaloop-nextest-clinnet>
133.07 s
gammaloop-nextest-clinnet> ========== nextest test summary ==========
133.07 s
gammaloop-nextest-clinnet> report: target/nextest/ci_gammaloop/junit.xml
133.07 s
gammaloop-nextest-clinnet> tests: 38, failures: 3, errors: 0
133.07 s
gammaloop-nextest-clinnet>
133.07 s
gammaloop-nextest-clinnet> 1. clinnet::public_typst_behavior::public_linnest_momentum_layers_place_shafts_and_labels
133.07 s
gammaloop-nextest-clinnet> failure: test failure with exit code 101
133.07 s
gammaloop-nextest-clinnet> thread 'public_linnest_momentum_layers_place_shafts_and_labels' (287) panicked at crates/clinnet/tests/public_typst_behavior.rs:81:55:
133.07 s
gammaloop-nextest-clinnet> called `Result::unwrap()` on an `Err` value: typst failed while compiling template /build/.tmp1GG1hA/.clinnet/templates/linnest-public-behavior.svg
133.07 s
gammaloop-nextest-clinnet>
133.07 s
gammaloop-nextest-clinnet> Command executed:
133.07 s
gammaloop-nextest-clinnet> "typst" "c" "/build/.tmp1GG1hA/.clinnet/templates/linnest-public-behavior.typ" "/build/.tmp1GG1hA/.clinnet/templates/linnest-public-behavior.svg" "--root" "/build/.tmp1GG1hA/.clinnet/templates"
133.07 s
gammaloop-nextest-clinnet>
133.07 s
gammaloop-nextest-clinnet> Typst stdout:
133.07 s
gammaloop-nextest-clinnet>
133.07 s
gammaloop-nextest-clinnet>
133.07 s
gammaloop-nextest-clinnet> Typst stderr:
133.07 s
gammaloop-nextest-clinnet>
133.07 s
gammaloop-nextest-clinnet>
133.07 s
gammaloop-nextest-clinnet> Location:
133.07 s
gammaloop-nextest-clinnet> crates/clinnet/src/lib.rs:741:13
133.07 s
gammaloop-nextest-clinnet> stack backtrace:
133.07 s
gammaloop-nextest-clinnet> 0: __rustc::rust_begin_unwind
133.07 s
gammaloop-nextest-clinnet> 1: core::panicking::panic_fmt
133.07 s
gammaloop-nextest-clinnet> 2: core::result::unwrap_failed
133.07 s
gammaloop-nextest-clinnet> 3: public_typst_behavior::render
133.07 s
gammaloop-nextest-clinnet> 4: <std::sync::once::Once>::call_once_force::<<std::sync::once_lock::OnceLock<alloc::string::String>>::initialize<<std::sync::once_lock::OnceLock<alloc::string::String>>::get_or_init<public_typst_behavior::linnest_public_svg::{closure#0}>::{closure#0}, !>::{closure#0}>::{closure#0}
133.07 s
gammaloop-nextest-clinnet> 5: <std::sys::sync::once::futex::Once>::call
133.07 s
gammaloop-nextest-clinnet> 6: <std::sync::once_lock::OnceLock<alloc::string::String>>::initialize::<<std::sync::once_lock::OnceLock<alloc::string::String>>::get_or_init<public_typst_behavior::linnest_public_svg::{closure#0}>::{closure#0}, !>
133.07 s
gammaloop-nextest-clinnet> 7: <public_typst_behavior::public_linnest_momentum_layers_place_shafts_and_labels::{closure#0} as core::ops::function::FnOnce<()>>::call_once
133.07 s
gammaloop-nextest-clinnet> note: Some details are omitted, run with `RUST_BACKTRACE=full` for a verbose backtrace.
133.07 s
gammaloop-nextest-clinnet> system-out
133.07 s
gammaloop-nextest-clinnet> running 1 test
133.07 s
gammaloop-nextest-clinnet> test public_linnest_momentum_layers_place_shafts_and_labels has been running for over 60 seconds
133.07 s
gammaloop-nextest-clinnet> test public_linnest_momentum_layers_place_shafts_and_labels ... FAILED
133.07 s
gammaloop-nextest-clinnet>
133.07 s
gammaloop-nextest-clinnet> failures:
133.07 s
gammaloop-nextest-clinnet>
133.07 s
gammaloop-nextest-clinnet> failures:
133.07 s
gammaloop-nextest-clinnet> public_linnest_momentum_layers_place_shafts_and_labels
133.07 s
gammaloop-nextest-clinnet>
133.07 s
gammaloop-nextest-clinnet> test result: FAILED. 0 passed; 1 failed; 0 ignored; 0 measured; 17 filtered out; finished in 69.92s
133.07 s
gammaloop-nextest-clinnet> system-err
133.07 s
gammaloop-nextest-clinnet> thread 'public_linnest_momentum_layers_place_shafts_and_labels' (287) panicked at crates/clinnet/tests/public_typst_behavior.rs:81:55:
133.07 s
gammaloop-nextest-clinnet> called `Result::unwrap()` on an `Err` value: typst failed while compiling template /build/.tmp1GG1hA/.clinnet/templates/linnest-public-behavior.svg
133.07 s
gammaloop-nextest-clinnet>
133.07 s
gammaloop-nextest-clinnet> Command executed:
133.07 s
gammaloop-nextest-clinnet> "typst" "c" "/build/.tmp1GG1hA/.clinnet/templates/linnest-public-behavior.typ" "/build/.tmp1GG1hA/.clinnet/templates/linnest-public-behavior.svg" "--root" "/build/.tmp1GG1hA/.clinnet/templates"
133.07 s
gammaloop-nextest-clinnet>
133.07 s
gammaloop-nextest-clinnet> Typst stdout:
133.07 s
gammaloop-nextest-clinnet>
133.07 s
gammaloop-nextest-clinnet>
133.07 s
gammaloop-nextest-clinnet> Typst stderr:
133.07 s
gammaloop-nextest-clinnet>
133.07 s
gammaloop-nextest-clinnet>
133.07 s
gammaloop-nextest-clinnet> Location:
133.07 s
gammaloop-nextest-clinnet> crates/clinnet/src/lib.rs:741:13
133.07 s
gammaloop-nextest-clinnet> stack backtrace:
133.07 s
gammaloop-nextest-clinnet> 0: __rustc::rust_begin_unwind
133.07 s
gammaloop-nextest-clinnet> 1: core::panicking::panic_fmt
133.07 s
gammaloop-nextest-clinnet> 2: core::result::unwrap_failed
133.07 s
gammaloop-nextest-clinnet> 3: public_typst_behavior::render
133.07 s
gammaloop-nextest-clinnet> 4: <std::sync::once::Once>::call_once_force::<<std::sync::once_lock::OnceLock<alloc::string::String>>::initialize<<std::sync::once_lock::OnceLock<alloc::string::String>>::get_or_init<public_typst_behavior::linnest_public_svg::{closure#0}>::{closure#0}, !>::{closure#0}>::{closure#0}
133.07 s
gammaloop-nextest-clinnet> 5: <std::sys::sync::once::futex::Once>::call
133.07 s
gammaloop-nextest-clinnet> 6: <std::sync::once_lock::OnceLock<alloc::string::String>>::initialize::<<std::sync::once_lock::OnceLock<alloc::string::String>>::get_or_init<public_typst_behavior::linnest_public_svg::{closure#0}>::{closure#0}, !>
133.07 s
gammaloop-nextest-clinnet> 7: <public_typst_behavior::public_linnest_momentum_layers_place_shafts_and_labels::{closure#0} as core::ops::function::FnOnce<()>>::call_once
133.07 s
gammaloop-nextest-clinnet> note: Some details are omitted, run with `RUST_BACKTRACE=full` for a verbose backtrace.
133.07 s
gammaloop-nextest-clinnet>
133.07 s
gammaloop-nextest-clinnet> 2. clinnet::public_typst_behavior::public_linnest_edge_styles_skip_fallbacks
133.07 s
gammaloop-nextest-clinnet> failure: test failure with exit code 101
133.07 s
gammaloop-nextest-clinnet> thread 'public_linnest_edge_styles_skip_fallbacks' (272) panicked at crates/clinnet/tests/public_typst_behavior.rs:81:55:
133.07 s
gammaloop-nextest-clinnet> called `Result::unwrap()` on an `Err` value: typst failed while compiling template /build/.tmpjzrRit/.clinnet/templates/linnest-public-behavior.svg
133.07 s
gammaloop-nextest-clinnet>
133.07 s
gammaloop-nextest-clinnet> Command executed:
133.07 s
gammaloop-nextest-clinnet> "typst" "c" "/build/.tmpjzrRit/.clinnet/templates/linnest-public-behavior.typ" "/build/.tmpjzrRit/.clinnet/templates/linnest-public-behavior.svg" "--root" "/build/.tmpjzrRit/.clinnet/templates"
133.07 s
gammaloop-nextest-clinnet>
133.07 s
gammaloop-nextest-clinnet> Typst stdout:
133.07 s
gammaloop-nextest-clinnet>
133.07 s
gammaloop-nextest-clinnet>
133.07 s
gammaloop-nextest-clinnet> Typst stderr:
133.07 s
gammaloop-nextest-clinnet>
133.07 s
gammaloop-nextest-clinnet>
133.07 s
gammaloop-nextest-clinnet> Location:
133.07 s
gammaloop-nextest-clinnet> crates/clinnet/src/lib.rs:741:13
133.07 s
gammaloop-nextest-clinnet> stack backtrace:
133.07 s
gammaloop-nextest-clinnet> 0: __rustc::rust_begin_unwind
133.07 s
gammaloop-nextest-clinnet> 1: core::panicking::panic_fmt
133.07 s
gammaloop-nextest-clinnet> 2: core::result::unwrap_failed
133.07 s
gammaloop-nextest-clinnet> 3: public_typst_behavior::render
133.07 s
gammaloop-nextest-clinnet> 4: <std::sync::once::Once>::call_once_force::<<std::sync::once_lock::OnceLock<alloc::string::String>>::initialize<<std::sync::once_lock::OnceLock<alloc::string::String>>::get_or_init<public_typst_behavior::linnest_public_svg::{closure#0}>::{closure#0}, !>::{closure#0}>::{closure#0}
133.07 s
gammaloop-nextest-clinnet> 5: <std::sys::sync::once::futex::Once>::call
133.07 s
gammaloop-nextest-clinnet> 6: <std::sync::once_lock::OnceLock<alloc::string::String>>::initialize::<<std::sync::once_lock::OnceLock<alloc::string::String>>::get_or_init<public_typst_behavior::linnest_public_svg::{closure#0}>::{closure#0}, !>
133.07 s
gammaloop-nextest-clinnet> 7: <public_typst_behavior::public_linnest_edge_styles_skip_fallbacks::{closure#0} as core::ops::function::FnOnce<()>>::call_once
133.07 s
gammaloop-nextest-clinnet> note: Some details are omitted, run with `RUST_BACKTRACE=full` for a verbose backtrace.
133.07 s
gammaloop-nextest-clinnet> system-out
133.07 s
gammaloop-nextest-clinnet> running 1 test
133.07 s
gammaloop-nextest-clinnet> test public_linnest_edge_styles_skip_fallbacks has been running for over 60 seconds
133.07 s
gammaloop-nextest-clinnet> test public_linnest_edge_styles_skip_fallbacks ... FAILED
133.07 s
gammaloop-nextest-clinnet>
133.07 s
gammaloop-nextest-clinnet> failures:
133.07 s
gammaloop-nextest-clinnet>
133.07 s
gammaloop-nextest-clinnet> failures:
133.07 s
gammaloop-nextest-clinnet> public_linnest_edge_styles_skip_fallbacks
133.07 s
gammaloop-nextest-clinnet>
133.07 s
gammaloop-nextest-clinnet> test result: FAILED. 0 passed; 1 failed; 0 ignored; 0 measured; 17 filtered out; finished in 75.20s
133.07 s
gammaloop-nextest-clinnet> system-err
133.07 s
gammaloop-nextest-clinnet> thread 'public_linnest_edge_styles_skip_fallbacks' (272) panicked at crates/clinnet/tests/public_typst_behavior.rs:81:55:
133.07 s
gammaloop-nextest-clinnet> called `Result::unwrap()` on an `Err` value: typst failed while compiling template /build/.tmpjzrRit/.clinnet/templates/linnest-public-behavior.svg
133.07 s
gammaloop-nextest-clinnet>
133.07 s
gammaloop-nextest-clinnet> Command executed:
133.07 s
gammaloop-nextest-clinnet> "typst" "c" "/build/.tmpjzrRit/.clinnet/templates/linnest-public-behavior.typ" "/build/.tmpjzrRit/.clinnet/templates/linnest-public-behavior.svg" "--root" "/build/.tmpjzrRit/.clinnet/templates"
133.07 s
gammaloop-nextest-clinnet>
133.07 s
gammaloop-nextest-clinnet> Typst stdout:
133.07 s
gammaloop-nextest-clinnet>
133.07 s
gammaloop-nextest-clinnet>
133.07 s
gammaloop-nextest-clinnet> Typst stderr:
133.07 s
gammaloop-nextest-clinnet>
133.07 s
gammaloop-nextest-clinnet>
133.07 s
gammaloop-nextest-clinnet> Location:
133.07 s
gammaloop-nextest-clinnet> crates/clinnet/src/lib.rs:741:13
133.07 s
gammaloop-nextest-clinnet> stack backtrace:
133.07 s
gammaloop-nextest-clinnet> 0: __rustc::rust_begin_unwind
133.07 s
gammaloop-nextest-clinnet> 1: core::panicking::panic_fmt
133.07 s
gammaloop-nextest-clinnet> 2: core::result::unwrap_failed
133.07 s
gammaloop-nextest-clinnet> 3: public_typst_behavior::render
133.07 s
gammaloop-nextest-clinnet> 4: <std::sync::once::Once>::call_once_force::<<std::sync::once_lock::OnceLock<alloc::string::String>>::initialize<<std::sync::once_lock::OnceLock<alloc::string::String>>::get_or_init<public_typst_behavior::linnest_public_svg::{closure#0}>::{closure#0}, !>::{closure#0}>::{closure#0}
133.07 s
gammaloop-nextest-clinnet> 5: <std::sys::sync::once::futex::Once>::call
133.07 s
gammaloop-nextest-clinnet> 6: <std::sync::once_lock::OnceLock<alloc::string::String>>::initialize::<<std::sync::once_lock::OnceLock<alloc::string::String>>::get_or_init<public_typst_behavior::linnest_public_svg::{closure#0}>::{closure#0}, !>
133.07 s
gammaloop-nextest-clinnet> 7: <public_typst_behavior::public_linnest_edge_styles_skip_fallbacks::{closure#0} as core::ops::function::FnOnce<()>>::call_once
133.07 s
gammaloop-nextest-clinnet> note: Some details are omitted, run with `RUST_BACKTRACE=full` for a verbose backtrace.
133.07 s
gammaloop-nextest-clinnet>
133.07 s
gammaloop-nextest-clinnet> 3. clinnet::public_typst_behavior::public_linnest_fixture_assertions_hold
133.07 s
gammaloop-nextest-clinnet> failure: test failure with exit code 101
133.07 s
gammaloop-nextest-clinnet> thread 'public_linnest_fixture_assertions_hold' (274) panicked at crates/clinnet/tests/public_typst_behavior.rs:81:55:
133.07 s
gammaloop-nextest-clinnet> called `Result::unwrap()` on an `Err` value: typst failed while compiling template /build/.tmp1F6fxQ/.clinnet/templates/linnest-public-behavior.svg
133.07 s
gammaloop-nextest-clinnet>
133.07 s
gammaloop-nextest-clinnet> Command executed:
133.07 s
gammaloop-nextest-clinnet> "typst" "c" "/build/.tmp1F6fxQ/.clinnet/templates/linnest-public-behavior.typ" "/build/.tmp1F6fxQ/.clinnet/templates/linnest-public-behavior.svg" "--root" "/build/.tmp1F6fxQ/.clinnet/templates"
133.07 s
gammaloop-nextest-clinnet>
133.07 s
gammaloop-nextest-clinnet> Typst stdout:
133.07 s
gammaloop-nextest-clinnet>
133.07 s
gammaloop-nextest-clinnet>
133.07 s
gammaloop-nextest-clinnet> Typst stderr:
133.07 s
gammaloop-nextest-clinnet>
133.07 s
gammaloop-nextest-clinnet>
133.07 s
gammaloop-nextest-clinnet> Location:
133.07 s
gammaloop-nextest-clinnet> crates/clinnet/src/lib.rs:741:13
133.07 s
gammaloop-nextest-clinnet> stack backtrace:
133.07 s
gammaloop-nextest-clinnet> 0: __rustc::rust_begin_unwind
133.07 s
gammaloop-nextest-clinnet> 1: core::panicking::panic_fmt
133.07 s
gammaloop-nextest-clinnet> 2: core::result::unwrap_failed
133.07 s
gammaloop-nextest-clinnet> 3: public_typst_behavior::render
133.07 s
gammaloop-nextest-clinnet> 4: <std::sync::once::Once>::call_once_force::<<std::sync::once_lock::OnceLock<alloc::string::String>>::initialize<<std::sync::once_lock::OnceLock<alloc::string::String>>::get_or_init<public_typst_behavior::linnest_public_svg::{closure#0}>::{closure#0}, !>::{closure#0}>::{closure#0}
133.07 s
gammaloop-nextest-clinnet> 5: <std::sys::sync::once::futex::Once>::call
133.07 s
gammaloop-nextest-clinnet> 6: <std::sync::once_lock::OnceLock<alloc::string::String>>::initialize::<<std::sync::once_lock::OnceLock<alloc::string::String>>::get_or_init<public_typst_behavior::linnest_public_svg::{closure#0}>::{closure#0}, !>
133.07 s
gammaloop-nextest-clinnet> 7: <public_typst_behavior::public_linnest_fixture_assertions_hold::{closure#0} as core::ops::function::FnOnce<()>>::call_once
133.07 s
gammaloop-nextest-clinnet> note: Some details are omitted, run with `RUST_BACKTRACE=full` for a verbose backtrace.
133.07 s
gammaloop-nextest-clinnet> system-out
133.07 s
gammaloop-nextest-clinnet> running 1 test
133.07 s
gammaloop-nextest-clinnet> test public_linnest_fixture_assertions_hold has been running for over 60 seconds
133.07 s
gammaloop-nextest-clinnet> test public_linnest_fixture_assertions_hold ... FAILED
133.07 s
gammaloop-nextest-clinnet>
133.07 s
gammaloop-nextest-clinnet> failures:
133.07 s
gammaloop-nextest-clinnet>
133.07 s
gammaloop-nextest-clinnet> failures:
133.07 s
gammaloop-nextest-clinnet> public_linnest_fixture_assertions_hold
133.07 s
gammaloop-nextest-clinnet>
133.07 s
gammaloop-nextest-clinnet> test result: FAILED. 0 passed; 1 failed; 0 ignored; 0 measured; 17 filtered out; finished in 85.81s
133.07 s
gammaloop-nextest-clinnet> system-err
133.07 s
gammaloop-nextest-clinnet> thread 'public_linnest_fixture_assertions_hold' (274) panicked at crates/clinnet/tests/public_typst_behavior.rs:81:55:
133.07 s
gammaloop-nextest-clinnet> called `Result::unwrap()` on an `Err` value: typst failed while compiling template /build/.tmp1F6fxQ/.clinnet/templates/linnest-public-behavior.svg
133.07 s
gammaloop-nextest-clinnet>
133.07 s
gammaloop-nextest-clinnet> Command executed:
133.07 s
gammaloop-nextest-clinnet> "typst" "c" "/build/.tmp1F6fxQ/.clinnet/templates/linnest-public-behavior.typ" "/build/.tmp1F6fxQ/.clinnet/templates/linnest-public-behavior.svg" "--root" "/build/.tmp1F6fxQ/.clinnet/templates"
133.07 s
gammaloop-nextest-clinnet>
133.07 s
gammaloop-nextest-clinnet> Typst stdout:
133.07 s
gammaloop-nextest-clinnet>
133.07 s
gammaloop-nextest-clinnet>
133.07 s
gammaloop-nextest-clinnet> Typst stderr:
133.07 s
gammaloop-nextest-clinnet>
133.07 s
gammaloop-nextest-clinnet>
133.07 s
gammaloop-nextest-clinnet> Location:
133.07 s
gammaloop-nextest-clinnet> crates/clinnet/src/lib.rs:741:13
133.07 s
gammaloop-nextest-clinnet> stack backtrace:
133.07 s
gammaloop-nextest-clinnet> 0: __rustc::rust_begin_unwind
133.07 s
gammaloop-nextest-clinnet> 1: core::panicking::panic_fmt
133.07 s
gammaloop-nextest-clinnet> 2: core::result::unwrap_failed
133.07 s
gammaloop-nextest-clinnet> 3: public_typst_behavior::render
133.07 s
gammaloop-nextest-clinnet> 4: <std::sync::once::Once>::call_once_force::<<std::sync::once_lock::OnceLock<alloc::string::String>>::initialize<<std::sync::once_lock::OnceLock<alloc::string::String>>::get_or_init<public_typst_behavior::linnest_public_svg::{closure#0}>::{closure#0}, !>::{closure#0}>::{closure#0}
133.07 s
gammaloop-nextest-clinnet> 5: <std::sys::sync::once::futex::Once>::call
133.07 s
gammaloop-nextest-clinnet> 6: <std::sync::once_lock::OnceLock<alloc::string::String>>::initialize::<<std::sync::once_lock::OnceLock<alloc::string::String>>::get_or_init<public_typst_behavior::linnest_public_svg::{closure#0}>::{closure#0}, !>
133.07 s
gammaloop-nextest-clinnet> 7: <public_typst_behavior::public_linnest_fixture_assertions_hold::{closure#0} as core::ops::function::FnOnce<()>>::call_once
133.07 s
gammaloop-nextest-clinnet> note: Some details are omitted, run with `RUST_BACKTRACE=full` for a verbose backtrace.
133.07 s
gammaloop-nextest-clinnet> =========================================
133.16 s
error: Cannot build '/nix/store/4pqspwvh8pi9s2vg9g6mfsggpl9ynwzx-gammaloop-nextest-clinnet.drv '.
133.16 s
Reason: builder failed with exit code 100 .
133.16 s
Output paths:
133.16 s
/nix/store/v9zka7gxdrym1pq03r0i4w2q43fgdwcq-gammaloop-nextest-clinnet
133.16 s
Last 449 log lines:
133.16 s
> Nextest worker budget: 16
133.16 s
> Extracting 4 binaries (including 1 non-test binary), 1 build script output directory, and 1 linked path to /build/source
133.16 s
> Extracted 16 files to /build/source in 0.09s
133.16 s
> ------------
133.16 s
> Nextest run ID 21864be8-93df-4624-808d-e8e8264d1c74 with nextest profile: ci_gammaloop
133.16 s
> Starting 38 tests across 3 binaries
133.16 s
> FAIL [ 69.935s] (32/38) clinnet::public_typst_behavior public_linnest_momentum_layers_place_shafts_and_labels
133.16 s
> stdout ---
133.16 s
>
133.16 s
> running 1 test
133.16 s
> test public_linnest_momentum_layers_place_shafts_and_labels has been running for over 60 seconds
133.16 s
> test public_linnest_momentum_layers_place_shafts_and_labels ... FAILED
133.16 s
>
133.16 s
> failures:
133.16 s
>
133.16 s
> failures:
133.16 s
> public_linnest_momentum_layers_place_shafts_and_labels
133.16 s
>
133.16 s
> test result: FAILED. 0 passed; 1 failed; 0 ignored; 0 measured; 17 filtered out; finished in 69.92s
133.16 s
>
133.16 s
> stderr ---
133.16 s
>
133.16 s
> thread 'public_linnest_momentum_layers_place_shafts_and_labels' (287) panicked at crates/clinnet/tests/public_typst_behavior.rs:81:55:
133.16 s
> called `Result::unwrap()` on an `Err` value: typst failed while compiling template /build/.tmp1GG1hA/.clinnet/templates/linnest-public-behavior.svg
133.16 s
>
133.16 s
> Command executed:
133.16 s
> "typst" "c" "/build/.tmp1GG1hA/.clinnet/templates/linnest-public-behavior.typ" "/build/.tmp1GG1hA/.clinnet/templates/linnest-public-behavior.svg" "--root" "/build/.tmp1GG1hA/.clinnet/templates"
133.16 s
>
133.16 s
> Typst stdout:
133.16 s
>
133.16 s
>
133.16 s
> Typst stderr:
133.16 s
>
133.16 s
>
133.16 s
> Location:
133.16 s
> crates/clinnet/src/lib.rs:741:13
133.16 s
> stack backtrace:
133.16 s
> 0: __rustc::rust_begin_unwind
133.16 s
> 1: core::panicking::panic_fmt
133.16 s
> 2: core::result::unwrap_failed
133.16 s
> 3: public_typst_behavior::render
133.16 s
> 4: <std::sync::once::Once>::call_once_force::<<std::sync::once_lock::OnceLock<alloc::string::String>>::initialize<<std::sync::once_lock::OnceLock<alloc::string::String>>::get_or_init<public_typst_behavior::linnest_public_svg::{closure#0}>::{closure#0}, !>::{closure#0}>::{closure#0}
133.16 s
> 5: <std::sys::sync::once::futex::Once>::call
133.16 s
> 6: <std::sync::once_lock::OnceLock<alloc::string::String>>::initialize::<<std::sync::once_lock::OnceLock<alloc::string::String>>::get_or_init<public_typst_behavior::linnest_public_svg::{closure#0}>::{closure#0}, !>
133.16 s
> 7: <public_typst_behavior::public_linnest_momentum_layers_place_shafts_and_labels::{closure#0} as core::ops::function::FnOnce<()>>::call_once
133.16 s
> note: Some details are omitted, run with `RUST_BACKTRACE=full` for a verbose backtrace.
133.16 s
>
133.16 s
> FAIL [ 75.232s] (33/38) clinnet::public_typst_behavior public_linnest_edge_styles_skip_fallbacks
133.16 s
> stdout ---
133.16 s
>
133.16 s
> running 1 test
133.16 s
> test public_linnest_edge_styles_skip_fallbacks has been running for over 60 seconds
133.16 s
> test public_linnest_edge_styles_skip_fallbacks ... FAILED
133.16 s
>
133.16 s
> failures:
133.16 s
>
133.16 s
> failures:
133.16 s
> public_linnest_edge_styles_skip_fallbacks
133.16 s
>
133.16 s
> test result: FAILED. 0 passed; 1 failed; 0 ignored; 0 measured; 17 filtered out; finished in 75.20s
133.16 s
>
133.16 s
> stderr ---
133.16 s
>
133.16 s
> thread 'public_linnest_edge_styles_skip_fallbacks' (272) panicked at crates/clinnet/tests/public_typst_behavior.rs:81:55:
133.16 s
> called `Result::unwrap()` on an `Err` value: typst failed while compiling template /build/.tmpjzrRit/.clinnet/templates/linnest-public-behavior.svg
133.16 s
>
133.16 s
> Command executed:
133.16 s
> "typst" "c" "/build/.tmpjzrRit/.clinnet/templates/linnest-public-behavior.typ" "/build/.tmpjzrRit/.clinnet/templates/linnest-public-behavior.svg" "--root" "/build/.tmpjzrRit/.clinnet/templates"
133.16 s
>
133.16 s
> Typst stdout:
133.16 s
>
133.16 s
>
133.16 s
> Typst stderr:
133.16 s
>
133.16 s
>
133.16 s
> Location:
133.16 s
> crates/clinnet/src/lib.rs:741:13
133.16 s
> stack backtrace:
133.16 s
> 0: __rustc::rust_begin_unwind
133.16 s
> 1: core::panicking::panic_fmt
133.16 s
> 2: core::result::unwrap_failed
133.16 s
> 3: public_typst_behavior::render
133.16 s
> 4: <std::sync::once::Once>::call_once_force::<<std::sync::once_lock::OnceLock<alloc::string::String>>::initialize<<std::sync::once_lock::OnceLock<alloc::string::String>>::get_or_init<public_typst_behavior::linnest_public_svg::{closure#0}>::{closure#0}, !>::{closure#0}>::{closure#0}
133.16 s
> 5: <std::sys::sync::once::futex::Once>::call
133.16 s
> 6: <std::sync::once_lock::OnceLock<alloc::string::String>>::initialize::<<std::sync::once_lock::OnceLock<alloc::string::String>>::get_or_init<public_typst_behavior::linnest_public_svg::{closure#0}>::{closure#0}, !>
133.16 s
> 7: <public_typst_behavior::public_linnest_edge_styles_skip_fallbacks::{closure#0} as core::ops::function::FnOnce<()>>::call_once
133.16 s
> note: Some details are omitted, run with `RUST_BACKTRACE=full` for a verbose backtrace.
133.16 s
>
133.16 s
> FAIL [ 85.826s] (34/38) clinnet::public_typst_behavior public_linnest_fixture_assertions_hold
133.16 s
> stdout ---
133.16 s
>
133.16 s
> running 1 test
133.16 s
> test public_linnest_fixture_assertions_hold has been running for over 60 seconds
133.16 s
> test public_linnest_fixture_assertions_hold ... FAILED
133.16 s
>
133.16 s
> failures:
133.16 s
>
133.16 s
> failures:
133.16 s
> public_linnest_fixture_assertions_hold
133.16 s
>
133.16 s
> test result: FAILED. 0 passed; 1 failed; 0 ignored; 0 measured; 17 filtered out; finished in 85.81s
133.16 s
>
133.16 s
> stderr ---
133.16 s
>
133.16 s
> thread 'public_linnest_fixture_assertions_hold' (274) panicked at crates/clinnet/tests/public_typst_behavior.rs:81:55:
133.16 s
> called `Result::unwrap()` on an `Err` value: typst failed while compiling template /build/.tmp1F6fxQ/.clinnet/templates/linnest-public-behavior.svg
133.16 s
>
133.16 s
> Command executed:
133.16 s
> "typst" "c" "/build/.tmp1F6fxQ/.clinnet/templates/linnest-public-behavior.typ" "/build/.tmp1F6fxQ/.clinnet/templates/linnest-public-behavior.svg" "--root" "/build/.tmp1F6fxQ/.clinnet/templates"
133.16 s
>
133.16 s
> Typst stdout:
133.16 s
>
133.16 s
>
133.16 s
> Typst stderr:
133.16 s
>
133.16 s
>
133.16 s
> Location:
133.16 s
> crates/clinnet/src/lib.rs:741:13
133.16 s
> stack backtrace:
133.16 s
> 0: __rustc::rust_begin_unwind
133.16 s
> 1: core::panicking::panic_fmt
133.16 s
> 2: core::result::unwrap_failed
133.16 s
> 3: public_typst_behavior::render
133.16 s
> 4: <std::sync::once::Once>::call_once_force::<<std::sync::once_lock::OnceLock<alloc::string::String>>::initialize<<std::sync::once_lock::OnceLock<alloc::string::String>>::get_or_init<public_typst_behavior::linnest_public_svg::{closure#0}>::{closure#0}, !>::{closure#0}>::{closure#0}
133.16 s
> 5: <std::sys::sync::once::futex::Once>::call
133.16 s
> 6: <std::sync::once_lock::OnceLock<alloc::string::String>>::initialize::<<std::sync::once_lock::OnceLock<alloc::string::String>>::get_or_init<public_typst_behavior::linnest_public_svg::{closure#0}>::{closure#0}, !>
133.16 s
> 7: <public_typst_behavior::public_linnest_fixture_assertions_hold::{closure#0} as core::ops::function::FnOnce<()>>::call_once
133.16 s
> note: Some details are omitted, run with `RUST_BACKTRACE=full` for a verbose backtrace.
133.16 s
>
133.16 s
> ------------
133.16 s
> Summary [ 95.523s] 38 tests run: 35 passed , 3 failed , 0 skipped
133.16 s
> FAIL [ 69.935s] (32/38) clinnet::public_typst_behavior public_linnest_momentum_layers_place_shafts_and_labels
133.16 s
> stdout ---
133.16 s
>
133.16 s
> running 1 test
133.16 s
> test public_linnest_momentum_layers_place_shafts_and_labels has been running for over 60 seconds
133.16 s
> test public_linnest_momentum_layers_place_shafts_and_labels ... FAILED
133.16 s
>
133.16 s
> failures:
133.16 s
>
133.16 s
> failures:
133.16 s
> public_linnest_momentum_layers_place_shafts_and_labels
133.16 s
>
133.16 s
> test result: FAILED. 0 passed; 1 failed; 0 ignored; 0 measured; 17 filtered out; finished in 69.92s
133.16 s
>
133.16 s
> stderr ---
133.16 s
>
133.16 s
> thread 'public_linnest_momentum_layers_place_shafts_and_labels' (287) panicked at crates/clinnet/tests/public_typst_behavior.rs:81:55:
133.16 s
> called `Result::unwrap()` on an `Err` value: typst failed while compiling template /build/.tmp1GG1hA/.clinnet/templates/linnest-public-behavior.svg
133.16 s
>
133.16 s
> Command executed:
133.16 s
> "typst" "c" "/build/.tmp1GG1hA/.clinnet/templates/linnest-public-behavior.typ" "/build/.tmp1GG1hA/.clinnet/templates/linnest-public-behavior.svg" "--root" "/build/.tmp1GG1hA/.clinnet/templates"
133.16 s
>
133.16 s
> Typst stdout:
133.16 s
>
133.16 s
>
133.16 s
> Typst stderr:
133.16 s
>
133.16 s
>
133.16 s
> Location:
133.16 s
> crates/clinnet/src/lib.rs:741:13
133.16 s
> stack backtrace:
133.16 s
> 0: __rustc::rust_begin_unwind
133.16 s
> 1: core::panicking::panic_fmt
133.16 s
> 2: core::result::unwrap_failed
133.16 s
> 3: public_typst_behavior::render
133.16 s
> 4: <std::sync::once::Once>::call_once_force::<<std::sync::once_lock::OnceLock<alloc::string::String>>::initialize<<std::sync::once_lock::OnceLock<alloc::string::String>>::get_or_init<public_typst_behavior::linnest_public_svg::{closure#0}>::{closure#0}, !>::{closure#0}>::{closure#0}
133.16 s
> 5: <std::sys::sync::once::futex::Once>::call
133.16 s
> 6: <std::sync::once_lock::OnceLock<alloc::string::String>>::initialize::<<std::sync::once_lock::OnceLock<alloc::string::String>>::get_or_init<public_typst_behavior::linnest_public_svg::{closure#0}>::{closure#0}, !>
133.16 s
> 7: <public_typst_behavior::public_linnest_momentum_layers_place_shafts_and_labels::{closure#0} as core::ops::function::FnOnce<()>>::call_once
133.16 s
> note: Some details are omitted, run with `RUST_BACKTRACE=full` for a verbose backtrace.
133.16 s
>
133.16 s
> FAIL [ 75.232s] (33/38) clinnet::public_typst_behavior public_linnest_edge_styles_skip_fallbacks
133.16 s
> stdout ---
133.16 s
>
133.16 s
> running 1 test
133.16 s
> test public_linnest_edge_styles_skip_fallbacks has been running for over 60 seconds
133.16 s
> test public_linnest_edge_styles_skip_fallbacks ... FAILED
133.16 s
>
133.16 s
> failures:
133.16 s
>
133.16 s
> failures:
133.16 s
> public_linnest_edge_styles_skip_fallbacks
133.16 s
>
133.16 s
> test result: FAILED. 0 passed; 1 failed; 0 ignored; 0 measured; 17 filtered out; finished in 75.20s
133.16 s
>
133.16 s
> stderr ---
133.16 s
>
133.16 s
> thread 'public_linnest_edge_styles_skip_fallbacks' (272) panicked at crates/clinnet/tests/public_typst_behavior.rs:81:55:
133.16 s
> called `Result::unwrap()` on an `Err` value: typst failed while compiling template /build/.tmpjzrRit/.clinnet/templates/linnest-public-behavior.svg
133.16 s
>
133.16 s
> Command executed:
133.16 s
> "typst" "c" "/build/.tmpjzrRit/.clinnet/templates/linnest-public-behavior.typ" "/build/.tmpjzrRit/.clinnet/templates/linnest-public-behavior.svg" "--root" "/build/.tmpjzrRit/.clinnet/templates"
133.16 s
>
133.16 s
> Typst stdout:
133.16 s
>
133.16 s
>
133.16 s
> Typst stderr:
133.16 s
>
133.16 s
>
133.16 s
> Location:
133.16 s
> crates/clinnet/src/lib.rs:741:13
133.16 s
> stack backtrace:
133.16 s
> 0: __rustc::rust_begin_unwind
133.16 s
> 1: core::panicking::panic_fmt
133.16 s
> 2: core::result::unwrap_failed
133.16 s
> 3: public_typst_behavior::render
133.16 s
> 4: <std::sync::once::Once>::call_once_force::<<std::sync::once_lock::OnceLock<alloc::string::String>>::initialize<<std::sync::once_lock::OnceLock<alloc::string::String>>::get_or_init<public_typst_behavior::linnest_public_svg::{closure#0}>::{closure#0}, !>::{closure#0}>::{closure#0}
133.16 s
> 5: <std::sys::sync::once::futex::Once>::call
133.16 s
> 6: <std::sync::once_lock::OnceLock<alloc::string::String>>::initialize::<<std::sync::once_lock::OnceLock<alloc::string::String>>::get_or_init<public_typst_behavior::linnest_public_svg::{closure#0}>::{closure#0}, !>
133.16 s
> 7: <public_typst_behavior::public_linnest_edge_styles_skip_fallbacks::{closure#0} as core::ops::function::FnOnce<()>>::call_once
133.16 s
> note: Some details are omitted, run with `RUST_BACKTRACE=full` for a verbose backtrace.
133.16 s
>
133.16 s
> FAIL [ 85.826s] (34/38) clinnet::public_typst_behavior public_linnest_fixture_assertions_hold
133.16 s
> stdout ---
133.16 s
>
133.16 s
> running 1 test
133.16 s
> test public_linnest_fixture_assertions_hold has been running for over 60 seconds
133.16 s
> test public_linnest_fixture_assertions_hold ... FAILED
133.16 s
>
133.16 s
> failures:
133.16 s
>
133.16 s
> failures:
133.16 s
> public_linnest_fixture_assertions_hold
133.16 s
>
133.16 s
> test result: FAILED. 0 passed; 1 failed; 0 ignored; 0 measured; 17 filtered out; finished in 85.81s
133.16 s
>
133.16 s
> stderr ---
133.16 s
>
133.16 s
> thread 'public_linnest_fixture_assertions_hold' (274) panicked at crates/clinnet/tests/public_typst_behavior.rs:81:55:
133.16 s
> called `Result::unwrap()` on an `Err` value: typst failed while compiling template /build/.tmp1F6fxQ/.clinnet/templates/linnest-public-behavior.svg
133.16 s
>
133.16 s
> Command executed:
133.16 s
> "typst" "c" "/build/.tmp1F6fxQ/.clinnet/templates/linnest-public-behavior.typ" "/build/.tmp1F6fxQ/.clinnet/templates/linnest-public-behavior.svg" "--root" "/build/.tmp1F6fxQ/.clinnet/templates"
133.16 s
>
133.16 s
> Typst stdout:
133.16 s
>
133.16 s
>
133.16 s
> Typst stderr:
133.16 s
>
133.16 s
>
133.16 s
> Location:
133.16 s
> crates/clinnet/src/lib.rs:741:13
133.16 s
> stack backtrace:
133.16 s
> 0: __rustc::rust_begin_unwind
133.16 s
> 1: core::panicking::panic_fmt
133.16 s
> 2: core::result::unwrap_failed
133.16 s
> 3: public_typst_behavior::render
133.16 s
> 4: <std::sync::once::Once>::call_once_force::<<std::sync::once_lock::OnceLock<alloc::string::String>>::initialize<<std::sync::once_lock::OnceLock<alloc::string::String>>::get_or_init<public_typst_behavior::linnest_public_svg::{closure#0}>::{closure#0}, !>::{closure#0}>::{closure#0}
133.16 s
> 5: <std::sys::sync::once::futex::Once>::call
133.16 s
> 6: <std::sync::once_lock::OnceLock<alloc::string::String>>::initialize::<<std::sync::once_lock::OnceLock<alloc::string::String>>::get_or_init<public_typst_behavior::linnest_public_svg::{closure#0}>::{closure#0}, !>
133.16 s
> 7: <public_typst_behavior::public_linnest_fixture_assertions_hold::{closure#0} as core::ops::function::FnOnce<()>>::call_once
133.16 s
> note: Some details are omitted, run with `RUST_BACKTRACE=full` for a verbose backtrace.
133.16 s
>
133.16 s
> error : test run failed
133.16 s
>
133.16 s
> ========== nextest test summary ==========
133.16 s
> report: target/nextest/ci_gammaloop/junit.xml
133.16 s
> tests: 38, failures: 3, errors: 0
133.16 s
>
133.16 s
> 1. clinnet::public_typst_behavior::public_linnest_momentum_layers_place_shafts_and_labels
133.16 s
> failure: test failure with exit code 101
133.16 s
> thread 'public_linnest_momentum_layers_place_shafts_and_labels' (287) panicked at crates/clinnet/tests/public_typst_behavior.rs:81:55:
133.16 s
> called `Result::unwrap()` on an `Err` value: typst failed while compiling template /build/.tmp1GG1hA/.clinnet/templates/linnest-public-behavior.svg
133.16 s
>
133.16 s
> Command executed:
133.16 s
> "typst" "c" "/build/.tmp1GG1hA/.clinnet/templates/linnest-public-behavior.typ" "/build/.tmp1GG1hA/.clinnet/templates/linnest-public-behavior.svg" "--root" "/build/.tmp1GG1hA/.clinnet/templates"
133.16 s
>
133.16 s
> Typst stdout:
133.16 s
>
133.16 s
>
133.16 s
> Typst stderr:
133.16 s
>
133.16 s
>
133.16 s
> Location:
133.16 s
> crates/clinnet/src/lib.rs:741:13
133.16 s
> stack backtrace:
133.16 s
> 0: __rustc::rust_begin_unwind
133.16 s
> 1: core::panicking::panic_fmt
133.16 s
> 2: core::result::unwrap_failed
133.16 s
> 3: public_typst_behavior::render
133.16 s
> 4: <std::sync::once::Once>::call_once_force::<<std::sync::once_lock::OnceLock<alloc::string::String>>::initialize<<std::sync::once_lock::OnceLock<alloc::string::String>>::get_or_init<public_typst_behavior::linnest_public_svg::{closure#0}>::{closure#0}, !>::{closure#0}>::{closure#0}
133.16 s
> 5: <std::sys::sync::once::futex::Once>::call
133.16 s
> 6: <std::sync::once_lock::OnceLock<alloc::string::String>>::initialize::<<std::sync::once_lock::OnceLock<alloc::string::String>>::get_or_init<public_typst_behavior::linnest_public_svg::{closure#0}>::{closure#0}, !>
133.16 s
> 7: <public_typst_behavior::public_linnest_momentum_layers_place_shafts_and_labels::{closure#0} as core::ops::function::FnOnce<()>>::call_once
133.16 s
> note: Some details are omitted, run with `RUST_BACKTRACE=full` for a verbose backtrace.
133.16 s
> system-out
133.16 s
> running 1 test
133.16 s
> test public_linnest_momentum_layers_place_shafts_and_labels has been running for over 60 seconds
133.16 s
> test public_linnest_momentum_layers_place_shafts_and_labels ... FAILED
133.16 s
>
133.16 s
> failures:
133.16 s
>
133.16 s
> failures:
133.16 s
> public_linnest_momentum_layers_place_shafts_and_labels
133.16 s
>
133.16 s
> test result: FAILED. 0 passed; 1 failed; 0 ignored; 0 measured; 17 filtered out; finished in 69.92s
133.16 s
> system-err
133.16 s
> thread 'public_linnest_momentum_layers_place_shafts_and_labels' (287) panicked at crates/clinnet/tests/public_typst_behavior.rs:81:55:
133.16 s
> called `Result::unwrap()` on an `Err` value: typst failed while compiling template /build/.tmp1GG1hA/.clinnet/templates/linnest-public-behavior.svg
133.16 s
>
133.16 s
> Command executed:
133.16 s
> "typst" "c" "/build/.tmp1GG1hA/.clinnet/templates/linnest-public-behavior.typ" "/build/.tmp1GG1hA/.clinnet/templates/linnest-public-behavior.svg" "--root" "/build/.tmp1GG1hA/.clinnet/templates"
133.16 s
>
133.16 s
> Typst stdout:
133.16 s
>
133.16 s
>
133.16 s
> Typst stderr:
133.16 s
>
133.16 s
>
133.16 s
> Location:
133.16 s
> crates/clinnet/src/lib.rs:741:13
133.16 s
> stack backtrace:
133.16 s
> 0: __rustc::rust_begin_unwind
133.16 s
> 1: core::panicking::panic_fmt
133.16 s
> 2: core::result::unwrap_failed
133.16 s
> 3: public_typst_behavior::render
133.16 s
> 4: <std::sync::once::Once>::call_once_force::<<std::sync::once_lock::OnceLock<alloc::string::String>>::initialize<<std::sync::once_lock::OnceLock<alloc::string::String>>::get_or_init<public_typst_behavior::linnest_public_svg::{closure#0}>::{closure#0}, !>::{closure#0}>::{closure#0}
133.16 s
> 5: <std::sys::sync::once::futex::Once>::call
133.16 s
> 6: <std::sync::once_lock::OnceLock<alloc::string::String>>::initialize::<<std::sync::once_lock::OnceLock<alloc::string::String>>::get_or_init<public_typst_behavior::linnest_public_svg::{closure#0}>::{closure#0}, !>
133.16 s
> 7: <public_typst_behavior::public_linnest_momentum_layers_place_shafts_and_labels::{closure#0} as core::ops::function::FnOnce<()>>::call_once
133.16 s
> note: Some details are omitted, run with `RUST_BACKTRACE=full` for a verbose backtrace.
133.16 s
>
133.16 s
> 2. clinnet::public_typst_behavior::public_linnest_edge_styles_skip_fallbacks
133.16 s
> failure: test failure with exit code 101
133.16 s
> thread 'public_linnest_edge_styles_skip_fallbacks' (272) panicked at crates/clinnet/tests/public_typst_behavior.rs:81:55:
133.16 s
> called `Result::unwrap()` on an `Err` value: typst failed while compiling template /build/.tmpjzrRit/.clinnet/templates/linnest-public-behavior.svg
133.16 s
>
133.16 s
> Command executed:
133.16 s
> "typst" "c" "/build/.tmpjzrRit/.clinnet/templates/linnest-public-behavior.typ" "/build/.tmpjzrRit/.clinnet/templates/linnest-public-behavior.svg" "--root" "/build/.tmpjzrRit/.clinnet/templates"
133.16 s
>
133.16 s
> Typst stdout:
133.16 s
>
133.16 s
>
133.16 s
> Typst stderr:
133.16 s
>
133.16 s
>
133.16 s
> Location:
133.16 s
> crates/clinnet/src/lib.rs:741:13
133.16 s
> stack backtrace:
133.16 s
> 0: __rustc::rust_begin_unwind
133.16 s
> 1: core::panicking::panic_fmt
133.16 s
> 2: core::result::unwrap_failed
133.16 s
> 3: public_typst_behavior::render
133.16 s
> 4: <std::sync::once::Once>::call_once_force::<<std::sync::once_lock::OnceLock<alloc::string::String>>::initialize<<std::sync::once_lock::OnceLock<alloc::string::String>>::get_or_init<public_typst_behavior::linnest_public_svg::{closure#0}>::{closure#0}, !>::{closure#0}>::{closure#0}
133.16 s
> 5: <std::sys::sync::once::futex::Once>::call
133.16 s
> 6: <std::sync::once_lock::OnceLock<alloc::string::String>>::initialize::<<std::sync::once_lock::OnceLock<alloc::string::String>>::get_or_init<public_typst_behavior::linnest_public_svg::{closure#0}>::{closure#0}, !>
133.16 s
> 7: <public_typst_behavior::public_linnest_edge_styles_skip_fallbacks::{closure#0} as core::ops::function::FnOnce<()>>::call_once
133.16 s
> note: Some details are omitted, run with `RUST_BACKTRACE=full` for a verbose backtrace.
133.16 s
> system-out
133.16 s
> running 1 test
133.16 s
> test public_linnest_edge_styles_skip_fallbacks has been running for over 60 seconds
133.16 s
> test public_linnest_edge_styles_skip_fallbacks ... FAILED
133.16 s
>
133.16 s
> failures:
133.16 s
>
133.16 s
> failures:
133.16 s
> public_linnest_edge_styles_skip_fallbacks
133.16 s
>
133.16 s
> test result: FAILED. 0 passed; 1 failed; 0 ignored; 0 measured; 17 filtered out; finished in 75.20s
133.16 s
> system-err
133.16 s
> thread 'public_linnest_edge_styles_skip_fallbacks' (272) panicked at crates/clinnet/tests/public_typst_behavior.rs:81:55:
133.16 s
> called `Result::unwrap()` on an `Err` value: typst failed while compiling template /build/.tmpjzrRit/.clinnet/templates/linnest-public-behavior.svg
133.16 s
>
133.16 s
> Command executed:
133.16 s
> "typst" "c" "/build/.tmpjzrRit/.clinnet/templates/linnest-public-behavior.typ" "/build/.tmpjzrRit/.clinnet/templates/linnest-public-behavior.svg" "--root" "/build/.tmpjzrRit/.clinnet/templates"
133.16 s
>
133.16 s
> Typst stdout:
133.16 s
>
133.16 s
>
133.16 s
> Typst stderr:
133.16 s
>
133.16 s
>
133.16 s
> Location:
133.16 s
> crates/clinnet/src/lib.rs:741:13
133.16 s
> stack backtrace:
133.16 s
> 0: __rustc::rust_begin_unwind
133.16 s
> 1: core::panicking::panic_fmt
133.16 s
> 2: core::result::unwrap_failed
133.16 s
> 3: public_typst_behavior::render
133.16 s
> 4: <std::sync::once::Once>::call_once_force::<<std::sync::once_lock::OnceLock<alloc::string::String>>::initialize<<std::sync::once_lock::OnceLock<alloc::string::String>>::get_or_init<public_typst_behavior::linnest_public_svg::{closure#0}>::{closure#0}, !>::{closure#0}>::{closure#0}
133.16 s
> 5: <std::sys::sync::once::futex::Once>::call
133.16 s
> 6: <std::sync::once_lock::OnceLock<alloc::string::String>>::initialize::<<std::sync::once_lock::OnceLock<alloc::string::String>>::get_or_init<public_typst_behavior::linnest_public_svg::{closure#0}>::{closure#0}, !>
133.16 s
> 7: <public_typst_behavior::public_linnest_edge_styles_skip_fallbacks::{closure#0} as core::ops::function::FnOnce<()>>::call_once
133.16 s
> note: Some details are omitted, run with `RUST_BACKTRACE=full` for a verbose backtrace.
133.16 s
>
133.16 s
> 3. clinnet::public_typst_behavior::public_linnest_fixture_assertions_hold
133.16 s
> failure: test failure with exit code 101
133.16 s
> thread 'public_linnest_fixture_assertions_hold' (274) panicked at crates/clinnet/tests/public_typst_behavior.rs:81:55:
133.16 s
> called `Result::unwrap()` on an `Err` value: typst failed while compiling template /build/.tmp1F6fxQ/.clinnet/templates/linnest-public-behavior.svg
133.16 s
>
133.16 s
> Command executed:
133.16 s
> "typst" "c" "/build/.tmp1F6fxQ/.clinnet/templates/linnest-public-behavior.typ" "/build/.tmp1F6fxQ/.clinnet/templates/linnest-public-behavior.svg" "--root" "/build/.tmp1F6fxQ/.clinnet/templates"
133.16 s
>
133.16 s
> Typst stdout:
133.16 s
>
133.16 s
>
133.16 s
> Typst stderr:
133.16 s
>
133.16 s
>
133.16 s
> Location:
133.16 s
> crates/clinnet/src/lib.rs:741:13
133.16 s
> stack backtrace:
133.16 s
> 0: __rustc::rust_begin_unwind
133.16 s
> 1: core::panicking::panic_fmt
133.16 s
> 2: core::result::unwrap_failed
133.16 s
> 3: public_typst_behavior::render
133.16 s
> 4: <std::sync::once::Once>::call_once_force::<<std::sync::once_lock::OnceLock<alloc::string::String>>::initialize<<std::sync::once_lock::OnceLock<alloc::string::String>>::get_or_init<public_typst_behavior::linnest_public_svg::{closure#0}>::{closure#0}, !>::{closure#0}>::{closure#0}
133.16 s
> 5: <std::sys::sync::once::futex::Once>::call
133.16 s
> 6: <std::sync::once_lock::OnceLock<alloc::string::String>>::initialize::<<std::sync::once_lock::OnceLock<alloc::string::String>>::get_or_init<public_typst_behavior::linnest_public_svg::{closure#0}>::{closure#0}, !>
133.16 s
> 7: <public_typst_behavior::public_linnest_fixture_assertions_hold::{closure#0} as core::ops::function::FnOnce<()>>::call_once
133.16 s
> note: Some details are omitted, run with `RUST_BACKTRACE=full` for a verbose backtrace.
133.16 s
> system-out
133.16 s
> running 1 test
133.16 s
> test public_linnest_fixture_assertions_hold has been running for over 60 seconds
133.16 s
> test public_linnest_fixture_assertions_hold ... FAILED
133.16 s
>
133.16 s
> failures:
133.16 s
>
133.16 s
> failures:
133.16 s
> public_linnest_fixture_assertions_hold
133.16 s
>
133.16 s
> test result: FAILED. 0 passed; 1 failed; 0 ignored; 0 measured; 17 filtered out; finished in 85.81s
133.16 s
> system-err
133.16 s
> thread 'public_linnest_fixture_assertions_hold' (274) panicked at crates/clinnet/tests/public_typst_behavior.rs:81:55:
133.16 s
> called `Result::unwrap()` on an `Err` value: typst failed while compiling template /build/.tmp1F6fxQ/.clinnet/templates/linnest-public-behavior.svg
133.16 s
>
133.16 s
> Command executed:
133.16 s
> "typst" "c" "/build/.tmp1F6fxQ/.clinnet/templates/linnest-public-behavior.typ" "/build/.tmp1F6fxQ/.clinnet/templates/linnest-public-behavior.svg" "--root" "/build/.tmp1F6fxQ/.clinnet/templates"
133.16 s
>
133.16 s
> Typst stdout:
133.16 s
>
133.16 s
>
133.16 s
> Typst stderr:
133.16 s
>
133.16 s
>
133.16 s
> Location:
133.16 s
> crates/clinnet/src/lib.rs:741:13
133.16 s
> stack backtrace:
133.16 s
> 0: __rustc::rust_begin_unwind
133.16 s
> 1: core::panicking::panic_fmt
133.16 s
> 2: core::result::unwrap_failed
133.16 s
> 3: public_typst_behavior::render
133.16 s
> 4: <std::sync::once::Once>::call_once_force::<<std::sync::once_lock::OnceLock<alloc::string::String>>::initialize<<std::sync::once_lock::OnceLock<alloc::string::String>>::get_or_init<public_typst_behavior::linnest_public_svg::{closure#0}>::{closure#0}, !>::{closure#0}>::{closure#0}
133.16 s
> 5: <std::sys::sync::once::futex::Once>::call
133.16 s
> 6: <std::sync::once_lock::OnceLock<alloc::string::String>>::initialize::<<std::sync::once_lock::OnceLock<alloc::string::String>>::get_or_init<public_typst_behavior::linnest_public_svg::{closure#0}>::{closure#0}, !>
133.16 s
> 7: <public_typst_behavior::public_linnest_fixture_assertions_hold::{closure#0} as core::ops::function::FnOnce<()>>::call_once
133.16 s
> note: Some details are omitted, run with `RUST_BACKTRACE=full` for a verbose backtrace.
133.16 s
> =========================================
133.16 s
For full logs, run:
133.16 s
nix log /nix/store/4pqspwvh8pi9s2vg9g6mfsggpl9ynwzx-gammaloop-nextest-clinnet.drv
133.39 s
[0 built (1 failed )]Run failed.