1. 0.02 s $ /nix/store/bhv6xyvqw6gjs3j488gi1z6wdv18bdpa-coreutils-9.11/bin/timeout --kill-after=15s 7200s /nix/store/bxgja2ppiqi6w2bgn0r07d7mgnl1k6k2-nix-2.34.8/bin/nix --extra-experimental-features nix-command --extra-experimental-features flakes flake clone git+https://github.com/alphal00p/gammaloop --dest /tmp/nix-ci-worker/stable-pwd/repo/
  2. 0.25 s Cloning into '/tmp/nix-ci-worker/stable-pwd/repo'...
  3. 1.01 s remote: Enumerating objects: 162134, done.
  4. 1.12 s remote: Counting objects: 0% (1/3710) remote: Counting objects: 1% (38/3710) remote: Counting objects: 2% (75/3710) remote: Counting objects: 3% (112/3710) remote: Counting objects: 4% (149/3710) remote: Counting objects: 5% (186/3710) remote: Counting objects: 6% (223/3710) remote: Counting objects: 7% (260/3710) remote: Counting objects: 8% (297/3710) remote: Counting objects: 9% (334/3710) remote: Counting objects: 10% (371/3710) remote: Counting objects: 11% (409/3710) remote: Counting objects: 12% (446/3710) remote: Counting objects: 13% (483/3710) remote: Counting objects: 14% (520/3710) remote: Counting objects: 15% (557/3710) remote: Counting objects: 16% (594/3710) remote: Counting objects: 17% (631/3710) remote: Counting objects: 18% (668/3710) remote: Counting objects: 19% (705/3710) remote: Counting objects: 20% (742/3710) remote: Counting objects: 21% (780/3710) remote: Counting objects: 22% (817/3710) remote: Counting objects: 23% (854/3710) remote: Counting objects: 24% (891/3710) remote: Counting objects: 25% (928/3710) remote: Counting objects: 26% (965/3710) remote: Counting objects: 27% (1002/3710) remote: Counting objects: 28% (1039/3710) remote: Counting objects: 29% (1076/3710) remote: Counting objects: 30% (1113/3710) remote: Counting objects: 31% (1151/3710) remote: Counting objects: 32% (1188/3710) remote: Counting objects: 33% (1225/3710) remote: Counting objects: 34% (1262/3710) remote: Counting objects: 35% (1299/3710) remote: Counting objects: 36% (1336/3710) remote: Counting objects: 37% (1373/3710) remote: Counting objects: 38% (1410/3710) remote: Counting objects: 39% (1447/3710) remote: Counting objects: 40% (1484/3710) remote: Counting objects: 41% (1522/3710) remote: Counting objects: 42% (1559/3710) remote: Counting objects: 43% (1596/3710) remote: Counting objects: 44% (1633/3710) remote: Counting objects: 45% (1670/3710) remote: Counting objects: 46% (1707/3710) remote: Counting objects: 47% (1744/3710) remote: Counting objects: 48% (1781/3710) remote: Counting objects: 49% (1818/3710) remote: Counting objects: 50% (1855/3710) remote: Counting objects: 51% (1893/3710) remote: Counting objects: 52% (1930/3710) remote: Counting objects: 53% (1967/3710) remote: Counting objects: 54% (2004/3710) remote: Counting objects: 55% (2041/3710) remote: Counting objects: 56% (2078/3710) remote: Counting objects: 57% (2115/3710) remote: Counting objects: 58% (2152/3710) remote: Counting objects: 59% (2189/3710) remote: Counting objects: 60% (2226/3710) remote: Counting objects: 61% (2264/3710) remote: Counting objects: 62% (2301/3710) remote: Counting objects: 63% (2338/3710) remote: Counting objects: 64% (2375/3710) remote: Counting objects: 65% (2412/3710) remote: Counting objects: 66% (2449/3710) remote: Counting objects: 67% (2486/3710) remote: Counting objects: 68% (2523/3710) remote: Counting objects: 69% (2560/3710) remote: Counting objects: 70% (2597/3710) remote: Counting objects: 71% (2635/3710) remote: Counting objects: 72% (2672/3710) remote: Counting objects: 73% (2709/3710) remote: Counting objects: 74% (2746/3710) remote: Counting objects: 75% (2783/3710) remote: Counting objects: 76% (2820/3710) remote: Counting objects: 77% (2857/3710) remote: Counting objects: 78% (2894/3710) remote: Counting objects: 79% (2931/3710) remote: Counting objects: 80% (2968/3710) remote: Counting objects: 81% (3006/3710) remote: Counting objects: 82% (3043/3710) remote: Counting objects: 83% (3080/3710) remote: Counting objects: 84% (3117/3710) remote: Counting objects: 85% (3154/3710) remote: Counting objects: 86% (3191/3710) remote: Counting objects: 87% (3228/3710) remote: Counting objects: 88% (3265/3710) remote: Counting objects: 89% (3302/3710) remote: Counting objects: 90% (3339/3710) remote: Counting objects: 91% (3377/3710) remote: Counting objects: 92% (3414/3710) remote: Counting objects: 93% (3451/3710) remote: Counting objects: 94% (3488/3710) remote: Counting objects: 95% (3525/3710) remote: Counting objects: 96% (3562/3710) remote: Counting objects: 97% (3599/3710) remote: Counting objects: 98% (3636/3710) remote: Counting objects: 99% (3673/3710) remote: Counting objects: 100% (3710/3710) remote: Counting objects: 100% (3710/3710), done.
  5. 3.08 s remote: Compressing objects: 0% (1/1481) remote: Compressing objects: 1% (15/1481) remote: Compressing objects: 2% (30/1481) remote: Compressing objects: 3% (45/1481) remote: Compressing objects: 4% (60/1481) remote: Compressing objects: 5% (75/1481) remote: Compressing objects: 6% (89/1481) remote: Compressing objects: 7% (104/1481) remote: Compressing objects: 8% (119/1481) remote: Compressing objects: 9% (134/1481) remote: Compressing objects: 10% (149/1481) remote: Compressing objects: 11% (163/1481) remote: Compressing objects: 12% (178/1481) remote: Compressing objects: 13% (193/1481) remote: Compressing objects: 14% (208/1481) remote: Compressing objects: 15% (223/1481) remote: Compressing objects: 16% (237/1481) remote: Compressing objects: 17% (252/1481) remote: Compressing objects: 18% (267/1481) remote: Compressing objects: 19% (282/1481) remote: Compressing objects: 20% (297/1481) remote: Compressing objects: 21% (312/1481) remote: Compressing objects: 22% (326/1481) remote: Compressing objects: 23% (341/1481) remote: Compressing objects: 24% (356/1481) remote: Compressing objects: 25% (371/1481) remote: Compressing objects: 26% (386/1481) remote: Compressing objects: 27% (400/1481) remote: Compressing objects: 28% (415/1481) remote: Compressing objects: 29% (430/1481) remote: Compressing objects: 30% (445/1481) remote: Compressing objects: 31% (460/1481) remote: Compressing objects: 31% (466/1481) remote: Compressing objects: 32% (474/1481) remote: Compressing objects: 33% (489/1481) remote: Compressing objects: 34% (504/1481) remote: Compressing objects: 35% (519/1481) remote: Compressing objects: 36% (534/1481) remote: Compressing objects: 37% (548/1481) remote: Compressing objects: 38% (563/1481) remote: Compressing objects: 39% (578/1481) remote: Compressing objects: 40% (593/1481) remote: Compressing objects: 40% (601/1481) remote: Compressing objects: 41% (608/1481) remote: Compressing objects: 42% (623/1481) remote: Compressing objects: 43% (637/1481) remote: Compressing objects: 44% (652/1481) remote: Compressing objects: 45% (667/1481) remote: Compressing objects: 46% (682/1481) remote: Compressing objects: 47% (697/1481) remote: Compressing objects: 48% (711/1481) remote: Compressing objects: 49% (726/1481) remote: Compressing objects: 50% (741/1481) remote: Compressing objects: 51% (756/1481) remote: Compressing objects: 52% (771/1481) remote: Compressing objects: 53% (785/1481) remote: Compressing objects: 54% (800/1481) remote: Compressing objects: 55% (815/1481) remote: Compressing objects: 56% (830/1481) remote: Compressing objects: 57% (845/1481) remote: Compressing objects: 58% (859/1481) remote: Compressing objects: 59% (874/1481) remote: Compressing objects: 60% (889/1481) remote: Compressing objects: 61% (904/1481) remote: Compressing objects: 62% (919/1481) remote: Compressing objects: 63% (934/1481) remote: Compressing objects: 64% (948/1481) remote: Compressing objects: 65% (963/1481) remote: Compressing objects: 66% (978/1481) remote: Compressing objects: 67% (993/1481) remote: Compressing objects: 68% (1008/1481) remote: Compressing objects: 69% (1022/1481) remote: Compressing objects: 70% (1037/1481) remote: Compressing objects: 71% (1052/1481) remote: Compressing objects: 72% (1067/1481) remote: Compressing objects: 73% (1082/1481) remote: Compressing objects: 74% (1096/1481) remote: Compressing objects: 75% (1111/1481) remote: Compressing objects: 76% (1126/1481) remote: Compressing objects: 77% (1141/1481) remote: Compressing objects: 78% (1156/1481) remote: Compressing objects: 79% (1170/1481) remote: Compressing objects: 80% (1185/1481) remote: Compressing objects: 81% (1200/1481) remote: Compressing objects: 82% (1215/1481) remote: Compressing objects: 83% (1230/1481) remote: Compressing objects: 84% (1245/1481) remote: Compressing objects: 85% (1259/1481) remote: Compressing objects: 86% (1274/1481) remote: Compressing objects: 87% (1289/1481) remote: Compressing objects: 88% (1304/1481) remote: Compressing objects: 89% (1319/1481) remote: Compressing objects: 90% (1333/1481) remote: Compressing objects: 91% (1348/1481) remote: Compressing objects: 92% (1363/1481) remote: Compressing objects: 93% (1378/1481) remote: Compressing objects: 94% (1393/1481) remote: Compressing objects: 95% (1407/1481) remote: Compressing objects: 96% (1422/1481) remote: Compressing objects: 97% (1437/1481) remote: Compressing objects: 98% (1452/1481) remote: Compressing objects: 99% (1467/1481) remote: Compressing objects: 100% (1481/1481) remote: Compressing objects: 100% (1481/1481), done.
  6. 16.99 s Receiving objects: 0% (1/162134) Receiving objects: 1% (1622/162134) Receiving objects: 2% (3243/162134) Receiving objects: 3% (4865/162134) Receiving objects: 4% (6486/162134) Receiving objects: 5% (8107/162134), 17.34 MiB | 34.67 MiB/s Receiving objects: 6% (9729/162134), 17.34 MiB | 34.67 MiB/s Receiving objects: 6% (10001/162134), 35.61 MiB | 35.64 MiB/s Receiving objects: 7% (11350/162134), 35.61 MiB | 35.64 MiB/s Receiving objects: 8% (12971/162134), 35.61 MiB | 35.64 MiB/s Receiving objects: 9% (14593/162134), 35.61 MiB | 35.64 MiB/s Receiving objects: 10% (16214/162134), 35.61 MiB | 35.64 MiB/s Receiving objects: 11% (17835/162134), 35.61 MiB | 35.64 MiB/s Receiving objects: 12% (19457/162134), 53.30 MiB | 35.09 MiB/s Receiving objects: 13% (21078/162134), 53.30 MiB | 35.09 MiB/s Receiving objects: 14% (22699/162134), 53.30 MiB | 35.09 MiB/s Receiving objects: 14% (22901/162134), 53.30 MiB | 35.09 MiB/s Receiving objects: 15% (24321/162134), 72.87 MiB | 36.09 MiB/s Receiving objects: 16% (25942/162134), 72.87 MiB | 36.09 MiB/s Receiving objects: 17% (27563/162134), 89.58 MiB | 35.57 MiB/s Receiving objects: 18% (29185/162134), 89.58 MiB | 35.57 MiB/s Receiving objects: 19% (30806/162134), 89.58 MiB | 35.57 MiB/s Receiving objects: 19% (32267/162134), 89.58 MiB | 35.57 MiB/s Receiving objects: 20% (32427/162134), 89.58 MiB | 35.57 MiB/s Receiving objects: 21% (34049/162134), 108.57 MiB | 35.62 MiB/s Receiving objects: 22% (35670/162134), 108.57 MiB | 35.62 MiB/s Receiving objects: 23% (37291/162134), 128.26 MiB | 36.15 MiB/s Receiving objects: 24% (38913/162134), 128.26 MiB | 36.15 MiB/s Receiving objects: 24% (39124/162134), 128.26 MiB | 36.15 MiB/s Receiving objects: 25% (40534/162134), 144.74 MiB | 35.75 MiB/s Receiving objects: 26% (42155/162134), 144.74 MiB | 35.75 MiB/s Receiving objects: 27% (43777/162134), 144.74 MiB | 35.75 MiB/s Receiving objects: 28% (45398/162134), 144.74 MiB | 35.75 MiB/s Receiving objects: 29% (47019/162134), 144.74 MiB | 35.75 MiB/s Receiving objects: 30% (48641/162134), 144.74 MiB | 35.75 MiB/s Receiving objects: 31% (50262/162134), 163.29 MiB | 35.90 MiB/s Receiving objects: 32% (51883/162134), 163.29 MiB | 35.90 MiB/s Receiving objects: 33% (53505/162134), 163.29 MiB | 35.90 MiB/s Receiving objects: 34% (55126/162134), 163.29 MiB | 35.90 MiB/s Receiving objects: 35% (56747/162134), 163.29 MiB | 35.90 MiB/s Receiving objects: 36% (58369/162134), 163.29 MiB | 35.90 MiB/s Receiving objects: 37% (59990/162134), 163.29 MiB | 35.90 MiB/s Receiving objects: 38% (61611/162134), 163.29 MiB | 35.90 MiB/s Receiving objects: 38% (62791/162134), 163.29 MiB | 35.90 MiB/s Receiving objects: 39% (63233/162134), 163.29 MiB | 35.90 MiB/s Receiving objects: 40% (64854/162134), 181.02 MiB | 35.99 MiB/s Receiving objects: 41% (66475/162134), 181.02 MiB | 35.99 MiB/s Receiving objects: 42% (68097/162134), 181.02 MiB | 35.99 MiB/s Receiving objects: 43% (69718/162134), 181.02 MiB | 35.99 MiB/s Receiving objects: 44% (71339/162134), 181.02 MiB | 35.99 MiB/s Receiving objects: 45% (72961/162134), 199.33 MiB | 35.90 MiB/s Receiving objects: 46% (74582/162134), 199.33 MiB | 35.90 MiB/s Receiving objects: 47% (76203/162134), 199.33 MiB | 35.90 MiB/s Receiving objects: 48% (77825/162134), 199.33 MiB | 35.90 MiB/s Receiving objects: 48% (77857/162134), 199.33 MiB | 35.90 MiB/s Receiving objects: 48% (78211/162134), 238.50 MiB | 36.11 MiB/s Receiving objects: 49% (79446/162134), 274.04 MiB | 36.07 MiB/s Receiving objects: 50% (81067/162134), 274.04 MiB | 36.07 MiB/s Receiving objects: 50% (81968/162134), 274.04 MiB | 36.07 MiB/s Receiving objects: 51% (82689/162134), 293.67 MiB | 35.70 MiB/s Receiving objects: 52% (84310/162134), 313.36 MiB | 36.03 MiB/s Receiving objects: 53% (85932/162134), 313.36 MiB | 36.03 MiB/s Receiving objects: 54% (87553/162134), 313.36 MiB | 36.03 MiB/s Receiving objects: 54% (88283/162134), 313.36 MiB | 36.03 MiB/s Receiving objects: 55% (89174/162134), 313.36 MiB | 36.03 MiB/s Receiving objects: 56% (90796/162134), 329.27 MiB | 35.47 MiB/s Receiving objects: 57% (92417/162134), 329.27 MiB | 35.47 MiB/s Receiving objects: 58% (94038/162134), 329.27 MiB | 35.47 MiB/s Receiving objects: 59% (95660/162134), 329.27 MiB | 35.47 MiB/s Receiving objects: 60% (97281/162134), 329.27 MiB | 35.47 MiB/s Receiving objects: 61% (98902/162134), 329.27 MiB | 35.47 MiB/s Receiving objects: 62% (100524/162134), 329.27 MiB | 35.47 MiB/s Receiving objects: 63% (102145/162134), 329.27 MiB | 35.47 MiB/s Receiving objects: 64% (103766/162134), 329.27 MiB | 35.47 MiB/s Receiving objects: 65% (105388/162134), 329.27 MiB | 35.47 MiB/s Receiving objects: 66% (107009/162134), 329.27 MiB | 35.47 MiB/s Receiving objects: 67% (108630/162134), 329.27 MiB | 35.47 MiB/s Receiving objects: 68% (110252/162134), 329.27 MiB | 35.47 MiB/s Receiving objects: 69% (111873/162134), 329.27 MiB | 35.47 MiB/s Receiving objects: 70% (113494/162134), 329.27 MiB | 35.47 MiB/s Receiving objects: 71% (115116/162134), 329.27 MiB | 35.47 MiB/s Receiving objects: 72% (116737/162134), 329.27 MiB | 35.47 MiB/s Receiving objects: 73% (118358/162134), 329.27 MiB | 35.47 MiB/s Receiving objects: 74% (119980/162134), 329.27 MiB | 35.47 MiB/s Receiving objects: 75% (121601/162134), 329.27 MiB | 35.47 MiB/s Receiving objects: 76% (123222/162134), 349.50 MiB | 36.00 MiB/s Receiving objects: 76% (123579/162134), 349.50 MiB | 36.00 MiB/s Receiving objects: 77% (124844/162134), 349.50 MiB | 36.00 MiB/s Receiving objects: 78% (126465/162134), 368.39 MiB | 36.00 MiB/s Receiving objects: 79% (128086/162134), 368.39 MiB | 36.00 MiB/s Receiving objects: 80% (129708/162134), 368.39 MiB | 36.00 MiB/s Receiving objects: 81% (131329/162134), 368.39 MiB | 36.00 MiB/s Receiving objects: 82% (132950/162134), 368.39 MiB | 36.00 MiB/s Receiving objects: 82% (133437/162134), 388.20 MiB | 35.98 MiB/s Receiving objects: 83% (134572/162134), 388.20 MiB | 35.98 MiB/s Receiving objects: 84% (136193/162134), 388.20 MiB | 35.98 MiB/s Receiving objects: 85% (137814/162134), 388.20 MiB | 35.98 MiB/s Receiving objects: 86% (139436/162134), 408.00 MiB | 35.74 MiB/s Receiving objects: 87% (141057/162134), 408.00 MiB | 35.74 MiB/s Receiving objects: 88% (142678/162134), 408.00 MiB | 35.74 MiB/s Receiving objects: 89% (144300/162134), 427.86 MiB | 36.00 MiB/s Receiving objects: 89% (144532/162134), 427.86 MiB | 36.00 MiB/s Receiving objects: 90% (145921/162134), 427.86 MiB | 36.00 MiB/s Receiving objects: 91% (147542/162134), 447.55 MiB | 36.47 MiB/s Receiving objects: 92% (149164/162134), 447.55 MiB | 36.47 MiB/s Receiving objects: 93% (150785/162134), 447.55 MiB | 36.47 MiB/s Receiving objects: 94% (152406/162134), 464.04 MiB | 36.16 MiB/s Receiving objects: 94% (152754/162134), 464.04 MiB | 36.16 MiB/s Receiving objects: 95% (154028/162134), 464.04 MiB | 36.16 MiB/s Receiving objects: 96% (155649/162134), 483.15 MiB | 36.16 MiB/s Receiving objects: 97% (157270/162134), 483.15 MiB | 36.16 MiB/s Receiving objects: 98% (158892/162134), 483.15 MiB | 36.16 MiB/s Receiving objects: 99% (160513/162134), 483.15 MiB | 36.16 MiB/s remote: Total 162134 (delta 2584), reused 2717 (delta 2211), pack-reused 158424 (from 3)
  7. 16.99 s Receiving objects: 100% (162134/162134), 483.15 MiB | 36.16 MiB/s Receiving objects: 100% (162134/162134), 500.56 MiB | 35.99 MiB/s, done.
  8. 19.14 s Resolving deltas: 0% (0/105592) Resolving deltas: 1% (1056/105592) Resolving deltas: 2% (2112/105592) Resolving deltas: 3% (3168/105592) Resolving deltas: 4% (4224/105592) Resolving deltas: 5% (5280/105592) Resolving deltas: 6% (6336/105592) Resolving deltas: 7% (7397/105592) Resolving deltas: 8% (8448/105592) Resolving deltas: 9% (9506/105592) Resolving deltas: 10% (10560/105592) Resolving deltas: 11% (11617/105592) Resolving deltas: 12% (12673/105592) Resolving deltas: 13% (13729/105592) Resolving deltas: 14% (14783/105592) Resolving deltas: 15% (15841/105592) Resolving deltas: 16% (16895/105592) Resolving deltas: 17% (17951/105592) Resolving deltas: 18% (19008/105592) Resolving deltas: 19% (20065/105592) Resolving deltas: 20% (21119/105592) Resolving deltas: 21% (22175/105592) Resolving deltas: 22% (23231/105592) Resolving deltas: 23% (24287/105592) Resolving deltas: 24% (25343/105592) Resolving deltas: 25% (26401/105592) Resolving deltas: 26% (27454/105592) Resolving deltas: 27% (28511/105592) Resolving deltas: 28% (29566/105592) Resolving deltas: 29% (30622/105592) Resolving deltas: 30% (31678/105592) Resolving deltas: 31% (32737/105592) Resolving deltas: 32% (33790/105592) Resolving deltas: 33% (34847/105592) Resolving deltas: 34% (35902/105592) Resolving deltas: 35% (36958/105592) Resolving deltas: 36% (38014/105592) Resolving deltas: 37% (39070/105592) Resolving deltas: 38% (40126/105592) Resolving deltas: 39% (41181/105592) Resolving deltas: 40% (42237/105592) Resolving deltas: 41% (43293/105592) Resolving deltas: 42% (44349/105592) Resolving deltas: 43% (45405/105592) Resolving deltas: 44% (46461/105592) Resolving deltas: 44% (46831/105592) Resolving deltas: 45% (47517/105592) Resolving deltas: 46% (48575/105592) Resolving deltas: 47% (49629/105592) Resolving deltas: 48% (50685/105592) Resolving deltas: 49% (51741/105592) Resolving deltas: 50% (52796/105592) Resolving deltas: 51% (53852/105592) Resolving deltas: 52% (54908/105592) Resolving deltas: 53% (55964/105592) Resolving deltas: 54% (57020/105592) Resolving deltas: 55% (58076/105592) Resolving deltas: 56% (59132/105592) Resolving deltas: 57% (60188/105592) Resolving deltas: 58% (61244/105592) Resolving deltas: 59% (62300/105592) Resolving deltas: 60% (63356/105592) Resolving deltas: 61% (64413/105592) Resolving deltas: 62% (65468/105592) Resolving deltas: 63% (66523/105592) Resolving deltas: 64% (67579/105592) Resolving deltas: 65% (68635/105592) Resolving deltas: 66% (69692/105592) Resolving deltas: 67% (70749/105592) Resolving deltas: 68% (71803/105592) Resolving deltas: 69% (72859/105592) Resolving deltas: 70% (73916/105592) Resolving deltas: 71% (74971/105592) Resolving deltas: 72% (76027/105592) Resolving deltas: 73% (77085/105592) Resolving deltas: 74% (78139/105592) Resolving deltas: 75% (79194/105592) Resolving deltas: 76% (80250/105592) Resolving deltas: 77% (81306/105592) Resolving deltas: 78% (82363/105592) Resolving deltas: 79% (83418/105592) Resolving deltas: 80% (84474/105592) Resolving deltas: 81% (85530/105592) Resolving deltas: 82% (86586/105592) Resolving deltas: 83% (87642/105592) Resolving deltas: 84% (88698/105592) Resolving deltas: 85% (89754/105592) Resolving deltas: 86% (90812/105592) Resolving deltas: 87% (91866/105592) Resolving deltas: 88% (92921/105592) Resolving deltas: 89% (93977/105592) Resolving deltas: 90% (95036/105592) Resolving deltas: 91% (96089/105592) Resolving deltas: 92% (97145/105592) Resolving deltas: 93% (98201/105592) Resolving deltas: 94% (99257/105592) Resolving deltas: 95% (100313/105592) Resolving deltas: 95% (100728/105592) Resolving deltas: 96% (101369/105592) Resolving deltas: 97% (102425/105592) Resolving deltas: 98% (103481/105592) Resolving deltas: 99% (104537/105592) Resolving deltas: 100% (105592/105592) Resolving deltas: 100% (105592/105592), done.
  9. 19.84 s Fetching commit 5927040624680bb00873a7e3587358a185c92900 for complex-null-spinors ...
  10. 19.84 s $ /nix/store/b1wn5clix1mz4vpfih7x9cnj9qfh7c6h-git-2.54.0/bin/git fetch origin 5927040624680bb00873a7e3587358a185c92900
  11. 20.23 s From https://github.com/alphal00p/gammaloop
  12. 20.23 s * branch 5927040624680bb00873a7e3587358a185c92900 -> FETCH_HEAD
  13. 20.25 s $ /nix/store/bhv6xyvqw6gjs3j488gi1z6wdv18bdpa-coreutils-9.11/bin/timeout --kill-after=15s 7200s /nix/store/b1wn5clix1mz4vpfih7x9cnj9qfh7c6h-git-2.54.0/bin/git -c advice.detachedHead=false checkout 5927040624680bb00873a7e3587358a185c92900
  14. 20.70 s HEAD is now at 592704062 Merge branch 'codex/ninja-shared-types' into complex-null-spinors
  15. 20.71 s $ /nix/store/bhv6xyvqw6gjs3j488gi1z6wdv18bdpa-coreutils-9.11/bin/timeout --kill-after=15s 7200s /nix/store/bxgja2ppiqi6w2bgn0r07d7mgnl1k6k2-nix-2.34.8/bin/nix --extra-experimental-features nix-command --extra-experimental-features flakes --log-format internal-json run .#packages.x86_64-linux.nix-ci-check-gammaloop-nextest-clinnet --print-build-logs
  16. 20.85 s warning: ignoring untrusted flake configuration setting 'extra-substituters'.
  17. 20.85 s Pass '--accept-flake-config' to trust it
  18. 20.85 s warning: ignoring untrusted flake configuration setting 'extra-trusted-public-keys'.
  19. 20.85 s Pass '--accept-flake-config' to trust it
  20. 25.62 s
  21. 25.88 s evaluating derivation 'gdo you want to allow configuration setting 'extra-substituters' to be set to 'https://cache.nix-ci.com' (y/N)? do you want to permanently mark this value as untrusted (y/N)? warning: ignoring untrusted flake configuration setting 'extra-substituters'.
  22. 25.88 s Pass '--accept-flake-config' to trust it
  23. 25.88 s do you want to allow configuration setting 'extra-trusted-public-keys' to be set to 'nix-ci:g3xV5BDTLtIBZr/A00IU1x0EtKKlb7YLgBN2SgYgM6A=' (y/N)? do you want to permanently mark this value as untrusted (y/N)? warning: ignoring untrusted flake configuration setting 'extra-trusted-public-keys'.
  24. 25.88 s Pass '--accept-flake-config' to trust it
  25. 37.32 s copying '/nix/store/jhld evaluating derivation 'g copying '/nix/store/jhld evaluating derivation 'g copying '/nix/store/jhld evaluating derivation 'g copying '/nix/store/jhld evaluating derivation 'g copying '/nix/store/jhld evaluating derivation 'g [0/1 built] [1/0/1 built] [1/0/1 built] building ggammaloop-nextest-clinnet> Nextest worker budget: 16
  26. 37.37 s gammaloop-nextest-clinnet> Extracting 4 binaries (including 1 non-test binary), 1 build script output directory, and 1 linked path to /build/source
  27. 37.46 s gammaloop-nextest-clinnet> Extracted 16 files to /build/source in 0.09s
  28. 37.50 s gammaloop-nextest-clinnet> ------------
  29. 37.50 s gammaloop-nextest-clinnet> Nextest run ID 21864be8-93df-4624-808d-e8e8264d1c74 with nextest profile: ci_gammaloop
  30. 37.50 s gammaloop-nextest-clinnet> Starting 38 tests across 3 binaries
  31. 107.55 s gammaloop-nextest-clinnet> FAIL [ 69.935s] (32/38) clinnet::public_typst_behavior public_linnest_momentum_layers_place_shafts_and_labels
  32. 107.55 s gammaloop-nextest-clinnet> stdout ---
  33. 107.55 s gammaloop-nextest-clinnet>
  34. 107.55 s gammaloop-nextest-clinnet> running 1 test
  35. 107.55 s gammaloop-nextest-clinnet> test public_linnest_momentum_layers_place_shafts_and_labels has been running for over 60 seconds
  36. 107.55 s gammaloop-nextest-clinnet> test public_linnest_momentum_layers_place_shafts_and_labels ... FAILED
  37. 107.55 s gammaloop-nextest-clinnet>
  38. 107.55 s gammaloop-nextest-clinnet> failures:
  39. 107.55 s gammaloop-nextest-clinnet>
  40. 107.55 s gammaloop-nextest-clinnet> failures:
  41. 107.55 s gammaloop-nextest-clinnet> public_linnest_momentum_layers_place_shafts_and_labels
  42. 107.55 s gammaloop-nextest-clinnet>
  43. 107.55 s gammaloop-nextest-clinnet> test result: FAILED. 0 passed; 1 failed; 0 ignored; 0 measured; 17 filtered out; finished in 69.92s
  44. 107.55 s gammaloop-nextest-clinnet>
  45. 107.55 s gammaloop-nextest-clinnet> stderr ---
  46. 107.55 s gammaloop-nextest-clinnet>
  47. 107.55 s gammaloop-nextest-clinnet> thread 'public_linnest_momentum_layers_place_shafts_and_labels' (287) panicked at crates/clinnet/tests/public_typst_behavior.rs:81:55:
  48. 107.55 s gammaloop-nextest-clinnet> called `Result::unwrap()` on an `Err` value: typst failed while compiling template /build/.tmp1GG1hA/.clinnet/templates/linnest-public-behavior.svg
  49. 107.55 s gammaloop-nextest-clinnet>
  50. 107.55 s gammaloop-nextest-clinnet> Command executed:
  51. 107.55 s gammaloop-nextest-clinnet> "typst" "c" "/build/.tmp1GG1hA/.clinnet/templates/linnest-public-behavior.typ" "/build/.tmp1GG1hA/.clinnet/templates/linnest-public-behavior.svg" "--root" "/build/.tmp1GG1hA/.clinnet/templates"
  52. 107.55 s gammaloop-nextest-clinnet>
  53. 107.55 s gammaloop-nextest-clinnet> Typst stdout:
  54. 107.55 s gammaloop-nextest-clinnet>
  55. 107.55 s gammaloop-nextest-clinnet>
  56. 107.55 s gammaloop-nextest-clinnet> Typst stderr:
  57. 107.55 s gammaloop-nextest-clinnet>
  58. 107.55 s gammaloop-nextest-clinnet>
  59. 107.55 s gammaloop-nextest-clinnet> Location:
  60. 107.55 s gammaloop-nextest-clinnet> crates/clinnet/src/lib.rs:741:13
  61. 107.55 s gammaloop-nextest-clinnet> stack backtrace:
  62. 107.55 s gammaloop-nextest-clinnet> 0: __rustc::rust_begin_unwind
  63. 107.55 s gammaloop-nextest-clinnet> 1: core::panicking::panic_fmt
  64. 107.55 s gammaloop-nextest-clinnet> 2: core::result::unwrap_failed
  65. 107.55 s gammaloop-nextest-clinnet> 3: public_typst_behavior::render
  66. 107.55 s gammaloop-nextest-clinnet> 4: <std::sync::once::Once>::call_once_force::<<std::sync::once_lock::OnceLock<alloc::string::String>>::initialize<<std::sync::once_lock::OnceLock<alloc::string::String>>::get_or_init<public_typst_behavior::linnest_public_svg::{closure#0}>::{closure#0}, !>::{closure#0}>::{closure#0}
  67. 107.55 s gammaloop-nextest-clinnet> 5: <std::sys::sync::once::futex::Once>::call
  68. 107.55 s gammaloop-nextest-clinnet> 6: <std::sync::once_lock::OnceLock<alloc::string::String>>::initialize::<<std::sync::once_lock::OnceLock<alloc::string::String>>::get_or_init<public_typst_behavior::linnest_public_svg::{closure#0}>::{closure#0}, !>
  69. 107.55 s gammaloop-nextest-clinnet> 7: <public_typst_behavior::public_linnest_momentum_layers_place_shafts_and_labels::{closure#0} as core::ops::function::FnOnce<()>>::call_once
  70. 107.55 s gammaloop-nextest-clinnet> note: Some details are omitted, run with `RUST_BACKTRACE=full` for a verbose backtrace.
  71. 107.55 s gammaloop-nextest-clinnet>
  72. 112.87 s gammaloop-nextest-clinnet> FAIL [ 75.232s] (33/38) clinnet::public_typst_behavior public_linnest_edge_styles_skip_fallbacks
  73. 112.87 s gammaloop-nextest-clinnet> stdout ---
  74. 112.87 s gammaloop-nextest-clinnet>
  75. 112.87 s gammaloop-nextest-clinnet> running 1 test
  76. 112.87 s gammaloop-nextest-clinnet> test public_linnest_edge_styles_skip_fallbacks has been running for over 60 seconds
  77. 112.87 s gammaloop-nextest-clinnet> test public_linnest_edge_styles_skip_fallbacks ... FAILED
  78. 112.87 s gammaloop-nextest-clinnet>
  79. 112.87 s gammaloop-nextest-clinnet> failures:
  80. 112.87 s gammaloop-nextest-clinnet>
  81. 112.87 s gammaloop-nextest-clinnet> failures:
  82. 112.87 s gammaloop-nextest-clinnet> public_linnest_edge_styles_skip_fallbacks
  83. 112.87 s gammaloop-nextest-clinnet>
  84. 112.87 s gammaloop-nextest-clinnet> test result: FAILED. 0 passed; 1 failed; 0 ignored; 0 measured; 17 filtered out; finished in 75.20s
  85. 112.87 s gammaloop-nextest-clinnet>
  86. 112.87 s gammaloop-nextest-clinnet> stderr ---
  87. 112.87 s gammaloop-nextest-clinnet>
  88. 112.87 s gammaloop-nextest-clinnet> thread 'public_linnest_edge_styles_skip_fallbacks' (272) panicked at crates/clinnet/tests/public_typst_behavior.rs:81:55:
  89. 112.87 s gammaloop-nextest-clinnet> called `Result::unwrap()` on an `Err` value: typst failed while compiling template /build/.tmpjzrRit/.clinnet/templates/linnest-public-behavior.svg
  90. 112.87 s gammaloop-nextest-clinnet>
  91. 112.87 s gammaloop-nextest-clinnet> Command executed:
  92. 112.87 s gammaloop-nextest-clinnet> "typst" "c" "/build/.tmpjzrRit/.clinnet/templates/linnest-public-behavior.typ" "/build/.tmpjzrRit/.clinnet/templates/linnest-public-behavior.svg" "--root" "/build/.tmpjzrRit/.clinnet/templates"
  93. 112.87 s gammaloop-nextest-clinnet>
  94. 112.87 s gammaloop-nextest-clinnet> Typst stdout:
  95. 112.87 s gammaloop-nextest-clinnet>
  96. 112.87 s gammaloop-nextest-clinnet>
  97. 112.87 s gammaloop-nextest-clinnet> Typst stderr:
  98. 112.87 s gammaloop-nextest-clinnet>
  99. 112.87 s gammaloop-nextest-clinnet>
  100. 112.87 s gammaloop-nextest-clinnet> Location:
  101. 112.87 s gammaloop-nextest-clinnet> crates/clinnet/src/lib.rs:741:13
  102. 112.87 s gammaloop-nextest-clinnet> stack backtrace:
  103. 112.87 s gammaloop-nextest-clinnet> 0: __rustc::rust_begin_unwind
  104. 112.87 s gammaloop-nextest-clinnet> 1: core::panicking::panic_fmt
  105. 112.87 s gammaloop-nextest-clinnet> 2: core::result::unwrap_failed
  106. 112.87 s gammaloop-nextest-clinnet> 3: public_typst_behavior::render
  107. 112.87 s gammaloop-nextest-clinnet> 4: <std::sync::once::Once>::call_once_force::<<std::sync::once_lock::OnceLock<alloc::string::String>>::initialize<<std::sync::once_lock::OnceLock<alloc::string::String>>::get_or_init<public_typst_behavior::linnest_public_svg::{closure#0}>::{closure#0}, !>::{closure#0}>::{closure#0}
  108. 112.87 s gammaloop-nextest-clinnet> 5: <std::sys::sync::once::futex::Once>::call
  109. 112.87 s gammaloop-nextest-clinnet> 6: <std::sync::once_lock::OnceLock<alloc::string::String>>::initialize::<<std::sync::once_lock::OnceLock<alloc::string::String>>::get_or_init<public_typst_behavior::linnest_public_svg::{closure#0}>::{closure#0}, !>
  110. 112.87 s gammaloop-nextest-clinnet> 7: <public_typst_behavior::public_linnest_edge_styles_skip_fallbacks::{closure#0} as core::ops::function::FnOnce<()>>::call_once
  111. 112.87 s gammaloop-nextest-clinnet> note: Some details are omitted, run with `RUST_BACKTRACE=full` for a verbose backtrace.
  112. 112.87 s gammaloop-nextest-clinnet>
  113. 123.38 s gammaloop-nextest-clinnet> FAIL [ 85.826s] (34/38) clinnet::public_typst_behavior public_linnest_fixture_assertions_hold
  114. 123.38 s gammaloop-nextest-clinnet> stdout ---
  115. 123.38 s gammaloop-nextest-clinnet>
  116. 123.38 s gammaloop-nextest-clinnet> running 1 test
  117. 123.38 s gammaloop-nextest-clinnet> test public_linnest_fixture_assertions_hold has been running for over 60 seconds
  118. 123.38 s gammaloop-nextest-clinnet> test public_linnest_fixture_assertions_hold ... FAILED
  119. 123.38 s gammaloop-nextest-clinnet>
  120. 123.38 s gammaloop-nextest-clinnet> failures:
  121. 123.38 s gammaloop-nextest-clinnet>
  122. 123.38 s gammaloop-nextest-clinnet> failures:
  123. 123.38 s gammaloop-nextest-clinnet> public_linnest_fixture_assertions_hold
  124. 123.38 s gammaloop-nextest-clinnet>
  125. 123.38 s gammaloop-nextest-clinnet> test result: FAILED. 0 passed; 1 failed; 0 ignored; 0 measured; 17 filtered out; finished in 85.81s
  126. 123.38 s gammaloop-nextest-clinnet>
  127. 123.38 s gammaloop-nextest-clinnet> stderr ---
  128. 123.38 s gammaloop-nextest-clinnet>
  129. 123.38 s gammaloop-nextest-clinnet> thread 'public_linnest_fixture_assertions_hold' (274) panicked at crates/clinnet/tests/public_typst_behavior.rs:81:55:
  130. 123.38 s gammaloop-nextest-clinnet> called `Result::unwrap()` on an `Err` value: typst failed while compiling template /build/.tmp1F6fxQ/.clinnet/templates/linnest-public-behavior.svg
  131. 123.38 s gammaloop-nextest-clinnet>
  132. 123.38 s gammaloop-nextest-clinnet> Command executed:
  133. 123.38 s gammaloop-nextest-clinnet> "typst" "c" "/build/.tmp1F6fxQ/.clinnet/templates/linnest-public-behavior.typ" "/build/.tmp1F6fxQ/.clinnet/templates/linnest-public-behavior.svg" "--root" "/build/.tmp1F6fxQ/.clinnet/templates"
  134. 123.38 s gammaloop-nextest-clinnet>
  135. 123.38 s gammaloop-nextest-clinnet> Typst stdout:
  136. 123.38 s gammaloop-nextest-clinnet>
  137. 123.38 s gammaloop-nextest-clinnet>
  138. 123.38 s gammaloop-nextest-clinnet> Typst stderr:
  139. 123.38 s gammaloop-nextest-clinnet>
  140. 123.38 s gammaloop-nextest-clinnet>
  141. 123.38 s gammaloop-nextest-clinnet> Location:
  142. 123.38 s gammaloop-nextest-clinnet> crates/clinnet/src/lib.rs:741:13
  143. 123.38 s gammaloop-nextest-clinnet> stack backtrace:
  144. 123.38 s gammaloop-nextest-clinnet> 0: __rustc::rust_begin_unwind
  145. 123.38 s gammaloop-nextest-clinnet> 1: core::panicking::panic_fmt
  146. 123.38 s gammaloop-nextest-clinnet> 2: core::result::unwrap_failed
  147. 123.38 s gammaloop-nextest-clinnet> 3: public_typst_behavior::render
  148. 123.38 s gammaloop-nextest-clinnet> 4: <std::sync::once::Once>::call_once_force::<<std::sync::once_lock::OnceLock<alloc::string::String>>::initialize<<std::sync::once_lock::OnceLock<alloc::string::String>>::get_or_init<public_typst_behavior::linnest_public_svg::{closure#0}>::{closure#0}, !>::{closure#0}>::{closure#0}
  149. 123.38 s gammaloop-nextest-clinnet> 5: <std::sys::sync::once::futex::Once>::call
  150. 123.38 s gammaloop-nextest-clinnet> 6: <std::sync::once_lock::OnceLock<alloc::string::String>>::initialize::<<std::sync::once_lock::OnceLock<alloc::string::String>>::get_or_init<public_typst_behavior::linnest_public_svg::{closure#0}>::{closure#0}, !>
  151. 123.38 s gammaloop-nextest-clinnet> 7: <public_typst_behavior::public_linnest_fixture_assertions_hold::{closure#0} as core::ops::function::FnOnce<()>>::call_once
  152. 123.38 s gammaloop-nextest-clinnet> note: Some details are omitted, run with `RUST_BACKTRACE=full` for a verbose backtrace.
  153. 123.38 s gammaloop-nextest-clinnet>
  154. 133.02 s gammaloop-nextest-clinnet> ------------
  155. 133.02 s gammaloop-nextest-clinnet> Summary [ 95.523s] 38 tests run: 35 passed, 3 failed, 0 skipped
  156. 133.02 s gammaloop-nextest-clinnet> FAIL [ 69.935s] (32/38) clinnet::public_typst_behavior public_linnest_momentum_layers_place_shafts_and_labels
  157. 133.02 s gammaloop-nextest-clinnet> stdout ---
  158. 133.02 s gammaloop-nextest-clinnet>
  159. 133.02 s gammaloop-nextest-clinnet> running 1 test
  160. 133.02 s gammaloop-nextest-clinnet> test public_linnest_momentum_layers_place_shafts_and_labels has been running for over 60 seconds
  161. 133.02 s gammaloop-nextest-clinnet> test public_linnest_momentum_layers_place_shafts_and_labels ... FAILED
  162. 133.02 s gammaloop-nextest-clinnet>
  163. 133.02 s gammaloop-nextest-clinnet> failures:
  164. 133.02 s gammaloop-nextest-clinnet>
  165. 133.02 s gammaloop-nextest-clinnet> failures:
  166. 133.02 s gammaloop-nextest-clinnet> public_linnest_momentum_layers_place_shafts_and_labels
  167. 133.02 s gammaloop-nextest-clinnet>
  168. 133.02 s gammaloop-nextest-clinnet> test result: FAILED. 0 passed; 1 failed; 0 ignored; 0 measured; 17 filtered out; finished in 69.92s
  169. 133.02 s gammaloop-nextest-clinnet>
  170. 133.02 s gammaloop-nextest-clinnet> stderr ---
  171. 133.02 s gammaloop-nextest-clinnet>
  172. 133.02 s gammaloop-nextest-clinnet> thread 'public_linnest_momentum_layers_place_shafts_and_labels' (287) panicked at crates/clinnet/tests/public_typst_behavior.rs:81:55:
  173. 133.02 s gammaloop-nextest-clinnet> called `Result::unwrap()` on an `Err` value: typst failed while compiling template /build/.tmp1GG1hA/.clinnet/templates/linnest-public-behavior.svg
  174. 133.02 s gammaloop-nextest-clinnet>
  175. 133.02 s gammaloop-nextest-clinnet> Command executed:
  176. 133.02 s gammaloop-nextest-clinnet> "typst" "c" "/build/.tmp1GG1hA/.clinnet/templates/linnest-public-behavior.typ" "/build/.tmp1GG1hA/.clinnet/templates/linnest-public-behavior.svg" "--root" "/build/.tmp1GG1hA/.clinnet/templates"
  177. 133.02 s gammaloop-nextest-clinnet>
  178. 133.02 s gammaloop-nextest-clinnet> Typst stdout:
  179. 133.02 s gammaloop-nextest-clinnet>
  180. 133.02 s gammaloop-nextest-clinnet>
  181. 133.02 s gammaloop-nextest-clinnet> Typst stderr:
  182. 133.02 s gammaloop-nextest-clinnet>
  183. 133.02 s gammaloop-nextest-clinnet>
  184. 133.02 s gammaloop-nextest-clinnet> Location:
  185. 133.02 s gammaloop-nextest-clinnet> crates/clinnet/src/lib.rs:741:13
  186. 133.02 s gammaloop-nextest-clinnet> stack backtrace:
  187. 133.02 s gammaloop-nextest-clinnet> 0: __rustc::rust_begin_unwind
  188. 133.02 s gammaloop-nextest-clinnet> 1: core::panicking::panic_fmt
  189. 133.02 s gammaloop-nextest-clinnet> 2: core::result::unwrap_failed
  190. 133.02 s gammaloop-nextest-clinnet> 3: public_typst_behavior::render
  191. 133.02 s gammaloop-nextest-clinnet> 4: <std::sync::once::Once>::call_once_force::<<std::sync::once_lock::OnceLock<alloc::string::String>>::initialize<<std::sync::once_lock::OnceLock<alloc::string::String>>::get_or_init<public_typst_behavior::linnest_public_svg::{closure#0}>::{closure#0}, !>::{closure#0}>::{closure#0}
  192. 133.02 s gammaloop-nextest-clinnet> 5: <std::sys::sync::once::futex::Once>::call
  193. 133.02 s gammaloop-nextest-clinnet> 6: <std::sync::once_lock::OnceLock<alloc::string::String>>::initialize::<<std::sync::once_lock::OnceLock<alloc::string::String>>::get_or_init<public_typst_behavior::linnest_public_svg::{closure#0}>::{closure#0}, !>
  194. 133.02 s gammaloop-nextest-clinnet> 7: <public_typst_behavior::public_linnest_momentum_layers_place_shafts_and_labels::{closure#0} as core::ops::function::FnOnce<()>>::call_once
  195. 133.02 s gammaloop-nextest-clinnet> note: Some details are omitted, run with `RUST_BACKTRACE=full` for a verbose backtrace.
  196. 133.02 s gammaloop-nextest-clinnet>
  197. 133.02 s gammaloop-nextest-clinnet> FAIL [ 75.232s] (33/38) clinnet::public_typst_behavior public_linnest_edge_styles_skip_fallbacks
  198. 133.02 s gammaloop-nextest-clinnet> stdout ---
  199. 133.02 s gammaloop-nextest-clinnet>
  200. 133.02 s gammaloop-nextest-clinnet> running 1 test
  201. 133.02 s gammaloop-nextest-clinnet> test public_linnest_edge_styles_skip_fallbacks has been running for over 60 seconds
  202. 133.02 s gammaloop-nextest-clinnet> test public_linnest_edge_styles_skip_fallbacks ... FAILED
  203. 133.02 s gammaloop-nextest-clinnet>
  204. 133.02 s gammaloop-nextest-clinnet> failures:
  205. 133.02 s gammaloop-nextest-clinnet>
  206. 133.02 s gammaloop-nextest-clinnet> failures:
  207. 133.02 s gammaloop-nextest-clinnet> public_linnest_edge_styles_skip_fallbacks
  208. 133.02 s gammaloop-nextest-clinnet>
  209. 133.02 s gammaloop-nextest-clinnet> test result: FAILED. 0 passed; 1 failed; 0 ignored; 0 measured; 17 filtered out; finished in 75.20s
  210. 133.02 s gammaloop-nextest-clinnet>
  211. 133.02 s gammaloop-nextest-clinnet> stderr ---
  212. 133.02 s gammaloop-nextest-clinnet>
  213. 133.02 s gammaloop-nextest-clinnet> thread 'public_linnest_edge_styles_skip_fallbacks' (272) panicked at crates/clinnet/tests/public_typst_behavior.rs:81:55:
  214. 133.02 s gammaloop-nextest-clinnet> called `Result::unwrap()` on an `Err` value: typst failed while compiling template /build/.tmpjzrRit/.clinnet/templates/linnest-public-behavior.svg
  215. 133.02 s gammaloop-nextest-clinnet>
  216. 133.02 s gammaloop-nextest-clinnet> Command executed:
  217. 133.02 s gammaloop-nextest-clinnet> "typst" "c" "/build/.tmpjzrRit/.clinnet/templates/linnest-public-behavior.typ" "/build/.tmpjzrRit/.clinnet/templates/linnest-public-behavior.svg" "--root" "/build/.tmpjzrRit/.clinnet/templates"
  218. 133.02 s gammaloop-nextest-clinnet>
  219. 133.02 s gammaloop-nextest-clinnet> Typst stdout:
  220. 133.02 s gammaloop-nextest-clinnet>
  221. 133.02 s gammaloop-nextest-clinnet>
  222. 133.02 s gammaloop-nextest-clinnet> Typst stderr:
  223. 133.02 s gammaloop-nextest-clinnet>
  224. 133.02 s gammaloop-nextest-clinnet>
  225. 133.02 s gammaloop-nextest-clinnet> Location:
  226. 133.02 s gammaloop-nextest-clinnet> crates/clinnet/src/lib.rs:741:13
  227. 133.02 s gammaloop-nextest-clinnet> stack backtrace:
  228. 133.02 s gammaloop-nextest-clinnet> 0: __rustc::rust_begin_unwind
  229. 133.02 s gammaloop-nextest-clinnet> 1: core::panicking::panic_fmt
  230. 133.02 s gammaloop-nextest-clinnet> 2: core::result::unwrap_failed
  231. 133.02 s gammaloop-nextest-clinnet> 3: public_typst_behavior::render
  232. 133.02 s gammaloop-nextest-clinnet> 4: <std::sync::once::Once>::call_once_force::<<std::sync::once_lock::OnceLock<alloc::string::String>>::initialize<<std::sync::once_lock::OnceLock<alloc::string::String>>::get_or_init<public_typst_behavior::linnest_public_svg::{closure#0}>::{closure#0}, !>::{closure#0}>::{closure#0}
  233. 133.02 s gammaloop-nextest-clinnet> 5: <std::sys::sync::once::futex::Once>::call
  234. 133.02 s gammaloop-nextest-clinnet> 6: <std::sync::once_lock::OnceLock<alloc::string::String>>::initialize::<<std::sync::once_lock::OnceLock<alloc::string::String>>::get_or_init<public_typst_behavior::linnest_public_svg::{closure#0}>::{closure#0}, !>
  235. 133.02 s gammaloop-nextest-clinnet> 7: <public_typst_behavior::public_linnest_edge_styles_skip_fallbacks::{closure#0} as core::ops::function::FnOnce<()>>::call_once
  236. 133.02 s gammaloop-nextest-clinnet> note: Some details are omitted, run with `RUST_BACKTRACE=full` for a verbose backtrace.
  237. 133.02 s gammaloop-nextest-clinnet>
  238. 133.02 s gammaloop-nextest-clinnet> FAIL [ 85.826s] (34/38) clinnet::public_typst_behavior public_linnest_fixture_assertions_hold
  239. 133.02 s gammaloop-nextest-clinnet> stdout ---
  240. 133.02 s gammaloop-nextest-clinnet>
  241. 133.02 s gammaloop-nextest-clinnet> running 1 test
  242. 133.02 s gammaloop-nextest-clinnet> test public_linnest_fixture_assertions_hold has been running for over 60 seconds
  243. 133.02 s gammaloop-nextest-clinnet> test public_linnest_fixture_assertions_hold ... FAILED
  244. 133.02 s gammaloop-nextest-clinnet>
  245. 133.02 s gammaloop-nextest-clinnet> failures:
  246. 133.02 s gammaloop-nextest-clinnet>
  247. 133.02 s gammaloop-nextest-clinnet> failures:
  248. 133.02 s gammaloop-nextest-clinnet> public_linnest_fixture_assertions_hold
  249. 133.02 s gammaloop-nextest-clinnet>
  250. 133.02 s gammaloop-nextest-clinnet> test result: FAILED. 0 passed; 1 failed; 0 ignored; 0 measured; 17 filtered out; finished in 85.81s
  251. 133.02 s gammaloop-nextest-clinnet>
  252. 133.02 s gammaloop-nextest-clinnet> stderr ---
  253. 133.02 s gammaloop-nextest-clinnet>
  254. 133.02 s gammaloop-nextest-clinnet> thread 'public_linnest_fixture_assertions_hold' (274) panicked at crates/clinnet/tests/public_typst_behavior.rs:81:55:
  255. 133.02 s gammaloop-nextest-clinnet> called `Result::unwrap()` on an `Err` value: typst failed while compiling template /build/.tmp1F6fxQ/.clinnet/templates/linnest-public-behavior.svg
  256. 133.02 s gammaloop-nextest-clinnet>
  257. 133.02 s gammaloop-nextest-clinnet> Command executed:
  258. 133.02 s gammaloop-nextest-clinnet> "typst" "c" "/build/.tmp1F6fxQ/.clinnet/templates/linnest-public-behavior.typ" "/build/.tmp1F6fxQ/.clinnet/templates/linnest-public-behavior.svg" "--root" "/build/.tmp1F6fxQ/.clinnet/templates"
  259. 133.02 s gammaloop-nextest-clinnet>
  260. 133.02 s gammaloop-nextest-clinnet> Typst stdout:
  261. 133.02 s gammaloop-nextest-clinnet>
  262. 133.02 s gammaloop-nextest-clinnet>
  263. 133.02 s gammaloop-nextest-clinnet> Typst stderr:
  264. 133.02 s gammaloop-nextest-clinnet>
  265. 133.02 s gammaloop-nextest-clinnet>
  266. 133.02 s gammaloop-nextest-clinnet> Location:
  267. 133.02 s gammaloop-nextest-clinnet> crates/clinnet/src/lib.rs:741:13
  268. 133.02 s gammaloop-nextest-clinnet> stack backtrace:
  269. 133.02 s gammaloop-nextest-clinnet> 0: __rustc::rust_begin_unwind
  270. 133.02 s gammaloop-nextest-clinnet> 1: core::panicking::panic_fmt
  271. 133.02 s gammaloop-nextest-clinnet> 2: core::result::unwrap_failed
  272. 133.02 s gammaloop-nextest-clinnet> 3: public_typst_behavior::render
  273. 133.02 s gammaloop-nextest-clinnet> 4: <std::sync::once::Once>::call_once_force::<<std::sync::once_lock::OnceLock<alloc::string::String>>::initialize<<std::sync::once_lock::OnceLock<alloc::string::String>>::get_or_init<public_typst_behavior::linnest_public_svg::{closure#0}>::{closure#0}, !>::{closure#0}>::{closure#0}
  274. 133.02 s gammaloop-nextest-clinnet> 5: <std::sys::sync::once::futex::Once>::call
  275. 133.02 s gammaloop-nextest-clinnet> 6: <std::sync::once_lock::OnceLock<alloc::string::String>>::initialize::<<std::sync::once_lock::OnceLock<alloc::string::String>>::get_or_init<public_typst_behavior::linnest_public_svg::{closure#0}>::{closure#0}, !>
  276. 133.02 s gammaloop-nextest-clinnet> 7: <public_typst_behavior::public_linnest_fixture_assertions_hold::{closure#0} as core::ops::function::FnOnce<()>>::call_once
  277. 133.02 s gammaloop-nextest-clinnet> note: Some details are omitted, run with `RUST_BACKTRACE=full` for a verbose backtrace.
  278. 133.02 s gammaloop-nextest-clinnet>
  279. 133.03 s gammaloop-nextest-clinnet> error: test run failed
  280. 133.07 s gammaloop-nextest-clinnet>
  281. 133.07 s gammaloop-nextest-clinnet> ========== nextest test summary ==========
  282. 133.07 s gammaloop-nextest-clinnet> report: target/nextest/ci_gammaloop/junit.xml
  283. 133.07 s gammaloop-nextest-clinnet> tests: 38, failures: 3, errors: 0
  284. 133.07 s gammaloop-nextest-clinnet>
  285. 133.07 s gammaloop-nextest-clinnet> 1. clinnet::public_typst_behavior::public_linnest_momentum_layers_place_shafts_and_labels
  286. 133.07 s gammaloop-nextest-clinnet> failure: test failure with exit code 101
  287. 133.07 s gammaloop-nextest-clinnet> thread 'public_linnest_momentum_layers_place_shafts_and_labels' (287) panicked at crates/clinnet/tests/public_typst_behavior.rs:81:55:
  288. 133.07 s gammaloop-nextest-clinnet> called `Result::unwrap()` on an `Err` value: typst failed while compiling template /build/.tmp1GG1hA/.clinnet/templates/linnest-public-behavior.svg
  289. 133.07 s gammaloop-nextest-clinnet>
  290. 133.07 s gammaloop-nextest-clinnet> Command executed:
  291. 133.07 s gammaloop-nextest-clinnet> "typst" "c" "/build/.tmp1GG1hA/.clinnet/templates/linnest-public-behavior.typ" "/build/.tmp1GG1hA/.clinnet/templates/linnest-public-behavior.svg" "--root" "/build/.tmp1GG1hA/.clinnet/templates"
  292. 133.07 s gammaloop-nextest-clinnet>
  293. 133.07 s gammaloop-nextest-clinnet> Typst stdout:
  294. 133.07 s gammaloop-nextest-clinnet>
  295. 133.07 s gammaloop-nextest-clinnet>
  296. 133.07 s gammaloop-nextest-clinnet> Typst stderr:
  297. 133.07 s gammaloop-nextest-clinnet>
  298. 133.07 s gammaloop-nextest-clinnet>
  299. 133.07 s gammaloop-nextest-clinnet> Location:
  300. 133.07 s gammaloop-nextest-clinnet> crates/clinnet/src/lib.rs:741:13
  301. 133.07 s gammaloop-nextest-clinnet> stack backtrace:
  302. 133.07 s gammaloop-nextest-clinnet> 0: __rustc::rust_begin_unwind
  303. 133.07 s gammaloop-nextest-clinnet> 1: core::panicking::panic_fmt
  304. 133.07 s gammaloop-nextest-clinnet> 2: core::result::unwrap_failed
  305. 133.07 s gammaloop-nextest-clinnet> 3: public_typst_behavior::render
  306. 133.07 s gammaloop-nextest-clinnet> 4: <std::sync::once::Once>::call_once_force::<<std::sync::once_lock::OnceLock<alloc::string::String>>::initialize<<std::sync::once_lock::OnceLock<alloc::string::String>>::get_or_init<public_typst_behavior::linnest_public_svg::{closure#0}>::{closure#0}, !>::{closure#0}>::{closure#0}
  307. 133.07 s gammaloop-nextest-clinnet> 5: <std::sys::sync::once::futex::Once>::call
  308. 133.07 s gammaloop-nextest-clinnet> 6: <std::sync::once_lock::OnceLock<alloc::string::String>>::initialize::<<std::sync::once_lock::OnceLock<alloc::string::String>>::get_or_init<public_typst_behavior::linnest_public_svg::{closure#0}>::{closure#0}, !>
  309. 133.07 s gammaloop-nextest-clinnet> 7: <public_typst_behavior::public_linnest_momentum_layers_place_shafts_and_labels::{closure#0} as core::ops::function::FnOnce<()>>::call_once
  310. 133.07 s gammaloop-nextest-clinnet> note: Some details are omitted, run with `RUST_BACKTRACE=full` for a verbose backtrace.
  311. 133.07 s gammaloop-nextest-clinnet> system-out
  312. 133.07 s gammaloop-nextest-clinnet> running 1 test
  313. 133.07 s gammaloop-nextest-clinnet> test public_linnest_momentum_layers_place_shafts_and_labels has been running for over 60 seconds
  314. 133.07 s gammaloop-nextest-clinnet> test public_linnest_momentum_layers_place_shafts_and_labels ... FAILED
  315. 133.07 s gammaloop-nextest-clinnet>
  316. 133.07 s gammaloop-nextest-clinnet> failures:
  317. 133.07 s gammaloop-nextest-clinnet>
  318. 133.07 s gammaloop-nextest-clinnet> failures:
  319. 133.07 s gammaloop-nextest-clinnet> public_linnest_momentum_layers_place_shafts_and_labels
  320. 133.07 s gammaloop-nextest-clinnet>
  321. 133.07 s gammaloop-nextest-clinnet> test result: FAILED. 0 passed; 1 failed; 0 ignored; 0 measured; 17 filtered out; finished in 69.92s
  322. 133.07 s gammaloop-nextest-clinnet> system-err
  323. 133.07 s gammaloop-nextest-clinnet> thread 'public_linnest_momentum_layers_place_shafts_and_labels' (287) panicked at crates/clinnet/tests/public_typst_behavior.rs:81:55:
  324. 133.07 s gammaloop-nextest-clinnet> called `Result::unwrap()` on an `Err` value: typst failed while compiling template /build/.tmp1GG1hA/.clinnet/templates/linnest-public-behavior.svg
  325. 133.07 s gammaloop-nextest-clinnet>
  326. 133.07 s gammaloop-nextest-clinnet> Command executed:
  327. 133.07 s gammaloop-nextest-clinnet> "typst" "c" "/build/.tmp1GG1hA/.clinnet/templates/linnest-public-behavior.typ" "/build/.tmp1GG1hA/.clinnet/templates/linnest-public-behavior.svg" "--root" "/build/.tmp1GG1hA/.clinnet/templates"
  328. 133.07 s gammaloop-nextest-clinnet>
  329. 133.07 s gammaloop-nextest-clinnet> Typst stdout:
  330. 133.07 s gammaloop-nextest-clinnet>
  331. 133.07 s gammaloop-nextest-clinnet>
  332. 133.07 s gammaloop-nextest-clinnet> Typst stderr:
  333. 133.07 s gammaloop-nextest-clinnet>
  334. 133.07 s gammaloop-nextest-clinnet>
  335. 133.07 s gammaloop-nextest-clinnet> Location:
  336. 133.07 s gammaloop-nextest-clinnet> crates/clinnet/src/lib.rs:741:13
  337. 133.07 s gammaloop-nextest-clinnet> stack backtrace:
  338. 133.07 s gammaloop-nextest-clinnet> 0: __rustc::rust_begin_unwind
  339. 133.07 s gammaloop-nextest-clinnet> 1: core::panicking::panic_fmt
  340. 133.07 s gammaloop-nextest-clinnet> 2: core::result::unwrap_failed
  341. 133.07 s gammaloop-nextest-clinnet> 3: public_typst_behavior::render
  342. 133.07 s gammaloop-nextest-clinnet> 4: <std::sync::once::Once>::call_once_force::<<std::sync::once_lock::OnceLock<alloc::string::String>>::initialize<<std::sync::once_lock::OnceLock<alloc::string::String>>::get_or_init<public_typst_behavior::linnest_public_svg::{closure#0}>::{closure#0}, !>::{closure#0}>::{closure#0}
  343. 133.07 s gammaloop-nextest-clinnet> 5: <std::sys::sync::once::futex::Once>::call
  344. 133.07 s gammaloop-nextest-clinnet> 6: <std::sync::once_lock::OnceLock<alloc::string::String>>::initialize::<<std::sync::once_lock::OnceLock<alloc::string::String>>::get_or_init<public_typst_behavior::linnest_public_svg::{closure#0}>::{closure#0}, !>
  345. 133.07 s gammaloop-nextest-clinnet> 7: <public_typst_behavior::public_linnest_momentum_layers_place_shafts_and_labels::{closure#0} as core::ops::function::FnOnce<()>>::call_once
  346. 133.07 s gammaloop-nextest-clinnet> note: Some details are omitted, run with `RUST_BACKTRACE=full` for a verbose backtrace.
  347. 133.07 s gammaloop-nextest-clinnet>
  348. 133.07 s gammaloop-nextest-clinnet> 2. clinnet::public_typst_behavior::public_linnest_edge_styles_skip_fallbacks
  349. 133.07 s gammaloop-nextest-clinnet> failure: test failure with exit code 101
  350. 133.07 s gammaloop-nextest-clinnet> thread 'public_linnest_edge_styles_skip_fallbacks' (272) panicked at crates/clinnet/tests/public_typst_behavior.rs:81:55:
  351. 133.07 s gammaloop-nextest-clinnet> called `Result::unwrap()` on an `Err` value: typst failed while compiling template /build/.tmpjzrRit/.clinnet/templates/linnest-public-behavior.svg
  352. 133.07 s gammaloop-nextest-clinnet>
  353. 133.07 s gammaloop-nextest-clinnet> Command executed:
  354. 133.07 s gammaloop-nextest-clinnet> "typst" "c" "/build/.tmpjzrRit/.clinnet/templates/linnest-public-behavior.typ" "/build/.tmpjzrRit/.clinnet/templates/linnest-public-behavior.svg" "--root" "/build/.tmpjzrRit/.clinnet/templates"
  355. 133.07 s gammaloop-nextest-clinnet>
  356. 133.07 s gammaloop-nextest-clinnet> Typst stdout:
  357. 133.07 s gammaloop-nextest-clinnet>
  358. 133.07 s gammaloop-nextest-clinnet>
  359. 133.07 s gammaloop-nextest-clinnet> Typst stderr:
  360. 133.07 s gammaloop-nextest-clinnet>
  361. 133.07 s gammaloop-nextest-clinnet>
  362. 133.07 s gammaloop-nextest-clinnet> Location:
  363. 133.07 s gammaloop-nextest-clinnet> crates/clinnet/src/lib.rs:741:13
  364. 133.07 s gammaloop-nextest-clinnet> stack backtrace:
  365. 133.07 s gammaloop-nextest-clinnet> 0: __rustc::rust_begin_unwind
  366. 133.07 s gammaloop-nextest-clinnet> 1: core::panicking::panic_fmt
  367. 133.07 s gammaloop-nextest-clinnet> 2: core::result::unwrap_failed
  368. 133.07 s gammaloop-nextest-clinnet> 3: public_typst_behavior::render
  369. 133.07 s gammaloop-nextest-clinnet> 4: <std::sync::once::Once>::call_once_force::<<std::sync::once_lock::OnceLock<alloc::string::String>>::initialize<<std::sync::once_lock::OnceLock<alloc::string::String>>::get_or_init<public_typst_behavior::linnest_public_svg::{closure#0}>::{closure#0}, !>::{closure#0}>::{closure#0}
  370. 133.07 s gammaloop-nextest-clinnet> 5: <std::sys::sync::once::futex::Once>::call
  371. 133.07 s gammaloop-nextest-clinnet> 6: <std::sync::once_lock::OnceLock<alloc::string::String>>::initialize::<<std::sync::once_lock::OnceLock<alloc::string::String>>::get_or_init<public_typst_behavior::linnest_public_svg::{closure#0}>::{closure#0}, !>
  372. 133.07 s gammaloop-nextest-clinnet> 7: <public_typst_behavior::public_linnest_edge_styles_skip_fallbacks::{closure#0} as core::ops::function::FnOnce<()>>::call_once
  373. 133.07 s gammaloop-nextest-clinnet> note: Some details are omitted, run with `RUST_BACKTRACE=full` for a verbose backtrace.
  374. 133.07 s gammaloop-nextest-clinnet> system-out
  375. 133.07 s gammaloop-nextest-clinnet> running 1 test
  376. 133.07 s gammaloop-nextest-clinnet> test public_linnest_edge_styles_skip_fallbacks has been running for over 60 seconds
  377. 133.07 s gammaloop-nextest-clinnet> test public_linnest_edge_styles_skip_fallbacks ... FAILED
  378. 133.07 s gammaloop-nextest-clinnet>
  379. 133.07 s gammaloop-nextest-clinnet> failures:
  380. 133.07 s gammaloop-nextest-clinnet>
  381. 133.07 s gammaloop-nextest-clinnet> failures:
  382. 133.07 s gammaloop-nextest-clinnet> public_linnest_edge_styles_skip_fallbacks
  383. 133.07 s gammaloop-nextest-clinnet>
  384. 133.07 s gammaloop-nextest-clinnet> test result: FAILED. 0 passed; 1 failed; 0 ignored; 0 measured; 17 filtered out; finished in 75.20s
  385. 133.07 s gammaloop-nextest-clinnet> system-err
  386. 133.07 s gammaloop-nextest-clinnet> thread 'public_linnest_edge_styles_skip_fallbacks' (272) panicked at crates/clinnet/tests/public_typst_behavior.rs:81:55:
  387. 133.07 s gammaloop-nextest-clinnet> called `Result::unwrap()` on an `Err` value: typst failed while compiling template /build/.tmpjzrRit/.clinnet/templates/linnest-public-behavior.svg
  388. 133.07 s gammaloop-nextest-clinnet>
  389. 133.07 s gammaloop-nextest-clinnet> Command executed:
  390. 133.07 s gammaloop-nextest-clinnet> "typst" "c" "/build/.tmpjzrRit/.clinnet/templates/linnest-public-behavior.typ" "/build/.tmpjzrRit/.clinnet/templates/linnest-public-behavior.svg" "--root" "/build/.tmpjzrRit/.clinnet/templates"
  391. 133.07 s gammaloop-nextest-clinnet>
  392. 133.07 s gammaloop-nextest-clinnet> Typst stdout:
  393. 133.07 s gammaloop-nextest-clinnet>
  394. 133.07 s gammaloop-nextest-clinnet>
  395. 133.07 s gammaloop-nextest-clinnet> Typst stderr:
  396. 133.07 s gammaloop-nextest-clinnet>
  397. 133.07 s gammaloop-nextest-clinnet>
  398. 133.07 s gammaloop-nextest-clinnet> Location:
  399. 133.07 s gammaloop-nextest-clinnet> crates/clinnet/src/lib.rs:741:13
  400. 133.07 s gammaloop-nextest-clinnet> stack backtrace:
  401. 133.07 s gammaloop-nextest-clinnet> 0: __rustc::rust_begin_unwind
  402. 133.07 s gammaloop-nextest-clinnet> 1: core::panicking::panic_fmt
  403. 133.07 s gammaloop-nextest-clinnet> 2: core::result::unwrap_failed
  404. 133.07 s gammaloop-nextest-clinnet> 3: public_typst_behavior::render
  405. 133.07 s gammaloop-nextest-clinnet> 4: <std::sync::once::Once>::call_once_force::<<std::sync::once_lock::OnceLock<alloc::string::String>>::initialize<<std::sync::once_lock::OnceLock<alloc::string::String>>::get_or_init<public_typst_behavior::linnest_public_svg::{closure#0}>::{closure#0}, !>::{closure#0}>::{closure#0}
  406. 133.07 s gammaloop-nextest-clinnet> 5: <std::sys::sync::once::futex::Once>::call
  407. 133.07 s gammaloop-nextest-clinnet> 6: <std::sync::once_lock::OnceLock<alloc::string::String>>::initialize::<<std::sync::once_lock::OnceLock<alloc::string::String>>::get_or_init<public_typst_behavior::linnest_public_svg::{closure#0}>::{closure#0}, !>
  408. 133.07 s gammaloop-nextest-clinnet> 7: <public_typst_behavior::public_linnest_edge_styles_skip_fallbacks::{closure#0} as core::ops::function::FnOnce<()>>::call_once
  409. 133.07 s gammaloop-nextest-clinnet> note: Some details are omitted, run with `RUST_BACKTRACE=full` for a verbose backtrace.
  410. 133.07 s gammaloop-nextest-clinnet>
  411. 133.07 s gammaloop-nextest-clinnet> 3. clinnet::public_typst_behavior::public_linnest_fixture_assertions_hold
  412. 133.07 s gammaloop-nextest-clinnet> failure: test failure with exit code 101
  413. 133.07 s gammaloop-nextest-clinnet> thread 'public_linnest_fixture_assertions_hold' (274) panicked at crates/clinnet/tests/public_typst_behavior.rs:81:55:
  414. 133.07 s gammaloop-nextest-clinnet> called `Result::unwrap()` on an `Err` value: typst failed while compiling template /build/.tmp1F6fxQ/.clinnet/templates/linnest-public-behavior.svg
  415. 133.07 s gammaloop-nextest-clinnet>
  416. 133.07 s gammaloop-nextest-clinnet> Command executed:
  417. 133.07 s gammaloop-nextest-clinnet> "typst" "c" "/build/.tmp1F6fxQ/.clinnet/templates/linnest-public-behavior.typ" "/build/.tmp1F6fxQ/.clinnet/templates/linnest-public-behavior.svg" "--root" "/build/.tmp1F6fxQ/.clinnet/templates"
  418. 133.07 s gammaloop-nextest-clinnet>
  419. 133.07 s gammaloop-nextest-clinnet> Typst stdout:
  420. 133.07 s gammaloop-nextest-clinnet>
  421. 133.07 s gammaloop-nextest-clinnet>
  422. 133.07 s gammaloop-nextest-clinnet> Typst stderr:
  423. 133.07 s gammaloop-nextest-clinnet>
  424. 133.07 s gammaloop-nextest-clinnet>
  425. 133.07 s gammaloop-nextest-clinnet> Location:
  426. 133.07 s gammaloop-nextest-clinnet> crates/clinnet/src/lib.rs:741:13
  427. 133.07 s gammaloop-nextest-clinnet> stack backtrace:
  428. 133.07 s gammaloop-nextest-clinnet> 0: __rustc::rust_begin_unwind
  429. 133.07 s gammaloop-nextest-clinnet> 1: core::panicking::panic_fmt
  430. 133.07 s gammaloop-nextest-clinnet> 2: core::result::unwrap_failed
  431. 133.07 s gammaloop-nextest-clinnet> 3: public_typst_behavior::render
  432. 133.07 s gammaloop-nextest-clinnet> 4: <std::sync::once::Once>::call_once_force::<<std::sync::once_lock::OnceLock<alloc::string::String>>::initialize<<std::sync::once_lock::OnceLock<alloc::string::String>>::get_or_init<public_typst_behavior::linnest_public_svg::{closure#0}>::{closure#0}, !>::{closure#0}>::{closure#0}
  433. 133.07 s gammaloop-nextest-clinnet> 5: <std::sys::sync::once::futex::Once>::call
  434. 133.07 s gammaloop-nextest-clinnet> 6: <std::sync::once_lock::OnceLock<alloc::string::String>>::initialize::<<std::sync::once_lock::OnceLock<alloc::string::String>>::get_or_init<public_typst_behavior::linnest_public_svg::{closure#0}>::{closure#0}, !>
  435. 133.07 s gammaloop-nextest-clinnet> 7: <public_typst_behavior::public_linnest_fixture_assertions_hold::{closure#0} as core::ops::function::FnOnce<()>>::call_once
  436. 133.07 s gammaloop-nextest-clinnet> note: Some details are omitted, run with `RUST_BACKTRACE=full` for a verbose backtrace.
  437. 133.07 s gammaloop-nextest-clinnet> system-out
  438. 133.07 s gammaloop-nextest-clinnet> running 1 test
  439. 133.07 s gammaloop-nextest-clinnet> test public_linnest_fixture_assertions_hold has been running for over 60 seconds
  440. 133.07 s gammaloop-nextest-clinnet> test public_linnest_fixture_assertions_hold ... FAILED
  441. 133.07 s gammaloop-nextest-clinnet>
  442. 133.07 s gammaloop-nextest-clinnet> failures:
  443. 133.07 s gammaloop-nextest-clinnet>
  444. 133.07 s gammaloop-nextest-clinnet> failures:
  445. 133.07 s gammaloop-nextest-clinnet> public_linnest_fixture_assertions_hold
  446. 133.07 s gammaloop-nextest-clinnet>
  447. 133.07 s gammaloop-nextest-clinnet> test result: FAILED. 0 passed; 1 failed; 0 ignored; 0 measured; 17 filtered out; finished in 85.81s
  448. 133.07 s gammaloop-nextest-clinnet> system-err
  449. 133.07 s gammaloop-nextest-clinnet> thread 'public_linnest_fixture_assertions_hold' (274) panicked at crates/clinnet/tests/public_typst_behavior.rs:81:55:
  450. 133.07 s gammaloop-nextest-clinnet> called `Result::unwrap()` on an `Err` value: typst failed while compiling template /build/.tmp1F6fxQ/.clinnet/templates/linnest-public-behavior.svg
  451. 133.07 s gammaloop-nextest-clinnet>
  452. 133.07 s gammaloop-nextest-clinnet> Command executed:
  453. 133.07 s gammaloop-nextest-clinnet> "typst" "c" "/build/.tmp1F6fxQ/.clinnet/templates/linnest-public-behavior.typ" "/build/.tmp1F6fxQ/.clinnet/templates/linnest-public-behavior.svg" "--root" "/build/.tmp1F6fxQ/.clinnet/templates"
  454. 133.07 s gammaloop-nextest-clinnet>
  455. 133.07 s gammaloop-nextest-clinnet> Typst stdout:
  456. 133.07 s gammaloop-nextest-clinnet>
  457. 133.07 s gammaloop-nextest-clinnet>
  458. 133.07 s gammaloop-nextest-clinnet> Typst stderr:
  459. 133.07 s gammaloop-nextest-clinnet>
  460. 133.07 s gammaloop-nextest-clinnet>
  461. 133.07 s gammaloop-nextest-clinnet> Location:
  462. 133.07 s gammaloop-nextest-clinnet> crates/clinnet/src/lib.rs:741:13
  463. 133.07 s gammaloop-nextest-clinnet> stack backtrace:
  464. 133.07 s gammaloop-nextest-clinnet> 0: __rustc::rust_begin_unwind
  465. 133.07 s gammaloop-nextest-clinnet> 1: core::panicking::panic_fmt
  466. 133.07 s gammaloop-nextest-clinnet> 2: core::result::unwrap_failed
  467. 133.07 s gammaloop-nextest-clinnet> 3: public_typst_behavior::render
  468. 133.07 s gammaloop-nextest-clinnet> 4: <std::sync::once::Once>::call_once_force::<<std::sync::once_lock::OnceLock<alloc::string::String>>::initialize<<std::sync::once_lock::OnceLock<alloc::string::String>>::get_or_init<public_typst_behavior::linnest_public_svg::{closure#0}>::{closure#0}, !>::{closure#0}>::{closure#0}
  469. 133.07 s gammaloop-nextest-clinnet> 5: <std::sys::sync::once::futex::Once>::call
  470. 133.07 s gammaloop-nextest-clinnet> 6: <std::sync::once_lock::OnceLock<alloc::string::String>>::initialize::<<std::sync::once_lock::OnceLock<alloc::string::String>>::get_or_init<public_typst_behavior::linnest_public_svg::{closure#0}>::{closure#0}, !>
  471. 133.07 s gammaloop-nextest-clinnet> 7: <public_typst_behavior::public_linnest_fixture_assertions_hold::{closure#0} as core::ops::function::FnOnce<()>>::call_once
  472. 133.07 s gammaloop-nextest-clinnet> note: Some details are omitted, run with `RUST_BACKTRACE=full` for a verbose backtrace.
  473. 133.07 s gammaloop-nextest-clinnet> =========================================
  474. 133.16 s error: Cannot build '/nix/store/4pqspwvh8pi9s2vg9g6mfsggpl9ynwzx-gammaloop-nextest-clinnet.drv'.
  475. 133.16 s Reason: builder failed with exit code 100.
  476. 133.16 s Output paths:
  477. 133.16 s /nix/store/v9zka7gxdrym1pq03r0i4w2q43fgdwcq-gammaloop-nextest-clinnet
  478. 133.16 s Last 449 log lines:
  479. 133.16 s > Nextest worker budget: 16
  480. 133.16 s > Extracting 4 binaries (including 1 non-test binary), 1 build script output directory, and 1 linked path to /build/source
  481. 133.16 s > Extracted 16 files to /build/source in 0.09s
  482. 133.16 s > ------------
  483. 133.16 s > Nextest run ID 21864be8-93df-4624-808d-e8e8264d1c74 with nextest profile: ci_gammaloop
  484. 133.16 s > Starting 38 tests across 3 binaries
  485. 133.16 s > FAIL [ 69.935s] (32/38) clinnet::public_typst_behavior public_linnest_momentum_layers_place_shafts_and_labels
  486. 133.16 s > stdout ---
  487. 133.16 s >
  488. 133.16 s > running 1 test
  489. 133.16 s > test public_linnest_momentum_layers_place_shafts_and_labels has been running for over 60 seconds
  490. 133.16 s > test public_linnest_momentum_layers_place_shafts_and_labels ... FAILED
  491. 133.16 s >
  492. 133.16 s > failures:
  493. 133.16 s >
  494. 133.16 s > failures:
  495. 133.16 s > public_linnest_momentum_layers_place_shafts_and_labels
  496. 133.16 s >
  497. 133.16 s > test result: FAILED. 0 passed; 1 failed; 0 ignored; 0 measured; 17 filtered out; finished in 69.92s
  498. 133.16 s >
  499. 133.16 s > stderr ---
  500. 133.16 s >
  501. 133.16 s > thread 'public_linnest_momentum_layers_place_shafts_and_labels' (287) panicked at crates/clinnet/tests/public_typst_behavior.rs:81:55:
  502. 133.16 s > called `Result::unwrap()` on an `Err` value: typst failed while compiling template /build/.tmp1GG1hA/.clinnet/templates/linnest-public-behavior.svg
  503. 133.16 s >
  504. 133.16 s > Command executed:
  505. 133.16 s > "typst" "c" "/build/.tmp1GG1hA/.clinnet/templates/linnest-public-behavior.typ" "/build/.tmp1GG1hA/.clinnet/templates/linnest-public-behavior.svg" "--root" "/build/.tmp1GG1hA/.clinnet/templates"
  506. 133.16 s >
  507. 133.16 s > Typst stdout:
  508. 133.16 s >
  509. 133.16 s >
  510. 133.16 s > Typst stderr:
  511. 133.16 s >
  512. 133.16 s >
  513. 133.16 s > Location:
  514. 133.16 s > crates/clinnet/src/lib.rs:741:13
  515. 133.16 s > stack backtrace:
  516. 133.16 s > 0: __rustc::rust_begin_unwind
  517. 133.16 s > 1: core::panicking::panic_fmt
  518. 133.16 s > 2: core::result::unwrap_failed
  519. 133.16 s > 3: public_typst_behavior::render
  520. 133.16 s > 4: <std::sync::once::Once>::call_once_force::<<std::sync::once_lock::OnceLock<alloc::string::String>>::initialize<<std::sync::once_lock::OnceLock<alloc::string::String>>::get_or_init<public_typst_behavior::linnest_public_svg::{closure#0}>::{closure#0}, !>::{closure#0}>::{closure#0}
  521. 133.16 s > 5: <std::sys::sync::once::futex::Once>::call
  522. 133.16 s > 6: <std::sync::once_lock::OnceLock<alloc::string::String>>::initialize::<<std::sync::once_lock::OnceLock<alloc::string::String>>::get_or_init<public_typst_behavior::linnest_public_svg::{closure#0}>::{closure#0}, !>
  523. 133.16 s > 7: <public_typst_behavior::public_linnest_momentum_layers_place_shafts_and_labels::{closure#0} as core::ops::function::FnOnce<()>>::call_once
  524. 133.16 s > note: Some details are omitted, run with `RUST_BACKTRACE=full` for a verbose backtrace.
  525. 133.16 s >
  526. 133.16 s > FAIL [ 75.232s] (33/38) clinnet::public_typst_behavior public_linnest_edge_styles_skip_fallbacks
  527. 133.16 s > stdout ---
  528. 133.16 s >
  529. 133.16 s > running 1 test
  530. 133.16 s > test public_linnest_edge_styles_skip_fallbacks has been running for over 60 seconds
  531. 133.16 s > test public_linnest_edge_styles_skip_fallbacks ... FAILED
  532. 133.16 s >
  533. 133.16 s > failures:
  534. 133.16 s >
  535. 133.16 s > failures:
  536. 133.16 s > public_linnest_edge_styles_skip_fallbacks
  537. 133.16 s >
  538. 133.16 s > test result: FAILED. 0 passed; 1 failed; 0 ignored; 0 measured; 17 filtered out; finished in 75.20s
  539. 133.16 s >
  540. 133.16 s > stderr ---
  541. 133.16 s >
  542. 133.16 s > thread 'public_linnest_edge_styles_skip_fallbacks' (272) panicked at crates/clinnet/tests/public_typst_behavior.rs:81:55:
  543. 133.16 s > called `Result::unwrap()` on an `Err` value: typst failed while compiling template /build/.tmpjzrRit/.clinnet/templates/linnest-public-behavior.svg
  544. 133.16 s >
  545. 133.16 s > Command executed:
  546. 133.16 s > "typst" "c" "/build/.tmpjzrRit/.clinnet/templates/linnest-public-behavior.typ" "/build/.tmpjzrRit/.clinnet/templates/linnest-public-behavior.svg" "--root" "/build/.tmpjzrRit/.clinnet/templates"
  547. 133.16 s >
  548. 133.16 s > Typst stdout:
  549. 133.16 s >
  550. 133.16 s >
  551. 133.16 s > Typst stderr:
  552. 133.16 s >
  553. 133.16 s >
  554. 133.16 s > Location:
  555. 133.16 s > crates/clinnet/src/lib.rs:741:13
  556. 133.16 s > stack backtrace:
  557. 133.16 s > 0: __rustc::rust_begin_unwind
  558. 133.16 s > 1: core::panicking::panic_fmt
  559. 133.16 s > 2: core::result::unwrap_failed
  560. 133.16 s > 3: public_typst_behavior::render
  561. 133.16 s > 4: <std::sync::once::Once>::call_once_force::<<std::sync::once_lock::OnceLock<alloc::string::String>>::initialize<<std::sync::once_lock::OnceLock<alloc::string::String>>::get_or_init<public_typst_behavior::linnest_public_svg::{closure#0}>::{closure#0}, !>::{closure#0}>::{closure#0}
  562. 133.16 s > 5: <std::sys::sync::once::futex::Once>::call
  563. 133.16 s > 6: <std::sync::once_lock::OnceLock<alloc::string::String>>::initialize::<<std::sync::once_lock::OnceLock<alloc::string::String>>::get_or_init<public_typst_behavior::linnest_public_svg::{closure#0}>::{closure#0}, !>
  564. 133.16 s > 7: <public_typst_behavior::public_linnest_edge_styles_skip_fallbacks::{closure#0} as core::ops::function::FnOnce<()>>::call_once
  565. 133.16 s > note: Some details are omitted, run with `RUST_BACKTRACE=full` for a verbose backtrace.
  566. 133.16 s >
  567. 133.16 s > FAIL [ 85.826s] (34/38) clinnet::public_typst_behavior public_linnest_fixture_assertions_hold
  568. 133.16 s > stdout ---
  569. 133.16 s >
  570. 133.16 s > running 1 test
  571. 133.16 s > test public_linnest_fixture_assertions_hold has been running for over 60 seconds
  572. 133.16 s > test public_linnest_fixture_assertions_hold ... FAILED
  573. 133.16 s >
  574. 133.16 s > failures:
  575. 133.16 s >
  576. 133.16 s > failures:
  577. 133.16 s > public_linnest_fixture_assertions_hold
  578. 133.16 s >
  579. 133.16 s > test result: FAILED. 0 passed; 1 failed; 0 ignored; 0 measured; 17 filtered out; finished in 85.81s
  580. 133.16 s >
  581. 133.16 s > stderr ---
  582. 133.16 s >
  583. 133.16 s > thread 'public_linnest_fixture_assertions_hold' (274) panicked at crates/clinnet/tests/public_typst_behavior.rs:81:55:
  584. 133.16 s > called `Result::unwrap()` on an `Err` value: typst failed while compiling template /build/.tmp1F6fxQ/.clinnet/templates/linnest-public-behavior.svg
  585. 133.16 s >
  586. 133.16 s > Command executed:
  587. 133.16 s > "typst" "c" "/build/.tmp1F6fxQ/.clinnet/templates/linnest-public-behavior.typ" "/build/.tmp1F6fxQ/.clinnet/templates/linnest-public-behavior.svg" "--root" "/build/.tmp1F6fxQ/.clinnet/templates"
  588. 133.16 s >
  589. 133.16 s > Typst stdout:
  590. 133.16 s >
  591. 133.16 s >
  592. 133.16 s > Typst stderr:
  593. 133.16 s >
  594. 133.16 s >
  595. 133.16 s > Location:
  596. 133.16 s > crates/clinnet/src/lib.rs:741:13
  597. 133.16 s > stack backtrace:
  598. 133.16 s > 0: __rustc::rust_begin_unwind
  599. 133.16 s > 1: core::panicking::panic_fmt
  600. 133.16 s > 2: core::result::unwrap_failed
  601. 133.16 s > 3: public_typst_behavior::render
  602. 133.16 s > 4: <std::sync::once::Once>::call_once_force::<<std::sync::once_lock::OnceLock<alloc::string::String>>::initialize<<std::sync::once_lock::OnceLock<alloc::string::String>>::get_or_init<public_typst_behavior::linnest_public_svg::{closure#0}>::{closure#0}, !>::{closure#0}>::{closure#0}
  603. 133.16 s > 5: <std::sys::sync::once::futex::Once>::call
  604. 133.16 s > 6: <std::sync::once_lock::OnceLock<alloc::string::String>>::initialize::<<std::sync::once_lock::OnceLock<alloc::string::String>>::get_or_init<public_typst_behavior::linnest_public_svg::{closure#0}>::{closure#0}, !>
  605. 133.16 s > 7: <public_typst_behavior::public_linnest_fixture_assertions_hold::{closure#0} as core::ops::function::FnOnce<()>>::call_once
  606. 133.16 s > note: Some details are omitted, run with `RUST_BACKTRACE=full` for a verbose backtrace.
  607. 133.16 s >
  608. 133.16 s > ------------
  609. 133.16 s > Summary [ 95.523s] 38 tests run: 35 passed, 3 failed, 0 skipped
  610. 133.16 s > FAIL [ 69.935s] (32/38) clinnet::public_typst_behavior public_linnest_momentum_layers_place_shafts_and_labels
  611. 133.16 s > stdout ---
  612. 133.16 s >
  613. 133.16 s > running 1 test
  614. 133.16 s > test public_linnest_momentum_layers_place_shafts_and_labels has been running for over 60 seconds
  615. 133.16 s > test public_linnest_momentum_layers_place_shafts_and_labels ... FAILED
  616. 133.16 s >
  617. 133.16 s > failures:
  618. 133.16 s >
  619. 133.16 s > failures:
  620. 133.16 s > public_linnest_momentum_layers_place_shafts_and_labels
  621. 133.16 s >
  622. 133.16 s > test result: FAILED. 0 passed; 1 failed; 0 ignored; 0 measured; 17 filtered out; finished in 69.92s
  623. 133.16 s >
  624. 133.16 s > stderr ---
  625. 133.16 s >
  626. 133.16 s > thread 'public_linnest_momentum_layers_place_shafts_and_labels' (287) panicked at crates/clinnet/tests/public_typst_behavior.rs:81:55:
  627. 133.16 s > called `Result::unwrap()` on an `Err` value: typst failed while compiling template /build/.tmp1GG1hA/.clinnet/templates/linnest-public-behavior.svg
  628. 133.16 s >
  629. 133.16 s > Command executed:
  630. 133.16 s > "typst" "c" "/build/.tmp1GG1hA/.clinnet/templates/linnest-public-behavior.typ" "/build/.tmp1GG1hA/.clinnet/templates/linnest-public-behavior.svg" "--root" "/build/.tmp1GG1hA/.clinnet/templates"
  631. 133.16 s >
  632. 133.16 s > Typst stdout:
  633. 133.16 s >
  634. 133.16 s >
  635. 133.16 s > Typst stderr:
  636. 133.16 s >
  637. 133.16 s >
  638. 133.16 s > Location:
  639. 133.16 s > crates/clinnet/src/lib.rs:741:13
  640. 133.16 s > stack backtrace:
  641. 133.16 s > 0: __rustc::rust_begin_unwind
  642. 133.16 s > 1: core::panicking::panic_fmt
  643. 133.16 s > 2: core::result::unwrap_failed
  644. 133.16 s > 3: public_typst_behavior::render
  645. 133.16 s > 4: <std::sync::once::Once>::call_once_force::<<std::sync::once_lock::OnceLock<alloc::string::String>>::initialize<<std::sync::once_lock::OnceLock<alloc::string::String>>::get_or_init<public_typst_behavior::linnest_public_svg::{closure#0}>::{closure#0}, !>::{closure#0}>::{closure#0}
  646. 133.16 s > 5: <std::sys::sync::once::futex::Once>::call
  647. 133.16 s > 6: <std::sync::once_lock::OnceLock<alloc::string::String>>::initialize::<<std::sync::once_lock::OnceLock<alloc::string::String>>::get_or_init<public_typst_behavior::linnest_public_svg::{closure#0}>::{closure#0}, !>
  648. 133.16 s > 7: <public_typst_behavior::public_linnest_momentum_layers_place_shafts_and_labels::{closure#0} as core::ops::function::FnOnce<()>>::call_once
  649. 133.16 s > note: Some details are omitted, run with `RUST_BACKTRACE=full` for a verbose backtrace.
  650. 133.16 s >
  651. 133.16 s > FAIL [ 75.232s] (33/38) clinnet::public_typst_behavior public_linnest_edge_styles_skip_fallbacks
  652. 133.16 s > stdout ---
  653. 133.16 s >
  654. 133.16 s > running 1 test
  655. 133.16 s > test public_linnest_edge_styles_skip_fallbacks has been running for over 60 seconds
  656. 133.16 s > test public_linnest_edge_styles_skip_fallbacks ... FAILED
  657. 133.16 s >
  658. 133.16 s > failures:
  659. 133.16 s >
  660. 133.16 s > failures:
  661. 133.16 s > public_linnest_edge_styles_skip_fallbacks
  662. 133.16 s >
  663. 133.16 s > test result: FAILED. 0 passed; 1 failed; 0 ignored; 0 measured; 17 filtered out; finished in 75.20s
  664. 133.16 s >
  665. 133.16 s > stderr ---
  666. 133.16 s >
  667. 133.16 s > thread 'public_linnest_edge_styles_skip_fallbacks' (272) panicked at crates/clinnet/tests/public_typst_behavior.rs:81:55:
  668. 133.16 s > called `Result::unwrap()` on an `Err` value: typst failed while compiling template /build/.tmpjzrRit/.clinnet/templates/linnest-public-behavior.svg
  669. 133.16 s >
  670. 133.16 s > Command executed:
  671. 133.16 s > "typst" "c" "/build/.tmpjzrRit/.clinnet/templates/linnest-public-behavior.typ" "/build/.tmpjzrRit/.clinnet/templates/linnest-public-behavior.svg" "--root" "/build/.tmpjzrRit/.clinnet/templates"
  672. 133.16 s >
  673. 133.16 s > Typst stdout:
  674. 133.16 s >
  675. 133.16 s >
  676. 133.16 s > Typst stderr:
  677. 133.16 s >
  678. 133.16 s >
  679. 133.16 s > Location:
  680. 133.16 s > crates/clinnet/src/lib.rs:741:13
  681. 133.16 s > stack backtrace:
  682. 133.16 s > 0: __rustc::rust_begin_unwind
  683. 133.16 s > 1: core::panicking::panic_fmt
  684. 133.16 s > 2: core::result::unwrap_failed
  685. 133.16 s > 3: public_typst_behavior::render
  686. 133.16 s > 4: <std::sync::once::Once>::call_once_force::<<std::sync::once_lock::OnceLock<alloc::string::String>>::initialize<<std::sync::once_lock::OnceLock<alloc::string::String>>::get_or_init<public_typst_behavior::linnest_public_svg::{closure#0}>::{closure#0}, !>::{closure#0}>::{closure#0}
  687. 133.16 s > 5: <std::sys::sync::once::futex::Once>::call
  688. 133.16 s > 6: <std::sync::once_lock::OnceLock<alloc::string::String>>::initialize::<<std::sync::once_lock::OnceLock<alloc::string::String>>::get_or_init<public_typst_behavior::linnest_public_svg::{closure#0}>::{closure#0}, !>
  689. 133.16 s > 7: <public_typst_behavior::public_linnest_edge_styles_skip_fallbacks::{closure#0} as core::ops::function::FnOnce<()>>::call_once
  690. 133.16 s > note: Some details are omitted, run with `RUST_BACKTRACE=full` for a verbose backtrace.
  691. 133.16 s >
  692. 133.16 s > FAIL [ 85.826s] (34/38) clinnet::public_typst_behavior public_linnest_fixture_assertions_hold
  693. 133.16 s > stdout ---
  694. 133.16 s >
  695. 133.16 s > running 1 test
  696. 133.16 s > test public_linnest_fixture_assertions_hold has been running for over 60 seconds
  697. 133.16 s > test public_linnest_fixture_assertions_hold ... FAILED
  698. 133.16 s >
  699. 133.16 s > failures:
  700. 133.16 s >
  701. 133.16 s > failures:
  702. 133.16 s > public_linnest_fixture_assertions_hold
  703. 133.16 s >
  704. 133.16 s > test result: FAILED. 0 passed; 1 failed; 0 ignored; 0 measured; 17 filtered out; finished in 85.81s
  705. 133.16 s >
  706. 133.16 s > stderr ---
  707. 133.16 s >
  708. 133.16 s > thread 'public_linnest_fixture_assertions_hold' (274) panicked at crates/clinnet/tests/public_typst_behavior.rs:81:55:
  709. 133.16 s > called `Result::unwrap()` on an `Err` value: typst failed while compiling template /build/.tmp1F6fxQ/.clinnet/templates/linnest-public-behavior.svg
  710. 133.16 s >
  711. 133.16 s > Command executed:
  712. 133.16 s > "typst" "c" "/build/.tmp1F6fxQ/.clinnet/templates/linnest-public-behavior.typ" "/build/.tmp1F6fxQ/.clinnet/templates/linnest-public-behavior.svg" "--root" "/build/.tmp1F6fxQ/.clinnet/templates"
  713. 133.16 s >
  714. 133.16 s > Typst stdout:
  715. 133.16 s >
  716. 133.16 s >
  717. 133.16 s > Typst stderr:
  718. 133.16 s >
  719. 133.16 s >
  720. 133.16 s > Location:
  721. 133.16 s > crates/clinnet/src/lib.rs:741:13
  722. 133.16 s > stack backtrace:
  723. 133.16 s > 0: __rustc::rust_begin_unwind
  724. 133.16 s > 1: core::panicking::panic_fmt
  725. 133.16 s > 2: core::result::unwrap_failed
  726. 133.16 s > 3: public_typst_behavior::render
  727. 133.16 s > 4: <std::sync::once::Once>::call_once_force::<<std::sync::once_lock::OnceLock<alloc::string::String>>::initialize<<std::sync::once_lock::OnceLock<alloc::string::String>>::get_or_init<public_typst_behavior::linnest_public_svg::{closure#0}>::{closure#0}, !>::{closure#0}>::{closure#0}
  728. 133.16 s > 5: <std::sys::sync::once::futex::Once>::call
  729. 133.16 s > 6: <std::sync::once_lock::OnceLock<alloc::string::String>>::initialize::<<std::sync::once_lock::OnceLock<alloc::string::String>>::get_or_init<public_typst_behavior::linnest_public_svg::{closure#0}>::{closure#0}, !>
  730. 133.16 s > 7: <public_typst_behavior::public_linnest_fixture_assertions_hold::{closure#0} as core::ops::function::FnOnce<()>>::call_once
  731. 133.16 s > note: Some details are omitted, run with `RUST_BACKTRACE=full` for a verbose backtrace.
  732. 133.16 s >
  733. 133.16 s > error: test run failed
  734. 133.16 s >
  735. 133.16 s > ========== nextest test summary ==========
  736. 133.16 s > report: target/nextest/ci_gammaloop/junit.xml
  737. 133.16 s > tests: 38, failures: 3, errors: 0
  738. 133.16 s >
  739. 133.16 s > 1. clinnet::public_typst_behavior::public_linnest_momentum_layers_place_shafts_and_labels
  740. 133.16 s > failure: test failure with exit code 101
  741. 133.16 s > thread 'public_linnest_momentum_layers_place_shafts_and_labels' (287) panicked at crates/clinnet/tests/public_typst_behavior.rs:81:55:
  742. 133.16 s > called `Result::unwrap()` on an `Err` value: typst failed while compiling template /build/.tmp1GG1hA/.clinnet/templates/linnest-public-behavior.svg
  743. 133.16 s >
  744. 133.16 s > Command executed:
  745. 133.16 s > "typst" "c" "/build/.tmp1GG1hA/.clinnet/templates/linnest-public-behavior.typ" "/build/.tmp1GG1hA/.clinnet/templates/linnest-public-behavior.svg" "--root" "/build/.tmp1GG1hA/.clinnet/templates"
  746. 133.16 s >
  747. 133.16 s > Typst stdout:
  748. 133.16 s >
  749. 133.16 s >
  750. 133.16 s > Typst stderr:
  751. 133.16 s >
  752. 133.16 s >
  753. 133.16 s > Location:
  754. 133.16 s > crates/clinnet/src/lib.rs:741:13
  755. 133.16 s > stack backtrace:
  756. 133.16 s > 0: __rustc::rust_begin_unwind
  757. 133.16 s > 1: core::panicking::panic_fmt
  758. 133.16 s > 2: core::result::unwrap_failed
  759. 133.16 s > 3: public_typst_behavior::render
  760. 133.16 s > 4: <std::sync::once::Once>::call_once_force::<<std::sync::once_lock::OnceLock<alloc::string::String>>::initialize<<std::sync::once_lock::OnceLock<alloc::string::String>>::get_or_init<public_typst_behavior::linnest_public_svg::{closure#0}>::{closure#0}, !>::{closure#0}>::{closure#0}
  761. 133.16 s > 5: <std::sys::sync::once::futex::Once>::call
  762. 133.16 s > 6: <std::sync::once_lock::OnceLock<alloc::string::String>>::initialize::<<std::sync::once_lock::OnceLock<alloc::string::String>>::get_or_init<public_typst_behavior::linnest_public_svg::{closure#0}>::{closure#0}, !>
  763. 133.16 s > 7: <public_typst_behavior::public_linnest_momentum_layers_place_shafts_and_labels::{closure#0} as core::ops::function::FnOnce<()>>::call_once
  764. 133.16 s > note: Some details are omitted, run with `RUST_BACKTRACE=full` for a verbose backtrace.
  765. 133.16 s > system-out
  766. 133.16 s > running 1 test
  767. 133.16 s > test public_linnest_momentum_layers_place_shafts_and_labels has been running for over 60 seconds
  768. 133.16 s > test public_linnest_momentum_layers_place_shafts_and_labels ... FAILED
  769. 133.16 s >
  770. 133.16 s > failures:
  771. 133.16 s >
  772. 133.16 s > failures:
  773. 133.16 s > public_linnest_momentum_layers_place_shafts_and_labels
  774. 133.16 s >
  775. 133.16 s > test result: FAILED. 0 passed; 1 failed; 0 ignored; 0 measured; 17 filtered out; finished in 69.92s
  776. 133.16 s > system-err
  777. 133.16 s > thread 'public_linnest_momentum_layers_place_shafts_and_labels' (287) panicked at crates/clinnet/tests/public_typst_behavior.rs:81:55:
  778. 133.16 s > called `Result::unwrap()` on an `Err` value: typst failed while compiling template /build/.tmp1GG1hA/.clinnet/templates/linnest-public-behavior.svg
  779. 133.16 s >
  780. 133.16 s > Command executed:
  781. 133.16 s > "typst" "c" "/build/.tmp1GG1hA/.clinnet/templates/linnest-public-behavior.typ" "/build/.tmp1GG1hA/.clinnet/templates/linnest-public-behavior.svg" "--root" "/build/.tmp1GG1hA/.clinnet/templates"
  782. 133.16 s >
  783. 133.16 s > Typst stdout:
  784. 133.16 s >
  785. 133.16 s >
  786. 133.16 s > Typst stderr:
  787. 133.16 s >
  788. 133.16 s >
  789. 133.16 s > Location:
  790. 133.16 s > crates/clinnet/src/lib.rs:741:13
  791. 133.16 s > stack backtrace:
  792. 133.16 s > 0: __rustc::rust_begin_unwind
  793. 133.16 s > 1: core::panicking::panic_fmt
  794. 133.16 s > 2: core::result::unwrap_failed
  795. 133.16 s > 3: public_typst_behavior::render
  796. 133.16 s > 4: <std::sync::once::Once>::call_once_force::<<std::sync::once_lock::OnceLock<alloc::string::String>>::initialize<<std::sync::once_lock::OnceLock<alloc::string::String>>::get_or_init<public_typst_behavior::linnest_public_svg::{closure#0}>::{closure#0}, !>::{closure#0}>::{closure#0}
  797. 133.16 s > 5: <std::sys::sync::once::futex::Once>::call
  798. 133.16 s > 6: <std::sync::once_lock::OnceLock<alloc::string::String>>::initialize::<<std::sync::once_lock::OnceLock<alloc::string::String>>::get_or_init<public_typst_behavior::linnest_public_svg::{closure#0}>::{closure#0}, !>
  799. 133.16 s > 7: <public_typst_behavior::public_linnest_momentum_layers_place_shafts_and_labels::{closure#0} as core::ops::function::FnOnce<()>>::call_once
  800. 133.16 s > note: Some details are omitted, run with `RUST_BACKTRACE=full` for a verbose backtrace.
  801. 133.16 s >
  802. 133.16 s > 2. clinnet::public_typst_behavior::public_linnest_edge_styles_skip_fallbacks
  803. 133.16 s > failure: test failure with exit code 101
  804. 133.16 s > thread 'public_linnest_edge_styles_skip_fallbacks' (272) panicked at crates/clinnet/tests/public_typst_behavior.rs:81:55:
  805. 133.16 s > called `Result::unwrap()` on an `Err` value: typst failed while compiling template /build/.tmpjzrRit/.clinnet/templates/linnest-public-behavior.svg
  806. 133.16 s >
  807. 133.16 s > Command executed:
  808. 133.16 s > "typst" "c" "/build/.tmpjzrRit/.clinnet/templates/linnest-public-behavior.typ" "/build/.tmpjzrRit/.clinnet/templates/linnest-public-behavior.svg" "--root" "/build/.tmpjzrRit/.clinnet/templates"
  809. 133.16 s >
  810. 133.16 s > Typst stdout:
  811. 133.16 s >
  812. 133.16 s >
  813. 133.16 s > Typst stderr:
  814. 133.16 s >
  815. 133.16 s >
  816. 133.16 s > Location:
  817. 133.16 s > crates/clinnet/src/lib.rs:741:13
  818. 133.16 s > stack backtrace:
  819. 133.16 s > 0: __rustc::rust_begin_unwind
  820. 133.16 s > 1: core::panicking::panic_fmt
  821. 133.16 s > 2: core::result::unwrap_failed
  822. 133.16 s > 3: public_typst_behavior::render
  823. 133.16 s > 4: <std::sync::once::Once>::call_once_force::<<std::sync::once_lock::OnceLock<alloc::string::String>>::initialize<<std::sync::once_lock::OnceLock<alloc::string::String>>::get_or_init<public_typst_behavior::linnest_public_svg::{closure#0}>::{closure#0}, !>::{closure#0}>::{closure#0}
  824. 133.16 s > 5: <std::sys::sync::once::futex::Once>::call
  825. 133.16 s > 6: <std::sync::once_lock::OnceLock<alloc::string::String>>::initialize::<<std::sync::once_lock::OnceLock<alloc::string::String>>::get_or_init<public_typst_behavior::linnest_public_svg::{closure#0}>::{closure#0}, !>
  826. 133.16 s > 7: <public_typst_behavior::public_linnest_edge_styles_skip_fallbacks::{closure#0} as core::ops::function::FnOnce<()>>::call_once
  827. 133.16 s > note: Some details are omitted, run with `RUST_BACKTRACE=full` for a verbose backtrace.
  828. 133.16 s > system-out
  829. 133.16 s > running 1 test
  830. 133.16 s > test public_linnest_edge_styles_skip_fallbacks has been running for over 60 seconds
  831. 133.16 s > test public_linnest_edge_styles_skip_fallbacks ... FAILED
  832. 133.16 s >
  833. 133.16 s > failures:
  834. 133.16 s >
  835. 133.16 s > failures:
  836. 133.16 s > public_linnest_edge_styles_skip_fallbacks
  837. 133.16 s >
  838. 133.16 s > test result: FAILED. 0 passed; 1 failed; 0 ignored; 0 measured; 17 filtered out; finished in 75.20s
  839. 133.16 s > system-err
  840. 133.16 s > thread 'public_linnest_edge_styles_skip_fallbacks' (272) panicked at crates/clinnet/tests/public_typst_behavior.rs:81:55:
  841. 133.16 s > called `Result::unwrap()` on an `Err` value: typst failed while compiling template /build/.tmpjzrRit/.clinnet/templates/linnest-public-behavior.svg
  842. 133.16 s >
  843. 133.16 s > Command executed:
  844. 133.16 s > "typst" "c" "/build/.tmpjzrRit/.clinnet/templates/linnest-public-behavior.typ" "/build/.tmpjzrRit/.clinnet/templates/linnest-public-behavior.svg" "--root" "/build/.tmpjzrRit/.clinnet/templates"
  845. 133.16 s >
  846. 133.16 s > Typst stdout:
  847. 133.16 s >
  848. 133.16 s >
  849. 133.16 s > Typst stderr:
  850. 133.16 s >
  851. 133.16 s >
  852. 133.16 s > Location:
  853. 133.16 s > crates/clinnet/src/lib.rs:741:13
  854. 133.16 s > stack backtrace:
  855. 133.16 s > 0: __rustc::rust_begin_unwind
  856. 133.16 s > 1: core::panicking::panic_fmt
  857. 133.16 s > 2: core::result::unwrap_failed
  858. 133.16 s > 3: public_typst_behavior::render
  859. 133.16 s > 4: <std::sync::once::Once>::call_once_force::<<std::sync::once_lock::OnceLock<alloc::string::String>>::initialize<<std::sync::once_lock::OnceLock<alloc::string::String>>::get_or_init<public_typst_behavior::linnest_public_svg::{closure#0}>::{closure#0}, !>::{closure#0}>::{closure#0}
  860. 133.16 s > 5: <std::sys::sync::once::futex::Once>::call
  861. 133.16 s > 6: <std::sync::once_lock::OnceLock<alloc::string::String>>::initialize::<<std::sync::once_lock::OnceLock<alloc::string::String>>::get_or_init<public_typst_behavior::linnest_public_svg::{closure#0}>::{closure#0}, !>
  862. 133.16 s > 7: <public_typst_behavior::public_linnest_edge_styles_skip_fallbacks::{closure#0} as core::ops::function::FnOnce<()>>::call_once
  863. 133.16 s > note: Some details are omitted, run with `RUST_BACKTRACE=full` for a verbose backtrace.
  864. 133.16 s >
  865. 133.16 s > 3. clinnet::public_typst_behavior::public_linnest_fixture_assertions_hold
  866. 133.16 s > failure: test failure with exit code 101
  867. 133.16 s > thread 'public_linnest_fixture_assertions_hold' (274) panicked at crates/clinnet/tests/public_typst_behavior.rs:81:55:
  868. 133.16 s > called `Result::unwrap()` on an `Err` value: typst failed while compiling template /build/.tmp1F6fxQ/.clinnet/templates/linnest-public-behavior.svg
  869. 133.16 s >
  870. 133.16 s > Command executed:
  871. 133.16 s > "typst" "c" "/build/.tmp1F6fxQ/.clinnet/templates/linnest-public-behavior.typ" "/build/.tmp1F6fxQ/.clinnet/templates/linnest-public-behavior.svg" "--root" "/build/.tmp1F6fxQ/.clinnet/templates"
  872. 133.16 s >
  873. 133.16 s > Typst stdout:
  874. 133.16 s >
  875. 133.16 s >
  876. 133.16 s > Typst stderr:
  877. 133.16 s >
  878. 133.16 s >
  879. 133.16 s > Location:
  880. 133.16 s > crates/clinnet/src/lib.rs:741:13
  881. 133.16 s > stack backtrace:
  882. 133.16 s > 0: __rustc::rust_begin_unwind
  883. 133.16 s > 1: core::panicking::panic_fmt
  884. 133.16 s > 2: core::result::unwrap_failed
  885. 133.16 s > 3: public_typst_behavior::render
  886. 133.16 s > 4: <std::sync::once::Once>::call_once_force::<<std::sync::once_lock::OnceLock<alloc::string::String>>::initialize<<std::sync::once_lock::OnceLock<alloc::string::String>>::get_or_init<public_typst_behavior::linnest_public_svg::{closure#0}>::{closure#0}, !>::{closure#0}>::{closure#0}
  887. 133.16 s > 5: <std::sys::sync::once::futex::Once>::call
  888. 133.16 s > 6: <std::sync::once_lock::OnceLock<alloc::string::String>>::initialize::<<std::sync::once_lock::OnceLock<alloc::string::String>>::get_or_init<public_typst_behavior::linnest_public_svg::{closure#0}>::{closure#0}, !>
  889. 133.16 s > 7: <public_typst_behavior::public_linnest_fixture_assertions_hold::{closure#0} as core::ops::function::FnOnce<()>>::call_once
  890. 133.16 s > note: Some details are omitted, run with `RUST_BACKTRACE=full` for a verbose backtrace.
  891. 133.16 s > system-out
  892. 133.16 s > running 1 test
  893. 133.16 s > test public_linnest_fixture_assertions_hold has been running for over 60 seconds
  894. 133.16 s > test public_linnest_fixture_assertions_hold ... FAILED
  895. 133.16 s >
  896. 133.16 s > failures:
  897. 133.16 s >
  898. 133.16 s > failures:
  899. 133.16 s > public_linnest_fixture_assertions_hold
  900. 133.16 s >
  901. 133.16 s > test result: FAILED. 0 passed; 1 failed; 0 ignored; 0 measured; 17 filtered out; finished in 85.81s
  902. 133.16 s > system-err
  903. 133.16 s > thread 'public_linnest_fixture_assertions_hold' (274) panicked at crates/clinnet/tests/public_typst_behavior.rs:81:55:
  904. 133.16 s > called `Result::unwrap()` on an `Err` value: typst failed while compiling template /build/.tmp1F6fxQ/.clinnet/templates/linnest-public-behavior.svg
  905. 133.16 s >
  906. 133.16 s > Command executed:
  907. 133.16 s > "typst" "c" "/build/.tmp1F6fxQ/.clinnet/templates/linnest-public-behavior.typ" "/build/.tmp1F6fxQ/.clinnet/templates/linnest-public-behavior.svg" "--root" "/build/.tmp1F6fxQ/.clinnet/templates"
  908. 133.16 s >
  909. 133.16 s > Typst stdout:
  910. 133.16 s >
  911. 133.16 s >
  912. 133.16 s > Typst stderr:
  913. 133.16 s >
  914. 133.16 s >
  915. 133.16 s > Location:
  916. 133.16 s > crates/clinnet/src/lib.rs:741:13
  917. 133.16 s > stack backtrace:
  918. 133.16 s > 0: __rustc::rust_begin_unwind
  919. 133.16 s > 1: core::panicking::panic_fmt
  920. 133.16 s > 2: core::result::unwrap_failed
  921. 133.16 s > 3: public_typst_behavior::render
  922. 133.16 s > 4: <std::sync::once::Once>::call_once_force::<<std::sync::once_lock::OnceLock<alloc::string::String>>::initialize<<std::sync::once_lock::OnceLock<alloc::string::String>>::get_or_init<public_typst_behavior::linnest_public_svg::{closure#0}>::{closure#0}, !>::{closure#0}>::{closure#0}
  923. 133.16 s > 5: <std::sys::sync::once::futex::Once>::call
  924. 133.16 s > 6: <std::sync::once_lock::OnceLock<alloc::string::String>>::initialize::<<std::sync::once_lock::OnceLock<alloc::string::String>>::get_or_init<public_typst_behavior::linnest_public_svg::{closure#0}>::{closure#0}, !>
  925. 133.16 s > 7: <public_typst_behavior::public_linnest_fixture_assertions_hold::{closure#0} as core::ops::function::FnOnce<()>>::call_once
  926. 133.16 s > note: Some details are omitted, run with `RUST_BACKTRACE=full` for a verbose backtrace.
  927. 133.16 s > =========================================
  928. 133.16 s For full logs, run:
  929. 133.16 s nix log /nix/store/4pqspwvh8pi9s2vg9g6mfsggpl9ynwzx-gammaloop-nextest-clinnet.drv
  930. 133.39 s [0 built (1 failed)]Run failed.